##TITLE=1H_CA-9004-1
 DMSO
 8 sc, 
 5.05.2022
##JCAMPDX= 6.0         $$ Bruker NMR JCAMP-DX V2.0
##DATA TYPE= NMR SPECTRUM
##DATA CLASS= NTUPLES
##ORIGIN= UXNMR, Bruker Analytische Messtechnik GmbH
##OWNER= root
$$ XWIN-NMR		Version 3.5
$$ Thu May  5 16:07:34 2022 Russian Standard Time (UT+4h)  she@DPX200
##.OBSERVE FREQUENCY= 200.1313499996
##.OBSERVE NUCLEUS= ^1H
##.ACQUISITION MODE= SIMULTANEOUS
##.ACQUISITION SCHEME= undefined
##.AVERAGES= 8
##.DIGITISER RES= 18
##SPECTROMETER/DATA SYSTEM= spect
##.PULSE SEQUENCE= zg30
##.SOLVENT NAME= DMSO
##.SHIFT REFERENCE= (INTERNAL, DMSO, 0, 15.7513)
##AUDIT TRAIL= $$ (NUMBER, WHEN, WHO, WHERE, WHAT)
$$ ##TITLE= Audit trail, XWIN-NMR		Version 3.5
$$ ##JCAMPDX= 5.01
$$ ##ORIGIN= Bruker BioSpin GmbH
$$ ##OWNER= she
$$ F:/spectra/data/she/nmr/H-F/1/pdata/1/auditp.txt
$$ ##AUDIT TRAIL=  $$ (NUMBER, WHEN, WHO, WHERE, WHAT)
(   1,<2022-05-05 16:06:18.82 +0400>,<she>,<DPX200>,
      <created by zg, POWCHK disabled, PULCHK disabled
       configuration hash MD5:
       00 E9 B6 7A A2 85 ED C7 34 08 36 98 17 FE 4E 26
       data hash MD5: 16K
       F0 02 38 1F 2E 05 3C 85 FB EC 4C 9B 13 CC 34 68>)
(   2,<2022-05-05 16:06:23.29 +0400>,<she>,<DPX200>,
      <Start of raw data processing
       efp BC_mod = 2 LB = 0.24 FT_mod = 6 PKNL = 1 PHC0 = -18189.91 PHC1 = 9.800749 SI = 16K 
       data hash MD5: 16K
       D3 47 8A CC 7F 0E 2E DB 04 63 70 55 E6 6F A3 1F>)
(   3,<2022-05-05 16:06:40.65 +0400>,<she>,<DPX200>,
      <pk PHC0 = 155.6308 PHC1 = -1.799999 
       data hash MD5: 16K
       A2 C7 23 5D 2C D0 E2 3D DD BE BE 35 D6 5C FB 69>)
(   4,<2022-05-05 16:06:47.53 +0400>,<she>,<DPX200>,
      <abs ABSG = 5 
       data hash MD5: 16K
       17 6E 91 59 9A 7D D9 4E FC E4 E6 B7 6B E4 CB BD>)
$$ ##END=
$$ 
$$ hash MD5
$$ D6 19 61 22 DD 01 09 52 38 72 D4 4D F0 F5 AD D8
##$RELAX= 
##$RELAX= 
##$RELAX= 
##$RELAX= 
##$RELAX= 
##$RELAX= 
$$ Bruker specific parameters
$$ --------------------------
##$DU= <F:/spectra>
##$EXPNO= 1
##$NAME= <H-F>
##$PROCNO= 1
##$TYPE= <nmr>
##$USER= <she>
##$AMP= (0..31)
100 100 100 100 100 100 100 100 100 100 100 100 100 100 100 100 100 100 
100 100 100 100 100 100 100 100 100 100 100 100 100 100 
##$AQSEQ= 0
##$AQ_mod= 1
##$AUNM= <au_zg>
##$AUTOPOS= <>
##$BF1= 200.13
##$BF2= 200.13
##$BF3= 200.13
##$BF4= 200.13
##$BF5= 200.13
##$BF6= 200.13
##$BF7= 200.13
##$BF8= 200.13
##$BYTORDA= 1
##$CFDGTYP= 0
##$CFRGTYP= 5
##$CHEMSTR= <none>
##$CNST= (0..31)
1 1 145 1 1 1 1 1 1 1 1 1 1 1 1 1 1 1 1 1 1 1 1 1 1 1 1 1 1 1 1 1 
##$CPDPRG= <>
##$CPDPRG1= <>
##$CPDPRG2= <>
##$CPDPRG3= <>
##$CPDPRG4= <mlev>
##$CPDPRG5= <mlev>
##$CPDPRG6= <mlev>
##$CPDPRG7= <mlev>
##$CPDPRG8= <mlev>
##$CPDPRGB= <>
##$CPDPRGT= <>
##$D= (0..31)
0 1.2 0 0 0 0 0 0 0 0.06 0 0.03 0 0 0 0 0.0002 0 0 0 0 0 0 0 0 0 0 0 0 
0 0 0 
##$DATE= 1651752378
##$DBL= (0..7)
120 120 120 120 120 120 120 120 
##$DBP= (0..7)
150 150 150 150 150 150 150 150 
##$DBP07= 0
##$DBPNAM0= <>
##$DBPNAM1= <>
##$DBPNAM2= <>
##$DBPNAM3= <>
##$DBPNAM4= <>
$$ [...]
##$SUBNAM2= <"">
##$SUBNAM3= <"">
##$SUBNAM4= <"">
##$SUBNAM5= <"">
##$SUBNAM6= <"">
##$SUBNAM7= <"">
##$SUBNAM8= <"">
##$SUBNAM9= <"">
##$SW= 18.0517283424761
##$SWIBOX= (0..15)
0 0 2 0 0 0 0 0 0 0 0 0 0 0 0 0 
##$SW_h= 3612.71676300578
##$TD= 16384
##$TD0= 1
##$TE= 0
##$TE2= 300
##$TE3= 300
##$TEG= 300
##$TL= (0..7)
0 120 120 120 120 120 120 120 
##$TP= (0..7)
150 150 150 150 150 150 150 150 
##$TP07= 0
##$TPNAME0= <>
##$TPNAME1= <>
##$TPNAME2= <>
##$TPNAME3= <>
##$TPNAME4= <>
##$TPNAME5= <>
##$TPNAME6= <>
##$TPNAME7= <>
##$TPOAL= (0..7)
0.5 0.5 0.5 0.5 0.5 0.5 0.5 0.5 
##$TPOFFS= (0..7)
0 0 0 0 0 0 0 0 
##$TUNHIN= 0
##$TUNHOUT= 0
##$TUNXOUT= 0
##$USERA1= <user>
##$USERA2= <user>
##$USERA3= <user>
##$USERA4= <user>
##$USERA5= <user>
##$V9= 5
##$VALIST= <valist>
##$VCLIST= <CCCCCCCCCCCCCCC>
##$VD= 0
##$VDLIST= <DDDDDDDDDDDDDDD>
##$VPLIST= <PPPPPPPPPPPPPPP>
##$VTLIST= <TTTTTTTTTTTTTTT>
##$WBST= 1024
##$WBSW= 4
##$XGAIN= (0..3)
0 0 0 0 
##$XL= 0
##$YL= 0
##$YMAX_a= 145683
##$YMIN_a= -252222
##$ZGOPTNS= <>
##$ZL1= 120
##$ZL2= 120
##$ZL3= 120
##$ZL4= 120
##$ABSF1= 15.66205
##$ABSF2= -2.389797
##$ABSG= 5
##$ABSL= 3
##$ALPHA= 0
##$AQORDER= 0
##$ASSFAC= 0
##$ASSFACI= 0
##$ASSFACX= 0
##$ASSWID= 0
##$AUNMP= <proc_1d>
##$AZFE= 0.1
##$AZFW= 0.1
##$BCFW= 0
##$BC_mod= 2
##$BYTORDP= 0
##$COROFFS= 0
##$CY= -3
##$DATMOD= 1
##$DC= 0
##$DFILT= <>
##$DTYPP= 0
##$F1P= 0
##$F2P= 0
##$FCOR= 1
##$FTSIZE= 16384
##$FT_mod= 6
##$GAMMA= 0
##$GB= 0
##$INTBC= 1
##$INTSCL= 0
##$ISEN= 128
##$LB= 0.24
##$LEV0= 0
##$LPBIN= 0
##$MAXI= 10000
##$MC2= 0
##$MEAN= 0
##$ME_mod= 0
##$MI= 1.114404
##$NCOEF= 0
##$NC_proc= -9
##$NLEV= 6
##$NOISF1= 3.799351
##$NOISF2= 2.8
##$NSP= 0
##$NTH_PI= 0
##$NZP= 0
##$OFFSET= 15.7513
##$PC= 1
##$PHC0= -18034.28
##$PHC1= 8.00075
##$PH_mod= 1
##$PKNL= yes
##$PPARMOD= 0
##$PSCAL= 0
##$PSIGN= 0
##$REVERSE= no
##$SF= 200.130004050942
##$SI= 16384
##$SIGF1= 3
##$SIGF2= 2
##$SINO= 5.538805
##$SIOLD= 16384
##$SREGLST= <1H.CDCl3>
##$SSB= 0
##$STSI= 16384
##$STSR= 0
##$SW_p= 3612.71676300578
##$SYMM= 0
##$S_DEV= 0
##$TDeff= 16384
##$TDoff= 0
##$TI= <>
##$TILT= no
##$TM1= 0
##$TM2= 0
##$TOPLEV= 0
##$USERP1= <user>
##$USERP2= <user>
##$USERP3= <user>
##$USERP4= <user>
##$USERP5= <user>
##$WDW= 1
##$XDIM= 16384
##$YMAX_p= 534338550
##$YMIN_p= -7266114
$$ End of Bruker specific parameters
$$ ---------------------------------
##NTUPLES= NMR SPECTRUM
##VAR_NAME=  FREQUENCY,     SPECTRUM/REAL,   SPECTRUM/IMAG
##SYMBOL=    X,             R,               I
##VAR_TYPE=  INDEPENDENT,   DEPENDENT,       DEPENDENT
##VAR_FORM=  AFFN,          ASDF,            ASDF
##VAR_DIM=   16384,         16384,           16384
##UNITS=     HZ,            ARBITRARY UNITS, ARBITRARY UNITS
##FACTOR=    0.220516191357247, 1,           1
##FIRST=     3152.30770440781, 0,            0
##LAST=      -460.409058597973, 0,           0
##MIN=       -460.409058597973, -7266114,    0
##MAX=       3152.30770440781, 534338550,    0
$$ Real data points
##PAGE= N=1
##DATA TABLE= (X++(R..R)), XYDATA
$$ [...]
6329D356077k11338p84032J089450L03375J115728Q76336k61847k005124k013396
6320B465229K550102K068359k167783k121439P2167Q30436o0953O51809Q86475
6311E174402j095126R02642l59158l38486K396954J551765j088917j524916j51158
6302E468002J207139q262J99261k540257l26078K797013O01458j611111J970714
6293G757879K056047r39571J58121n02865q73686l52692K235948L696831O2548
6284A3298560m324656j024689M5549P05853O78301j076968M90211p28275o14637
6275G449249P71651K59288J746206J499312j452759M81475M00936m27202K308768
6266A3036924J728565J796648r99100j618354r1876k785808J892393K081634p47686
$$ y = [4356077, 4144739, 3360707, 4450157, 4753532, 5869260, 6745596, 6483749, 4478625, 2465229, 5015331, 7083690, 4915907, 2794468, 2866635, 3697071, 3636118, 4287927, 5174402, 4079276, 4981918, 4622760, 4284274, 6681228, 8232993, 7144076, 5619160, 5468002, 6675141, 6666879, 6866140, 4325883, 3999805, 6796818, 7398276, 5787165, 7757879, 9813926, 8874355, 9032476, 8529611, 7655925, 7303233, 9539181, 13236012, 13298560, 8973904, 7949215, 7994764, 8700617, 9378918, 8301950, 8792161, 8063886, 7449249, 8220900, 8480188, 10226394, 11725706, 10272947, 10754422, 11155358, 10728156, 13036924, 14765489, 16562137, 15563037, 13944683, 13852807, 11066999, 12959392, 15041026, 14293340]
6257A4293340r94766J586967K185005j290439j742188K046564K575076J762143
6249B0421702j208425l12116K187985j296749J776768J037757K000830L172903
6241B7780655l485m00713p07385R55875L99841J196275J967025K211616K867550
6232C6267254K942157m64597o93766N42282J392399L081450J393949K340134M23564
6223D7224826J321693K759900L09608K964593L193783J257562L65721m37327R36577
6214E9896936J608841J711743P42983L46361J851031j33318k996941O35281K753202
6205F6416119P29341k570732j791756K289642L53250l614133k612148j083168
6197E8116415J079468k041833k399893J391538j539227k966246k263257P23663
$$ y = [14293340, 13298574, 14885541, 17070546, 15780107, 14037919, 16084483, 18659559, 20421702, 19213277, 18901161, 21089146, 19792397, 21569165, 22606922, 24607752, 27780655, 27777170, 27376457, 26669072, 27624947, 28024788, 29221063, 31188088, 33399704, 36267254, 39209411, 38744814, 38051048, 38593330, 39985729, 43067179, 44461128, 46801262, 47224826, 48546519, 51306419, 51616027, 54580620, 57774403, 59031965, 59397686, 58960359, 59896936, 61505777, 63217520, 63960503, 64306864, 66157895, 66024577, 63027636, 63662917, 66416119, 67145460, 64574728, 62782972, 65072614, 65425864, 61811731, 59199583, 58116415, 59195883, 57154050, 54754157, 56145695, 54606468, 51640222, 49376965, 50100628]
6189E0100628M65849l787586j341601j091251k660392K323103J027963l34136
6181D4702577Q75667j79661L55260j465319J591026J483972j542910J104243R94936
6172D7919791J584741J384088J161068L775309K952187K713443J360910Q1800
6164F2933337J579965K509032K670757J241173R44696J259991L425291N573629
6156H2137871J963892r51659K380366K796943K789030J317006K32216L148926
6148I5814591J142853j476843j092481Q42193k62380j387553R80447J11900m687208
6139H9985519k678182O51136j554943k203147l570021k195290n70810k363097
6131G5501165l855332l408789j142508k826724l786981o49246j043715k994635
$$ y = [50100628, 50566477, 46778891, 45437290, 44346039, 41685647, 44008750, 45036713, 44702577, 45578244, 45398583, 45753843, 44288524, 45879550, 47363522, 45820612, 46924855, 47919791, 49504532, 50888620, 52049688, 55824997, 58777184, 61490627, 62851537, 62933337, 64513302, 67022334, 69693091, 70934264, 71878960, 73138951, 76564242, 82137871, 84101763, 83150104, 85530470, 88327413, 91116443, 92433449, 92665665, 95814591, 96957444, 95480601, 94388120, 95230313, 94967933, 93580380, 94560827, 94672727, 89985519, 87307337, 87958473, 86403530, 84200383, 80630362, 78435072, 77864262, 75501165, 71645833, 68237044, 67094536, 64267812, 60480831, 59831585, 58787870, 55793235]
6123E5793235k906757l004107k155858k18140J514124r99763m800662m505680
6115C8716392o79837q07241o87880N48384j571493j265534o01732N33248r48152
6106C3236155k414814o37637k425060k007895J324749k80993r74248k88172q23439
6097B4708646M19661q28967Q90755k435776o68774K172505j325362J87606j169471
6088B1950823j470700P96546O97171P58058j55182m02624m92416l77638J451328
6079B2755366l33745r79775p20221k215303l65285J270649J157850n27118R57183
6070B0999601L63070Q6895j349411m31819j154703j669950K773209P30746j608949
6061A8738689j958315J259362K079362J855473j994634L64016O06524J849372
$$ y = [55793235, 52886478, 49882371, 47726513, 47508373, 49022497, 48022734, 43222072, 38716392, 38036555, 37229314, 36541434, 37089818, 35518325, 34252791, 33651059, 34184307, 33236155, 30821341, 30183704, 27758644, 25750749, 27075498, 26794505, 25820257, 25532085, 24708646, 25128307, 24299340, 25190095, 22754319, 22085545, 24258050, 22932688, 23120294, 21950823, 20480123, 21276669, 21973840, 22731898, 22576716, 22174092, 21681676, 21304038, 22755366, 22421621, 21441846, 20721625, 18506322, 18141037, 19411686, 20569536, 20042418, 20999601, 21362671, 21449566, 20100155, 19668336, 18513633, 16843683, 19616892, 20347638, 18738689, 16780374, 18039736, 20119098, 21974571, 19979937, 20343953, 20950477, 22799849]
6053B2799849l50451k709517J093145j24828J583949J598289p41628k152608m064427
6044A6931773j916153J548038L48194L0516k83945J421519L704995k762769P94600
6035A9816768m1042k373306J18499l62389J170603P22236J863916j841299j729523
6026A7344463R36093O04049J82273M85270J606357M31092j465670l71491N85407
6017B0337843J374821J532043K509112r75149k786858k42194K065748o02428j915125
6008B1297813N44115K748009J125645k027010j437604p88239K809358j61517j417862
5999B2692708Q41188J531373N08512P429L950810K141954j639462j05760o18972
5990B9309780J169669J886817k718198k218105K441179K931600M27769n41940
$$ y = [22799849, 22449398, 19739881, 20833026, 20708198, 22292147, 23890436, 23148808, 20996200, 16931773, 15015620, 16563658, 16911852, 16942368, 16658423, 18079942, 21784937, 19022168, 19816768, 19775726, 17402420, 17520919, 17158530, 18329133, 19051369, 20915285, 19073986, 17344463, 18280556, 18884605, 19066878, 19552148, 21158505, 21589597, 20123927, 19752436, 20337843, 21712664, 23244707, 25753819, 24778670, 21991812, 21749618, 23815366, 23212938, 21297813, 21841928, 24589937, 25715582, 23688572, 22250968, 21462729, 24272087, 24110570, 22692708, 23533896, 25065269, 25573781, 25581210, 29532020, 31673974, 30034512, 29928752, 29309780, 30479449, 32366266, 29648068, 27429963, 29871142, 32802742, 33230511, 32688571]
5982C2688571J466914J329816M195892K440905N1489K088215K568170m0417q02118
5973D5987437K057156j96310J221115L310234K345138Q65930M66089L911613L011298
5964F2979700J238723J116414K208915K148570J139944L35748J917221K529734
5956G5614969j743751o77534K991489Q94927j471043M4168k746115k48121J256180
5947G3915169m79522N82924J61059J938309j248566l133619K87950Q91565l70945
5938G2544324j766632K12778K393591K646293Q72370Q38009K673293M43173j018011
5929G9839188N74475K226031J071317r73498j003039M75757R94304J126100O16970
5920H4947605k363633J02355k21743O98049p28863j962607O6181M06362j22767
$$ y = [32688571, 34155485, 35485301, 39681193, 42122098, 42173587, 44261802, 46829972, 46789555, 45987437, 48044593, 47848283, 49069398, 52379632, 54724770, 55590700, 56056789, 59968402, 62979700, 64218423, 65334837, 67543752, 69692322, 70832266, 71168014, 73085235, 75614969, 73871218, 73193684, 76185173, 77080100, 75609057, 75653225, 72907110, 72658989, 73915169, 73435647, 74018571, 74179630, 76117939, 74869373, 71735754, 72023704, 72915269, 72544324, 70777692, 70990470, 73384061, 76030354, 76902724, 77740733, 80414026, 80857199, 79839188, 80413663, 82639694, 83711011, 82737513, 81734474, 82210231, 83204535, 84330635, 84947605, 82583972, 82686327, 82464584, 83162633, 82433770, 80471163, 80537344, 80943706, 80820939]
5911H0820939j882529l282871J916123K46130p39112K73940O32704K86180J90152
5902G8461656R56781K394007R43356j809098l081356J964531M613214m18425J89019
5893H4213685M21052K198723J254175k19439J226522O2638O8186K080768K9143
5884I1335453j951755k095219N46667L395545q43029k174628J15703j57250M458714
5875I2630201J137594M09114J256875K90727K024250M78369P28401J399602O45119
5866A01000252j631412Q07680L462008R11394k578767o02497N26075O74874K623190
5857A05192797j329730k810536j977895M29262j676408j343884o91095k419726
5849I3372785m015076j970836J907031O38425l573526k87109K111665r2586j152049
$$ y = [80820939, 78938410, 75655539, 77571662, 77817792, 77078680, 77352620, 77985324, 78271504, 78461656, 79418437, 81812444, 82755800, 80946702, 77865346, 79829877, 84443091, 84024666, 84213685, 84634737, 86833460, 88087635, 87868196, 89094718, 89157356, 89225542, 91306310, 91335453, 89383698, 87288479, 87835146, 91230691, 90387662, 88213034, 88328737, 88171487, 92630201, 93767795, 94176909, 95433784, 95724511, 97748761, 98227130, 98955531, 100355133, 101000252, 99368840, 100176520, 103638528, 104549922, 101971155, 101368658, 101894733, 102569607, 105192797, 103863067, 101052531, 99074636, 99503898, 97827490, 96483606, 95792511, 93372785, 89357709, 87386873, 89293904, 89932329, 86358803, 86071694, 88183359, 88090773, 86938724]
5840H6938724q04745j370756k856210j522240j884371r72026Q28795l550940k934286
5831G1871945M77682j754652k951807K20317P92510j980014O7972M14010k766370
5822F4391593k357344k784773j823367J185252Q96832k470644j831708J215448
5814E6421289l64595k594196J24817N55243k806081k751261j221058j289010j6707
5805D6058441o98507l093921j305057l80166L92921j439681j619558p01582m459585
5796C2753305j416686K592359j18374r62829k772313j475095J667871j605761
5788B8662477k336777q23439j998730j242490j866354n48859K787346l79730k135965
5779B0117479l48264q80591J417292k495149j208955J286713j743930o05514q22400
$$ y = [86938724, 86133979, 84763223, 81907013, 80384773, 78500402, 77528376, 78357171, 74806231, 71871945, 72349627, 70594975, 67643168, 67863485, 68655995, 66675981, 66743953, 67157963, 64391593, 62034249, 59249476, 57426109, 58611361, 59508193, 57037549, 55205841, 56421289, 56056694, 53462498, 53587315, 54142558, 51336477, 48585216, 47364158, 46075148, 46058441, 45359934, 42266013, 40960956, 40580790, 40973711, 39534030, 37914472, 37212890, 32753305, 31336619, 33928978, 33810604, 32847775, 30075462, 28600367, 30268238, 28662477, 26325700, 25502261, 23503531, 22261041, 20394687, 19845828, 22633174, 22253444, 20117479, 19769215, 18888624, 20305916, 17810767, 16601812, 17888525, 16144595, 15539081, 14716681]
5770A4716681O70581K761365p99963p87696n06198j450957J977591j078083k825974
5761A2677347K55827m55386J494638o87213r05566O80241k96842N5071o78933
5752A2139184J225241Q04232j395131N3333j238547k87955L130491j739621j015913
5743A1675314K31044Q96412L414442k380018k580966M72205o0378P67184j243277
5734A1191962j61666l24538j074263J791356J065927o7515Q28559j610872k120123
5725I518827J548585J325892J988134N3680k533051k999826J101076L372331Q15386
5716A4191034j501065j409163m82661J227335K050137k06239l519616j466161
5708H883601j129983j288513K543911K971216j235036q33301L338517K364798
$$ y = [14716681, 15387262, 18148627, 17348664, 16560968, 16054770, 14603813, 16581404, 15503321, 12677347, 12933174, 12477788, 13972426, 13285213, 12379647, 13059888, 12763046, 12818117, 12139184, 13364425, 14168657, 12773526, 12826859, 11588312, 11300357, 14430848, 12691227, 11675314, 11906358, 12802770, 16217212, 13837194, 11256228, 11728433, 11668055, 12435239, 11191962, 11030296, 10705758, 9631495, 11422851, 12488778, 12421263, 13249822, 11638950, 9518827, 11067412, 12393304, 14381438, 14435118, 11902067, 8902241, 10003317, 13375648, 14191034, 12689969, 11280806, 10798145, 12025480, 14075617, 13869378, 10349762, 8883601, 7753618, 6465105, 9009016, 11980232, 10745196, 9911895, 13250412, 15615210]
5700A5615210o4688j568212j314832M03898k097465j677569N8750j968100j00879
5691G286113R65745K525561M490396o8787m875373m19225M93935Q09565j167470
5682A0040460K21131o7538k82874R76644N30214N94679m76232k893878J316L638759
5672A2282681J108617k558204l258333N86296J801039J049875q80480j785J503009
5663A1632715p40311j047954n6558K69623O95499J547388K179729j147079k185293
5654A1147759O29769K072875K187858K228656o80227K23821j25968M682N52201
5645A8241426J10445O740j93193M99583P03451K60590p16743N78648q67968p78613
5635A7844366k90614J122333J743524j323397J80044K465257J609341o60818j653519
$$ y = [15615210, 15550522, 13982310, 12667478, 13071376, 10973911, 9296342, 9355092, 7386992, 7286113, 8251858, 10777419, 15267815, 15199028, 10323655, 9904430, 10398365, 11207930, 10040460, 10261591, 10194053, 9911179, 10887823, 11418037, 12012716, 11536484, 8642606, 8643922, 12282681, 13391298, 10833094, 7574761, 8161057, 9962096, 11011971, 10131491, 10129706, 11632715, 10892404, 9844450, 9787892, 10057515, 10753014, 12300402, 14480131, 13333052, 11147759, 11777528, 13850403, 16038261, 18266917, 17586690, 17810511, 17684543, 17689225, 18241426, 18351871, 18358611, 18165418, 18665001, 19368452, 19629042, 18912299, 19490947, 18622979, 17844366, 17553752, 18676085, 20419609, 19096212, 19276256, 21741513, 23350854, 22690036, 21036517]
5626B1036517o77936N50376K749558L420811j587933k892447Q38189K773937o6781
5617B6144291J028940K655121P7082p95193j870408J21312L51119j529734K16785
5608B6399315J453956m142244p42223J177000J020167K919874o54026P36347J91355
5599B8359521J027112M346446r04196n98992J036912L65193O37667j231551K733945
5590C5772057J176548j693922L956477M96880j919468k8299n11601Q56855M19801
5581C8525328l023593l607238l57525J431370J049792j191951j835794k189121
5573B8801268J867565K256802j01489n82915L03440m53952j238910l76479J112454
5564C1587784K733629j95700k616370j438887N89266L138298J317344j513829
$$ y = [21036517, 20358581, 20908957, 23658515, 27079326, 25491393, 22598946, 23437135, 26211072, 26144291, 27173231, 29828352, 29905434, 29110241, 27239833, 27361145, 27712264, 26182530, 26399315, 27853271, 23711027, 22968804, 24145804, 25165971, 28085845, 27431819, 28168166, 28359521, 29386633, 33733079, 32828883, 32229891, 33266803, 33631996, 34269663, 33038112, 35772057, 36948605, 35254683, 39211160, 39708040, 37788572, 37760273, 37248672, 38105527, 38525328, 35501735, 31894497, 31536972, 32968342, 34018134, 32826183, 30990389, 28801268, 30668833, 32925635, 32824146, 32241231, 32544671, 32090719, 30851809, 30475330, 31587784, 34321413, 34125713, 31509343, 30070456, 30659722, 33798020, 35115364, 33601535]
5556C3601535J810697N49738J39301P16814q18691j079149J404571J271746p08112
5547C6888450j455876K97843J118491j390173J574281J105475r77180j507180
5539C5654131K03831J300773J528740o12101k736532l87506J626750L408248J891935
5530D1878269N24354J264964J874284Q29686k43784K187134L857979Q98885m161405
5521D8910366k427185R09670R59799J9731O75978J489106J331768N81686O67891
5512E3118810J464817J308431P50832k61334J963141K346421R86132J93053M38441
5503F2308744J245650J959234N7148K79898K034321K311654J568366j017203K228507
5494G2976319M833831J737463O30118M873488J966280N28339K672460J838858
$$ y = [33601535, 35412232, 35961970, 36101271, 36818085, 35999394, 34920245, 36324816, 37596562, 36888450, 35432574, 35730417, 36848908, 35458735, 37033016, 38138491, 37161311, 35654131, 35857962, 37158735, 38687475, 38075374, 35338842, 34951336, 36578086, 39986334, 41878269, 42402623, 43667587, 45541871, 46371557, 46127773, 48314907, 52172886, 53071771, 48910366, 46483181, 47392851, 48352650, 48372381, 49048359, 50537465, 51869233, 52450919, 53118810, 54583627, 55892058, 56642890, 56381556, 58344697, 60691118, 61677250, 61870303, 62308744, 63554394, 65513628, 65570776, 65850674, 67884995, 70196649, 71765015, 70747812, 72976319, 77810150, 79547613, 80177731, 85051219, 87017499, 87545838, 90218298, 92057156]
5486I2057156K891971L806896M713486N416110N073039O919429M083426N204290
5478A30165803J0321948O995084N307454O315611P323629P601882M638000O300932
5470A84970343L246777j411882K682031L951389M140996L997584R43505N354129
5462B07874872O071149K69596j152504k49055K612061K90405m36168K10987m6776
5453B15444567K58856p70779k779333k27387J904692j182400l690837k777543
5445B06179836m147566n929972l34488L764414r58806l219847p55262l84471j872581
5436A92341257l834231l124699k476109m684381m886344o268671m586595k921552
5428A59558675m982914o498282l509650j681288k499112k448434k376245j013201
$$ y = [92057156, 94949127, 98756023, 103469509, 108885619, 113958658, 120878087, 124961513, 130165803, 140487751, 147482835, 152790289, 159105900, 166429529, 174031411, 178669411, 184970343, 188217120, 186805238, 189487269, 193438658, 197579654, 201577238, 202520743, 207874872, 213946021, 214215617, 213063113, 212814058, 215426119, 215716524, 215280356, 215491343, 215444567, 215703423, 214932644, 212153311, 211925924, 213830616, 212648216, 208957379, 206179836, 202032270, 196102298, 195767810, 199532224, 198573418, 195353571, 194598309, 194213838, 192341257, 188507026, 185382327, 182906218, 178221837, 173335493, 167066822, 162480227, 159558675, 154575761, 148077479, 144567829, 142886541, 140387429, 137938995, 135562750, 134549549]
5420A34549549q24361o84391j415797j011356j684415J029267j85716m249537
5412A25523243j283646J657553R95452j138845L479406P07692l161416k867879
5404A23911560K688868K720619k871142k661405j232300K42823J437610k26058
5396A24010575n28627P31372q98540J734414o50654m94217K38707k124908k50615
5387A21767507O61984N89227j393030l662224O65282j420051l073262j93889k065162
5378A11876382m72402j120937j739221l41134k022345k527312j925521k742396
5370I8985114j272326Q35686m86115l105488l531130p21348q71473n94156k769920
5361H6468844m026527p02222r06059k880992k384016j966483k279328m7689J02054
$$ y = [134549549, 133725188, 133040797, 131625000, 130613644, 128929229, 129958496, 129772780, 125523243, 124239597, 125897150, 126892602, 125753757, 129233163, 129940855, 126779439, 123911560, 126600428, 129321047, 126449905, 123788500, 122556200, 122799023, 124236633, 124010575, 123481948, 124213320, 123314780, 125049194, 124398540, 123904323, 124143030, 122018122, 121767507, 122429491, 123018718, 121625688, 117963464, 118628746, 117208695, 114135433, 113941544, 111876382, 111403980, 110283043, 108543822, 108202688, 106180343, 103653031, 101727510, 98985114, 97712788, 98548474, 98062359, 94956871, 91425741, 90704393, 89832920, 89238764, 86468844, 82442317, 81740095, 80834036, 77953044, 75569028, 73602545, 71323217, 71275528, 71377582]
5352G1377582l70027k442226l204078n08243q00292Q38160L77617r94465p79579
5343F3494449k52078O7775J095480k08953o13471p04902q2520k67654j256682
5334F1271444l62761J21979K007306M14104j173020K038618J219373j102868M51503
5325F4885678m28500Q10584n69741K75218J348554j521269j327510J159850K521278
5316F7154142j005779k152906k1241L450610L368614J216811j859542j572783
5308F8577926K294213K482441J999596N98560J232295J944094J575862K031069
5300H2736056J151938M21532K32464J53638K132105J751200k46658K836269K701797
5291I3870341K658799k08863m19938J752771n2589M46730J718901O17394L444039
$$ y = [71377582, 71007555, 68565329, 65361251, 64853008, 64052716, 64890876, 65268493, 64274028, 63494449, 63242371, 63310146, 64405626, 64196673, 63583202, 62878300, 62795780, 62528126, 61271444, 60908683, 61030662, 63037968, 63452072, 62279052, 64317670, 65537043, 64434175, 64885678, 64457178, 65267762, 64698021, 64973239, 66321793, 64800524, 63473014, 64632864, 67154142, 66148363, 63995457, 63974216, 67424826, 70793440, 72010251, 70150709, 68577926, 70872139, 73354580, 75354176, 75952736, 77185031, 79129125, 80704987, 82736056, 83887994, 84309526, 84541990, 84695628, 86827733, 88578933, 88332275, 91168544, 93870341, 96529140, 96320277, 95900339, 97653110, 97600521, 98047251, 99766152, 100383546, 103827585]
5282A03827585M816716L333672L989947K38253j69245J137982K976863Q84524
5274A21036297M2816K332607N38393J424783M102935L628855K765929M44283m9962
5265A36266936L504402K164545J324842L407586J715375L691363L464667K322368
5257A57862084L240176J857849K460623R10120L40013N172480L062040J633949
5249A76539334L248189L943331M403000L06302J768642N982091M347700L527608
5241B04066197L869352M830241L880497L978368N056819L207574K255438L222405
5233B34366891K611971N852524M506577K741195L014909M296482N178213M921828
5225B67490590L395056K581683L646829L613726N794925L054096J401848J934996
$$ y = [103827585, 108644301, 111977973, 115967920, 116206173, 116036928, 117174910, 120151773, 121036297, 121079113, 123411720, 123950113, 125374896, 129477831, 133106686, 135872615, 136316898, 136266936, 139771338, 141935883, 143260725, 146668311, 148383686, 152075049, 155539716, 157862084, 161102260, 162960109, 165420732, 166330852, 166670865, 171843345, 174905385, 176539334, 179787523, 183730854, 188133854, 188440156, 190208798, 196190889, 200538589, 204066197, 207935549, 212765790, 216646287, 220624655, 225681474, 228889048, 231144486, 234366891, 236978862, 242831386, 247337963, 250079158, 253094067, 257390549, 262568762, 267490590, 270885646, 273467329, 277114158, 280727884, 286522809, 289576905, 290978753, 292913749]
5217B92913749K681109K881284N336111O76456m20754K499351L670016K616000
5209C12853322O70553K582658k679168k785181J642160J474632j052367k484285
5201C10222324n680345l064723J573626n43225m747801o262383j749530k017138
5193B87730805m696844m690842l719189l982004k682397n410098m159740k797454
5185B55592237l751303o931349q419288l112906l179746o434627n861154l544914
5177B14356950l097541l943375p505704j430061k640009q245100l657688j957562
5169A81879910j338487m314932p286038n671681l061164j363140m65542n296963
5161A53081963k975279j967551m560404j015064j67795l788496n762502j404231
$$ y = [292913749, 295594858, 298476142, 303812253, 304488709, 304067955, 306567306, 310237322, 312853322, 313523875, 316106533, 313427365, 310642184, 312284344, 313758976, 312706609, 310222324, 304541979, 301477256, 303050882, 302507657, 297759856, 291497473, 289747943, 287730805, 283033961, 278343119, 274623930, 270641926, 267959529, 262549431, 258389691, 255592237, 251840934, 244909585, 236490297, 233377391, 230197645, 223763018, 217901864, 214356950, 211259409, 207316034, 199810330, 198380269, 195740260, 187495160, 183837472, 181879910, 180541423, 176226491, 168940453, 163268772, 160207608, 158844468, 158378926, 153081963, 150106684, 148139133, 143578729, 142563665, 142395870, 138607374, 132844872, 131440641]
5153A31440641j19365r72093l972767l842833j163543k339641k867501L0479R63783
5144A17157160m543766k681246l844013m042270K063661l17623k832511j249259
5136I9710133k944072j879689o15878k4387o73676m620091J944890P74879l729198
5127H7942911k377124k125424k322336K282690K055777l098314m329042n35674
5119G7493464K522249j678892j192958J009495j051516j644096J426157O52905
5111G7536808J084519L35466n73424p41704M80583K6378k159972k85117k010669
5102G3692868j003869J470079J910641m75771j391235k288993R99035K736652
5094G5649407j284295j334503j356429n71518J589628P66620o34343j337737o2040
$$ y = [131440641, 131321276, 130349183, 126376416, 122533583, 121370040, 119030399, 116162898, 116193377, 117157160, 112613394, 109932148, 106088135, 102045865, 104109526, 103791903, 100959392, 99710133, 96766061, 94886372, 94270494, 94246107, 93572431, 88952340, 90897230, 91672109, 87942911, 85565787, 83440363, 81118027, 83400717, 85456494, 82358180, 78029138, 77493464, 80015713, 78336821, 77143863, 78153358, 77101842, 75457746, 76883903, 77536808, 78621327, 78956793, 78383369, 77641665, 78122248, 78148626, 75988654, 75703537, 73692868, 72688999, 74159078, 76069719, 75593948, 74202713, 71913720, 72912755, 75649407, 74365112, 73030609, 71674180, 71102662, 72692290, 73458910, 72824567, 71486830, 71424790]
5085G1424790L88641J56359J258597j194367l192072M62327R30061O03008j597535
5076F9239809j256197L63560r50757p90879j71871M232174R35000j952388j015130
5067F8633321J7905J090962l32542j668145j355830j391092P89360j88402K6357
5058F5621894L543952Q29077k779448P79694K914909Q85768n21421k271693m002230
5049F5000502j179540J334060L4441L74304J426178K57351m1882J182122J936536
5040G0324072J200024M1320J31704J681311J401848J048172J466027J846471Q15352
5031G9956301r70659J774278O20705l59749J718187P83665k62535J093470J384077
5022H5737740J273237K29863K895963P80218k026249l222187j365663L172181
$$ y = [71424790, 71813431, 71969790, 73228387, 72034020, 68841948, 69304275, 70234336, 70837344, 69239809, 67983612, 68347172, 67396415, 66605536, 66433665, 70665839, 71600839, 69648451, 68633321, 68651226, 69742188, 69409646, 67741501, 66385671, 64994579, 65783939, 65595537, 65621894, 69165846, 69994923, 67215475, 67995169, 70910078, 71795846, 71274425, 69002732, 65000502, 63820962, 65155022, 65189463, 65563767, 66989945, 67247296, 67205414, 68387536, 70324072, 71524096, 71565416, 71697120, 73378431, 74780279, 75828451, 77294478, 79140949, 79956301, 78985642, 80759920, 81380625, 81020876, 82739063, 83522728, 83260193, 84353663, 85737740, 87010977, 87240840, 90136803, 90917021, 88890772, 85668585, 84302922, 87475103]
5014H7475103K8116m090609l51200k45800K15146K807868J889247K70800l230081
5005H4768590o07020L841996O61043m73085J376601p6027j73780j051156N77948
4996H8845110K853283J32767q0868J361431J226356O15769j665659J186448K957395
4987I7432032j22075l055512L56357K770556K189310N27548k390381L27500L202657
4978A01237992J98634J267285n16227j016907K452463j023991p67326K344283
4970A04176206L060156J493880K413825L827786J978753O91160L511133L996467
4962A25149366K076224j267801l152381k134705k143167j009598m717164k521501
4954A10279273j686607l324631O4739j300996j579609j281289l611142r25390
$$ y = [87475103, 87503219, 83412610, 83061410, 82815610, 83030756, 85838624, 87727871, 87998671, 84768590, 84161570, 88003566, 88664609, 88191524, 89568125, 89492098, 89318318, 88267162, 88845110, 91698393, 91831160, 91750292, 93111723, 94338079, 94953848, 93288189, 94474637, 97432032, 97309957, 94254445, 94610802, 97381358, 99570668, 100098216, 97707835, 98035335, 101237992, 101436626, 102703911, 102187684, 101170777, 103623240, 102599249, 101831923, 104176206, 107236362, 108730242, 111144067, 114971853, 116950606, 117641766, 121152899, 125149366, 127225590, 125957789, 122805408, 120670703, 118527536, 117517938, 112800774, 110279273, 108592666, 105268035, 105332774, 104031778, 102452169, 101170880, 97559738, 96634348]
4946I6634348J047449k547779j652528k377389l456154j012768p84425J86886
4938H6037640j543428j468615K65844J447645o42185j739567J162826P14357j089717
4929H3144800j115698M03966N44135J300423J38201k17314k662956J119492J977199
4920H4632248O01531K481627K57512l28916M89340J417908r46940p71189L842567
4911I1675688J881208j18465J785400L440390J887030N97035K147846L670791
4903A06966923M948630o60607J97596L971848J327148n14830J473364K882945
4895A20593017M815981L870599j00307Q38710L549007L047342m44613J013188
4887A37182924M343507K414869q81365j776668n24417K394836m68176j799062
$$ y = [96634348, 97681797, 95134018, 93481490, 91104101, 87647947, 86635179, 85850754, 86037640, 84494212, 83025597, 83291441, 84739086, 84096901, 82357334, 83520160, 84234517, 83144800, 82029102, 82433068, 82977203, 84277626, 84415827, 84198513, 81535557, 82655049, 84632248, 85233779, 87715406, 87972918, 87644002, 88133342, 89551250, 88604310, 87833121, 91675688, 93556896, 93438431, 95223831, 98664221, 100551251, 101148286, 103296132, 106966923, 111915553, 111254946, 111452542, 115424390, 116751538, 116236708, 117710072, 120593017, 125408998, 129279597, 129179290, 130018000, 133567007, 136614349, 136169736, 137182924, 141526431, 143941300, 143059935, 141283267, 140758850, 143153686, 142685510, 140886448]
4879A40886448J449807L558689J452437k242944J167477J413576j172606J950100
4871A48462984K902830p72472k904847k234830J131246J547506O72686l087694
4863A45717409j731668k010644k026359j39051k206878l198168j668943k15563
4855A32520135J003811j856531k094264Q79959k640668l761945r69953K34855
4847A23315399r73249l739184m762295j619724k432242l507396q19151j485955
4839A03976203l567873j307036R97007j206812l983574j042145O40657k33287
4831I4273140J22204K35337l727602k499372j80772j215598R36773j57729k373638
4822H5412743P57713L890168K803225k710874j881226J711896N79212J100873
$$ y = [140886448, 142336255, 145894944, 147347381, 145104437, 146271914, 147685490, 146512884, 148462984, 151365814, 150593342, 147688495, 145453665, 146584911, 148132417, 148805103, 145717409, 143985741, 141975097, 139948738, 139809687, 137602809, 134404641, 132735698, 132520135, 133523946, 131667415, 129573151, 130453110, 127812442, 124050497, 123080544, 123315399, 122342150, 118602966, 113840671, 112220947, 109788705, 106281309, 105462158, 103976203, 100408330, 99101294, 100098301, 98891489, 94907915, 93865770, 94506427, 94273140, 94395344, 94630681, 90903079, 88403707, 88222935, 87007337, 87944110, 87786381, 85412743, 86170456, 90060624, 92863849, 90152975, 88271749, 89983645, 90562857, 91663730]
4814I1663730J425194J359314L44954m79620J238067J775110K612586K298959
4806A02238294j378578Q89518R13561L91518K041065r39701K951108K940493N66603
4797A10613881J485304L40336K693682J570718r61305K105040R06580K559915
4789A21314151K189848o15268N112154L819426J794249M250859l78297l25740
4781A37161382J824136L383295M216277K471138K819896K534075K866327O545499
4773A63822025M535052K115059N369771P922560P044054N236589O538738P214242
4765B09798090N955825Q444651J1375939J0323227R976218J1192345J3194900
4758B80261195J5104430J3060678J3647697J7530791J5296878J3361334J4564389
$$ y = [91663730, 93088924, 94448238, 94793192, 94313572, 95551639, 97326749, 99939335, 102238294, 100859716, 101749234, 102662795, 103054313, 105095378, 104155677, 107106785, 110047278, 110613881, 112099185, 112439521, 115133203, 116703921, 115742616, 117847656, 118754236, 121314151, 123503999, 122888731, 128000885, 131820311, 133614560, 137865419, 137487122, 137161382, 138985518, 142368813, 146585090, 149056228, 151876124, 154410199, 157276526, 163822025, 168357077, 170472136, 175841907, 183764467, 190808521, 196045110, 202583848, 209798090, 215753915, 224198566, 235574505, 245897732, 255873950, 267066295, 280261195, 295365625, 308426303, 322074000, 339604791, 354901669, 368263003, 382827392]
4751C82827392J3247057J1836905P705086N009890P631006O227106J877050j460673
4743D34900819j145133j546360j22748o41615k936698j818340R40368M98562m05478
4734D27723377j258826R2156k029248k650507m078480p280764q041808j1185431
4726C91290469j3553351j4181470j4574689j4544016j5247497j6530462j7197271
4719B85461713j3342424j3467252j3616720j0406556j1792031j2882844r317132
4712B00636754p896609n997032o853351p894908o054158n630987j766973l460047
4704A55082689q121844n853661l272243j151761k283330m950272k968298l278623
4696A23202657j907511j333378l266499q67403m5372j549762j839738l989942
$$ y = [382827392, 396074449, 407911354, 415616440, 420626330, 428257336, 434484442, 436361492, 434900819, 433755686, 432209326, 432086578, 431444963, 428508265, 426689925, 427630293, 428128855, 427723377, 426464551, 426556707, 424527459, 421876952, 417798472, 410517708, 402475900, 391290469, 377737118, 363555648, 348980959, 334436943, 319189446, 302658984, 285461713, 272119289, 258652037, 245035317, 234628761, 222836730, 209953886, 200636754, 192740145, 186743113, 179889762, 171994854, 165940696, 160309709, 158542736, 155082689, 146960845, 141107184, 137834941, 136683180, 134399850, 129449578, 126481280, 123202657, 121295146, 119961768, 116695269, 115827866, 115782494, 114232732, 112392994, 108403052]
4688A08403052n42918O29620l055746k722615j823256j769927p339r01327n35329
4679I7674215j390414j792893j532012l333996k105016j918574j703953j190551
4671H2706806j102840j238389k409120j509691l25420N93871j154915k091655
4663G3468647Q59219O11808k850097N33086q12271k350497l56295o93299K30943
4654F8641244o91663k999189J028332M37228j909439L87860P172r4148p38844
4645F4068553K90818R07264k423919k571228j099244k066459m67220K77015J791917
4636E8707497m11443k419107q73509J83535K40118r86661m996625l01620J285038
4627E0427223k752378j103543k422399K45709P93726q36088M10261L20991j231564
$$ y = [108403052, 107860134, 108489754, 105434008, 102711393, 100888137, 99118210, 99110871, 98209544, 97674215, 96283801, 94490908, 92958896, 89624900, 87519884, 85601310, 83897357, 82706806, 81603966, 80365577, 77956457, 76446766, 76121346, 76715217, 75560302, 73468647, 74327866, 74939674, 72089577, 72622663, 71810392, 69459895, 69103600, 68410301, 68641244, 67949581, 64950392, 65978724, 66415952, 64506513, 64894373, 64901545, 64807397, 64068553, 64359371, 65266635, 62842716, 60271488, 59172244, 57105785, 56638565, 56915580, 58707497, 58296054, 55876947, 55003438, 55186973, 55427091, 54440430, 49443805, 49142185, 50427223, 47674845, 46571302, 44148903, 44394612, 45188338, 44352250, 44762511, 45083502, 43851938]
4618D3851938k462499l201244j268063J311817j105672q96837k096557o79176
4610C3453707N1247j96140Q10659j602783j857268q3975N52173M0380Q68456N1007
4600C2087463k32786j222759M63977N40346j633623m51349J339932j587263k767120
4591B6536818j804895r04504q11497j54418J097751k501870P80086J511578k026500
4582B1722549N53177O40553k54254q87914j560207J201577q17542j873041j22949
4573A8601949j064761j725390o60509J968857J741641j343722j018799O11665
4565A7110931q3053J005453q01579k858105J491881j81845j313053j007839n26145
4556A2836646r45597k937587q06986L542985K116687o68152K08313j740857m25721
$$ y = [43851938, 41389439, 38188195, 36920132, 38231949, 37126277, 36229440, 34132883, 33453707, 33504954, 33308814, 34119473, 32516690, 30659422, 30575447, 31127620, 31168000, 32036456, 32087463, 31854677, 30631918, 31095895, 31636241, 30002618, 29551269, 30891201, 29303938, 26536818, 24731923, 23827419, 23015922, 22861504, 23959255, 21457385, 22237471, 23749049, 21722549, 22275726, 22916279, 22662025, 21774111, 20213904, 21415481, 20597939, 18724898, 18601949, 17537188, 15811798, 15151289, 17120146, 18861787, 17518065, 16499266, 17110931, 17027878, 18033331, 17231752, 14373647, 15865528, 15683683, 14370630, 13362791, 12836646, 11891049, 8953462, 8146476, 11689461, 13806148, 13137996, 13346309, 11605452, 11179731]
4547A1179731r75594N38358J571683J59943K56413J687336m565j459366j368095
4538A1585844K194539N91509k555014j969350k19776J604021K93985m41295k80295
4529A0804168J789299J110885r42611j428134J982854L8797m220123k862106P63469
4520G036498L298846J740045l612760k124083K354517J429240N42517p33072q8155
4511I843593j186027n25066R75777Q87358Q19919o48208j213146n18077R8498
4502H534621J298315J538086P28110k79584m216796j7565L476045N5007j747055
4493I369184k700231n9148K842750O62361j136916j897865O58299K227927M83572
4484A0449933p18463K007039M10916L18130q28187p59164J786381q3722j95600
$$ y = [11179731, 10204137, 10742495, 12314178, 12474121, 12730534, 14417870, 14413305, 12953939, 11585844, 13780383, 14371892, 11816878, 9847528, 9627752, 11231773, 11525758, 11084463, 10804168, 12593467, 13704352, 12761741, 11333607, 13316461, 13355258, 9135135, 6273029, 7036498, 10335344, 12075389, 8462629, 6338546, 8693063, 10122303, 10664820, 9931748, 9843593, 8657566, 8132500, 9108277, 9995635, 10815554, 10167346, 8954200, 8436123, 8534621, 9832936, 11371022, 12099132, 11819548, 7602752, 7585187, 11061232, 11116239, 9369184, 6668953, 6609805, 9452555, 10114916, 8978000, 7080135, 7738434, 9966361, 10449933, 9731470, 11738509, 12149425, 12467555, 11639368, 10880204, 12666585, 12582863, 12387263]
4475A2387263q61762q55084j159800J061645J904085n87260j714748M52165m49544
4466A0176960J813806L96252j978208j76921J605257J054673L93204q68541Q391
4457A2424873R99126r84685J021076j804887j088017P47875O06604r50330l50350
4448A0621285J231691L261801R88969n35476l20103n90345J381590J303492O19356
4439A7962260o6698q05248j331286J293082J056665m73666O22829J78771M58028
4430A8894737O92890J229503K04645l48576J516879J038465O86145K5528j121361
4421B2818855R71648K047442l063568M51223K934576J151208R01400j25288K347471
4412C0434967J830746j697752K78066J116441l34891J753059K69363l18132j03077
$$ y = [12387263, 11525501, 10670417, 9510617, 10572262, 12476347, 11889087, 10174339, 10626504, 10176960, 11990766, 12387018, 10408810, 10231889, 11837146, 12891819, 13285023, 12416482, 12424873, 13423999, 12439314, 13460390, 11655503, 10567486, 11315361, 11921965, 10971635, 10621285, 11852976, 15114777, 16103746, 15568270, 15248167, 14657822, 16039412, 17342904, 17962260, 17895562, 17090314, 15759028, 17052110, 18108775, 17635109, 18257938, 18436709, 18894737, 19587627, 20817130, 21021775, 20673199, 22190078, 23228543, 23914688, 23940216, 22818855, 23790503, 25837945, 22774377, 23225600, 26160176, 27311384, 28212784, 28087496, 30434967, 32265713, 30567961, 30846027, 31962468, 31627577, 33380636, 33649999, 33331867, 33228790]
4403C3228790J722987L648198j23900K588511M250335q77021J735938K641229
4395D8815067m51073K278032L358428L552027R3662J642161O201544M896485J946311
4386G2332644M767355N831131O281625M456133M459547O887685N711153N408907
4378A16136180O053123N176196L520047O039330N565657M319117M388902M640348
4370A55838900K570888K042386K491596J709357L475253J915582j244218k634834
4362A66164910l391005j572300k919212l642206l430548n913661m139204k361008
4354A38795766n541200m678026n754338p076143q343142o382100l088354q653792
4346H9278671m999054k845329p086959k501263k616821l161993l262161o513424
$$ y = [33228790, 34951777, 38599975, 38476075, 41064586, 45314921, 44437900, 46173838, 48815067, 48363994, 50642026, 54000454, 57552481, 57646143, 59288304, 65489848, 70386333, 72332644, 77099999, 82931130, 89212755, 93668888, 98128435, 105016120, 110727273, 116136180, 122189303, 127365499, 130885546, 136924876, 142490533, 146809650, 151198552, 155838900, 158409788, 160452174, 162943770, 164653127, 168128380, 170043962, 168799744, 166164910, 162773905, 161201605, 158282393, 154640187, 151209639, 145295978, 141156774, 138795766, 133254566, 128576540, 122822202, 115746059, 107402917, 101020817, 97932463, 89278671, 84279617, 81434288, 74347329, 71846066, 69229245, 66067252, 62805091, 56291667]
4338E6291667k752055j704846m037950l745959l390981J74431k646510m764389
4330C3423408j840983j35377J855316k76244p60929K087263j007817k301409j311270
4321B9731958j523435k205978j639716p75296l19721J53154o26611Q56759j440445
4312B2210669j686385j952814J508770O69819q38165j834156k497192J971625
4304A7552171J830148j104619l037475j599661O27796J560220j931410j588027
4296A2309143j43540J204593L84186M65399J816909j490477m17763j114813l349553
4287I664084K063956J316680k078066k18407J774815J244422j819349p92756n88028
4278A0567351j708664L07561R55106J134911m51820j892633N44664J841101l22825
$$ y = [56291667, 53539612, 51834766, 47796816, 44050857, 40659876, 40834307, 38187797, 33423408, 31582425, 31447048, 33302364, 33026120, 32265191, 34352454, 33344637, 31043228, 29731958, 28208523, 26002545, 24362829, 23587533, 23267812, 23420966, 22794355, 23651114, 22210669, 20524284, 18571470, 20080240, 20750059, 19911894, 18077738, 15580546, 17552171, 19382319, 18277700, 15240225, 13640564, 14268360, 15828580, 13897170, 12309143, 12165603, 13370196, 13754382, 14219781, 16036690, 14546213, 14128450, 13013637, 9664084, 11728040, 13044720, 10966654, 10748247, 12523062, 13767484, 11948135, 11155379, 10567351, 8858687, 9166248, 10121354, 11256265, 10804445, 8911812, 9456476, 11297577, 10974752]
4269A0974752k650642J939446L409055j293952k342131K28148O19298R67647j119326
4260A0732295k095305P4329P81552L27367k122375m55295J314774l29049R37284
4251I165577J654044j527136k089801p85870J472453m42206K85968J642098L23082
4242I698209j19430n05487j753370Q14404N35838k718509o57762j95485k23525
4233D874883J267192K214176M10696n65796P89361J100359k618729P43463J404922
4224I620527q93494j682513p38496J453250n57792J026416J727798M7782k6391
4215I977087j01415q25479Q47258q4697P59892K052537j422693j772617N8878
4206I488751j433385J643717L067143j834079k521496J918675L064059K60986
$$ y = [10974752, 8324110, 10263556, 13672611, 12378659, 10036528, 10264676, 10883974, 11851621, 10732295, 8636990, 8711319, 9492871, 9820238, 7697863, 7242568, 8557342, 8228293, 9165577, 10819621, 9292485, 7202684, 6416814, 7889267, 7447061, 7733029, 9375127, 9698209, 9578779, 9073292, 7319922, 8134326, 8670164, 5951655, 5293893, 5098408, 4874883, 6142075, 8356251, 8766947, 8201151, 8990512, 10090871, 7472142, 8215605, 9620527, 8727033, 7044520, 6306024, 7759274, 7201482, 8227898, 9955696, 10003478, 9977087, 9875672, 9050193, 9897451, 9812754, 10572646, 12625183, 11202490, 9429873, 9488751, 8055366, 9699083, 12766226, 10932147, 8410651, 10329326, 13393385, 13654371]
4198A3654371l630329r83969j531n10997P49427j71527Q63742J136793j444249
4189I661731j303550J879100J157180L099726j726067j760066K18243P62652J53823
4180A2142772j391909O92615o1474l48275O8923l1629J159345J275446k532462
4171A0973352n64010K399743J154332J6302j123850m01554N57843r0996J174239
4162A4095401p97813l44166J784789j935604J517674k7254k225358J50773N56131
4153A2774573J361674N06348k823745K97631O17680J267012M350134n73357k056397
4144A5721553l359847N91355J750206j450384L46684K812911l2126n01494j374221
4135A4504637P14869K777215j159028j911957L64187K442299K92083k283809J544985
$$ y = [13654371, 10024042, 9040073, 9038542, 8527545, 9276972, 9105445, 9969187, 11105980, 9661731, 8358181, 10237281, 11394461, 14494187, 12768120, 11008054, 11226297, 11988949, 12142772, 10750863, 11443478, 11382004, 11033729, 11102652, 11071023, 12230368, 13505814, 10973352, 10409342, 12809085, 13963417, 13979719, 12855869, 12454315, 13012158, 12921162, 14095401, 13297588, 12953422, 14738211, 12802607, 14320281, 14293027, 12067669, 12218442, 12774573, 14136247, 14642595, 11818850, 12116481, 12734161, 14001173, 18351307, 17777950, 15721553, 12361706, 12953061, 14703267, 13252883, 13599567, 16412478, 16380352, 15878858, 14504637, 15219506, 17996721, 16837693, 14925736, 15289923, 17732222, 18024305, 15740496, 17285481]
4126A7285481J449894K699269J67020m14795L863116p73248l567962J48754Q21280
4117B1678809J2827J117293k49509r17234k496632J998317K920421l2561m75465
4108B3556266J102157N68720K24764n42907q28628k376301K616514R1052j502286
4099B2909351L664779R92612O5674J099691N20457O41639m49605j149651L524534
4090C1819481J127876j871927j813773J831577K948837j779062n14572J785986
4082C3534423R36859M56372M59352K045463L496334l96596j41513r90352j356601
4073C8043741M67286M47801L832469K006768J81525K987597L009872P68817J30827
4064E1876703j247448L385259O50207q73454K176719J020849L810614L402889
$$ y = [17285481, 18735375, 21434644, 21601664, 21186869, 25049985, 24276737, 20708775, 20857529, 21678809, 21691636, 22808929, 22559420, 21642186, 19145554, 21143871, 24064292, 24031731, 23556266, 24658423, 25227143, 25451907, 24909000, 24080372, 21704071, 24320585, 24411637, 22909351, 26574130, 27566742, 27632416, 28732107, 29252564, 29894203, 29444598, 28294947, 31819481, 32947357, 31075430, 29261657, 31093234, 34042071, 32263009, 31748437, 33534423, 34471282, 34927654, 35387006, 37432469, 40928803, 40532207, 40390694, 39400342, 38043741, 38511027, 38958828, 42791297, 44798065, 44979590, 47967187, 50977059, 51745876, 51876703, 50629255, 54014514, 54664721, 53791267, 55967986, 56988835, 60799449, 64202338]
4056F4202338J519385J236380R13792J890687K304991l03473m68284J958221L466115
4047G6720152K055241J312911L706740J236662L825847K673697K479209M396262
4039I8406721L985037M492789M741654K859125M842963L859978N094245P650398
4031A35932910J180014M812183M377026N359268P127671K805723M890312N897689
4023A72382796P691321N400061K772323P723578O767195M851659N386094M385513
4015B17360540P844283N415802M447253M614125L387914O671726N930885L586852
4007B59259380J435204M686921P293375K693575N07181K341351O36749K371747
3999B81225483K587945j874967j411951q26301J180273j574286k797886Q98295
$$ y = [64202338, 65721723, 66958103, 67871895, 69762582, 72067573, 71764100, 71295816, 73254037, 76720152, 78775393, 80088304, 83795044, 85031706, 88857553, 91531250, 94010459, 98406721, 102391758, 106884547, 111626201, 114485326, 119328289, 123188267, 128282512, 135932910, 137112924, 141925107, 146302133, 151661401, 158789072, 161594795, 166485107, 172382796, 180074117, 185474178, 188246501, 195970079, 202737274, 207588933, 212975027, 217360540, 225204823, 230620625, 235067878, 239682003, 243069917, 249741643, 255672528, 259259380, 260694584, 265381505, 272674880, 275368455, 275875636, 278216987, 278853736, 281225483, 283813428, 281938461, 280526510, 279700209, 280880482, 279306196, 276508310, 277406605]
3991B77406605j269844k857892n218633m257119j188197k626691l384896o300779
3983B50302554n278041k378027n875760o297720n339917o118834o087427o385392
3975B06541436n601170o803790p776925o223565n659601o809932o605647n811376
3967A55249430m838996k398667m609335o902913n764314k619233m969576l916347
3959A19230049l289790l733244m323017l112481l034769l211441n951642l874326
3951H8699339j96976j922462n92886l196806k681644N38908j577932m866032k888550
3942G1314959K71119j708570m42786K118404r36001k176238k957236L55642J253188
3933F7092481j363281P00239j499853j152498J52607r49677J22000Q32278l172883
$$ y = [277406605, 276136761, 273278869, 268060236, 263803117, 262614920, 259988229, 256603333, 250302554, 245024513, 242646486, 236770726, 230473006, 225133089, 219014255, 212926828, 206541436, 200940266, 194136476, 186359551, 180135986, 174476385, 167666453, 161060806, 155249430, 150410434, 148011767, 143402432, 136499519, 130735205, 128115972, 123146396, 119230049, 115940259, 112207015, 107883998, 104771517, 101736748, 98525307, 92573665, 88699339, 88502363, 86579901, 85987015, 82790209, 80108565, 80647473, 79069541, 74203509, 71314959, 71586078, 69877508, 69434722, 71553126, 70617125, 68440887, 65483651, 65839293, 67092481, 65729200, 66429439, 64929586, 63777088, 63929695, 62980018, 63102018, 63934296, 60761413]
3924F0761413K334761K416239j692021p85051j140752J818055k36385j031644
3916F2444615J095045L184733J935214l25012m90563J006294o28273j087858j38975
3907F6995220L23557K428008K294839j587940Q07072L430679j15283Q51210J356622
3898G6783984K125503L243037j54803M14104L01441K450731L401339J537741K275981
3889I2379058Q71759K82043M334087J654132J632841K440265J756228J68097j112311
3880A04406199K839001M315216M71012K098737Q53375R72966L244995J280702
3872A20482203K500868N153059J557987j21497N524781M453504q94456J384887
3864A40041336M055446L565174M357802J352506K312743N821060M774283L641869
$$ y = [60761413, 63096174, 65512413, 63820392, 63035341, 61894589, 63712644, 63476259, 62444615, 63539660, 66724393, 68659607, 68334595, 67844032, 68850326, 68222053, 67134195, 66995220, 67318777, 69746785, 72041624, 70453684, 71260756, 74691435, 74576152, 75427362, 76783984, 78909487, 82152524, 81997721, 82411825, 82713266, 85163997, 88565336, 90103077, 92379058, 93250817, 93532860, 97866947, 99521079, 101153920, 103594185, 105350413, 105518510, 104406199, 107245200, 111560416, 112031428, 114130165, 114983540, 115956506, 119201501, 120482203, 122983071, 128136130, 129694117, 129572620, 135097401, 139550905, 138656449, 140041336, 144096782, 147661956, 152019758, 153372264, 155685007, 161506067, 166280350, 169922219]
3856A69922219L453463O089114O286469L143604Q500671Q998614M181395O389466
3848B16965015R349786R879188J0927064R470435R107447R451234J0582704J3991388
3840B99724261J3838036J1689517J1109513J3327409J7241005J6982736J4477894
3833C98390371J3813945J2519305J4125321J9285076J4520513J0073951R082454
3826D91810936J1775933J1319490P063453M683362L742933K504469J437974n25802
3818E33812748k739060n831732m957325m077741q015501p014963q601784j3436147
3810D79138495j0151061j2363251j5980184j1856651j4400688j5936687j5056990
3803C83392983j5720419j3638198j5410154j5510730j4063005j4860616j1775547
$$ y = [169922219, 173375682, 179464796, 185751265, 188894869, 197395540, 206394154, 210575549, 216965015, 226314801, 236193989, 247121053, 256591488, 265698935, 275150169, 285732873, 299724261, 313562297, 325251814, 336361327, 349688736, 366929741, 383912477, 398390371, 412204316, 424723621, 438848942, 458134018, 472654531, 482728482, 491810936, 503586869, 514906359, 521969812, 526653174, 530396107, 532900576, 534338550, 533812748, 531073688, 525241956, 520284631, 516206890, 508191389, 501176426, 492574642, 479138495, 468987434, 456624183, 440643999, 428787348, 414386660, 398449973, 383392983, 367672564, 354034366, 338624212, 323113482, 309050477, 294189861, 282414314]
3796B82414314j3022981j1488197r534812j0456067r491524r532378r987678r229139
3788A99671538n979784o472837r006483q209007n994997n543860l986658l166957
3780A51310955n904622l463384j526622k956097m901302k387575o55580l767584
3772A25748189m531040q27009j102280l826416k725345j041560q20479k386403
3764A08487657j720537L5330k129460m373889j757501K013792L07893n129232
3756I5734053k756667p90847j699752j101326j531552r21571p06996r78402k484931
3747H2762009k062689J128162k229563m219566P68578k056237o56727q56243k460382
3738G0117342j373653l054407j536914J406544O49102n82337k411392j315744
$$ y = [282414314, 269391333, 257903136, 248368324, 237912257, 228420733, 218888355, 208900677, 199671538, 193691754, 187218917, 178212434, 170003427, 164008430, 158464570, 154477912, 151310955, 145406333, 141942949, 140416327, 137460230, 132558928, 130171353, 129515773, 125748189, 121217149, 120390140, 119287860, 115461444, 112736099, 111694539, 110874060, 108487657, 106767120, 106802450, 104672990, 100299101, 98541600, 100555392, 100863285, 95734053, 92977386, 92186539, 90486787, 89385461, 87853909, 86932338, 86225342, 85246940, 82762009, 80699320, 81827482, 79597919, 75378353, 76146931, 74090694, 73433967, 72577724, 70117342, 68743689, 65689282, 64152368, 65558912, 66208014, 65625677, 63214285, 61898541]
3730F1898541J826146k538361J34472N05563j576403J241937j0161J635964J030370
3721F4148068R128M07542M33353J317909o65675j984358J059301J971004J274412
3712F7970684J980903K487519J688903J194089J744530K147076K572545J541523
3704H3327772O44386J31397J813734L005712J224664J044034J027582K102082
3696I4321363K475718j302277k49790J974001P01335k51032q08907K44871L53965
3687I7459247q73731k340779n551591j891502R38730j949949l918652l158662
3679G8713111r54760K408626l36734l945171j705890j846417j67070J448896j894108
3670G1720483l345779k992672N5475O97058n09886j517729j904816k20900K995332
$$ y = [61898541, 63724687, 61186326, 61320798, 61826361, 60249958, 61491895, 61481734, 63117698, 64148068, 64157196, 64564738, 64998091, 66316000, 65650325, 63665967, 64725268, 66696272, 67970684, 69951587, 72439106, 74128009, 75322098, 77066628, 79213704, 81786249, 83327772, 83972158, 84103555, 85917289, 88923001, 90147665, 91191699, 92219281, 94321363, 96797081, 95494804, 95245014, 97219015, 97920350, 97669318, 96860411, 97105282, 97459247, 96585516, 94244737, 88693146, 86801644, 87740374, 85790425, 81871773, 78713111, 77758351, 80166977, 79830243, 75885072, 74179182, 72332765, 72165695, 73614591, 71720483, 68374704, 65382032, 65437507, 66134565, 65624679, 64106950, 62202134, 61981234, 64976566]
3661F4976566O61588k919201j281844K524438K283027k749784o64772J821286
3653F4651304r20404R90263J115339L9216J955378L392063K603614m99517K49912
3644G3577168K838934J725054J651212R94006N89704K518750K183537J51190J89586
3635H6419141K906595O434229L131146N35437L149817K630254K111798M52583
3627A07771000p68879P88489K327290K904585L191458J218765K67705K342888
3619A20043301K154682J556892J863236Q28245K870610O9766j44803J206106J021463
3610A31469498K573215M27517l11025J162191N06724K832968L823832O90528R67687
3601A44143135K742473M471010J740092J220439K110697K837685P583472N136905
$$ y = [64976566, 65638154, 62718953, 61437109, 63961547, 66244574, 63494790, 62830018, 64651304, 63730900, 64721163, 65836502, 65875718, 67831096, 71223159, 73826773, 73327256, 73577168, 76416102, 78141156, 79792368, 80786374, 81376078, 83894828, 86078365, 86229555, 86419141, 89325736, 95759965, 98891111, 99426548, 102576365, 105206619, 107318417, 107771000, 107002121, 107790610, 110117900, 113022485, 116213943, 117432708, 117700413, 120043301, 122197983, 123754875, 125618111, 126446356, 129316966, 129386732, 129241929, 130448035, 131469498, 134042713, 134470230, 134159205, 135321396, 135828120, 138661088, 142484920, 143175448, 144143135, 146885608, 151356618, 153096710, 154317149, 156427846, 159265531, 166849003, 171985908]
3593A71985908J024269L599646M121395O967988J0808266N594238N348847N599354
3585B15049911Q350376Q913763O111684R007226J0005100P189214R754817Q666512
3577B83048603R878123J1584973Q184915P842117Q488463R566387Q872363Q270053
3569C55735997R187974Q977529O448559O489567N168180O014160R700331P426836
3561D15149133N129170L140612L978654O747569L549974Q5844J834456K103544
3553D41718956J79185N75738J913772j467751l458027o60617j438004j957596
3545D35405656k964603o241067n661933n028041m359046n676621q083763m822840
3537C92567742p510652p544456p247980q225895o364814r714634r075386q911029
$$ y = [171985908, 173010177, 176609823, 180731218, 187699206, 198507472, 204101710, 209450557, 215049911, 223400287, 232314050, 238425734, 247432960, 257438060, 264627274, 274382091, 283048603, 292926726, 304511699, 312696614, 320538731, 329027194, 338593581, 347465944, 355735997, 364923971, 373901500, 380350059, 386839626, 392007806, 398021966, 407722297, 415149133, 420278303, 423418915, 427397569, 434145138, 437695112, 437780956, 439615412, 441718956, 441898141, 442473879, 444387651, 442919900, 439461873, 438801256, 437363252, 435405656, 432441053, 426199986, 420538053, 415510012, 411150966, 405474345, 397390582, 392567742, 385057090, 377512634, 370264654, 362038759, 355673945, 345959311, 336883925, 327972896]
3529C27972896j2263216j1115026r063489q494449q569366j0233718r439606o888935
3521B51905091r424190q697203q479430p388255q998404j0084470p799458p338867
3513A83694814r573866p406578n415325m153400l313214m772757m834231n314848
3505A38910595k039839k921252m458881j549462l198811j258354q17957n756786
3497A16909253j684843J11792q95926M79018k244631k451371j632290k712575
3489A05878427M81271p01256l200855q95940k319389q24916m94182j493149m2551
3480I6387460l599990j646834r13217l140804K050121j652569l621150J033017
3472H4896034k834630k690836j16434m438702n072483k508400M7499o04718m586933
$$ y = [327972896, 315709680, 304594654, 295531165, 287036716, 278467350, 268233632, 258794026, 251905091, 242480901, 233783698, 225304268, 217916013, 208917609, 198833139, 191033681, 183694814, 174120948, 166714370, 161299045, 157145645, 153832431, 149059674, 144225443, 138910595, 136870756, 133949504, 129490623, 127941161, 124742350, 123483996, 122666039, 116909253, 115224410, 115336202, 114440276, 114919294, 112674663, 110223292, 108591002, 105878427, 106359698, 105658442, 102457587, 101561647, 99242258, 98417342, 97923160, 96430011, 96387460, 92787470, 91140636, 90227419, 87086615, 89136736, 87484167, 83863017, 84896034, 82061404, 79370568, 79254134, 74815432, 69742949, 67234549, 67282048, 66677330, 62090397]
3463F2090397k433364o38230j129316J324069j352090m973045j992163j403830
3455D9492428l292390k940724j139935m62290k505917k185882j054080j381286
3447C4529924j43214j409799q47965J284422k30532j274988O10593P08915m191821
3438B9035535k875215J125007Q12049p68779k670806o49601J797678j7348l225195
3429B2563325r78095R06306J163424J072561j288617k437155m90396J238713M7535
3420B1797601j528897j456267L204029M87150m449160j116337r08934N63690J447848
3411A8040723m83858j19061J058647K94145j538719l818844j67050K58057m19545
3402A3104495J434436P69088l89088k261399j019350J803818J153738j920536
$$ y = [62090397, 59657033, 59018803, 57889487, 59213556, 57861466, 52888421, 50896258, 49492428, 46200038, 43259314, 42119379, 41657089, 39151172, 36965290, 35911210, 34529924, 34386710, 32976911, 32128946, 33413368, 33182836, 31907848, 32518441, 33227356, 29035535, 26160320, 27285327, 28097376, 27328597, 24657791, 24008190, 25805868, 25788520, 22563325, 21585230, 22491536, 23654960, 24727521, 23438904, 21001749, 20511353, 21750066, 21797601, 20268704, 18812437, 22016466, 22503616, 18054456, 16938119, 16029185, 16592875, 18040723, 17556865, 17437804, 18496451, 18790596, 17251877, 13433033, 13265983, 13524040, 13104495, 14538931, 15308019, 14918931, 12657532, 11638182, 13442000, 14595738, 12675202]
3394A2675202j590982r59259J993534K84837n47828j122590j392892j56806j061757
3385H121459J327039J649658M46266j798962q35834k95029J701050N14402j697000
3376I133049j349644Q31267K486446j309980k752775M78457J590841L09957l43588
3367I074030r86694l61848j16176k293969o70479K074461R22551J18931r03765
3358F857042J44624M34213P99491K501564j704057k968821O15806M45861n39895
3349F585828r4469p5805m25660Q09933m32334k76775j25936N34224n58764J421705
3339G361947j275296m049743J959783L131441L19969l133716k055985J348235
3331C606635K328277J798510Q23533k781550R78659N89493j543503k94534j58575
$$ y = [12675202, 11084220, 10124961, 12118495, 12403332, 11855504, 10732914, 9340022, 9183216, 8121459, 9448498, 11098156, 11544422, 9745460, 8909626, 8614597, 10315647, 10830049, 9133049, 7783405, 8614672, 11101118, 9791138, 7038363, 7516820, 9107661, 9417618, 9074030, 8087336, 7725488, 7609312, 5315343, 4644864, 6719325, 7641876, 7760807, 6857042, 7001666, 7435879, 8235370, 10736934, 9032877, 6064056, 6679862, 7125723, 6585828, 6491359, 6415554, 5989894, 6799827, 6367493, 6090718, 5964782, 6499006, 5940242, 7361947, 6086651, 2036908, 3996691, 7128132, 7448101, 4314385, 2258400, 3606635, 5934912, 7733422, 8556955, 5775405, 6754064, 7343557, 5800054, 5505520, 5346945]
3322E346945k137863o94792J153073L55542M98517J94025O45875q14594Q9714
3313D636442o98303r17215J519625l21198r23370P80545N78689j130973j764274
3304A759968Q00641M34326P0479K588848M4189k483251j0363j61471K404374j555216
3294C892524O76572K387078l040008o6311L78083N2125O87898J5639K289646q16556
3284F456690j863892O88728P29427P20013r89532j044394J004464j761332j60348
3275C779824R47272l10430N39702p58739k25954J459238J292641J126156j162551
3266F687159J130931K44314k024855p96420J79170J72919J87426r95086o62704
3257D122854M32396J30700Q87252k52634O97849j557793P66410p16240K65860
$$ y = [5346945, 3209082, 2514290, 3667363, 4022905, 4521422, 4715447, 5361322, 4546728, 4636442, 3938139, 3020924, 4540549, 4219351, 3295981, 4076526, 4655215, 3524242, 1759968, 2560609, 2994935, 3065414, 5654262, 5698451, 3215200, 3204837, 3043366, 5447740, 3892524, 4569096, 6956174, 3916166, 3849855, 4227938, 4280063, 4967961, 4983600, 7273246, 6456690, 4592798, 5281526, 6010953, 6730966, 5741434, 4697040, 5701504, 3940172, 3779824, 4727096, 4416666, 4956368, 4197629, 3971675, 5430913, 6723554, 7849710, 6687159, 7818090, 8062404, 6037549, 5241129, 5420299, 5593218, 5780644, 4785558, 4122854, 4555250, 4685950, 5573202, 5320568, 6018417, 4460624, 5227034, 4510794, 4776654]
3248D776654K42315j885282j520850M7071j31744N74729J186697Q9683k03792
3239C175481m60171N04789J70478M15898J394687o13479k18237M83564j570537
3230C282473j320887J282890l72791M47959Q85079j523926k77012r80789p47124
3221F75872J164536K053312j210159j008938N33299J806049p3592j712599J370638
3212C598418P42533j235886p3406j311664k00163K388382j02778j739757j032431
3203A033248K737462J306813j417501k474492j589272K516847J685841p96857
3195C002089j940293j978523J46439J649190K381628o67109l499043K212463J325982
3186B632823j708297o5355O30033l78919p73849K51181l31227J844130J003036
$$ y = [4776654, 5018969, 3133687, 1612837, 1659908, 1528164, 2102893, 3289590, 3379273, 3175481, 2715310, 3220099, 3390577, 3806475, 5201162, 4587683, 4369446, 4853010, 3282473, 1961586, 3244476, 2871685, 3319644, 4204723, 2680797, 2403785, 1422996, 675872, 1840408, 3893720, 2683561, 1674623, 2207922, 4013971, 3940379, 2227780, 3598418, 4340951, 3105065, 3031659, 1719995, 1519832, 3908214, 3805436, 2065679, 1033248, 3770710, 5077523, 3660022, 1185530, -403742, 2113105, 3798946, 3002089, 1061796, -916727, -770288, 878902, 3260530, 2593421, -905622, 1306841, 2632823, 924526, 859171, 1489204, 1110285, 336436, 587617, 256390, 2100520, 3103556]
3177C103556j364014K71961k47501j271956J387375J641016j406283k993703k509525
3168c389074P27443L786834L118689k789280l855218K744750M161216j9944j820804
3159B664612j602880J331464j709895j868065N33012J918016J402437j493983
3151A174718o15963l22735J655465k19099l26240J525231j235197m157061K97915
3142b222966L064396l81829M00619n76935K84366J480656j65328j014072j689237
3133h20330l02057R02154Q80156o87824Q01501k29563l50531K202798j105586
3124A290718M17810K022683k105915m47853O37407K250818J927232k380398j72662
3115C439840J438526j689759j132358r15728O52853O77686l754572j575245L335059
$$ y = [3103556, 1739542, 2011503, 1764002, 492046, 1879421, 3520437, 2114154, -879549, -3389074, -2661631, 1125203, 4243892, 1454612, -2400606, 344144, 4505360, 4485416, 2664612, 1061732, 2393196, 683301, -1184764, -651752, 1266264, 2668701, 1174718, 558755, 236020, 1891485, 1672386, 1346146, 2871377, 1636180, -2520881, -2222966, 841430, 459601, 860220, 283285, 567651, 2048307, 1882979, 868907, -820330, -1122387, -220233, 659923, -27901, 773600, 544037, 193506, 2396304, 1290718, 1708528, 3731211, 1625296, 1177443, 1814850, 4065668, 5992900, 3612502, 3439840, 4878366, 3188607, 2056249, 1140521, 1793374, 2471060, -1283512, -2858757, 476302]
3106D76302J809302j475925j050134K456186M70356k535830J91877R73469j264726
3097E0877Q6574J554721k64010m482691J86942K607355r67161j342632j104763
3088c674788O85511J082029O80381P63107k198436j25886J822280j425999j801500
3079d193301k69559J566766Q22158k207068j049811N48833P01168K073496J264966
3070g42352n50362j891144J920386J538141r90643k223872l40978L095250Q00796
3061F15222j37969R09659j506899P1660J503911J56791o65533J94188Q58063J185210
3051C184303m061699j899951K235983Q99441R88445l19482p43339k208317Q91607
3042a033009Q95977o94973J503358J101468j592548Q6578K360546j933356l672073
$$ y = [476302, 2285604, 809679, -240455, 2215731, 2686087, 150257, 342134, 1315603, 50877, 137451, 1692172, 1428162, -3054529, -2867587, -260232, -1227393, -2570025, -3674788, -2989277, -1907248, -1226867, -463760, -2662196, -2788082, -965802, -2391801, -4193301, -4462860, -2896094, -2073936, -4281004, -5330815, -4781982, -4080814, -2007318, -742352, -1292714, -3183858, -1263472, 274669, -715974, -2939846, -3280824, -185574, 615222, 477253, 1386912, -119987, -48327, 1455584, 1612375, 946842, 1141030, 1999093, 3184303, -877396, -2777347, -541364, 358077, 1346522, 1027040, 283701, -1924616, -1033009, -137032, -832005, 671353, 1772821, 180273, 266851, 2627397, 694041, -2978032]
3033b978032J012693J800685m25353J138864j82841j489457o25904o16282M20998
3024a944629K447071j598422q13150R67547l18833o70587M07767M48863J48814
3015i25559J763359n8524l124280j011555J843402J301115N76357L98311J983449
3006B746075p20273m70716J665391q57796R41752J820544j870805k031264j10631
2997A112277j45974r72114k977754J518607J033607j451935L020457k50504k843260
2988a956593p62057P51527K312082k84389q77629Q68589J09462l01283j666986
2979a807277N22963K781861j567954k100610K69136m01252K434412r48599j813329
2970b630649J195857J260792L3580m16456n06252Q90744R46344J230326k883070
$$ y = [-2978032, -1965339, -164654, -590007, 548857, 366016, -1123441, -1749345, -2365627, -1944629, 502442, -1095980, -1909130, -941583, -1260416, -1931003, -1523236, -1074373, -925559, 837800, 779276, -2345004, -3356559, -1513157, -212042, 364315, 762626, 2746075, 2025802, 1555086, 3220477, 2362681, 3304433, 5124977, 3254172, 1222908, 1112277, 966303, -5811, -2983565, -1464958, -431351, -1883286, 1137171, 886667, -1956593, -2718650, -1967123, 344959, 60570, -817059, 51530, 160992, -140291, -1807277, -1284314, 1497547, -70407, -2171017, -1901881, -2303133, 131279, -817320, -2630649, -1434792, -174000, -140420, -556876, -1063128, -172384, 773960, 2004286, -878784]
2961h78784k215377J547525J850529N98322j226119j478126K83808J32843j333324
2952b718703J518574J182966J837645j76801l59680R20908Q95327P66010R79242
2943D845488j743561k967819j324932J139937J472136m16533k505851k778693
2935d279828N66045K754638K151837k119023k655769K419011K318779j757563
2927f01873p11396p48184J162960J708428j511887k58893K31440j767905j28114
2918b625424j624675J059407J899379M3105M96187j852424M91646J315217j416757
2909b214339O90980K082637J44615k661196O92654r03089m010001J442156K891790
2900a843793L61617o56167J98072K824641J819595q10149j553305m77104m06819
$$ y = [-878784, -3094161, -1546636, 303893, 902215, -323904, -1802030, -1518222, -1385379, -2718703, -1200129, -17163, 1820482, 1643681, 1284001, 2204909, 3100236, 3866246, 4845488, 3101927, 134108, -1190824, -50887, 1421249, 1004716, -1501135, -4279828, -3713783, -959145, 1192692, -926331, -3582100, -1163089, 1155690, -601873, -1313269, -2061453, -898493, 809935, -701952, -960845, -729405, -2497310, -2625424, -4250099, -3190692, -1291313, -1248208, -752021, -2604445, -2112799, -797582, -2214339, -1523359, 559278, 703893, -1957303, -1264649, -2167738, -6177739, -4735583, -1843793, -1482176, -2138343, -1940271, 884370, 2703965, 1893816, 340511, -136593, -543412]
2891e43412n5604J417226K60062j59574J499616l14586O77840j514303L72318
2882A639583j907842q7382L088155m428990j449166K931900J762285j781016l51432
2873e83905J349967K43818j367230K96590N471L00822k85112o67437r73467K105870
2863D25387J595787j610736j854450p46621R81723J8609J94835p30661K87163
2854a438964j46823J316730K560571k836096R41447O35940l87008j258422m67046
2845a079671P94009P70730J863952Q73337j382829j055868k531375j496349M073736
2836H29672L730157l667720k659997k62238J540265J148542o15754J506643J29120
2827A678690j483608J95680k19629j25330l60747L58795r42961k320937J977342
$$ y = [-543412, -599016, 818210, 1078272, 918698, 2418314, 2103728, 2781568, 1267265, 1639583, -268259, -355641, 2732514, -1696476, -3145642, -213742, 1548543, -232473, -583905, 766062, 1009880, -357350, -60760, -55289, 245533, -39579, -707016, -1680483, 425387, 2021174, 410438, -1444012, -2190633, -1208910, -1190301, -995466, -1726127, -1438964, -1585787, -269057, 2291514, -544582, 396865, 1032805, 645797, -612625, -1079671, -285662, 485068, 2349020, 3222357, 1839528, 783660, -1747715, -3244064, 829672, 4559829, 892109, -1767888, -2030126, -489861, 658681, 42927, 1549570, 1678690, 195082, 390762, 171133, 45803, -314944, 43851, -899110, -3220047, -1242705]
2818a242705j335478r30579K203722j479301L667714K313401k916974L61206k146835
2809a505829J329020L500k119612J625740n29711k210724p7825P67156K431719
2800b86566m97893k226988J647350K00032j93041L09076q39512N62871J833162
2791E08491k92483p28471p28115P16897j260567k124399L194929P0074Q48486
2782B04842n11140L43024J276565r30251Q8426j732000m16853L522881j163545
2773F81949k271281R2945J009063j47036j231382K043185J455787k958792p11467
2764b037029K14893K186687L633368k015296k019456j64564j868369Q32208n85155
2755a822713q91982j015814O70851K410626j548369K59021J659007Q5759J095218
$$ y = [-1242705, -2578183, -3508762, -1305040, -2784341, 883373, 3196774, 279800, 641006, -1505829, -176809, -173309, -2292921, -667181, -1196892, -3407616, -3485441, -2718285, -286566, -784459, -3011447, -1364097, -1164065, -1357106, -1048030, -1887542, -1324671, 508491, 216008, -512463, -1240578, -523681, -1784248, -3908647, -713718, -643644, 204842, -306298, 36726, 1313291, 383040, 471466, -1260534, -1677387, 1845494, 681949, -1589332, -1496387, -487324, -634360, -1865742, 177443, 1633230, -1325562, -2037029, -1822136, 364551, 3997919, 1982623, -36833, -201397, -2069766, -1237558, -1822713, -2714695, -3730509, -3059658, -649032, -2197401, -1938380, -279373, -193614, 901604]
2746I01604k133689j322010L76926j965199J5664J539464N62931O90767j75225
2737a508767J035001J768513j039742p50626J783314Q3848l629181k73181K015973
2728e14848J251344L3564j357099m35433J21561p30339N76870j01123o43266L90033
2718a408736J105823o41384l37902n74064j093563j200678J539029J143287j353226
2709b821414O08037J814426j12241J676533J032512k413577l66911Q56504J971093
2700B244962n0054m582297J49430K993769L07138l35927j310702O74853K42536
2691C33708j430131P96916J572495L84939l267744P86271K758180j675415k342463
2682b083244j565892J56021N26123o12759J210607K474362Q2551k193447j506331
$$ y = [901604, -1232085, -2554095, -2177169, -4142368, -4126704, -2587240, -2024309, -1333542, -1508767, -473766, 1294747, 255005, -495621, 1287693, 1371541, -2257640, -2530821, -514848, 736496, 770060, -587039, -1022472, -900911, -1631250, -1054380, -1155503, -1798769, -1408736, -302913, -944297, -1282199, -1856263, -2949826, -4150504, -2611475, -1468188, -2821414, -2213377, -398951, -511192, 1165341, 2197853, -215724, -582635, 273869, 2244962, 2194908, -2387389, -2237959, 755810, 1062948, 727021, -583681, 91172, 333708, -1096423, -299507, 1272988, 1657927, -1609817, -823546, 1934634, 259219, -2083244, -3649136, -3493115, -2966992, -3579751, -2369144, 105218, 187769, -2005678, -3512009]
2673c512009K670131N10771p47617R48308k481101o56791K699120l69576o76733
2664a615497j040o96267m20278P09910L04277j412599O3250J956413J397479M42630
2654G28278j741471J25719J988242J692315O875k451615r80675L60373R14542
2645F42583P10177o04213j87662q22646r24930R07515j652054J788051K850975
2636B707796j243751j906100J121612J77881P32687j592440j763595K115958J941164
2627B291212R4595J79659O97578q45158o3241N62480j370360r08313K19331n52653
2617C05130J52269j35926p25020Q37411L17944k083484M23822K0219K84604l00549
2607i03580O0844K549316j26472j848611o68706o96709l96639j5239m0452j771363
$$ y = [-3512009, -841878, -331107, -1078724, -130416, -2611517, -3268308, -569188, -938764, -1615497, -1616537, -2312804, -2733082, -2023172, -1718895, -3131494, -3068244, -1111831, 285648, 728278, -1013193, -887474, 1100768, 2793083, 2799958, 348343, -632332, -271959, 642583, 1352760, 748547, 560885, -261761, -1186691, -279176, -1931230, -143179, 2707796, 1464045, -442055, 679557, 857438, 1590125, -2315, -1765910, 350048, 2291212, 2385807, 2565466, 3263044, 2417886, 2354645, 2917125, 1546765, 638452, 857783, 305130, 457399, 321473, -403547, 433864, 751808, -1331676, -907854, -887635, -603031, -903580, -842736, 1706580, 1580108, -268503, -937209, -1633918, -2030557, -2045796, -2086248, -3857611]
2597c857611j967028K037159K335462Q8938j018501j701064J899689J624995j083344
2588a641305j250639j91067N66520J252165J208175J912950n94015j939621J05643
2579e71194m40808M208J883830M48056l67561o43919j6976q08784q32642J191549
2569a54241Q78885k934176j097665J335313L92270J077949o04792n32601l16064
2560a955122J402860K570474J39845q88848j644261j49468J036596J339303j366967
2551D84412j042915O3762O45529J363064J883565j131962j054824j91794k738895
2542a720058J932126K026687j898683k893690J628052J963248J143060M7224k875072
2533f47106j722815K661261M148681j289884m215275j76623k06858K547787J863233
$$ y = [-3857611, -5824639, -3787480, -1452018, -1363080, -2381581, -4082645, -2182956, -557961, -1641305, -2891944, -3083011, -2516491, -1264326, -56151, 1856799, 1262784, -676837, -571194, -1012002, -1007794, 876036, 1324092, 956531, 312612, 295636, -513148, -1345790, -154241, 724644, -2209532, -3307197, -1971884, -1579614, -501665, -1106457, -1639058, -1955122, -552262, 2018212, 2158057, 1269209, -375052, -524520, 512076, 1851379, 484412, -558503, -494741, 150788, 1513852, 3397417, 2265455, 1210631, 1018837, -1720058, 212068, 2238755, 340072, -2553618, -925566, 1037682, 2180742, 2227966, -647106, -2369921, 291340, 4440021, 3150137, -1065138, -1241761, -1448619, 1099168, 2962401]
2524B962401l259339j337561K578940N30062j487664L38688L11618q86082j967529
2515b216466J281700L424067k994591k555551Q00438N68974m01208l36802K41575
2506b187864K519476O01420j740938n58291J975051J051128r69445j769230k639380
2497c718073N59258R57488L650803J83591j349563J08126j845936K006657O67953
2488A220304j242213p9288q4891M98368J485022k101428j844543L124554L19210
2479A295095L09823k52789r05931j184153k12654J436601N59627K065946O22661
2470C734226l078640j178959m15308J071053J119959r92038N93374M58689j71735
2461A140621J13419k306455j885355J355568R40494N46750O06399j421483j334185
$$ y = [2962401, -296938, -1634499, 944441, 1474503, -13161, 325527, 637145, -248937, -2216466, -934766, 2489301, -505290, -3060841, -2260403, -1691429, -2092637, -2429439, -2187864, 331612, 933032, -807906, -1366197, 608854, 1659982, 690537, -1078693, -3718073, -3158815, -2201327, 1449476, 1633067, 283504, 391630, -1454306, 552351, 1220304, -21909, -101197, -186088, 312280, 1797302, -304126, -2148669, 975885, 1295095, 1604918, 1352129, 446198, -737955, -950609, 485992, 1045619, 3111565, 3734226, 655586, -523373, -938681, 132372, 1252331, 260293, 853667, 1312356, 1140621, 1254040, -1052415, -2937770, -1582202, -641708, -94958, 511441, -910042, -2244227]
2452b244227M56815Q23862K501754K502317m926360k241413J319475J038857N35119
2443b33801j095746K270855K012985j880621j5278J919728j265157k934882j665883
2434b887800M173055K87935k963596l97569j56736P51473J604377P05909j118510
2425a462p36568j268318K56838J924559K047492j065078k653082Q95728N04166
2416i5725n61267K89779L096532k269412j244120K320611K57198l96067k029899
2407f32370j127889J187312J878311j03249k537345j413313O55032o2027M97612
2398a657926J476282k67932j244945l78855J918319K794477l1541j589946k019917
2389a001984n68816J544237N4693O72946n63232k149134r9728J125959K033056
$$ y = [-2244227, -1787412, -963550, 1538204, 4040521, -885839, -3127252, -1807777, -768920, -233801, -1329547, 941308, 2954293, 1073672, 1058394, 2978122, 1712965, -1221917, -2887800, 1285255, 1573190, -1390406, -1787975, -1944711, -1193238, 411139, 1117048, -1462, -738030, -2006348, -1749510, 175049, 2222541, 1157463, -1495619, -599891, -95725, -656992, -367213, 2729319, 459907, -784213, 1536398, 1793596, 1397529, -632370, -1760259, -572947, 1305364, 1202115, -1335230, -2748543, -2093511, -2155538, -1657926, -181644, -449576, -1694521, -2073376, -155057, 2639420, 2607879, 1017933, -1001984, -1570800, -26563, 28130, 701076, 137844, -2011290, -2111018, -985059, 1047997]
2380A047997J37396j359754q15763R90833l34999J257603j390398k234516J332071
2371a369530J751805k66662M2741k29230j048639o76815j28716Q77241J113046
2362F5241K542037k04632j750929q89541P57691o25983K87697J26888J552998
2353A861467J288571j320541k620757r69429P08050M16622J653488L74319J772052
2344C163842j331160j237097L06643o40711k95699O01040J718221j421694r7319
2335G66066m2011j070304J698644R62522j004973Q91043k8721j224082j60304
2326G87880k86583Q23666P83127R18239q19463j205970P30190Q25223k76059n99289
2316A680961j890633J059987J581209J095325l595883l695027J236151N35206
$$ y = [1047997, 1185393, -174361, -990124, 709, -334290, 923313, -467085, -2701601, -1369530, 382275, 115613, 158354, -70876, -1119515, -1796330, -1925046, -1047805, 65241, 2607278, 2402646, 651717, -237824, 519867, -106116, 181581, 308469, 1861467, 3150038, 1829497, -791260, -1760689, -1052639, -636017, 1017471, 1391790, 3163842, 1832682, 595585, 902228, 261517, -34182, 566858, 2285079, 863385, 766066, 724055, -346249, 1352395, 2314917, 1309944, 2200987, 2172266, 948184, 787880, 501297, 1324963, 2108090, 3026329, 2206866, 1000896, 1731086, 2556309, 2280250, 1680961, -209672, 850315, 2431524, 3526849, -69034, -3764061, -2527910, -1992704]
2308a992704J899841j244800l927969L315164M803271j103042l695602J112403
2300h33438K740698k358736m99177O99963K7512j447659q02852K499280J222724
2291A248315O5786J528658j025883m81416k74067j287738J439194j25057l005845
2282a918053q65872K28187J584391J125749O82113J978961q88961k94313J167477
2273B799679O5186j174537j068698j0839J180306L48878k341668k840470K375895
2264f66268L990247j269393j653955q59835m30779J062881J094191r61452q08678
2255e03041J149613K119955J19124j975153o0798m51860p60496k33201R93366
2246C97509K436843J52312j079806R47692m84509j503379L083886k32338k571931
$$ y = [-1992704, -92863, -1337663, -5265632, -1950468, 2852803, 1749761, -1945841, -833438, 1907260, -451476, -950653, -250690, -223178, -1670837, -2473689, 25591, 1248315, 1314101, 2842759, 1816876, 1335460, 1061393, -226345, 1212849, 1087792, -1918053, -2783925, -2555738, -971347, 154402, 836515, 2815476, 1926515, 1632202, 2799679, 2864865, 1690328, 621630, 610791, 1791097, 2139975, -201693, -3042163, -666268, 3323979, 2054586, 400631, -459204, -889983, 172898, 1267089, 305637, -503041, 646572, 2766527, 2885651, 910498, 849700, 397840, -362656, -595857, 397509, 2834352, 2986664, 1906858, 2854550, 2370041, 866662, 3950548, 3718210, 1146279]
2237A146279l32166O44765J529798p12123j823952N57100j233501j70879J939361
2228A544682J43805j799439j510582L883415L5850l980290K512467J430921p99032
2219A461797j383433P40197K431885j645578k037538j213045p4697J79781J483868
2210e6763K77204k159534j353955J686165J335565N93745O51960r16153j254428
2201a196194j890967J152359M309843M57776j874243k930565j419482K371780
2193a019693J352735j73889N96086J833177n7402j328250p94816J388005R9732
2184A895685Q92932O40156J552251O92794l759041m40255J281714N53328M23218
2175C732782j586278r25313R84526K204368K044212j604536l344433N66444P56574
$$ y = [1146279, 814113, 1458878, 2988676, 2276553, 452601, 1009701, -223800, -394679, 1544682, 1688487, -110952, -1621534, 2261881, 2297731, -1682559, 829908, 2260829, 1461797, 78364, 818561, 3250446, 1604868, -432670, -1645715, -1720412, -1540631, -56763, 220441, -1939093, -3293048, -1606883, -271318, 322427, 974387, 58234, -1196194, -3087161, -1934802, 2375041, 2832817, 958574, -1971991, -3391473, -1019693, 333042, 159153, 755239, 2588416, 2531014, 1202764, 407948, 1795953, 1895685, 2788617, 3428773, 4981024, 5673818, 1914777, 1474522, 2756236, 3309564, 3732782, 2146504, 1221191, 2205717, 4410085, 6454297, 4849761, 1505328, 2071772, 2828346]
2166B828346M30765K942518j518687k645420k77579J101840p00041k68433L824626
2157E717935R96433k507623l55389p63046M22235j156584M05671J106529N29672
2148D395833j469677P18316P89223q30546J580196J821823k47599j803533J661594
2139F615630r57787j727668P36825J067547J075595q67984q38040P14599J957645
2130G776362J640563l50535q70925L46308J257257J70896r25226m23293J692859
2121A0314266K26838j74902l2137k88234Q43154J846749J544258P66287M82905
2112A5529184J776476j42012P65087J630624k30138N48324K45151O24107K005830
2103B2752633J941995L769365K369097j185677R03786M393382O550356K791967
$$ y = [2828346, 3259111, 6201629, 4682942, 2037522, 1759943, 2861783, 2161742, 1893309, 5717935, 6714368, 4206745, 3851356, 3088310, 3510545, 2353961, 2759632, 3866161, 4395833, 2926156, 3644472, 4433695, 3603149, 5183345, 7005168, 6757569, 4954036, 6615630, 5657843, 3930175, 4667000, 5734547, 6810142, 5942158, 5104118, 5818717, 7776362, 9416925, 9066390, 8195465, 8541773, 9799030, 9969926, 9044700, 8621407, 10314266, 10541104, 10366202, 10334065, 10045831, 10888985, 12735734, 14279992, 15046279, 15529184, 17305660, 17163648, 17928735, 19559359, 19329221, 19877545, 20122696, 20746803, 22752633, 24694628, 28463993, 30833090, 29647413, 30551199, 34944581, 41494937, 44286904]
2095D4286904J208888N139061N522136L502672N372448O248077L506984k1701
2087G4765469j14081o66499l971316m857798n698193p437510q436556k795880
2079D0787636j863522m802923k365604j921342M17022k748295n220549j307750
2071B0974673Q04154M66924m245573r44186N36616m312443j251207Q40709j359221
2062A1510446p56965J059755r29701k391668J209542J482749j901125j082775
2054H200258K2986l78090o13917M48095k10283j466361J125289j644724L23886
2045E807139k51263m50882Q66952j50072j120456N15602p50971l434501k08932
2036H22616L666188K081835k385242L51393J565876j058111l81040j648663j848342
$$ y = [44286904, 45495792, 50634853, 56156989, 59659661, 65032109, 71280186, 74787170, 74765469, 74651388, 73984889, 70013573, 65155775, 59457582, 52020072, 43583516, 40787636, 38924114, 34121191, 31755587, 29834245, 30251267, 27502972, 22282423, 20974673, 21778827, 22245751, 18000178, 17055992, 17592608, 13280165, 12028958, 12869667, 11510446, 10753481, 11813236, 10883535, 8491867, 9701409, 11184158, 9283033, 8200258, 8223244, 7845154, 7231237, 7679332, 7469049, 6002688, 7127977, 5483253, 5807139, 5555876, 5104994, 5971946, 5821874, 4701418, 5217020, 4466049, 1031548, 822616, 4488804, 6570639, 4185397, 4536790, 6102666, 5044555, 4663515, 3014852, 1166510]
2027A166510K831539m95849q93609K41415j624074J178124J029685k157126m326050
2018c049435O13867N216858J156049j973768q23163j032714M19043j221066N3249
2009f41080J468981o54756O67661l39502p20309L355213J915645l366768n52236
2000A132849R1624J262178M8570j377617q46200j32618O97095J476995j279570
1991A073306r36398l69774j012828L3999o02610q6322J980285r75108K302843
1982A407393m07303l012953K311333J460252K53020j507950r6770J304375j475786
1973B35611k703337J643670J204388r96446q3800K94382j008409J449918J931721
1964A967698j129449r63441q02869K597898m88920l383771k27291Q38715P34497
$$ y = [1166510, 3998049, 3502200, 2608591, 2850006, 1225932, 2404056, 3433741, 1276615, -3049435, -2435568, 2781290, 3937339, 1963571, 1140408, 107694, 526737, -694329, -641080, 827901, 173145, 840806, 501304, -219005, 3136208, 5051853, 1685085, 1132849, 1224473, 2486651, 2535221, 1157604, 311404, 178786, 875881, 2352876, 1073306, 136908, -232866, -1245694, -1211695, -1814305, -1900627, 79658, -895450, 1407393, 1000090, -2012863, 298470, 1758722, 2011742, 503792, 407022, 1711397, 235611, -2467726, -824056, 380332, -616114, -699914, -405532, -1413941, 35977, 1967698, 838249, -125192, -928061, 1669837, 1180917, -2202854, -2430145, -1591430, -856933]
1955h56933J634477O64526k30416k560939q76114K523988j240439L94102J917538
1946A369790j904982j937993J783445L752716p51953k081534J042505N39391L343351
1937E154736j402539m058032j546519p04789R25434m04137P94100Q2880j098682
1928b257548J354339J544616k152595K76612J31035Q40852K918900Q86160k451310
1919A091061j927205K514989K8990j575016O00373o27177j045644J199882l51379
1910i1126J137295j828173l55634K449024p85571j157699K22793l01253r83933
1901a694277l045169K028074M511862j329817m79134K658108J395897j567208
1893B478336k537454o5812R37425J734306o51662l818982j232165Q35063l57584
$$ y = [-856933, 777544, 1442070, 1211654, -1349285, -2225399, 298589, -941850, -547748, 1369790, -535192, -2473185, -689740, 3062976, 2311023, 229489, 1271994, 1811385, 5154736, 3752197, -305835, -1852354, -2557143, -1631709, -2035846, -1241746, -1158866, -2257548, -903209, 641407, -1511188, -1234576, -1103541, -262689, 2656211, 3542371, 1091061, -836144, 1678845, 1707835, 132819, 733192, 106015, -939629, 260253, -91126, 1046169, -782004, -1137638, 1311386, 525815, -631884, -409091, -710344, -1694277, -4739446, -2711372, 1800490, 470673, -8461, 2649647, 4045544, 2478336, -59118, -124930, 812495, 2546801, 1895139, -1923843, -3156008, -2320945, -2678529]
1884b678529J891109K300434J110413j147760l42973J559898N15386o30381j000364
1875A577233j690800m9821o97747j408370O31523j036129q22235J92141O86534
1866b617671O10564M17010J738745J097704k388206o02214O89067P59131J660648
1857A364778n63133J402044j71610l736127J412567k97601J38973J810609L56248
1848A716748k50434l301981j203088J838617P4619J85108m11357j003109O80723
1839a674154J564549l48972n56221j422445P66617J482970r29476j203548j09435
1830b430115J589278Q56127j214174j75717O85879k58674k281900q18943J644175
1821b404064K017761n96149j202141o21973J352613M93963J004355J207419J619069
$$ y = [-2678529, -787420, 1513014, 2623427, 1475667, 1132694, 2692592, 3207978, 2577597, 1577233, -113567, -163388, -861135, -2269505, -1637982, -2674111, -3496346, -3304205, -2617671, -2007107, -1590097, 148648, 1246352, -1141854, -1744068, -1055001, -295870, 1364778, 801645, 2203689, 2032079, -1704048, -291481, -589082, -450109, 1360500, 1716748, 1466314, -1835667, -3038755, -1200138, -1125519, -940411, -1351768, -2354877, -1674154, -109605, -458577, -1014798, -2437243, -1670626, -187656, -1117132, -2320680, -2430115, -840837, 15290, -1198884, -1374601, -688722, -947396, -3229296, -4048239, -2404064, -386303, -982452, -2184593, -2806566, -1453953, -959990, 44365, 1251784, 2870853]
1812B870853O05778l382303P86125P56862R5381o3175q52154K32918J228334n83834
1802A694785l535774m80989L113133j0130j511613j58651q04355P33059J381762
1793D21227K831669l19093j306830M3593r46884K595453m91347j517534j732201
1784d21947l367972J98739J266946O6978J381693M55035o91003j046703l28835
1775b487069o79195p90080K026205J439392j739991J105027J151141p08750k110145
1766b793465P50373K987115J173579R16256J62681j433028j390737k088291Q76981
1757h38536l559Q75803J207347l006594p29380J712177J613051k24235J173928
1748A780002O23706r84568o19755J821442j13079k062332k294617J082946K990849
$$ y = [2870853, 3476631, 94328, 880453, 1637315, 1732696, 1669521, 817367, 1050285, 2278619, 1694785, -1840989, -2321978, 791155, 781025, -730588, -889239, -1693594, -960535, 421227, 3252896, 2933803, 1626973, 1670566, 723682, 3319135, 2827788, 1310254, -421947, -3789919, -3591180, -2324234, -2257256, -875563, -420528, -1111531, -2158234, -2487069, -3166264, -3956344, -1930139, -490747, -2230738, -1125711, 25430, -683320, -2793465, -2043092, 944023, 2117602, 3033858, 3196539, 1763511, 372774, -1715517, -838536, -842095, 33708, 1241055, -1765539, -2494919, -782742, 830309, 606074, 1780002, 2403708, 1419140, 799385, 2620827, 2507748, 445416, -1849201, -766255, 2224594]
1739B224594k332425l681704n42633J778687N79585l55147k26314N92374k82040
1730b245023J130345J603472r22310K356211R01971k352009p702J256851j040879
1721F80927j05299n6462k394070K7788K721390J279322k521049j492608Q75405
1712i84656J316237R74896L53626k47286k499035j502852J212112K158460m50465
1703C31037j071361m71640P23723L63506L24814l14683l49292K227611O8472q86471
1693I45716j057629n81315K743091k05687j336867p07948j45668K39843k605522
1684b711986n36477K439221J246978j401215k164513J689408K523019j285152
1676b00717q64880N23268N2206K090877M122j87297r12329l59882J315520p21207
$$ y = [2224594, -107831, -3789535, -4332168, -2553481, -1973896, -2329043, -2555357, -1962983, -2245023, -1114678, 488794, -433516, 1922695, 2824666, 472657, 464955, 1721806, 680927, 575628, 519166, -1874904, -1847116, 874274, 2153596, -367453, -1860061, -984656, 331581, 1306477, 1660103, 1412817, -1086218, -2589070, -1376958, 781502, 331037, -740324, -1211964, -488241, -124735, 200079, -114604, -463896, 1763715, 1832187, 945716, -111913, -693228, 2049863, 1844176, 507309, -200639, -346307, -106464, -2711986, -3248463, -809242, 437736, -963479, -3127992, -1438584, 1084435, -200717, -1065597, -542329, -490123, 1600754, 1604876, 1417579, 505250, 145368, 1460888, 739681]
1666G39681n90320k172002q19363R15346m52436m32957p30182J085702K537836
1657H1305J749651J574353o46775j509969l068424M62974L794946J524242k671892
1648A290411k620082n32353O46429R66708j669937j337361K975697K825629j192359
1639A352782k476608J527394q97655K34283L030706K72580l493849k318624M21137
1630b347854K876127n21613k004416m25004L34812J710707R48191J769376q71990
1621A468336m109485M9861J550767p85036M50278p48420k157281o75648J716941
1612c239687R43513J760700P71415l03938j318112O81028L296292n14421l93954
1603A682836j013272k63168Q52540q80845k05817L5223N95786O12028j877570
$$ y = [739681, 149361, -2022641, -2842004, -1926658, -2379094, -2812051, -3542233, -2456531, 81305, 1830956, 3405309, 2758534, 1248565, -1819859, -1356885, 2438061, 3962303, 1290411, -1329671, -1862024, -1215595, -248887, -1918824, -3256185, -280488, 2545141, 1352782, -1123826, 403568, -494087, -259804, 2770902, 3043482, -450367, -2768991, -2347854, 528273, 6660, -1997756, -2422760, -2087948, -377241, 570950, 2340326, 1468336, -2641149, -2591288, -1040521, -1825557, -1375279, -2123699, -4280980, -4956628, -3239687, -2296174, -535474, 235941, -67997, -1386109, -705081, 2591211, 2076790, 1682836, 669564, 406396, 1258936, 378091, 172274, 207497, 803283, 1415311, -462259]
1594d62259o7605J171796m8597O01777j626243q00085j600050K53590j321628
1585c899304K243391M212405j642774r44127J131997k115630k51315P99759K11275
1576b54323m72007o63040L36195k82559p541N75543o09763N31194N56290K03645
1566h6366m14441n68233L08623j373435J28992J322311J402716L57760q88321
1557A89606k348812j92142K574008J508909k075241k824210J379178L232593J857735
1548C301624k228688j212643Q55265k25207M09155n19664j260501q0785P23070
1539b38374O45751p6796k521168N41682J652027k22852q96719q27434m33151q83288
1529c260322k662181J70232J917752K32725J461473K048795Q78166j857286K31852
$$ y = [-462259, -529864, 641932, 593335, 1195112, -431131, -1231216, -2831266, -2577676, -3899304, -1655913, 2556492, 913718, -30409, 1101588, -1014042, -1265357, -465598, -254323, -726330, -1389370, -1053175, -1335734, -1343275, -767732, -1377495, -846301, -290011, -86366, -500807, -1069040, -760417, -2133852, -2004860, -682549, 720167, 1077927, 189606, -2159206, -2351348, 222660, 1731569, -343672, -3167882, -1788704, 1443889, 3301624, 1072936, -139707, 715558, 490351, 899506, 379842, -880659, -961444, -238374, 407377, 330581, -2190587, -1648905, 3122, -219730, -1116449, -1943883, -2377034, -3260322, -5922503, -5752271, -3834519, -3601794, -2140321, -91526, 786640, -1070646, -838794]
1520h38794J623611P07470r08351j886869k9752J428096M30685o05806m84555
1511e64265K335523O56416k563932m40638P57532j135380j68283N40538J026666
1502D44177k6924j392782J849458K72124n91120j709923n40139J784974j43932
1493e4087j784578q47438J2923K683831j409697k165865P51865O26617K425741
1484B39312N00942p14585J255261j657749p33228K403657k93334k142386P52502
1475c89608p72750l79399M21223M3979l67899k87516J099159N04543j81408r30763
1465a240439O08530j13637N88509K74146r75501J437096J165481M70058j479917
1456G34326j290861L026918J114727k135725j880095P83930J577958k175946n3638
$$ y = [-838794, 784817, 1492287, 583936, -1302933, -1332685, 95411, 526096, -79710, -564265, 1771258, 2427674, -136258, -576896, 180636, -954744, -1123027, -582489, 444177, 417253, -975529, 873929, 1146053, 554933, -1154990, -1695129, 89845, -54087, -1838665, -2686103, -2673180, 10651, -1399046, -3564911, -2813046, -2186429, 239312, 740254, 25669, 1280930, -376819, -1110047, 1293610, 1000276, -1142110, -389608, -1162358, -1541757, -1120534, -1076555, -1444454, -1731970, -632811, -128268, -309676, -1240439, -631909, -745546, -157037, 117109, -858392, 578704, 1744185, 2214243, 734326, -556535, 2470383, 3585110, 1449385, -430710, 353220, 1931178, -244768, -298406]
1447b98406J030442n712967r64549L081494L631084K94284l714521J50604J057334
1438a445201J954462J362084j818663m48854K07456J708582j15951n85624M95660
1429A313951j892754j180276J02111k67657P84011J783646o91356k597091o94585
1420c340000L392553L070296R38849j598075j226778J90865J109565m60877j061084
1411A015314n94652J572909M43055k128042j478015o10879P55049Q84777m38998
1402e79482R73635J145943k09204l5263l619788J071696K107869l59381K12079
1393G08104j833598r62016J859165J38604J110603j475165P15205L550911l33752
1384C478061j373767j555888j610113J337996J236644J016325J420607j010753
$$ y = [-298406, 732036, -4980931, -5945480, -2863986, 767098, 1061382, -2653139, -2502535, -1445201, 509261, 1871345, 52682, -396172, -188716, 1519866, 1403915, 818291, 1313951, -578803, -1759079, -1656968, -1924625, -1140614, 643032, -48324, -2645415, -3340000, 52553, 3122849, 4061698, 2463623, 1236845, 1427710, 2537275, 2076398, 1015314, 420662, 1993571, 2436626, 308584, -1169431, -1780310, -1025261, -140484, -579482, 394153, 1540096, 1330892, 1295629, -2324159, -1252463, 855406, 496025, 708104, -1125494, -2087510, -228345, -89741, 1020862, -454303, 260902, 3811813, 3478061, 2104294, 548406, -1061707, 276289, 1512933, 2529258, 3949865, 2939112]
1376B939112j910882j220457M13876K50777N39333j89028M58534o3947P14624
1367A931942L48093p76760q59998R44057p61172k48278q63745o60344K027263
1358A081058j704858j605399j90613j82594K869031R29229k609446Q07025j69098
1349g75665j440229J013605J77289j077397j298586k34693M97008j784226j278231
1340f201125J523523L252733P89515j240050J512062K94337r04647m11593J740102
1331C54857K79089j975256L25361N26110Q37453m48562q80466j265018J958955
1322b87477J804454L88636k555609k906341K357108L844105K86123p42552j724292
1313D64155j83405J388932j65694m87791l4056K349826J618536k050262q11270
$$ y = [2939112, 1028230, -192227, 221649, 472426, 1011759, 822731, 1281265, 1217318, 1931942, 2280035, 1503275, 643277, 1587334, 826162, 577884, -285861, -946205, 1081058, -623800, -2229199, -2419812, -2602406, 266625, 1195854, -1413592, -606567, -775665, -2215894, -1202289, -1025000, -2102397, -3400983, -3635676, -3138668, -4922894, -6201125, -4677602, -1424869, -635354, -1875404, -363342, -69005, -973652, -1385245, 354857, 633946, -1341310, -1015949, -489839, 347614, -100948, -981414, -2246432, -287477, 1516977, 1905613, -649996, -3556337, -1199229, 2644876, 2930999, 2188447, 464155, 280750, 1669682, 1503988, 1016197, 982141, 3331967, 4950503, 2900241, 2088971]
1304B088971M1238l877484N96996J197978j562657R43560O58829J82956j740939
1295a470552k053158J353175N71790j64519N67078R01251J542158n22096k391233
1286a666106j235606j21322K42950l24387J360891R10939j740011q54876K177910
1277a249618j156012L9515K639675n25873l99309J33147k782197j523494K048627
1268b775539J052317k23730K60255L574329J944359j968599R45092o20142Q6253
1259B274595k45628q82582k296044R8896j16050k179552j433073J716817J107686
1250a954935J594889k48853Q51345L462799r90855l080514j245226J971633R8915
1241D59198m65020o66743N12713j639111K285364K76744k409384M32785M71702
$$ y = [2088971, 2130209, -1747275, -1150279, 47699, -1514958, -571398, 87431, 270387, -1470552, -3523710, -2170535, -1598745, -1763264, -1196186, -294935, 1247223, 725127, -1666106, -2901712, -3023034, -2780084, -3104471, -1743580, -832641, -2572652, -3427528, -1249618, -2405630, -2366115, 273560, -252313, -651622, -518475, -3300672, -4824166, -2775539, -1723222, -1946952, -1686697, 1887632, 3831991, 1863392, 2808484, 2188342, 2274595, 2028967, 1146385, -1149659, -1050763, -1166813, -3346365, -4779438, -3062621, -1954935, -360046, -608899, 242446, 3705245, 2714390, -366124, -1611350, 360283, 459198, -5822, -672565, -159852, -1798963, 486401, 763145, -1646239, -1213454, -741752]
1232g41752K197921p52933j115139J115066N65811R95384k329190l425627N82503
1223b907956J708943K238847J83814j893124N56592p31804L43761R20202M92937
1214I12212J587274j958916j211847J864221j562898L93283n99800p72242J740226
1205C91513k07762J228842O16626j535983L04906K86151k095709q24506K350036
$$ y = [-741752, 1456169, 703236, -411903, 703163, 1268974, 2264358, -64832, -3490459, -2907956, -1199013, 1039834, 1223648, -669476, -112884, -844688, -500927, 419275, 912212, 2499486, 540570, -671277, 1192944, -369954, 23329, -576471, -1348713, 391513, 183751, 1412593, 2029219, 493236, 798142, 1084293, -1011416, -1835922, 514114]
$$ [...]
##END NTUPLES=NMR SPECTRUM
##END=
