##TITLE=1H_CA-8993-3
 CDCl3
 8 sc, 
 17.03.2022
##JCAMPDX= 6.0         $$ Bruker NMR JCAMP-DX V2.0
##DATA TYPE= NMR SPECTRUM
##DATA CLASS= NTUPLES
##ORIGIN= UXNMR, Bruker Analytische Messtechnik GmbH
##OWNER= root
$$ XWIN-NMR		Version 3.5
$$ Fri Mar 18 12:51:40 2022 Russian Standard Time (UT+4h)  she@DPX200
##.OBSERVE FREQUENCY= 200.131346
##.OBSERVE NUCLEUS= ^1H
##.ACQUISITION MODE= SIMULTANEOUS
##.ACQUISITION SCHEME= undefined
##.AVERAGES= 8
##.DIGITISER RES= 18
##SPECTROMETER/DATA SYSTEM= spect
##.PULSE SEQUENCE= zg30
##.SOLVENT NAME= CDCl3
##.SHIFT REFERENCE= (INTERNAL, CDCl3, 0, 15.7094)
##AUDIT TRAIL= $$ (NUMBER, WHEN, WHO, WHERE, WHAT)
$$ ##TITLE= Audit trail, XWIN-NMR		Version 3.5
$$ ##JCAMPDX= 5.01
$$ ##ORIGIN= Bruker BioSpin GmbH
$$ ##OWNER= she
$$ F:/spectra/data/she/nmr/H-F/1/pdata/1/auditp.txt
$$ ##AUDIT TRAIL=  $$ (NUMBER, WHEN, WHO, WHERE, WHAT)
(   1,<2022-03-18 12:50:17.73 +0400>,<she>,<DPX200>,
      <created by zg, POWCHK disabled, PULCHK disabled
       configuration hash MD5:
       00 E9 B6 7A A2 85 ED C7 34 08 36 98 17 FE 4E 26
       data hash MD5: 16K
       F3 2F 00 60 03 8B C1 12 4D F5 4A 03 91 DF AA CB>)
(   2,<2022-03-18 12:50:21.79 +0400>,<she>,<DPX200>,
      <Start of raw data processing
       efp BC_mod = 2 LB = 0.24 FT_mod = 6 PKNL = 1 PHC0 = -17136.59 PHC1 = 7.80078 SI = 16K 
       data hash MD5: 16K
       BF E9 8A 98 A9 73 71 86 70 44 7A A5 A8 FD 0A 15>)
(   3,<2022-03-18 12:50:39.12 +0400>,<she>,<DPX200>,
      <pk PHC0 = -171.5338 PHC1 = 3.4 
       data hash MD5: 16K
       37 26 AF 3E 75 5C 36 F8 08 74 D2 97 16 65 9F E5>)
(   4,<2022-03-18 12:50:42.70 +0400>,<she>,<DPX200>,
      <abs ABSG = 5 
       data hash MD5: 16K
       6F 13 6A 1C 07 85 26 06 DC 3F 71 CF 77 74 3C 8A>)
$$ ##END=
$$ 
$$ hash MD5
$$ 70 84 70 86 CC 39 FF 11 BF C8 CE 72 6B 1C A1 C6
##$RELAX= 
##$RELAX= 
##$RELAX= 
##$RELAX= 
##$RELAX= 
##$RELAX= 
$$ Bruker specific parameters
$$ --------------------------
##$DU= <F:/spectra>
##$EXPNO= 1
##$NAME= <H-F>
##$PROCNO= 1
##$TYPE= <nmr>
##$USER= <she>
##$AMP= (0..31)
100 100 100 100 100 100 100 100 100 100 100 100 100 100 100 100 100 100 
100 100 100 100 100 100 100 100 100 100 100 100 100 100 
##$AQSEQ= 0
##$AQ_mod= 1
##$AUNM= <au_zg>
##$AUTOPOS= <>
##$BF1= 200.13
##$BF2= 200.13
##$BF3= 200.13
##$BF4= 200.13
##$BF5= 200.13
##$BF6= 200.13
##$BF7= 200.13
##$BF8= 200.13
##$BYTORDA= 1
##$CFDGTYP= 0
##$CFRGTYP= 5
##$CHEMSTR= <none>
##$CNST= (0..31)
1 1 145 1 1 1 1 1 1 1 1 1 1 1 1 1 1 1 1 1 1 1 1 1 1 1 1 1 1 1 1 1 
##$CPDPRG= <>
##$CPDPRG1= <>
##$CPDPRG2= <>
##$CPDPRG3= <>
##$CPDPRG4= <mlev>
##$CPDPRG5= <mlev>
##$CPDPRG6= <mlev>
##$CPDPRG7= <mlev>
##$CPDPRG8= <mlev>
##$CPDPRGB= <>
##$CPDPRGT= <>
##$D= (0..31)
0 1.2 0 0 0 0 0 0 0 0.06 0 0.03 0 0 0 0 0.0002 0 0 0 0 0 0 0 0 0 0 0 0 
0 0 0 
##$DATE= 1647593417
##$DBL= (0..7)
120 120 120 120 120 120 120 120 
##$DBP= (0..7)
150 150 150 150 150 150 150 150 
##$DBP07= 0
##$DBPNAM0= <>
##$DBPNAM1= <>
##$DBPNAM2= <>
##$DBPNAM3= <>
##$DBPNAM4= <>
$$ [...]
##$SUBNAM2= <"">
##$SUBNAM3= <"">
##$SUBNAM4= <"">
##$SUBNAM5= <"">
##$SUBNAM6= <"">
##$SUBNAM7= <"">
##$SUBNAM8= <"">
##$SUBNAM9= <"">
##$SW= 18.0517287032376
##$SWIBOX= (0..15)
0 0 2 0 0 0 0 0 0 0 0 0 0 0 0 0 
##$SW_h= 3612.71676300578
##$TD= 16384
##$TD0= 1
##$TE= 0
##$TE2= 300
##$TE3= 300
##$TEG= 300
##$TL= (0..7)
0 120 120 120 120 120 120 120 
##$TP= (0..7)
150 150 150 150 150 150 150 150 
##$TP07= 0
##$TPNAME0= <>
##$TPNAME1= <>
##$TPNAME2= <>
##$TPNAME3= <>
##$TPNAME4= <>
##$TPNAME5= <>
##$TPNAME6= <>
##$TPNAME7= <>
##$TPOAL= (0..7)
0.5 0.5 0.5 0.5 0.5 0.5 0.5 0.5 
##$TPOFFS= (0..7)
0 0 0 0 0 0 0 0 
##$TUNHIN= 0
##$TUNHOUT= 0
##$TUNXOUT= 0
##$USERA1= <user>
##$USERA2= <user>
##$USERA3= <user>
##$USERA4= <user>
##$USERA5= <user>
##$V9= 5
##$VALIST= <valist>
##$VCLIST= <CCCCCCCCCCCCCCC>
##$VD= 0
##$VDLIST= <DDDDDDDDDDDDDDD>
##$VPLIST= <PPPPPPPPPPPPPPP>
##$VTLIST= <TTTTTTTTTTTTTTT>
##$WBST= 1024
##$WBSW= 4
##$XGAIN= (0..3)
0 0 0 0 
##$XL= 0
##$YL= 0
##$YMAX_a= 113418
##$YMIN_a= -215425
##$ZGOPTNS= <>
##$ZL1= 120
##$ZL2= 120
##$ZL3= 120
##$ZL4= 120
##$ABSF1= 17.54285
##$ABSF2= -0.5090313
##$ABSG= 5
##$ABSL= 3
##$ALPHA= 0
##$AQORDER= 0
##$ASSFAC= 0
##$ASSFACI= 0
##$ASSFACX= 0
##$ASSWID= 0
##$AUNMP= <proc_1d>
##$AZFE= 0.1
##$AZFW= 0.1
##$BCFW= 0
##$BC_mod= 2
##$BYTORDP= 0
##$COROFFS= 0
##$CY= -3
##$DATMOD= 1
##$DC= 0
##$DFILT= <>
##$DTYPP= 0
##$F1P= 0
##$F2P= 0
##$FCOR= 1
##$FTSIZE= 16384
##$FT_mod= 6
##$GAMMA= 0
##$GB= 0
##$INTBC= 1
##$INTSCL= 0
##$ISEN= 128
##$LB= 0.24
##$LEV0= 0
##$LPBIN= 0
##$MAXI= 10000
##$MC2= 0
##$MEAN= 0
##$ME_mod= 0
##$MI= 1.114404
##$NCOEF= 0
##$NC_proc= -8
##$NLEV= 6
##$NOISF1= 3.799351
##$NOISF2= 2.8
##$NSP= 0
##$NTH_PI= 0
##$NZP= 0
##$OFFSET= 15.70943
##$PC= 1
##$PHC0= -17308.12
##$PHC1= 11.20078
##$PH_mod= 1
##$PKNL= yes
##$PPARMOD= 0
##$PSCAL= 0
##$PSIGN= 0
##$REVERSE= no
##$SF= 200.1300084309
##$SI= 16384
##$SIGF1= 3
##$SIGF2= 2
##$SINO= 5.538805
##$SIOLD= 16384
##$SREGLST= <1H.CDCl3>
##$SSB= 0
##$STSI= 16384
##$STSR= 0
##$SW_p= 3612.71676300578
##$SYMM= 0
##$S_DEV= 0
##$TDeff= 16384
##$TDoff= 0
##$TI= <>
##$TILT= no
##$TM1= 0
##$TM2= 0
##$TOPLEV= 0
##$USERP1= <user>
##$USERP2= <user>
##$USERP3= <user>
##$USERP4= <user>
##$USERP5= <user>
##$WDW= 1
##$XDIM= 16384
##$YMAX_p= 430798561
##$YMIN_p= -1203005
$$ End of Bruker specific parameters
$$ ---------------------------------
##NTUPLES= NMR SPECTRUM
##VAR_NAME=  FREQUENCY,     SPECTRUM/REAL,   SPECTRUM/IMAG
##SYMBOL=    X,             R,               I
##VAR_TYPE=  INDEPENDENT,   DEPENDENT,       DEPENDENT
##VAR_FORM=  AFFN,          ASDF,            ASDF
##VAR_DIM=   16384,         16384,           16384
##UNITS=     HZ,            ARBITRARY UNITS, ARBITRARY UNITS
##FACTOR=    0.220516191357247, 1,           1
##FIRST=     3143.9283064921, 0,             0
##LAST=      -468.788456513679, 0,           0
##MIN=       -468.788456513679, -1203005,    0
##MAX=       3143.9283064921, 430798561,     0
$$ Real data points
##PAGE= N=1
##DATA TABLE= (X++(R..R)), XYDATA
$$ [...]
7835 181864 -94349 391659 170467 -127238 -100839 -278380 -317864 -298419 -182133 -220964
7825 -220964 -237539 62907 -32859 -304668 -450844 -397114 -394238 -85256 -71723 -517890 -437295
7814 -437295 -257938 -270797 -82038 -80850 -321940 -163015 -96498 465073 544738 443225 153737
7803 153737 -24670 310264 -108756 -500335 -788827 -548021 -235539 240445 24267 -37548
7793 -37548 35105 -227980 -707445 -286673 115122 -192174 -461612 -275493 -311676 -365878
7783 -365878 -43553 314973 113119 372990 -50074 -137109 -193758 -290128 -74767 -166823
7773 -166823 71174 -35749 -242667 -61996 -276144 -279732 124428 -50031 -320415 -395857
7763 -395857 -210919 -475319 -554404 -753078 -621493 -228726 85534 24370 -273179 89592
7753 89592 102548 54999 -179541 -129257 -63300 -208229 -121112 273055 47026 -602835 -180863
7742 -180863 -256281 -407343 -490000 -414240 -168160 -274258 -250609 -649665 -422103 58976
7732 58976 -131469 -365866 -653750 -600047 -276160 -325365 -434190 -397693 -679234 -724826 -398390
7721 -398390 -225966 -564346 -688329 -411644 242827 -58900 -131755 -543946 -618569 -415471
7711 -415471 -577504 -454321 -245372 -617946 -592003 -165220 -174122 -320685 -321273 -349939 -151276
7700 -151276 -439907 -674520 -313620 -164639 -9162 -280894 -438920 -361209 -597141 -816884
7690 -816884 -555255 -436659 -314551 -244204 -515422 -577336 -322882 94047 12518 -83044
7680 -83044 -79490 25352 37752 431987 402593 -256524 -277581 72935 238386 -12649 -686388
7669 -686388 -566220 -283812 -16304 -170015 -368865 -163230 -272809 -679593 -499030 -388156
7659 -388156 -339189 -22404 -188778 -545694 -571411 -727757 -879585 -458873 -110073 41011
7649 41011 -264141 -464665 -647133 -187363 -418504 -321037 -236569 -220000 -123318 -162816 -309530
7638 -309530 -369364 -297186 -137190 -535175 -215047 -60182 -320000 -404393 -510135 -628831
7628 -628831 -677123 -679229 -549393 -428308 -398719 -421557 -384727 -196985 -280066 -366269 -351967
7617 -351967 -387226 -394674 -474226 -480753 -315168 -29060 169336 -47144 -213567 -708724 -524010
7606 -524010 -595275 -444974 -560173 -511656 -423823 -255723 3244 -67478 -66642 7857 65039
7595 65039 -445585 -861814 -1067865 -1181604 -966155 -568237 -584121 -941708 -987662 -811366
7585 -811366 -721450 -311668 -374274 -508912 -390216 -208928 -224439 -178917 -229554 -418971 -496512
7574 -496512 -77275 197339 -151184 -360791 -507876 -378966 103690 -207609 -210692 -486852
7564 -486852 -127270 -174039 -301901 -419973 -376495 -560785 -481941 -372247 -500374 -210083
7554 -210083 -193148 28684 -117862 -397952 81774 -48880 -402910 -273828 -300169 -224844
7544 -224844 -232921 -73114 -34990 -64577 -232366 -196194 -234457 -394931 -428126 -653968 -648072
7533 -648072 -339936 -141885 272906 85271 109042 93395 32429 -81393 -261500 -55768
7523 -55768 -154152 80563 507630 -5137 -235670 -333696 187513 -159618 150694 -94036
7513 -94036 -323853 -415754 -20961 -277618 -319661 -689606 -476186 -404640 -476274 -402346 -438835
7502 -438835 -234041 -492495 -663984 -740379 -670167 -575231 -497364 -265731 50692 -107285
7492 -107285 -71846 14720 -595703 -809271 -397602 -620511 -217393 -664737 -775989 -650566
7482 -650566 -583608 -448796 -721995 -437495 -515279 -651837 -401468 -316565 -80010 -463563
7472 -463563 -531598 -511724 -1176 -124755 -217744 56565 39943 -78326 -211957 -646484
7462 -646484 -599401 -362163 -53465 -103544 -205172 -52706 -480393 -356376 -263338 -566865
7452 -566865 -456483 -328130 -314561 -157257 -19725 -253547 150406 39571 -78117 -191633
7442 -191633 120939 128084 -383564 -495491 -539571 -477180 -665913 -766779 -343524 -11249
7432 -11249 -166368 -332205 -444185 -476046 -176160 -677322 -783656 -313014 -52138 -509127
7422 -509127 -361444 -75398 167809 256832 58888 -525675 -957099 -675833 -533696 -548479
7412 -548479 -696693 -680382 -431508 -411939 -292962 -150561 -353162 -58598 -576972 -279260
7402 -279260 -716537 -470949 -240981 -49766 30577 -469195 -171572 -150450 -495975 -404853
7392 -404853 -176646 -95019 241648 86246 -101276 9645 279122 33147 -84032 -189485
7382 -189485 -22009 197546 -148287 -253092 -107678 376023 50122 184371 -118582 87633
7372 87633 365240 -206096 -67392 360122 -5371 -194169 -174672 -400013 -549164 -622086
7362 -622086 -624728 -141336 -252236 -464283 -498045 -807546 -495283 -141308 -573898 -294647
7352 -294647 40847 -24279 -201133 -583815 -647014 -640410 -527451 -608107 -418834 -125847 80630
7341 80630 -14159 -188388 -327488 218600 -39457 -383917 6122 111592 -219855 -286882
7331 -286882 -346068 -274755 -107384 -70546 -78241 -397368 -65033 -61573 -100017 46913 -297360
7320 -297360 -528719 -172107 -419618 -468718 -361650 -730502 -825207 -919996 -682256 -795718
7310 -795718 -692006 -752389 -501780 -200623 -330629 -429461 -421711 -442799 -299713 -401993 -101582
7299 -101582 -201263 -402339 -477863 -269909 -105282 -52490 258084 -59274 -178863 -300239
7289 -300239 13549 147356 20204 128787 -97715 -310219 -128301 39123 413079 523441
7279 523441 249658 100676 62644 -101169 -518477 -362923 -396858 -95563 19362 -164477
7269 -164477 -32519 140925 -102975 -318377 -240153 -325978 -352415 -194785 51652 277168
7259 277168 -90489 -327866 -125986 -308524 64987 148397 -189981 -159329 -6364 257185
7249 257185 -335580 -203774 -176333 -47682 -24469 -299798 -246236 106731 388372 117504
7239 117504 -180264 -400820 -166414 -263798 -169265 -205741 -214312 -250635 20948 311506 331325
7228 331325 -120113 -316157 63287 271693 115491 -10485 215262 154218 -95166 274284
7218 274284 76707 145867 23174 -35573 167630 98068 58559 37353 38098 -69945 -101395
7207 -101395 -150261 -118591 283800 -35305 -482151 -471531 -53170 234746 296346 120159
7197 120159 -3084 21629 -32589 225335 446444 -62853 79886 86159 -36643 -183588
7187 -183588 -294039 2731 584821 382754 90536 320006 432510 283468 -9273 253372
7177 253372 333352 419406 120945 386514 421451 36370 120608 354037 368286 324272 882289
7166 882289 262199 -127622 207493 185894 238947 151073 347929 682793 739308 677695 739222
7155 739222 701043 407666 55221 450937 322966 675505 588668 1258 166548 589786
7145 589786 671223 431024 174227 88687 398391 706351 267867 463277 444216 313036
7135 313036 710352 645056 694137 830254 780571 669275 172516 564560 1068772 971542
7125 971542 603822 239266 -132875 165321 364293 652103 564495 404739 564762 1022402
7115 1022402 1060558 856020 762038 435563 160540 482651 342684 422324 470381 263036
7105 263036 407428 332726 205687 184796 574064 749545 600907 458563 657357 480055
7095 480055 180723 306162 761807 768354 483297 597092 757032 700815 880786 640707
7085 640707 899005 978680 1003170 1107381 727879 531004 641477 989247 1524112 933070
7075 933070 678092 1097102 591875 533627 749971 755736 912898 874922 817896 790443 957187
7064 957187 1236551 1194003 1366749 1264586 896896 1463305 1544591 1018160 707544 1055065
7054 1055065 1008450 852762 873298 1078764 1241819 1533034 1512587 1103992 1061406 1251258
7044 1251258 927866 932673 1293234 1500692 1066960 852717 761550 852773 895551 1130387
7034 1130387 1221422 1157045 914157 1077594 1104937 1209466 1218975 885287 935873 586571 126038
7023 126038 892265 1246695 985545 1187823 1657946 1460723 1098134 1544436 1399783 1104523
7013 1104523 1025043 1286944 1194378 1414017 1443211 1556936 1980822 1970170 1946060 1994826 1688116
7002 1688116 1532349 1876957 1737980 1608851 1366392 1349385 1822230 1606419 1717557 1818442
6992 1818442 1873155 1227260 1372001 1728937 1582359 1492639 1560825 1447472 1450759 1372691 1418552
6981 1418552 1740233 1333127 1016706 1446867 1691148 1961865 1965158 1728196 1749147 1528888
6971 1528888 1589635 1501211 1572685 1806252 1794399 1605604 1832349 2137989 2046485 2179599
6961 2179599 1961883 1714872 1643808 1910565 1615665 1724097 1852573 1887798 1240860 1454434
6951 1454434 1823972 1987774 1929011 1858275 2014852 1896146 1826103 1822014 1834302 1694597 1842541
6940 1842541 2137974 2044489 2195821 2010931 1817012 1775817 1636861 1855367 1688616 1617125
6930 1617125 2042695 2145252 2161205 2069122 1973156 2094417 1906675 2531938 2300605 2483228
6920 2483228 2436565 2576565 2968486 2842178 3011451 3077219 2962045 3058952 3223346 3389123
6910 3389123 3161899 3373688 3666381 4074491 4006816 4361215 4891590 5169039 5978350 6333879
6900 6333879 6550638 6919261 7733379 8326761 9056150 9383857 9414152 8895264 8265265 7770935
6890 7770935 7237717 6711461 5886017 5690753 5167888 5431746 5300528 4852035 4549834 4254581
6880 4254581 3973841 3623076 3379591 3120256 3119660 2995765 2820387 2950189 2564507 2887490
6870 2887490 2701165 2495987 2622236 2638017 2798868 2653244 2438335 2098449 2153639 2172018
6860 2172018 2324309 1957896 2215490 2385406 1493286 1222382 1332352 1874271 2105732 2013484
6850 2013484 2135796 1476467 1575677 1623066 1639560 1391922 1406420 1291669 1447305 1621870
6840 1621870 1419256 1390279 1276833 1243064 1054024 670680 799748 977469 1025788 932590
6830 932590 776595 1453771 1091140 1350141 1279192 715873 1102619 1207816 820369 1085154
6820 1085154 1231773 1288636 1352141 873597 602667 838000 907337 801570 854504 786404
6810 786404 1087753 986916 1189110 1072194 841007 932533 969695 606828 522874 363162
6800 363162 524139 644165 668686 507842 452665 852118 853555 941438 627111 451953 514982
6789 514982 747251 737224 848802 971662 788206 717728 1236376 984618 899139 960183
6779 960183 351140 314691 671851 1098238 615875 1108802 923369 612204 560951 449115
6769 449115 238291 291804 948914 852916 757619 209894 169280 736011 821602 43522 80146
6758 80146 382210 307623 135828 260075 316183 435497 379493 30731 289414 324713 29708
6747 29708 174681 596497 624501 460525 399369 545261 318263 -54496 -54015 375445 689145
6736 689145 462517 200834 86458 58673 373727 413513 37151 120841 215138 247949 276193
6725 276193 23625 471838 636076 569643 461189 263021 21463 154920 207876 246734
6715 246734 715929 343305 322179 253689 214312 462972 232606 660033 578267 434734
6705 434734 422326 138186 132498 116382 322028 621923 281203 48964 181111 384270
6695 384270 135392 106116 46800 78267 252836 222092 559796 475496 357811 534850 985747
6684 985747 648770 170857 317380 472128 417827 291078 3327 143594 -199105 254054
6674 254054 437910 428356 345442 211752 229912 723731 557140 701367 838471 492729
6664 492729 121853 491996 981102 923254 809630 1043511 770102 655431 362922 269047
6654 269047 671654 979003 868590 504798 655234 -30254 373800 824860 495926 296563
6644 296563 444596 285292 671212 164933 282957 400640 604791 440660 906386 1136309
6634 1136309 449100 518138 948252 850901 477772 338317 657335 638780 592407 491903
6624 491903 323677 172750 20577 -224016 -6431 145256 259137 692928 118623 178019
6614 178019 482126 152191 197570 629463 861093 578118 349465 696190 717061 361798
6604 361798 161368 438422 675517 446751 337981 537533 226314 325900 385772 510734
6594 510734 328800 541103 704141 460869 670809 716538 794431 567619 780297 1196576
6584 1196576 1074415 784907 681412 553588 278632 165697 447296 412028 273776 287960
6574 287960 200694 454336 734212 813538 885214 824240 510130 352082 339433 399505 493717
6563 493717 240104 402498 793811 1084170 1094809 532169 380835 252619 227282 293386
6553 293386 508562 235626 324879 55828 626145 676103 725236 362021 144340 403437
6543 403437 738853 1176731 1150939 925821 210072 430799 483409 340188 294469 829114
6533 829114 702041 558678 915178 847712 678244 670825 631873 551647 693860 1139547 1236952
6522 1236952 991868 1096516 1207593 1029852 931564 882175 1249339 1169024 1058714 729381
6512 729381 720556 743345 354699 376189 530304 270888 150047 387516 619583 857546
6502 857546 929224 890607 1067969 898053 723002 684976 620553 761208 825652 779153 629781
6491 629781 647472 657387 1065471 1505809 1517761 1674568 1601138 1504594 1262785 1119624 1092655
6480 1092655 958980 628108 652947 446635 570856 1038636 1305631 1574570 942795 900664
6470 900664 1228949 1165637 930595 840423 495450 635254 1089926 1161871 899225 940119
6460 940119 620612 1005432 1606554 1453645 1190410 920192 705821 930488 1219316 1163721
6450 1163721 1671081 1983994 1421433 1226779 1497727 1478901 1651264 1587094 1204306 1203084
6440 1203084 1805717 1718846 1759220 1594946 1865817 2084937 1913769 2035777 2520714 2525703
6430 2525703 2537465 2701975 2577032 2701580 2799262 2818779 2656338 2395342 2181846 2122499
6420 2122499 1918169 1829045 1816829 1956003 1536274 1728849 1422571 1358275 1591580 1809804
6410 1809804 1708216 1534551 1653162 1189200 1366490 1143547 1283631 1150128 1134202 1327615
6400 1327615 1254123 1826888 1934144 1690855 1612516 1501610 1096327 1321281 1576047 1513618
6390 1513618 1386517 1674846 1706968 1383262 1531018 1499848 1165522 1097716 1462062 1588867
6380 1588867 1597097 1506613 1750533 2028569 1665673 1604714 1519437 1611058 1884704 2129377 2085633
6369 2085633 1651348 1979468 2151543 1936550 2095721 2203967 2090434 2239309 2044856 1972711
6359 1972711 1847201 1775506 1980082 2111360 2263211 2664679 2445670 2046052 2128147 2497561
6349 2497561 2426788 2565651 2356672 2472800 2338803 2126685 2264022 2000594 2232397 2512032
6339 2512032 2238421 2583722 2752290 2596560 2621663 2222202 2019779 2153315 2130060 2294813
6329 2294813 2611346 2452605 2247861 2224513 2766274 2580119 3060975 2949903 2873232 2535405
6319 2535405 2592772 2285494 2335157 2812968 2773882 2614176 2581484 2688843 2618597 2749136
6309 2749136 2925824 3370535 3007326 2388873 2461228 2616915 2734301 2448293 2820399 3109308
6299 3109308 3131962 3278860 3428638 3460267 3215570 3315933 3365913 2772466 2970709 3192242
6289 3192242 3169301 3604337 3731834 3548987 3641314 3757763 3930538 4237662 4253871 4376017
6279 4376017 4330145 4322962 4683259 4836737 4681858 4830938 4875576 5276952 5160052 5067515
6269 5067515 5235962 6027383 6267979 6511046 7134462 7519553 7468419 8203674 8446979 8471514
6259 8471514 8710067 9611430 10313421 10744460 11579219 12607954 13229088 13573532 14410324
6250 14410324 14758064 14954824 15204979 15050160 14484606 14024122 13453440 12488260 11717631
6241 11717631 11121440 10568287 9847971 8955893 8362097 7833822 7474730 6888730 6847396 7029995
6231 7029995 6896537 6733513 6415724 6206931 5900956 6004672 6001850 6149247 5785964 5554736
6221 5554736 5389384 5237356 5391339 5267879 5475979 5001870 4675009 4847088 5009823 5024422
6211 5024422 4918932 5137380 5169925 5123203 5281747 5364748 5320259 5655208 5863172 5721413
6201 5721413 6131468 6136419 6194201 5975364 5876589 5601040 5637533 5405932 5552444 4948013
6191 4948013 5108943 5604543 5626607 6098529 6225663 6063069 5880374 6172121 6477160 7023853
6181 7023853 6775588 7270789 7472903 7698865 8169718 8696585 9558560 10184383 10082495 10046131
6171 10046131 9433853 8853859 8460963 7922577 7376247 7238238 7198828 6942808 7069066 6756192
6161 6756192 6975826 7169865 7371195 7451036 7716585 7841873 8397515 8996173 9006802 9991460
6151 9991460 10719649 10835002 11472671 12433736 12891746 13126419 12984224 12047181 11059593 10338724
6141 10338724 9493840 8667103 7779183 7529997 7257247 6609542 6768113 6670334 6175583 6194547
6131 6194547 6520302 6623701 6898900 7245532 7456777 7767930 8240575 8451731 8885934 9033385
6121 9033385 9638797 9835220 9527929 9300417 8725439 7789712 7156549 6373539 5839877 5609581
6111 5609581 5203478 5136190 4704904 4424076 4318740 4315622 4002424 3806492 3814153 4008099
6101 4008099 4335005 4165347 4446434 4216073 4245987 4208489 4541725 4460458 4466065 4466748 4446806
6090 4446806 4061295 3748595 3867961 3752441 3345107 3327427 2904422 2769082 3000351 2892661
6080 2892661 2836187 2814661 2948565 2694525 2432096 2652957 2804980 2557484 2510602 2578867
6070 2578867 2559306 1986698 2297016 2035434 1984582 1696052 1976270 1782990 2014927 2534849
6060 2534849 2293739 1846236 2285256 2239721 2078625 1795018 2013508 2131915 2133404 2156396
6050 2156396 2168748 2471145 2362963 2216846 2128812 2236995 2302317 2051904 1884010 2252518
6040 2252518 2381046 2524941 2455625 2451398 2637334 2457643 2456620 2091703 2069507 1863191 2171959
6029 2171959 2564145 2369726 2410716 2005837 1716650 1784678 1867633 1623745 1653208 1751085
6019 1751085 2230800 2300622 2146539 2328537 2195164 2102591 2112918 2044848 1996630 2431246
6009 2431246 2324821 1811773 2018481 2369150 2275690 2058854 2227882 2234186 2266204 2179019
5999 2179019 1867922 2055139 2103962 1887543 1926587 1970273 2073770 2005718 2166814 2581123
5989 2581123 2690804 2413149 2419942 2660219 2602641 2327485 2201815 2220126 2257763 2653098
5979 2653098 2779056 2654095 2341152 1920124 2277591 2332814 2205157 2499372 2607917 2415495
5969 2415495 2653382 2372624 2311953 2276131 2340813 2581848 2881629 2776193 2893127 2673040
5959 2673040 2429465 2602847 2741935 2508476 2628881 2700206 2708748 2742744 2789937 3053403
5949 3053403 3043405 2959463 3144061 3009990 3023855 3314963 2912998 2873886 2492537 2270686
5939 2270686 2569194 2761938 2807631 3031530 2717096 2553800 2627250 2494779 2194339 2324305
5929 2324305 2723441 2513491 2595688 2393378 2215336 2538901 2555442 2633102 2591035 2820486
5919 2820486 2527719 2756301 3005516 2812026 2859487 2412453 2630984 2457682 2787663 2623157
5909 2623157 2393446 2621099 2745623 2658613 2596625 2512952 2583502 2464179 2696234 2736716
5899 2736716 2871389 3121316 2894052 2694942 3157341 3284866 3035902 2942092 2686970 2774258
5889 2774258 2830397 3013416 2693892 2831348 2788761 2931143 3173702 3413104 3348073 3158995
5879 3158995 3155203 2946041 2853131 3154652 2673046 2799940 3171154 3057719 2969754 3266629
5869 3266629 3790695 3764516 3201746 2942364 2664859 3208118 3305673 3086366 3324761 2693963
5859 2693963 2858231 3085100 2759111 3144108 3425620 3238451 3011372 3785265 3386275 3092269
5849 3092269 3260460 3295333 3745116 3428036 3492992 3653630 3478425 3292231 3366046 3446444
5839 3446444 3679864 3584740 3786252 3733600 3759387 4019325 3857404 4089364 4328244 3835901
5829 3835901 4051112 4243201 3900090 4283574 4283293 4001689 3682588 3579650 3722080 3826224
5819 3826224 4124710 4378997 4282708 4167005 4177695 4674358 4798989 4890548 4649205 4465067
5809 4465067 4571813 4719325 4728698 4826632 4788443 4916667 4809942 4664550 5058025 5318689
5799 5318689 5457345 5158837 4855370 4993682 4963894 5157332 5545810 5609741 5701434 5587051
5789 5587051 5871234 5788581 5892707 6162301 6529042 6807186 6767642 6857938 7063776 7211434
5779 7211434 7128669 7683828 8147322 8187587 8519015 8965329 9689211 10133466 10865335 11409555
5769 11409555 11764125 12296814 13065389 12821247 13300443 13077671 12793306 12232342 11132983
5760 11132983 10503954 10159711 10020867 9471895 9375138 9363120 9223285 8971689 8603108 8519679
5750 8519679 8395657 8149296 8429119 8033728 7811633 7581614 7538313 7765317 7821134 7719071
5740 7719071 8069892 8343362 8844083 8843654 8802821 9034298 8749446 8807065 9240563 9663511
5730 9663511 9872208 10461701 10941749 11236872 11621248 12244711 12386113 13285811 13720104 14127620
5720 14127620 14555421 15044402 14865320 14421465 14353376 13881888 13344499 12897977 12123390 11747720
5710 11747720 11322756 10643284 10771206 10845622 10420254 10272864 10387218 9664581 9950474 9920933
5700 9920933 9916920 9680704 9644644 10118212 10187762 10191256 9942383 9607722 9668631 9640388 9731282
5689 9731282 9656509 9349672 10031450 10283041 9737171 9538989 9433990 9354510 9429451 9648491
5679 9648491 9967318 10152612 9949286 9779697 9657363 9790404 9751537 9770410 9426862 9395616
5669 9395616 9675165 9764413 10011341 10056851 9970182 9718146 10094099 10201938 10182151 10140280
5659 10140280 10251640 10749018 10964157 10961845 11351924 11498332 11858798 12076206 12090981 12681420
5649 12681420 13025915 13330359 14176303 14759370 15450427 16563928 17295840 18357422 19399854
5640 19399854 20741485 22484543 24238967 26436640 28733775 31577669 34562919 36516704
5632 36516704 36469781 33730871 30219248 26410251 23037668 20633766 18897672 17382607
5624 17382607 16551649 15447659 14701665 14102274 13629521 13263622 12885338 12903599 12394604
5615 12394604 11751296 12120072 12200783 11984701 12151499 11816153 12015062 12189353 11866302 11460878
5605 11460878 10909877 10928181 11372074 11883011 11488245 11287960 11219203 11223866 11259134 10923711
5595 10923711 11035083 11354555 11511763 11309049 11285937 12053592 12291355 11453082 11518760 11906953
5585 11906953 11905900 11491573 11587559 11376455 11379869 11477217 11133992 10954897 11036260 11036373 11181016
5574 11181016 11305325 11473683 11498213 11492619 11676503 11819763 11445864 11636928 11059190 11159589
5564 11159589 11778469 12003497 12048148 12155527 12742118 12571142 12331935 12523229 12520430 12701368
5554 12701368 12499293 12872763 13665119 14004341 14047586 14286444 15022160 15621879 15644420 15726778
5544 15726778 16285821 16700549 17647350 17677971 17222957 16821819 16989910 16954175 16747160 17032417
5534 17032417 16885372 16877632 16961341 16404350 16374034 16764746 16954999 16817444 17543199 17854238
5524 17854238 17714671 17720335 18403469 18829203 19154070 19340663 19541094 20215740 20455669 21114889
5514 21114889 21937191 23136551 24068528 25573507 27258214 27216785 25563608 24176912 23110569
5505 23110569 22488269 22211237 21821824 21955164 21891076 21680696 21676085 21847615 22007056 22385037
5495 22385037 22633461 23011435 22785621 22941572 23287184 23339999 23498277 23733376 23885104 23670909
5485 23670909 24187451 24877633 25185693 25938858 27060757 28087515 29727775 30675917 30366723
5476 30366723 28861519 27158595 26065834 25489996 25065782 24797393 24619642 24769554 24915784
5467 24915784 24753059 24579260 24973870 24860780 24977112 25238585 25412403 24972549 24402938
5458 24402938 24459636 24167361 24053345 24302271 24206783 23712375 23572836 23240494 23386832 23855016
5448 23855016 24606525 24668449 24908431 25052456 24325147 23521034 23304247 23289721 23396781 22988276
5438 22988276 22910597 22976175 22709272 23140324 22948992 22847910 23241644 23272271 23387753 24011777
5428 24011777 24261952 24324912 24438744 24576741 24553507 24833887 25430344 25933604 25809268 25890932
5418 25890932 26604015 27535587 28257957 28390481 28709180 29123170 29125409 28919269 29172931 29898274
5408 29898274 30373136 30584323 30833609 31956471 32767513 33015682 33748848 34793351 35381924
5399 35381924 36166870 37163776 38063476 38765743 38834421 38795393 37582643 36480035 35448582
5390 35448582 34517147 34007453 33181184 32201107 31080739 30198545 29486578 28392635 27945587
5381 27945587 27781019 27406532 26817469 26301954 25630318 24999976 24287669 23765679 23265574
5372 23265574 22734601 22659148 22130530 21331798 20662838 20846775 20631700 19970102 20067628 19859149
5362 19859149 19699727 19786959 19376995 19094236 18968222 18856698 18851725 18964133 18687933 18341710
5352 18341710 18229087 18099182 18020662 17740844 17597166 17373115 16839654 16873650 16784476 16789643
5342 16789643 16197806 16030471 15580000 15208002 15994609 16137824 15619354 15357955 15208463
5333 15208463 15193730 15314681 15126344 14873179 14708517 15081563 14763760 14794431 14955541 15062945
5323 15062945 15071607 15348821 15180884 15026058 14887696 14807367 14655604 14594200 14709084 14783388
5313 14783388 14613138 14912316 15011995 15250253 15508936 15593892 15745650 15520560 15774152 15955700
5303 15955700 16439589 17114116 17352883 17324365 17580715 18245413 18756683 19169635 20166416 20399380
5293 20399380 21040187 22197868 23621204 24769949 26126584 27425227 28823524 29948270
5285 29948270 30687634 31101285 31290170 32111253 32966628 34149845 36237516 38539843 40553462
5276 40553462 43166732 46079265 50320260 52831713 48580153 42238893 37579774 34180121
5268 34180121 31415768 29542574 28037406 26863504 25647213 24530241 24041337 23757920
5260 23757920 23394160 23007561 23400426 23801662 24425574 25111684 25865701 26422664 27994972
5251 27994972 29991087 31598085 32940825 32864212 32178157 31331960 30958261 31045551 31178072
5242 31178072 31283814 31888663 31854966 31135653 29459416 27047599 25023866 23250480 21999705
5233 21999705 21024460 20166991 19888413 19366457 18947926 18889720 18599066 18669935 19106455 19659905
5223 19659905 20120769 20669371 20930089 21152057 21008023 20998133 20792519 20743217 21047494 21631030
5213 21631030 22254843 22127061 21573515 20134077 18782254 17597570 16555251 15358654 14418984
5204 14418984 13434513 12901238 12548737 12313810 11956924 11678945 11439830 11618090 11182155
5195 11182155 10346004 10339929 10591619 10226501 9666874 9946102 10340402 10329415 10290127 10356882
5185 10356882 9983329 9813217 9554350 9347782 9182065 9427317 9437899 9490312 9240489 9001400
5175 9001400 9254731 9583354 9265259 9602442 9255310 8923454 9032183 9326183 9324529 9613970
5165 9613970 9628602 9702744 9535909 9423430 9306460 9151765 8828125 8616361 8738626 8946266
5155 8946266 8646199 8506293 8553410 8390399 8595571 8807651 8717142 8368259 8493458 8259079
5145 8259079 7907934 8167644 8303809 8172336 8223100 7956004 7815778 7745773 7897698 7829432
5135 7829432 7801499 7667079 7826764 8228581 7918014 7663010 7694634 7682767 7917178 7824505
5125 7824505 8002397 7730278 7762238 7845257 7459778 7586334 7979967 7510225 7395046 7782989
5115 7782989 7511494 7415467 7632757 7380926 7363827 7529619 7491070 7792016 7615743 7605658
5105 7605658 7684952 7548415 7838889 8038336 8499655 8237445 8080111 8444944 8429034 8245384
5095 8245384 8161048 8092944 8166409 8132202 8094768 8142758 8579714 9230884 8992180 8671182 8894705
5084 8894705 8798539 8806874 8702040 8520035 8462114 8504903 8395335 8567130 8609952 8509126 8613594
5073 8613594 8085925 7926966 7945265 7894137 7920629 8229045 7933558 7884540 8050145 7973547
5063 7973547 7958587 7769050 8003245 8250529 8147864 8254322 8413923 8097106 7692070 7891112
5053 7891112 8069047 7886409 7902692 7910614 8504138 8513613 8148600 7918490 7893562 8165942 8401606
5042 8401606 8746127 8525808 8644621 9078422 8607064 8547855 8488083 8578135 8898159 8316050
5032 8316050 8521058 8634149 8551199 8591122 8851304 9144564 8816041 9241025 8927723 8809304
5022 8809304 8948295 8801458 9296913 9102616 9140491 9306634 9098840 9623510 9870219 9927303
5012 9927303 9842133 9923930 10034773 10198958 10275657 10667999 10979873 10634832 10765015 10867222
5002 10867222 10399029 10564999 10997484 11254646 11017595 11106042 11271066 11356291 11829183 11790168
4992 11790168 12000604 12305617 12787570 13085020 13254454 13592823 13583006 13607137 14268348 14721581
4982 14721581 15286724 15891413 16694328 17479974 18389886 19248710 20148574 21348360 23139016
4973 23139016 24667082 25394066 25096119 24542400 23766869 22768771 22644605 22718754 22509899
4964 22509899 22699384 22275085 21947302 21620265 21599283 20926066 21042299 20675144 20932970 21330572
4954 21330572 22013830 22435598 23099687 24324628 25106293 26630017 28180020 29387737 30045196
4945 30045196 30066345 29772736 29503871 28741490 28160149 28109513 28271846 28129707 28228678 28009949
4935 28009949 27789462 26253333 24951886 23776984 22567003 21223253 20276626 19522938 18895794
4926 18895794 18608612 18334854 18183616 18261972 18324153 18511895 18591620 18882184 19531398 19879445
4916 19879445 19818051 19734163 19822130 19880039 19931338 20523029 20997808 20832436 19862045 18777597
4906 18777597 17332807 16258222 15286847 14693531 14156579 13378068 13204101 13136849 12656335
4897 12656335 12089695 12433767 12145934 11710558 11952014 11649567 11511529 11158796 11302844
4888 11302844 11445783 11100584 10659243 10590305 11060895 11172936 11164261 10839155 10430026 10586504
4878 10586504 10709102 10378358 10437988 10564944 10403789 10401378 10575585 10585788 10764794 10616684
4868 10616684 10124813 10403587 10809207 10668313 11043954 10774026 10439326 10538537 10674050 10875346
4858 10875346 10917037 11032674 10661570 10497539 11048448 11291750 11218791 10938223 11156604 11235282
4848 11235282 11414484 11259881 11242721 11517041 11324582 11172560 11336864 11507843 11657742 11924041
4838 11924041 11893323 11918946 12038348 12226018 12631182 12428445 12567976 12845631 12677391 13244361
4828 13244361 13685664 13825250 13534246 13548253 13704574 13811288 13673456 13722769 13785303 13456945
4818 13456945 13822078 14249094 14060373 14308959 14463285 14940952 15189447 15795435 16045390
4809 16045390 16099410 16443931 16397638 16190848 16023206 16158731 16428674 16769491 16903918 17555563
4799 17555563 17782352 17907432 17745237 18041988 18626548 18479093 18502148 18515372 18750383 19212128
4789 19212128 19153896 19111221 19158882 19425134 19843406 20422400 20525392 20742133 21576266 21827510
4779 21827510 22159265 22881235 23658083 24206599 24541399 24814820 25221312 25844334 26066189
4770 26066189 26402751 26761490 27356960 27750342 27493332 27390961 27565819 27981418 28072648 28274270
4760 28274270 28726005 29120492 29464334 29962485 30283149 30591751 31478857 32333201 33268856
4751 33268856 33737134 34040122 34267667 34782150 35191106 35420620 35821101 36393702 36564160
4742 36564160 36614556 36733099 36578131 36621930 36960977 37510959 37960199 38319516 38436652 39565230
4732 39565230 40344162 40681328 40865036 40845390 41528555 41307737 41152839 41605514 42144681 42285519
4722 42285519 42455637 43258702 43835873 44380500 45108600 45733097 46342235 47066207 47793556
4713 47793556 48376960 49085908 49667239 50139171 50559223 50716764 50685843 51038081 51275420 51578136
4703 51578136 51964200 52973489 53304013 53722536 54775153 55167350 55216711 55793566 56506344
4694 56506344 57366045 58116224 58267954 58507832 58885973 59013063 59107762 59258435 59563250 59790330
4684 59790330 59482024 58941843 57885398 57319640 55898151 54736348 53148690 52352707 51332566
4675 51332566 50392331 49626947 49068471 49174906 49282798 49726360 50382225 50876649 50732262
4666 50732262 50388550 49783618 48741178 47920724 46880392 46129207 45693734 45445919 45408412
4657 45408412 45183786 45074695 45314319 45655929 46210512 47114633 47857421 48023555 48152271
4648 48152271 48658427 49001658 49292126 49506964 49152816 48872282 48937088 48692506 49115130 49111292
4638 49111292 49015067 49397228 49967905 50387187 50654219 50969232 51445992 52055639 52555546 53015189
4628 53015189 53435803 54076962 54406100 54727355 55148323 55137647 55192091 54944115 54251232 54238369
4618 54238369 54037807 53267022 52684005 52104841 51492765 50559984 50295966 50023946 50002059 49587521
4608 49587521 48962236 49278474 49463969 49271823 49400557 49669982 49656016 49328847 48874607 49112938
4598 49112938 49322322 49647822 49696559 49225248 49297883 49121530 49418139 49411026 49151112 49126546
4588 49126546 48695105 48404006 48378217 48447270 48410668 47638840 48097654 48242695 47720791 47588710
4578 47588710 47344850 46998080 46673019 46091101 46051779 46058110 45557576 45767353 45178964 44987151
4568 44987151 45081155 44950548 44897252 44481435 44918597 44560676 44149559 44119845 44229909 44368230
4558 44368230 43950643 43935497 44016928 43439346 43340987 43401752 42853564 42556476 42887017 42976105
4548 42976105 43034518 42837632 42173347 42401580 41684656 41431906 41163094 40895897 40600498 40605791
4538 40605791 39730303 39327699 39463842 39810776 39850232 39469595 39314614 38919425 38280371 37587496
4528 37587496 36845275 36473225 36379292 36146232 35720963 35305461 34779245 34682018 34271304 33912346
4518 33912346 34377261 34722640 34386556 34038539 34373742 34409735 34300817 34505352 34685893 34319714
4508 34319714 34085700 33956748 34236459 34323175 34260168 33986944 34264606 34009843 34525804 35321433
4498 35321433 35558253 35604120 35684074 36146505 36578098 36775258 37066129 36642254 36636680 36596934
4488 36596934 36509966 36098329 35599200 35140158 34797802 34958853 34646845 35211543 35707295 35832958
4478 35832958 36017777 36173400 36105050 36197973 36296856 36535512 36953880 36974842 36804478 36898313
4468 36898313 36900300 37047242 37298105 37399062 37317639 37395218 37642778 38015212 38599721 38968707
4458 38968707 39413236 39846254 40310946 41049105 41641126 42244529 42830667 43615933 44422447
4449 44422447 45304035 46224702 47278118 48288243 49430726 50872695 53461452 55998959
4441 55998959 59051675 62293966 66453072 71851467 77167072 82160074 82629912 77894934
4433 77894934 71081480 64623161 59592389 56378359 53701646 52055190 50718267 49528828
4425 49528828 48760952 48463873 48714557 48705762 48298160 47972666 47941388 47693971 47982367 48034244
4415 48034244 48090461 48786851 48969215 49629208 50800069 51584314 51653562 50953237 50011249 48961380
4405 48961380 47630906 46633278 46039987 45103107 44381651 44134945 43837306 43790503 43490355
4396 43490355 43440656 42927293 42904371 42977897 42376596 42424997 42513154 42081852 42150770 42150314 41602541
4385 41602541 41260678 40803169 40494062 39944064 39765879 39936795 40153495 40316076 40828223
4376 40828223 41156134 40868722 39639926 38715627 38139222 37435754 37006457 37188253 36814024
4367 36814024 36520886 36346400 36161959 36094295 35917931 35800723 35977365 36293171 35916020 36475281
4357 36475281 36936561 36809126 36747644 37356598 37867283 38524025 39334582 40005376 41352878
4348 41352878 42640236 43763965 44411746 44482396 43891812 42878368 41946286 41267835 40527236
4339 40527236 39916406 39700384 39585009 39026292 38595454 38669910 38572998 38467246 38501960 38117403
4329 38117403 37703693 37562891 36897589 36715562 36476864 36084488 36051821 36085100 35938979 35898328
4319 35898328 36301066 36535546 36652281 36886530 36784171 37246102 37514461 37854313 38343929
4310 38343929 38591235 39293151 40307375 41073209 41027015 41370111 41684462 42604809 43328048
4301 43328048 43748702 44195593 44200971 44383679 44843098 45267288 45879822 46326790 46868014 47591661
4291 47591661 48118968 48441711 49132970 50054875 51066404 51431397 52124893 52868397 53719524
4282 53719524 54904698 56339046 57663420 59206514 61554802 63314360 64837132 65455746
4274 65455746 65272211 64571700 63289803 62173477 61232533 60244397 59961958 59823146 59411534
4265 59411534 59592948 60115006 59698777 60132495 60141712 60148439 60843190 60966922 61856002 63012261
4255 63012261 63599201 64230273 65334093 66988611 67892685 69098111 70733069 72298559 73465913
4246 73465913 74975301 76340684 77532993 79346013 80868738 82373522 83876055 84303814
4238 84303814 84363998 84625720 85013615 86262289 87199042 87667150 87220276 85546293 83262384
4229 83262384 80476165 77731362 75451902 72851504 71054235 69387058 67452601 65968132
4221 65968132 64493517 62839815 61281828 60318890 59335117 58338097 57664153 57145469 56613604
4212 56613604 56437848 56092539 56002059 55981648 56047807 56275948 56514453 57077889 57451138 57586538
4202 57586538 57489393 57649472 57402169 56955778 56779337 56056450 55910517 56107845 55914245 55889053
4192 55889053 56452547 56888619 57387429 57901998 58861042 59889916 60670722 62391334 64212570
4183 64212570 66041668 68255431 69875014 68877806 65987694 63237290 60963175 59183799
4175 59183799 57930696 57086655 56908545 56379682 56847988 57240134 57177908 57518355 57870647
4166 57870647 58329851 59164305 60494136 62400388 64214860 66708317 69933135 73259053
4158 73259053 76730291 79968070 82125330 81992969 78875787 73992809 68880530 64390751
4150 64390751 60653926 57741609 55368915 53506740 51938747 50655243 49234811 48182249
4142 48182249 47764217 46942464 46063769 45251812 44829344 44638727 44306429 44009514 43476878
4133 43476878 43053529 42751713 42459316 42794700 42546410 42663285 42923723 43244037 42909344
4124 42909344 42715190 42040386 41053474 40257033 39300224 38477901 37767959 37579378 37006142
4115 37006142 36530001 36613072 36061180 35912101 36209200 35993765 36148692 36473889 36446718 36740527
4105 36740527 36979355 37010892 37107027 37517918 37898281 38212370 38616805 38695256 39078711 39486639
4095 39486639 39111696 38878818 38746273 38899288 39348816 39704073 39835145 39415882 39560017
4086 39560017 40141252 40529408 41040994 41540073 42080370 43542839 44077831 44868367 46108816
4077 46108816 47040118 47712222 48362461 48736029 48799608 48659263 48710843 49139333 49913080 49935436
4067 49935436 50742142 51610258 52091329 52887051 53550309 54067926 54163048 54513478 54006550 53618396
4057 53618396 52726046 52574796 52196295 51952982 52241430 52378152 52606742 52559181 52645340 52777018
4047 52777018 52435930 51482849 50705698 49725610 48667759 47410197 46085455 45306067 44895873
4038 44895873 43927385 43357525 42976442 42134475 41024131 39858278 39455843 38658384 37627325
4029 37627325 36780689 35551569 34667997 33677219 32729342 31908509 31013183 30279883 29641894
4020 29641894 29076434 28326878 27638039 26925215 25856211 25010436 24793494 24047341 23540370
4011 23540370 23102283 22686983 22448248 21803845 21224891 20794811 20034455 19821751 19493553
4002 19493553 18932069 18285320 17783893 17694374 17661379 16630945 16556556 16497491 16144029 16012658
3992 16012658 15289920 15318940 15347589 15292977 14988855 14797353 14657393 14679682 14616184 14805285
3982 14805285 14707139 14637714 13959238 13135389 12990250 12969713 12420566 12230493 12429607 12380792
3972 12380792 12477162 12096721 11559207 11401116 11030147 10678984 10515855 10471275 10649871 10316698
3962 10316698 10271747 10207686 10005755 9736045 9769358 9789530 10047228 9614676 9381250 9560664
3952 9560664 8944709 8895015 8918291 8725923 8560100 8818895 9030226 8849845 8479312 8603856
3942 8603856 8755561 8726888 8862380 8396035 8598334 8805450 8230951 7977816 8206207 8067735
3932 8067735 8026037 7881655 7736356 7761339 7726762 7742082 7312964 7177678 7345289 7596900
3922 7596900 7547878 7621599 7231109 7080636 7553092 7212631 6666606 6902439 6823399 7354116
3912 7354116 6729760 6778684 6693209 6552809 6383405 5788698 6231203 6342607 6164842 5934188
3902 5934188 6318489 6311031 6083296 5934496 6174471 6746049 6590612 6547638 6642698 6213420
3892 6213420 6414600 6780946 6587695 6690953 6923629 7096011 6580877 6591812 6607255 6597243
3882 6597243 6895540 6129598 6065165 6071095 6209871 6588563 6444325 5890137 6088177 6144964
3872 6144964 6156734 5917345 5684434 5469497 5913208 6049612 5840190 5960322 5664485 5686127
3862 5686127 5730687 6080974 5818046 5592224 5682811 5537840 5461080 5562559 5488618 5333646
3852 5333646 5104583 5084345 5427821 5520404 5600584 5399536 5501453 5511386 5483696 5540608 5689628
3841 5689628 5715521 5531272 5386797 5209647 5184601 5339567 5333422 5137507 5021677 5045803
3831 5045803 4762206 4913305 5255445 5083060 5189896 5430028 5219844 5327115 5313092 5204578
3821 5204578 5120300 5079273 5005672 4644320 4993736 4989554 5221532 5045307 5044631 4805684 4993565
3810 4993565 5007843 4803808 4608503 4820077 4931723 4657550 4711573 4440193 4676944 4984311
3800 4984311 4926398 4806806 5075046 4827956 4671330 4663644 4964868 4696678 4633334 4721094
3790 4721094 4740061 4575261 4513590 4290957 4409559 4429272 4482388 4550675 4532764 4481108 4532082
3779 4532082 4991022 5207070 4762935 4247953 4201615 4420004 4412091 4539346 4127575 4412392
3769 4412392 4753752 4296654 4424948 4647373 4400950 4266230 4421842 4217419 4634512 4768016
3759 4768016 4875715 4425167 4390786 4431689 4037620 4288486 4424859 4340798 4413637 4401810
3749 4401810 4428407 4559684 4726581 4759487 4566448 4454096 4401695 4346153 4653681 4237531
3739 4237531 4301431 4116748 4398961 4566630 4429778 4650327 4617417 4746068 4416798 4329635
3729 4329635 4763508 4552049 4305831 3869824 4284120 4393185 4443231 4312047 4009656 4169047
3719 4169047 4426988 4381260 4478294 4658794 4574395 4713162 4662201 4745745 4513835 4748425
3709 4748425 4641243 4064611 3967070 4306443 4418029 4067940 3907447 4029550 4448512 4372705
3699 4372705 4670436 4744838 4701365 4838056 4349273 4617910 4856667 4767612 4835432 4925606
3689 4925606 4472849 4189366 4484031 4894733 4620657 4347476 4467851 4673284 4909098 4764561
3679 4764561 4689262 4931581 4514329 4557393 4320788 4361383 4481564 4355312 4338103 4782668
3669 4782668 4615523 4718727 5022674 5086431 4917331 4809480 4870370 4760975 4624223 4517038
3659 4517038 4584277 4497002 4322013 4560376 4535065 4536873 4314507 4561984 5293458 5391646 5145408
3648 5145408 4823720 4730985 4680679 4758003 4661039 4418929 4712831 5014983 5171551 5197789
3638 5197789 4942755 5131391 4665711 4834050 4995558 4998710 4774086 5044718 5564636 5662260
3628 5662260 5420668 5380807 5428257 5430226 5573624 5562012 5453362 5210282 5149944 5232887 5029539
3617 5029539 5305121 5518217 6006830 6197294 6001871 5701615 6034082 5884054 5635148 6035743
3607 6035743 6282585 6283237 6342499 7009644 6615553 6361073 6753474 7187865 7217524 7144966 7224974
3596 7224974 7218285 7229556 7317813 7593284 7749368 7484400 7202825 7414614 7767081 7596964
3586 7596964 7648044 7780903 8133236 7987554 7929290 8267519 8297806 8323497 7980123 8295848
3576 8295848 8610684 8392269 7695945 7507411 7548678 7989506 8051785 8300565 8516329 7891813
3566 7891813 7875804 8155265 8589911 8742543 8803853 8513881 8268583 8683433 9578852 9398007
3556 9398007 9195949 9470159 9252911 9029291 9387782 9442041 9377748 9162943 9170860 9329102
3546 9329102 9262097 9261465 9378567 9447461 9662699 9848053 9963085 9916940 10330062 10320431 10222004
3535 10222004 10338305 10257562 9872469 10057314 10434472 10908681 11077487 11282548 11287807 10826382
3525 10826382 11111908 11298710 11510312 12106832 12321710 11908416 12306216 12131059 12401345
3516 12401345 13335494 13404834 13430210 13964785 14021001 14060447 14292011 15149819 15481349 15704046
3506 15704046 15797643 16224460 16131127 16584251 17364560 17526707 17835972 18187476 18261448 18478095
3496 18478095 19004784 19675901 20506493 20414533 20592222 20990029 21290753 21271914 21517134 21551632
3486 21551632 21932172 22305841 22184418 22415113 22675401 22593776 22685708 22656601 23070217 23375994
3476 23375994 23388387 23801443 24076658 24737087 25310883 25316888 25494765 25855817 26013381 26357207
3466 26357207 26894194 27313523 27715996 28157015 28571418 28865673 29234273 29342181 30084576
3457 30084576 30635294 31736841 32508900 33358915 33989192 35118652 36006061 36685506 37937329
3448 37937329 38419850 39741374 40798135 41970425 43016916 44558899 45125450 46267547
3440 46267547 47196643 48198561 49562314 51344618 52323230 53050727 54081936 54909388 55734039
3431 55734039 56601090 57127149 57897732 58589622 58991636 59698642 59905020 60291564 60547397
3422 60547397 61010947 61432422 61715598 61751116 61692599 61691182 60997446 60405257 60197146 59587013
3412 59587013 58532382 57740086 57115323 56229897 55554732 54787155 54012258 52961003 51741176
3403 51741176 50549713 49620928 49049843 48502036 48008894 46909601 45481681 44565239 44450275
3394 44450275 44196794 42913088 42368541 41749957 41012568 40804642 40591945 40262659 39886644
3385 39886644 39594294 40150805 40019784 40264447 40461294 40702016 41455242 42058909 42519859
3376 42519859 43217752 44021519 44662204 45394546 46638977 47977947 49499407 51082175 53236789
3367 53236789 55086758 57104204 58995281 60599177 62388529 63936194 65008174 65540037
3359 65540037 65763370 65523095 65023103 64926337 64862761 65227605 65969756 66800191 67286665 67846234
3349 67846234 69198505 69445089 69591299 69657072 69262917 68357209 67203291 66635475 65655611
3340 65655611 64512445 63821534 62959388 62158384 61487684 61296727 61465444 61594438 61920337
3331 61920337 62486831 62690442 63520939 64252030 64791874 65598046 66748707 68217997 69577674
3322 69577674 70804365 72354392 74199131 75745203 77690878 79602333 81425370 84071693
3314 84071693 86599200 89514575 92002426 94467220 97253911 100721182 104427144 108073226
3306 108073226 111943139 116540107 121239176 125986772 130887527 136029306 141385923 146912516
3298 146912516 152601821 158277240 164026665 170275615 175936149 181800922 187707631 193182586
3290 193182586 198535057 203903424 208909677 213696875 218944613 224345728 229714042 234748520
3282 234748520 239922057 244469439 248518519 251733614 253288481 251637540 248076268 244078461
3274 244078461 240082972 235949481 232416914 229175609 225741255 223430550 221636540 219061640
3266 219061640 215967057 212846523 209349960 204943294 200280476 195069386 189573340 184534782
3258 184534782 179783208 175403478 171198233 167730216 164720635 162901012 161524623 160715917
3250 160715917 160225361 159925750 160940486 162752491 162217366 158354596 154353714 150530417
3242 150530417 148122474 146407808 145107446 143881728 143086060 142601167 142154663 141767210 141571433
3233 141571433 140310592 139298329 138381841 137619469 136899461 135771832 134491725 132284408
3225 132284408 130628818 128797587 126566843 124492045 122960286 120944389 118841533 117258136
3217 117258136 115846436 114657887 113775771 111654999 108307243 104431593 100826208 97972430
3209 97972430 95684519 93552043 91375753 89761911 87827668 85880399 84158211 82668133
3201 82668133 81161966 79894330 78462851 76909110 75502365 74298869 73264342 72290822
3193 72290822 72024327 71405205 70720611 69968995 69930758 69852387 69745788 69676096 69957165 70305600
3183 70305600 70701846 71259058 72226376 73680897 75028264 76104694 77435934 79772761 81998215
3174 81998215 84980080 87278101 89758050 92776030 95469762 98331518 101089030 103396951
3166 103396951 105025137 106778919 108363515 109481175 110360422 110470245 110105353 108970545
3158 108970545 108336847 107657046 106444861 105536656 104050205 102236477 100926912 99474639
3150 99474639 97574084 95755233 93413207 91339106 89393118 87799379 86427290 85081325
3142 85081325 84065159 83481581 82902955 82634196 82651526 83172991 83956705 84860715 86144285
3133 86144285 87695942 89035260 90161980 91633736 92796654 94386223 95845980 96853699
3125 96853699 97977619 99323655 100225867 100472132 100775665 101084181 101328214 101534031 101767319
3116 101767319 100997328 99990077 99103830 97634226 96604689 95288921 93708262 92328782
3108 92328782 90412697 88478262 87125532 85655784 83933642 82763924 81821237 80634695
3100 80634695 79212123 77589174 76290587 74634531 73316015 71485304 69687729 67839349
3092 67839349 65281797 63275974 61390650 59365951 57221398 55298975 53003093 50794749
3084 50794749 49357851 47851866 45808638 44497135 43292839 42020663 40661556 39733827
3076 39733827 38550014 37847733 37093477 36185342 35213536 34777110 34770116 33830669 33295672 32522293
3066 32522293 32375229 32266983 31748933 31618339 31243667 30950938 30604132 30230035 29766247
3057 29766247 29326360 29387333 29222669 29212427 28828953 28109699 27726038 27794986 27099616 26944569
3047 26944569 26699012 26162189 25290051 25153047 25293767 25280811 24931907 24746783 24318697 24044023
3037 24044023 23786903 23545647 23286250 22645210 22397246 21791161 21250655 20372065 20204218
3028 20204218 19959346 20013703 19710150 19682414 19724555 19620648 19350527 19165237 19016426 18642933
3018 18642933 18480827 18480478 18154985 18066974 17765110 17885669 17923984 18086197 18134853 18332937
3008 18332937 18217631 17875587 17405211 17382263 17571786 17776419 17613670 17721302 17931862 17422081
2998 17422081 17697520 17630954 17777309 17667683 18058543 18342603 18390162 18558580 18588773 18737016
2988 18737016 18644359 19114396 19320697 19235010 19576792 19983247 19926015 19653248 19664247 19815556
2978 19815556 19959821 20187269 20387783 20284531 20386106 20778425 21204055 21204720 21012090 21447478
2968 21447478 22164903 22193109 22351895 22679239 23322605 23731453 24395840 24174361 24465137 25043620
2958 25043620 25535227 26206016 26872996 27337247 28257321 28862197 29621856 30304839 30897219
2949 30897219 31896523 32785733 33754201 34240366 34927348 35527012 36301586 37218777 38003485
2940 38003485 38665058 39636093 40604733 41570554 43195921 44270457 45438834 47004313 48192090
2931 48192090 49630352 50830315 52742683 53922039 54753335 56186845 57637823 58940599
2923 58940599 59900637 61093908 61947368 63085894 64209861 65629279 67074588 68899432
2915 68899432 71081491 73267894 75661102 78009635 80969382 83911760 87003258 90531887
2907 90531887 94427407 98305922 102674409 107585372 113107189 118997086 125934646 133061848
2899 133061848 140825948 150028430 160698374 172112912 184765687 199522821 216946010
2892 216946010 237076542 259869130 286553779 317734559 352874945 389403210 418751874
2885 418751874 430798561 426663908 415300119 404800331 398404036 393899331 387998773 377869088
2877 377869088 363401055 346677122 329087917 310870528 293934591 278058763 262820065
2870 262820065 248492859 235926192 223157557 209895117 196888745 184332973 172796525
2863 172796525 161808102 151877553 143170020 135353559 127946963 121649154 115654389 110497398
2855 110497398 105678064 101156746 96924596 92925158 89756868 86013700 83109703 80504468
2847 80504468 77780066 75089080 72562547 70913052 68786515 67301393 65718656 64171788
2839 64171788 62755623 61592189 60865555 60069849 58625129 57970663 57274137 55772838 54674433
2830 54674433 53416518 51788717 49668147 47116367 45062975 43017622 41362041 39507589
2822 39507589 37890249 36757095 35536638 33835316 32670840 31997976 30944450 29957480
2814 29957480 28713351 27552738 26962072 26528600 25803688 24778455 24152221 23696662 23031062
2805 23031062 22418820 21455791 20966483 20300876 19968278 19621965 19079387 18771868 18074131
2796 18074131 17642082 17202690 16628587 16133252 15810293 15169405 14654149 14370318 14094576
2787 14094576 13340627 13075416 13148420 12695308 12212213 12356338 12138411 11744137 11800988 11377703
2777 11377703 11338850 11273061 11019480 10873620 10688520 10677049 10596333 10046533 9894975 9838613
2767 9838613 9565667 9415000 9278727 9015229 8883672 8969405 8955527 8631966 8494123 8063037
2757 8063037 8126806 7791709 7815002 7656572 6875923 6770112 6998626 6919230 6908205 6945322
2747 6945322 6564565 6407708 6812765 6200229 6229004 6131885 5560195 5924138 6023481 6068103
2737 6068103 6063148 5952260 5840421 5626565 5540178 5343998 5015192 5201089 5112776 4816029
2727 4816029 4699016 4857390 4775107 4779542 4690943 4589172 4639267 4469936 4624015 4917676
2717 4917676 4649062 4602507 4703617 4678546 4583920 4415033 4604718 4753666 4494637 4200044
2707 4200044 4052309 4218329 3982721 4299153 3988106 4026441 4132231 3498145 3602657 3269521
2697 3269521 3040405 2988887 3218185 3405675 3747020 3702252 3237226 3103735 3409040 3835794
2687 3835794 3815980 3598828 3274463 3177840 3048568 3431162 3636072 3588982 3586757 3418468
2677 3418468 3481480 3634860 3151250 3052308 3366309 2945461 2951736 2850561 2694057 3119036
2667 3119036 2916674 2641988 2741339 2784747 2509329 2421176 2694708 2845155 3092120 2759335
2657 2759335 2304693 2385761 2534723 2692138 2811715 2923548 2462471 2511353 2896630 2511276
2647 2511276 2645317 2808333 2684477 3018546 2839793 2676560 2685793 2470143 2728652 2888253
2637 2888253 2864485 2763437 2244781 2382107 2578151 1987276 1930321 2311329 2360496 2191310
2627 2191310 2172204 2165863 2138578 2308497 2230563 2176234 2114905 2488274 2496556 2288440 2427376
2616 2427376 2493276 2759633 2334175 2465845 2560406 2808444 2923302 2998294 3061690 2976143
2606 2976143 2669707 2754087 3048968 3373963 3626662 3808058 3853594 3635557 3328341 3039631
2596 3039631 3454497 3270528 3187084 3440140 3094188 2979926 2886476 2736894 2744742 2845491
2586 2845491 2848232 2721429 2462613 1980308 2342059 2302232 2050241 1909842 1785397 2346389
2576 2346389 2353152 2281362 2082083 1978244 1966308 2303278 2123929 1870326 1514844 1866570
2566 1866570 1707034 1673775 1527606 1067721 1551019 1388004 1289825 1219278 1577619 1416734
2556 1416734 1375205 1110799 1447650 1290609 1339736 1120915 991369 1123571 1156616 1308045
2546 1308045 1414399 1451757 1312169 1072590 907332 974644 1148182 1527324 1727675 1386936
2536 1386936 1034220 1395977 1661701 1677938 1406002 1296987 1357469 1524034 1568244 1428185
2526 1428185 1150928 1103970 1240143 1205078 1108676 1137369 1378335 1241568 1188784 1193000 1226935
2515 1226935 907760 983436 802668 548893 1045571 1110418 979433 1203957 1242178 1096839
2505 1096839 915791 667916 977463 965405 905794 892267 971092 826951 900028 845719 833502
2494 833502 837466 630513 779909 573923 404158 505538 483811 486280 466664 352730 679798
2483 679798 594795 453792 601470 879782 889328 674536 648245 564587 557861 786446 678181
2472 678181 391368 158499 276192 477407 769148 879635 798436 1016766 575980 514640
2462 514640 565002 548541 1001904 1045814 1079180 773264 594917 817221 483071 485411 399225
2451 399225 774884 789783 620600 647336 843293 914766 649961 442193 776838 1096030
2441 1096030 1263507 993567 691980 703440 696948 716211 925981 1125813 1025023 686599
2431 686599 549819 747241 1065708 884768 649478 805042 1039848 578077 462369 689299
2421 689299 714123 843783 645629 1021579 968107 841668 895919 753009 1224353 1273383
2411 1273383 603440 1052135 990127 964230 859102 506385 475082 892185 1049019 553948
2401 553948 1029858 1226153 1573560 1418661 987256 1088682 1266097 1806001 2267286 2217661
2391 2217661 1862533 1049031 1122417 1051178 1148162 1154905 1190639 1163100 704329 669639 660820
2380 660820 754037 874696 888665 864351 1023692 638264 284128 846800 632248 744223
2370 744223 739986 484394 1028133 1038240 1074170 795400 991764 763921 1002738 1274103
2360 1274103 1254947 914699 533368 605482 1038967 610908 355630 787697 793362 733389
2350 733389 827498 525960 624197 477252 993461 903582 800717 847107 721208 1048058
2340 1048058 1097431 832308 941657 1141553 1022984 481836 429372 731373 713865 742075
2330 742075 564017 767719 682107 354938 215192 498746 507605 407066 538384 392275
2320 392275 554787 1158618 1090715 330701 385222 830222 941207 563312 953882 1138159
2310 1138159 1000373 1256958 943312 1150043 1261958 996712 1021859 1068564 1278314 775515
2300 775515 470149 978916 1168518 1176853 1242563 1220740 1049375 907418 947678 1136257 912096
2289 912096 1013975 1150400 1264915 1265518 1633828 1362141 1146694 1132189 1129298 1204241 1113758
2278 1113758 917883 850550 1179627 1509542 1698565 1732365 1299485 1538866 1257928 1379437
2268 1379437 1650391 1316418 1370868 1525082 1614994 1366989 1226170 1379587 1546679 1494698
2258 1494698 1499684 1627543 1576388 1762334 1548272 1268248 1501960 1629979 1768558 1975730
2248 1975730 1956119 1627149 1690974 1604293 1471169 1783273 1780161 2083830 1933507 1939472 2177397
2237 2177397 2216923 2267900 2458047 2104084 2114269 2141521 2168981 2531787 2733912 2818441 2724881
2226 2724881 2576224 2493866 2280764 2879155 3204034 3292364 3582927 3717323 3294513 3199166
2216 3199166 3368735 3182953 3344152 3445587 3425389 3379213 3332651 3435811 3450192 3698149
2206 3698149 4107271 4347913 4138268 4139180 4006992 4309292 4458027 4817160 4992620 4974842
2196 4974842 4759395 4931521 5282249 5197213 5227857 5722719 6182007 6175755 6432336 6526589
2186 6526589 6682556 6853263 6998595 7211641 7461575 7223353 7664793 7918879 8531053 8410995
2176 8410995 8613673 8940545 8883582 8888786 9188777 9215861 9637810 9837544 10596633 11021233
2166 11021233 11307099 11479407 11827954 12497764 13367539 13914394 14787613 15687695 15810726
2157 15810726 16626732 17624527 18119957 18720521 19371639 20621855 21485199 22525169 24238917
2148 24238917 25426963 26173763 28456041 30238124 32237231 34568172 37480567 40664795
2140 40664795 43815954 45603667 47994214 50366453 54443912 58902607 66346387 74532176
2132 74532176 85768546 99136202 116155176 134571218 161288792 199823483 261500860
2125 261500860 280934012 223840327 164247647 121904942 96956416 78805837 67200350
2118 67200350 58128646 50999703 45120541 40849246 37355721 35297225 34059410 34077188
2110 34077188 32896689 29908545 27077355 25036006 22910299 21530060 20323037 19439301
2102 19439301 18504303 17476798 16019921 15137823 14547294 13739275 13064005 12589668 11995006
2093 11995006 11357292 11018835 11015624 10682613 10479354 10034145 9944510 9572051 9136486 8635994
2083 8635994 8383638 8309003 8180481 7834926 7469744 7151510 6976052 6938907 6688572 5900666
2073 5900666 5332721 5563608 5793587 5409410 5605093 5727072 5212106 5286171 5131315 4815781
2063 4815781 4467146 3861609 3923145 3828590 3822810 4096227 4084618 3811859 3615823 3523881 3220665
2052 3220665 2814248 2849498 3177680 3201790 3248846 3093124 3129447 2426324 2489937 2372897
2042 2372897 2419057 2201960 2130398 2342198 2273955 2067313 2094048 2205829 1975206 1696622
2032 1696622 1834784 1887570 1745764 1222252 1012682 1109435 1767910 1820118 1838927 1507703
2022 1507703 1308326 1158572 1419688 1322721 1469037 1491232 1438381 1333548 895422 1123762
2012 1123762 952095 1054100 1478117 1360897 1236303 1248017 1354144 1288740 1492422 1611029
2002 1611029 1201302 1255585 1564216 1168664 1019006 1359047 1730280 1393986 1078702 1089667
1992 1089667 1104847 949193 832948 488963 621959 876017 646584 473882 633193 746344
1982 746344 438275 639411 559763 641588 914668 908410 884517 774686 816014 827944 843714
1971 843714 1024377 843968 892338 835159 810529 622798 194232 301932 31100 41477
1961 41477 330687 257128 11133 726316 679922 532259 357866 200547 197524 443892 782992
1950 782992 916837 577294 581118 224016 440077 794339 529470 410813 457383 637860
1940 637860 719081 977412 805849 663951 485182 274350 -114050 200366 158204 348254
1930 348254 285442 151844 639985 276234 492717 263184 164423 -50475 -202503 289025
1920 289025 223734 496528 589066 690663 195605 18897 -106625 153037 217936 397587
1910 397587 33854 310705 347321 611991 466561 194773 -133953 -117723 521071 762079
1900 762079 428318 308462 162219 -48478 13032 193990 261418 227738 577125 399045
1890 399045 241821 272043 342702 639928 652924 784658 543142 402956 506345 753114
1880 753114 415076 601328 764321 484375 532988 441010 445540 404046 419616 308350 207531
1869 207531 434895 470945 382532 99431 389923 558957 488466 362874 203324 363168
1859 363168 597273 890169 798094 995111 972869 997998 968302 1089798 1229873 875057
1849 875057 563536 390981 355078 264768 -84058 61472 507234 416839 77700 205511
1839 205511 469495 417350 66956 -36253 44418 644183 476122 509072 470623 573469
1829 573469 919253 651479 439447 -288275 86105 929689 502274 547404 364962 569089
1819 569089 468336 516531 394683 -139729 386223 239082 303235 405302 121067 220421
1809 220421 265077 278392 517113 291691 191914 59244 -290232 -6903 485048 494340 133372
1798 133372 256140 348504 420017 6169 -73036 9055 -155001 -518604 -175938 143134
1788 143134 -12628 -221462 -66785 -138654 108169 99347 219759 251699 -7395 -105858 35566
1777 35566 99622 -301388 124116 159819 289222 420048 234768 -88913 47739 305413
1767 305413 520932 506526 2543 -180915 -126698 -252937 36767 -84996 -3077 42510
1757 42510 -563213 -328611 7652 22410 29475 232209 328884 353009 424104 123320 -418728
1746 -418728 -98978 468818 427659 252611 284530 -198194 -145079 98451 212565 90395
1736 90395 -439921 -347962 49258 101608 24200 249033 -151682 -14050 9902 -374924 -261078
1725 -261078 -36061 225262 181643 332872 311021 233345 658237 130844 -953 -14759
1715 -14759 32513 108650 164042 434781 134651 78822 97544 68492 -188107 -78545 32859
1704 32859 140953 97501 -150630 80710 210494 601613 412334 57679 -82089 -75113
1694 -75113 498519 223196 -179677 -434464 -304716 -135740 -131567 7272 -39044 123267
1684 123267 23275 138871 93546 322095 218924 52225 16240 -211546 -117181 -40095 7004
1673 7004 115810 93676 21596 -5951 -89527 -13248 264826 311656 -222781 -171924 -126462
1662 -126462 -89189 -19056 -17296 -237309 -398631 -338740 -407799 115169 272697 832223 398286
1651 398286 -294194 -418370 -146251 -162177 -284902 -158021 166875 -49434 -491321 90383
1641 90383 31587 -146198 -143787 -150001 195706 299607 -36531 -145900 -211555 -451838 -142444
1630 -142444 -210939 -260772 -276923 -354660 -272788 -250906 -608672 -931582 -520219 -94157 -136154
1619 -136154 16314 -3057 -105216 106361 482898 162487 -34127 -268727 -479740 -438765
1609 -438765 -457221 -72378 -226088 -310719 -298043 -494862 -542590 -310812 -40065 193155
1599 193155 -165794 3061 -169447 -127298 140020 71817 54563 103154 399170 204466
1589 204466 -267206 -207587 -158336 5237 -256051 -151807 -71374 -26280 169324 287194
1579 287194 244230 -155612 -54404 -458645 -267635 157981 175484 51907 213131 103723
1569 103723 -454038 -634910 -324346 -5652 73091 170868 -236098 -238124 -112531 -59398 -379217
1558 -379217 -15198 -80351 62638 259519 155310 -49909 136029 -118459 -372738 -156531
1548 -156531 219416 -3480 -350038 -205255 45724 112674 -104414 96856 162993 -27544
1538 -27544 -484445 -449981 77495 -95621 -174060 -73343 -572548 -285331 50232 93361
1528 93361 173515 417308 276009 283174 272944 18525 -71562 10446 31222 186646 55726
1517 55726 108981 426561 249048 -74401 65323 149325 389723 350694 323100 550776 547740
1506 547740 -8159 -204501 -100478 -213049 -128478 138661 -248599 -410883 -380329 -391032
1496 -391032 -70303 -195314 -60232 173636 500215 311666 254060 60681 -45329 -539371
1486 -539371 -567623 -562234 -566570 -261157 -151461 68474 -58021 -68167 -274887 -212607 -147117
1475 -147117 -140141 -201682 49475 219351 -185967 -146960 137147 -99281 -186389 316669 186551
1464 186551 -79297 -45013 26675 -110986 -25062 -129650 -201369 54821 -166651 -13118
1454 -13118 105174 -334 -8047 -120585 -290655 28078 -54653 -51771 -131253 -212028 -18808
1443 -18808 191280 116669 -107857 -553523 -259945 -408295 -452063 -603522 -465297 -256919
1433 -256919 -233162 -331839 -390245 -290379 -192076 122870 85043 -78081 -461258 -238699 188808
1422 188808 143290 -47216 -45365 30857 5713 -247487 -339513 -297494 5841 866 2463 -291190
1410 -291190 -599920 -217002 64170 -249094 -383197 146103 111915 -210618 299739 230099
1400 230099 259955 -39209 -94209 -112746 -430814 -292949 -256169 -202551 -390497 -31658 4581
1389 4581 285819 719644 228389 352751 141697 283866 418712 -59412 -155679 21984
1379 21984 119299 -237373 -52704 108860 -14461 56432 -200077 -204423 -248950 -328028 -130624
1368 -130624 -481103 -488622 -365354 622 92117 -11057 251960 -130160 -497098 -347638
1358 -347638 -109215 -244333 -355367 -120874 -121301 -37318 188179 257020 204982 -59333 -192620
1347 -192620 -235668 -430080 -347110 -357101 -203114 -136677 -32004 175203 -150075 -172562 -171726
1336 -171726 -144982 -212656 -224273 -43522 32671 -86750 -314871 -402336 44029 119301 -82951
1325 -82951 251039 256380 65634 96279 -224698 -606900 -589603 -426417 -261208 -80688 -64372
1314 -64372 -115102 -524184 -175613 -239811 -411635 -255748 -100393 -129527 -40993 -155906 73353
1303 73353 -196188 25043 -201458 -254171 -181894 -391958 143366 189607 329579 548193
1293 548193 372133 19229 -350316 -517876 -94035 -144569 -50091 207961 -150355 -296899
1283 -296899 -79241 -423895 41052 -106479 25856 127692 325460 -91624 -352335 -90168
1273 -90168 104739 133637 43164 61639 30573 -136346 -143877 28103 310387 187121 -201062
1262 -201062 -421733 -450210 -377980 -319627 -220781 -272344 -229383 -475939 -229795 -109370 -375317
1251 -375317 -5618 258694 342732 509487 11896 -90030 -8583 23198 -224620 -448618
1241 -448618 -747567 -421822 -158074 -379762 -350786 -388283 -104359 -214093 -148540 156922
1231 156922 13342 154975 167513 -588018 -229143 -89582 -197090 -320402 -338497 -188575
1221 -188575 287239 246078 -350392 -496415 -207751 195391 -118460 -343723 -321461 -293769
1211 -293769 74201 45043 197926 52240 -281229 116928 169037 129814 323157 205235
1201 205235 -30865 -323377 42285 105551 -118617 206586 -41834 -358646 -693432 -584798
1191 -584798 -117172 -108789 -472746 -123757 -283916 -504381 -29054 133007 -118527 -107868
1181 -107868 -455340 -328961 -310146 -292237 -408097 -315215 -61669 -337835 -175120 -179122 -77284
1170 -77284 -38204 69206 433825 201844 -218600 -156327 86652 214633 -141523 -250192
1160 -250192 -479454 -520158 35362 253782 -164312 -264030 -385024 -175319 -6096 76362
1150 76362 481898 575032 306885 -236109 -322911 -196769 -221935 -69934 -72514 -92239 22551
1139 22551 381393 62970 -266845 -27581 -200501 265619 286763 -132668 -456318 166885
1129 166885 -17144 -212735 -253952 -303331 -369370 -343970 271262 19914 -52285 -136636 -251671
1118 -251671 -252419 34356 -203831 -492930 -551330 -708487 -458810 40805 -19295 -353119 -214127
1107 -214127 -304619 15485 219687 96336 116407 -8175 -381768 84162 -146551 166613
1097 166613 18932 -178959 -379129 -137960 160728 -177951 -266330 -380682 20857 72190
1087 72190 -229373 -537375 -450028 -208320 -18068 415623 456156 -105244 -215948 192886
1077 192886 258706 -277302 -24309 -187919 -137424 90418 83834 -13360 136863 44842 164814
1066 164814 256403 446885 -43179 -462829 -249588 -17737 -225926 -118765 -190767 -127732
1056 -127732 107491 -5764 77194 42620 72666 -2253 63576 441086 196076 43260 324135
1045 324135 38176 27138 177729 324110 88 -214263 -303990 -53782 460426 151782
1035 151782 155112 -62582 -55749 180259 548869 94760 -110376 148927 217093 252288 75379
1024 75379 515120 466873 48731 -1516 107072 294333 117812 -221390 -291200 -7014
1014 -7014 -218730 -136494 -150310 -49588 -345018 -43141 539519 398088 235739 390704
1004 390704 -28 -121830 370087 -385227 -340897 -347242 -244499 -279272 -65928 205842
994 205842 514819 92482 25576 -34189 -159896 -251036 -260766 -543129 -269225 -405217 -749905
983 -749905 -339588 -204370 -596840 -549606 -534053 -411738 -153191 134772 202858 282302 471645
972 471645 407867 301406 362742 169322 194018 257645 -309854 -393894 -527853 -570425 -502558
961 -502558 -299572 -486476 -271164 -414703 -286887 72134 247290 385567 9752 -147747
951 -147747 24094 99904 -340211 -199768 -124982 -52751 -100396 -391041 28733 272583 325834
940 325834 290678 97384 127284 590167 383184 -275648 -184281 -147385 -207445 -171383 -52079
929 -52079 9426 252543 117860 21510 203815 -23579 -56911 181483 346682 198750 47600
918 47600 21169 -47857 -106295 185470 -153179 -218226 -331494 -213413 -28820 61027 118974
907 118974 242466 26250 158195 -86531 -471695 -488288 -573921 -81161 116185 32870
897 32870 -134965 -116897 -19957 -317293 16191 160281 -113557 -162094 -171449 -5468 -135341
886 -135341 -92530 -49601 -53136 -413593 -25826 305532 -106806 -143532 -198399 -358174 -458348
875 -458348 202761 44156 348439 519033 376733 41520 31748 308600 441222 357578
865 357578 -656 -11796 -518599 -173629 49355 -80947 -161059 -85834 -439118 -174560
855 -174560 -110760 -549479 -192110 -417420 -425439 65517 73151 -200761 -356999 -189717 -311043
844 -311043 -617733 -190302 -169133 45822 -95360 -320218 -204677 -332496 -82926 -53788
834 -53788 343849 -64663 -239250 381171 459545 -41147 -324976 -387422 -267373 -84788
824 -84788 -157803 -43203 -117152 -232080 -291872 -222512 595998 558556 219465 429073 428917
813 428917 79983 104382 247228 368242 397924 393532 471602 484051 33981 -171078 59604
802 59604 -6419 -411903 -313375 -221555 237608 -245531 -522626 -30717 289599 277041 -149704
791 -149704 41145 -60908 -332655 215770 131725 -343226 -244225 -494395 -371728 -298471
781 -298471 -368013 -87034 54721 -313627 -90407 518846 625692 360505 285732 31080
771 31080 -62695 -223499 -216459 13493 -245636 32422 148815 -124477 104367 123965 76813
760 76813 70839 -1586 79116 -128285 -242294 -131914 -409767 -454963 -252761 -320571 -218155
749 -218155 -406358 97884 279146 -144459 3624 315208 319687 -107362 -133957 -322137
739 -322137 95075 -97297 -265859 -204583 -304687 -333318 -95910 -324634 -475057 -810233
729 -810233 -433834 -288199 199781 436244 -42622 -98109 278046 -82646 -340074 -228847
719 -228847 -177043 174612 124027 -74268 -148158 -358841 -399535 163203 -85786 -152155 -19448
708 -19448 181456 57525 56648 -85036 -3556 34527 52244 -126592 -493481 -254157 -127560
697 -127560 -518549 -505854 -209262 -36329 83182 -7784 -218431 -486816 -582053 -114431
687 -114431 21208 36582 -64529 116293 54100 -157602 -409683 -637907 -77872 177099
677 177099 65751 127731 -73312 30178 -35436 -200726 -71671 -64572 -143667 -156776 212097
666 212097 510952 -173005 36942 342564 -39755 -465839 -325957 250142 -192752 -392005
656 -392005 -234540 -116344 -261777 -131333 -296114 -89354 61797 -251013 -386311 -546654
646 -546654 -461124 108784 409457 464096 30910 -425024 -127556 473792 189932 284172
636 284172 384237 302669 166216 36658 -28585 -258932 -303348 -104766 80134 632338
626 632338 234394 251893 306437 349954 380612 -98885 -374761 -91885 363604 35183 118813
615 118813 -72490 117924 -19657 17182 148195 350885 38129 297971 311834 565625
605 565625 177229 -231026 -77993 -351756 -506451 -365240 -142006 -121411 -5179 252156
595 252156 698807 566577 48591 106867 -475264 -205408 2108 407310 492061 173196
585 173196 -410879 -308502 -266605 -303089 -253807 -253047 -224084 -397981 -40283 -254333 225191
574 225191 185619 78626 -65268 98539 -273605 -115319 -15810 -176327 166229 216157
564 216157 286331 51195 155963 36322 107333 263560 -150368 -294241 -438066 68294
554 68294 160454 230218 -68143 -208104 -442912 -418838 142388 442499 254451 282154 119611
543 119611 45186 106745 -43254 15152 -245628 -249986 -513686 -500270 -295575 -188578 -114704
532 -114704 -17655 333044 249139 -138641 141116 70083 -71166 205694 -150476 -49800
522 -49800 315275 163570 -380249 -2864 16780 -121620 51806 -123733 318133 285566
512 285566 285820 -103670 554561 506978 59758 67824 -189309 72264 82551 275574 170356
501 170356 -19145 287041 8311 -371021 71009 104408 -61146 -88582 225343 306185
491 306185 665752 642322 565879 167311 -76457 80420 -421713 -542379 -651985 -593157
481 -593157 -494436 -240611 61776 -495964 -273712 -231157 -88907 -29912 193574 253818 -247135
470 -247135 131058 251811 348692 253970 72581 345481 438026 597659 618832 223994 319383
459 319383 553504 406967 -183099 -339998 271562 229682 165680 -58830 -102420 -6886 -76148
448 -76148 234493 119169 -122201 76166 20727 -60494 -64721 25015 245167 -86530 -219497
437 -219497 -216699 101057 156369 293372 316927 453117 459556 276238 283993 440337 240161
426 240161 80472 -11390 102597 531108 402126 187456 30425 237364 123864 -416659
416 -416659 -178254 -375131 -291533 56973 -168093 -288822 -15779 -78526 -168225 -107132 177212
405 177212 157485 272090 -128879 -290956 89430 121297 -3741 248484 491671 557496
395 557496 384174 -36219 -499880 -265345 -76686 137500 263105 178835 340255 -138692
385 -138692 -14555 -1809 54379 -67559 -190223 -182366 151397 252779 175191 273712 189726
374 189726 321712 67276 -247959 126117 399643 435981 -90509 -92633 -218720 31733
364 31733 395148 569381 733087 244007 319827 -97177 -296084 -85040 55286 63946 -58964
353 -58964 362682 373641 457798 562639 179962 368664 -38492 -480122 -55060 -249474
343 -249474 -556768 -414262 79321 31062 -354462 -188627 505135 146604 369377 233404
333 233404 -97425 -422436 23640 296338 58100 75103 -108050 -350163 -499838 -86724
323 -86724 222593 215032 -147049 -34805 -178521 325109 356944 353952 456466 187779 120058
312 120058 -29504 78082 -42918 -161745 205724 582621 655793 541993 355640 78501
302 78501 509372 532946 158584 94765 -20558 43904 326810 275642 289087 168216 145448
291 145448 -240331 -183749 294217 428101 14181 17715 341626 227127 349427 145200
281 145200 -3481 -161969 -238786 146647 432253 345304 304718 150458 348792 147114
271 147114 -30273 281664 431693 610241 30991 -202917 -288212 -19149 -138599 -287401
261 -287401 -214428 -162634 225872 99964 -44877 165327 123647 -201463 56110 -43906
251 -43906 -19092 -92645 50320 72832 86420 208234 122874 -144174 -69932 503249 216078
240 216078 -287397 -437327 -505279 -391573 -351968 239156 180169 257519 305541 22416 139783
229 139783 210452 -176295 60631 543524 785480 505109 175532 345359 224199 -90643
219 -90643 132117 344462 -119064 -26257 -262265 -244326 23654 330670 414664 -104439 -93886
208 -93886 78860 101856 -47801 29030 -20618 -123940 -48246 18582 202917 112182 51045
197 51045 201147 71778 193390 209626 434130 544909 326054 651019 473488 548876
187 548876 300097 137946 81714 -23705 297166 504143 387816 215359 -121585 31122
177 31122 609605 790963 462799 514303 428733 476754 -147554 -361522 -41136 -14792 -20169
166 -20169 -58178 91601 230990 462451 221446 236664 128862 92098 -97578 -15100 64318
155 64318 39525 623579 539598 356329 166402 135555 121948 206005 170954 109192 283933
144 283933 -75314 50082 139552 -18390 144937 304397 144962 109096 120215 384699
134 384699 449319 370477 465955 199727 48909 208909 144570 12586 -138860 -179162 191281
123 191281 106988 -151103 -211148 47285 185734 53851 -79561 -11804 2679 -52474 -93787
112 -93787 42134 152650 361453 450372 338667 347097 172821 197194 1614 77098 461389
101 461389 222602 -109680 -230000 -235592 -331433 -77790 445663 131434 -91766 210456
91 210456 392946 424649 345335 392289 180881 133604 171907 67322 250412 709605 558742
80 558742 217085 -7953 -113879 162476 296956 546522 660851 568450 96121 321646
70 321646 350785 250416 6034 92270 -40862 37575 121251 -132817 -22886 81521 -59549
59 -59549 -71271 189489 230316 215462 -6219 190533 434797 557408 220955 129371 89743
48 89743 151614 42692 296520 402668 105439 164672 292863 384009 303297 208426 -32348
37 -32348 -16947 327701 495296 311294 -75278 -352552 32654 41453 180314 34320 100825
26 100825 105917 289832 313384 147487 108641 153557 61790 -33997 215526 234442 159266 191195
14 191195 243329 393724 576653 566915 274677 141335 458640 259229 154478 -202906 -138193
3 -138193 145687 223617 493931
0 493931
$$ Imaginary data points
##PAGE= N=2
##DATA TABLE= (X++(I..I)), XYDATA
16383 -3777739 -3832545 -3815201 -3936277 -3783975 -3606280 -3530711 -3649967 -3371420 -3217165 -3316287
16373 -3316287 -3239178 -3322215 -3151988 -2928959 -3050856 -3268321 -3053480 -3007411 -2972914 -2859714
16363 -2859714 -2849502 -2742847 -2584504 -2642706 -2355172 -2000754 -2072131 -2316713 -2200002 -2126368
16353 -2126368 -2045915 -2031627 -2210680 -2303942 -2052938 -1964894 -1969811 -1806387 -1515652 -1551459 -1748962
16342 -1748962 -1651504 -1603704 -1448736 -1443392 -1259437 -1003735 -1061998 -789890 -831395 -1224822
16332 -1224822 -1436572 -1340272 -1330614 -1499168 -1256773 -1092844 -931991 -907717 -791800 -966627
16322 -966627 -558493 -698535 -606496 -624077 -855302 -680197 -640503 -530918 -508526 -336316
16312 -336316 -350499 -330619 -352769 -279607 -425588 -374555 -207311 -37120 -69376 -59831 -135638
16301 -135638 -289637 -263901 158620 135151 178586 103206 -244918 111649 694738 660569
16291 660569 437830 535367 739471 706219 653043 1133072 935589 893754 745311 882985
16281 882985 1007446 838856 948507 1063441 1012301 1249666 1364050 1104751 955997 880045
16271 880045 1415234 1422324 1002278 912252 1093040 1313762 1273718 1232654 1367687 1587412
16261 1587412 1416741 1568840 1762302 1651864 1806697 1930241 2053544 2257762 2215013 2177345
16251 2177345 2012522 2043581 2142185 2120071 1919100 1786728 1607293 1630530 1547281 1626737
16241 1626737 1987762 1607511 1604139 2079173 2330992 2582504 2084044 2204664 2611814 2514535
16231 2514535 2553572 2869923 2604841 2357084 2601752 2703856 2976970 2931905 2717797 2766206
16221 2766206 2974664 3215736 2975319 2881153 2857620 2706328 2611927 2751163 2467208 2753498
16211 2753498 2743698 2885843 2928237 2628897 3271985 3281661 3093653 3034735 3033019 2787875 2886123
16200 2886123 3110394 3209712 3065381 3153871 3064990 3129498 3016827 2962753 2906463 2946962 2829904
16189 2829904 3256627 3587138 3260811 3058080 3318878 3409145 3460189 3530598 3843292 3683879
16179 3683879 3462233 3329232 3208633 3539555 3395382 3338808 3357922 3241803 3084532 3507530
16169 3507530 3587750 3568706 3547575 3460953 3412538 3520180 3506987 3584575 3525723 3249022 3493459
16158 3493459 3696622 3951534 3474943 3851416 3824008 3808133 4014939 3837505 4204284 3965621
16148 3965621 3742879 3626896 3571692 4045464 3947251 3891341 3794008 3836000 3758168 3928583
16138 3928583 4278986 3804317 3695305 3723392 3639239 3877048 4300438 4497667 4045842 4016447
16128 4016447 3980698 3643012 3775465 3977770 4039021 4080588 4013880 4066555 3855559 3544778
16118 3544778 3849456 4096438 4287903 3834746 4108782 4229462 4332167 3944164 4009396 4163840
16108 4163840 4252774 4191780 4146258 3746273 3674761 3942647 4254885 4112949 4019291 4111533
16098 4111533 4023306 4260400 4299675 4096680 3692500 3852452 3806904 3871444 3882997 3987635
16088 3987635 4249182 4332784 3965638 4356633 4042411 3959920 4306373 4179269 4047014 4139501
16078 4139501 4046610 4164835 4111758 3998220 3975490 3788710 3948712 4218780 4347048 4301336
16068 4301336 4495920 4253723 4153750 4145765 3962876 3952227 4018801 4428672 4513219 4323180
16058 4323180 4301528 4151575 4013527 4560339 4727884 4366494 4121173 4165741 4201826 4002291
16048 4002291 4259996 4189629 4076223 3942036 4003338 3782059 3952416 4446371 4364264 4216159
16038 4216159 3951264 3906203 4394825 4067846 3799814 4084185 4044497 3871899 3642419 3694208
16028 3694208 4003516 4055664 4150376 4294085 4207306 4117649 4325336 4050364 3686959 3602319
16018 3602319 3984385 4339334 3963164 4377884 4169397 4012693 4277640 4016202 4000278 3913803
16008 3913803 3907287 4417568 4628433 4164219 4059354 4117121 3873189 3908226 4322198 4432266
15998 4432266 4331819 4415226 4501382 4419338 4534989 4454632 4367434 4385134 4262924 4231228 4311269
15987 4311269 4431738 4291819 4275393 4111214 4323411 4490765 4182301 4185803 4371547 4397826
15977 4397826 4283168 4384621 4722212 4816211 4230664 4262701 4280380 4286352 4363988 3829301
15967 3829301 3916903 4083802 4047795 4221017 4332674 4611956 4317246 4494193 4340414 4464248
15957 4464248 4333980 4639085 4822513 4839330 4450919 4253255 4099124 3846582 4138485 3936571
15947 3936571 4092969 4282320 3951452 3854132 4274020 4349545 4478671 4155981 3910872 4181153
15937 4181153 4545760 4726474 4569239 4473470 4427601 4256834 4688283 4574649 4408909 4145713
15927 4145713 4266612 4525606 4378108 4306819 4644805 4286970 4188116 4379547 4314412 4115908
15917 4115908 4339523 4275250 4252267 4305129 4317300 4012606 4287878 4250900 4567484 4395410
15907 4395410 4267927 4281917 4262247 4230618 4627323 4732789 4507248 4613946 4141989 3839122
15897 3839122 4313546 4234946 3910055 3859531 4126612 4433096 4160275 4273164 4077418 3823140
15887 3823140 3949601 4079805 4210297 4277490 4488514 4149965 3871766 3816170 3457194 3937288
15877 3937288 3830006 3905833 4074957 4140891 3956760 3781851 4196311 4365506 4068822 4037507
15867 4037507 3999346 4031664 4197753 4212139 4117989 4117815 4071625 4558622 4731840 4389054 4213964
15856 4213964 4509442 4313498 3922023 3854809 4037017 4143433 4212064 4153157 4311140 4055586
15846 4055586 4227552 4435470 3926479 3761104 4222898 4287168 4303334 4346745 4606029 4299330
15836 4299330 4676999 4694383 4491778 4366352 4627738 4381771 4259014 3998124 3789127 4072942
15826 4072942 4311855 4338001 4493664 4616769 4109564 4467853 4627305 4396894 4166568 4543599
15816 4543599 4724345 4776026 4365401 4279621 4328109 4373229 4087149 4080313 4314668 4513464
15806 4513464 4471819 4153089 3969912 3968090 4199308 4446731 4305283 4154310 4318423 4275445
15796 4275445 4361803 4207459 4136069 3988447 4147326 4013605 3989612 4044432 4141171 4599841
15786 4599841 4315271 4169982 4381178 4500714 4693691 4765341 4496755 4599331 4668692 4245290
15776 4245290 4184619 4597699 4361903 4289660 4297505 4571805 4579804 4346919 4079573 4192179
15766 4192179 4164604 4119687 4280074 4033806 4166796 4182462 4155789 4311717 4661096 4849737
15756 4849737 4207704 3901877 4048383 3966579 4028291 4149588 4049162 3829574 4085579 4500741
15746 4500741 4449314 4519104 4330089 4235826 4546563 4834869 4719206 4170510 3595963 3729561
15736 3729561 3912967 3866592 4097345 4721718 4271157 4276562 4335349 4198032 4346769 4521854
15726 4521854 4457284 4103927 4328936 4694086 4595337 4559108 4506688 4158097 4157870 4080310 4195134
15715 4195134 4474983 4388884 4574555 4315497 4417162 4413254 4761534 4543773 4078921 4344650
15705 4344650 4612960 4733009 4464691 4186250 4053812 4201670 4271040 4523496 4072122 4466769
15695 4466769 4417408 4461579 4445072 3880149 4054130 4018481 3868481 4318943 4068503 4331427
15685 4331427 4075714 3939247 4276528 3940293 4149779 4333520 4531969 4393313 4358149 4657519
15675 4657519 4245331 4331774 4132219 3950718 4191537 4070971 4030844 3839112 3751429 3880987
15665 3880987 4462188 4351190 4344096 4777411 4454355 3814051 4284765 4429805 4354209 4956413
15655 4956413 4393586 4402874 4496697 4177237 4031817 4050381 3972112 4245348 4456076 4459361 4168269
15644 4168269 4267109 4523766 4130832 3787659 3992430 3941586 4012562 4041282 4174475 4530291
15634 4530291 4421289 4065366 4390839 4757121 4922527 4383058 4049658 4263337 4315318 4677876
15624 4677876 4417985 4329806 3867729 3996129 4086296 4251283 4707780 4340915 4053642 4344815
15614 4344815 4473818 4549887 4275415 4255781 4454345 4428918 4554083 4582541 4474413 4548596
15604 4548596 4002959 3979714 4315240 4355182 4335507 4656717 4804703 4422431 4242226 4711549
15594 4711549 4732217 4114273 4175947 4124405 4515448 4657700 4466808 4477604 3914120 4077619
15584 4077619 4155235 3956404 3918801 3644191 3793656 3690547 4057286 4235141 4069851 4116337
15574 4116337 4189542 3958516 4377862 4351064 4289011 4898014 4650778 4993498 4613855 4395017
15564 4395017 4504248 3993953 3945403 4062207 4342213 4283873 4348481 4553732 4313139 4318070
15554 4318070 4254889 4160584 4318197 4112275 3936550 4039333 4321954 4431220 4207497 4414907
15544 4414907 4591574 4340460 4177375 3805252 4148908 4092347 4248947 4410107 4176330 4353784
15534 4353784 4448732 4431697 4391915 4442223 4313676 4745236 4584825 4591672 4403903 4836876
15524 4836876 4737297 4378136 4193447 4289816 4317322 4209737 4290313 4755810 4666652 4256413
15514 4256413 4381910 4103442 4075251 4216048 4447165 4492768 4670673 4510974 4728272 4951383
15504 4951383 4609437 4433410 4283444 4106463 4467430 4481067 4728636 4750168 4583201 4276935
15494 4276935 4400032 4676440 4959172 4949399 4522562 4368670 3964689 4383256 4650781 4813662
15484 4813662 4992813 4672203 4974314 5034905 4929644 4677149 4646425 4588716 4513395 4354782
15474 4354782 4460338 4215659 4176493 4772370 4635538 4429156 4612240 4446350 4495682 4297553
15464 4297553 4094583 3941082 3936776 4213531 4598766 4723258 4219206 4419822 4143329 4585792
15454 4585792 4701251 4368702 4868586 4740987 4228195 4639008 4640067 4694231 4447349 4087580
15444 4087580 4062945 3862938 4107658 4487795 4102332 3749846 3857687 3933085 3971235 4024407
15434 4024407 4379041 4355806 4323241 4636167 4732662 4565645 4692177 4676003 4508407 4436523
15424 4436523 4325803 4079258 4214483 4171756 4249656 4283299 4016741 4209318 4337978 4266469
15414 4266469 4522236 4483391 4295460 4383180 4660463 4799289 4507490 4244194 3957071 4305590
15404 4305590 4512828 4596544 4305169 4214759 4454616 4490724 4419538 4414020 4225001 4041349
15394 4041349 4174016 4021763 4322524 4616886 4740035 4564546 3767537 4118756 4486963
15385 4486963 4482677 4372442 4386119 4767553 4764847 4748672 4410756 4108960 4489738 4380485
15375 4380485 4261901 4594435 4478729 4426445 4089938 4177905 4322144 4400046 4457692 4369902
15365 4369902 4363170 4347387 4100964 3792783 4363534 4763199 4895567 4593673 4381310 4599614
15355 4599614 4240791 4378838 3976041 4000200 4387633 4570981 4360500 4493780 4584240 4492726
15345 4492726 4242463 4321884 4011683 4036879 4140836 4254487 4564399 4467337 4145969 3978435
15335 3978435 4230277 4489357 4896324 4374534 4290857 4495449 4367996 4229013 4563174 4123406
15325 4123406 4214605 4689269 4619485 4654268 4450507 4254086 4477644 4487539 4447777 4243872
15315 4243872 4473666 4574495 4608347 4148177 4073891 4597726 4277947 4260871 4270439 4539688
15305 4539688 4405169 4006179 4283504 4285915 4210096 4390244 4447367 4516859 4527301 4488760 4343717
15294 4343717 4471818 4930031 4858563 4618792 4554904 4478867 4104455 4210796 4094740 4248975
15284 4248975 4790950 4548948 4374943 4310249 4412447 4422937 4768824 4873479 4388445 4386035
15274 4386035 4255301 4238057 4259663 4364318 4203737 4437489 4645159 4527137 4606333 4173510
15264 4173510 4347353 4366543 4616304 4729157 4404219 4235393 4206487 4377393 4282753 4371671
15254 4371671 4527742 4735984 4707600 4508608 4551014 4222475 4548186 4756400 4817584 4508589
15244 4508589 4600112 4730339 4492260 4450358 4279909 4500700 4743640 4843287 4860429 4769934
15234 4769934 4829081 5122576 5193968 4766278 4491882 4592387 4549611 4300691 4351369 4988406
15224 4988406 4832253 4884368 5094635 4983307 4712223 4750090 5037240 4562434 4191291 4441397
15214 4441397 4655117 4685340 4871870 4791620 4729878 4725179 4768383 4369540 4253865 4495893
15204 4495893 4977300 5432202 4859539 4452311 4391645 4565441 4412513 4355047 4296196 4343889
15194 4343889 4384387 4457631 3982127 3894588 4008879 4324936 4494768 4813499 4579015 4004505
15184 4004505 4607098 4873359 4788919 4812468 4631025 4443188 4545491 4490097 4302340 4206862
15174 4206862 4384083 4422278 4838639 4874566 4917469 4600133 4687746 4847962 4846333 4534486
15164 4534486 4219280 4459058 4440496 4894628 5232124 4940111 4303634 4412473 4892027 4306668
15154 4306668 4063025 4410594 4313914 4533862 4522634 4346223 4580501 4688866 4628044 4432723
15144 4432723 4910374 4560730 4499028 4525694 4607926 4734758 4938498 5117145 4844628 4969325
15134 4969325 4739150 4463856 4274174 4209036 4307414 4571152 4415118 4490641 4753237 4836003
15124 4836003 4938732 4604780 4372091 4430219 4550455 4939652 4537195 4778923 4894790 4507209
15114 4507209 4793979 4900966 4796899 4597385 4843061 4747681 4735897 4735636 4812987 4661580
15104 4661580 4740014 4773981 4338644 4428453 4354590 4757318 4720053 4796310 4783481 4856437 4646065
15093 4646065 4524242 5023503 4906533 4951357 4815822 4529842 4656521 4626132 4442208 4514479
15083 4514479 4809577 4301268 4568669 4834692 4903295 4652175 4563753 4948389 4684306 4590473
15073 4590473 4530175 4403969 4006917 4210593 4356104 4604432 4608621 4671369 4964379 5146656
15063 5146656 5019229 4590168 4694167 5066897 5241062 4832846 4896976 4590902 4446859 4688567
15053 4688567 4399574 4623062 4705836 4682044 4685540 5018996 5120631 4730378 4672216 4583993
15043 4583993 4247584 4642301 4500547 4667026 4436562 4305591 4738241 4636785 4927089
15034 4927089 5054088 4703136 4502818 4915572 4650665 4489956 4515337 4679043 4886189 4524478
15024 4524478 4715720 4872116 4703098 4550876 4671942 4731864 4353761 4428258 4506879 4628646
15014 4628646 4467553 4568494 4410526 4464453 4906384 4892900 4671540 4548683 4606165 4612186
15004 4612186 4590223 4533370 4856555 4430058 4519444 4942468 4605133 4563752 4415492 4416183 4285791
14993 4285791 4219712 4345220 4198379 4207824 4490004 4739371 4879178 4931875 4731903 4659301
14983 4659301 4627463 4449074 4478805 4519250 4593240 4632556 4763679 4974487 4585320 4586628 4462184
14972 4462184 4479921 5014791 4829333 4614855 4651741 4696064 4695278 4721930 4872890 4934324 4710176
14961 4710176 4676615 5095894 5107775 5394555 5408342 5013864 4888248 4903333 4879958 4745539
14951 4745539 4592343 4321554 4104394 4307862 4649676 4860570 5110832 5260757 5095234
14942 5095234 4822173 4805555 4886892 4837275 5044471 4614144 4433892 4650240 4736239 4916024
14932 4916024 4771702 4816891 4659420 5204720 4739559 4910059 5327427 4943470 4834678 4850423
14922 4850423 4569770 4290292 4346500 4655988 4724309 4629439 4469237 4341319 4542623 4531113
14912 4531113 4502709 4828986 4874615 4402572 4194592 4367705 4744950 4858756 4997247 4858232
14902 4858232 4805228 4643933 4798661 4856861 4504439 4503881 4576223 5019931 4839456 4458998
14892 4458998 4653904 4893417 5058160 4799901 4870363 4956005 5014819 4868642 4853938 4199554
14882 4199554 4228032 4409476 4439317 4215652 4443928 4875317 4744682 5092422 4856520 5028030
14872 5028030 4924157 5106893 5194630 4877968 4967304 4696393 4114199 4649746 4333022 4147709
14862 4147709 4540460 4665139 4549922 4627696 5019862 4889600 4973141 4701874 4736770 4723151
14852 4723151 4666494 4714908 4763265 4601680 4510649 4473681 4482254 4637846 4832328 4603563 4455730
14841 4455730 4533727 4685060 4771018 4614458 4288642 5121642 4843354 4334184 4677840 4882366
14831 4882366 4795088 4338798 4486013 4927341 4774322 4507888 4386416 4658882 4987084 4749334
14821 4749334 4550000 4683645 4864301 4604470 4795767 4892167 4562583 4317402 4483589 4507554
14811 4507554 4866932 5105417 4858253 4801585 4944887 4374080 4538176 4791437 4780583 4717176
14801 4717176 4828761 4609127 4358176 4475578 4524890 4354607 4348497 4199888 4200891 4307876
14791 4307876 4982092 4983534 4734274 4992393 4979815 4873549 4564303 4868612 4839449 4763069
14781 4763069 5014257 5132681 4809158 4919286 5020027 4694270 4348974 4710332 4934582
14772 4934582 4580678 4360608 4707374 5085612 4937588 4858766 5009975 4986984 4742317 5016710
14762 5016710 5083075 4841641 4509075 4361514 4582339 4733093 4846072 4572107 4903624 4816527
14752 4816527 4593016 4997759 4696527 4816304 4479378 4540123 4702850 4599221 4740525 4751149
14742 4751149 4900942 5175036 5178011 5147914 5243860 4761972 4768651 5071923 4944928 4668425
14732 4668425 4815052 4927748 4851632 4674319 4631054 4731286 5034732 5028215 5221513 5257688
14722 5257688 5207149 4989525 4892032 5103078 4591569 4249887 4279620 4422242 4743103 5144355
14712 5144355 4736747 4645002 4838975 5037011 5047379 4709063 4972579 5098195 5017190 5012113
14702 5012113 4994500 4743597 4780113 4916002 4601651 4589002 5197402 4976325 4816338 4325584
14692 4325584 4318915 4597384 5082337 5105631 5225083 5153559 4875913 5082786 4937779 4755140
14682 4755140 4657416 4613957 4430274 4528378 4541880 4574003 5129827 5082783 4940472 4870800 4841769
14671 4841769 4756727 4692574 4573781 4918505 4874731 4785884 5166839 4786741 4735516 5288430
14661 5288430 4897711 4583680 4721133 4561230 4784912 4674765 4748163 4964323 4921643 4903071
14651 4903071 5105912 4743161 4806855 4884500 5072348 5103777 4991878 4894443 4839885 4740562
14641 4740562 4584978 4373537 4469170 4751942 4922241 4622639 4919440 4744278 4985929 4776789
14631 4776789 5254181 5335607 4724760 4545375 5159473 4995752 4564208 4600655 4983915 5047088
14621 5047088 5104185 5037718 4991209 4975027 4588612 4424455 4649790 5178801 4901691 4879584
14611 4879584 4877173 4412864 3908309 4304521 4978758 5006909 4522163 4264204 4455204 4594915
14601 4594915 4484000 4577214 4681015 4788178 4840043 4756800 4749184 4595958 4788025 5279635
14591 5279635 4838879 4966175 5072864 5030297 5044148 5247490 4753120 4734933 4750099 4808032
14581 4808032 4610204 4818574 4756997 4829822 4923570 4836481 4909312 4875720 5106538 5160383 4423533
14570 4423533 4469941 4612475 4506967 4507412 4570836 4527462 4717733 4818342 4591861 4657197 4609795
14559 4609795 5127728 4976378 4875226 5104891 5040213 4948954 4899147 5038117 4919631 5156039
14549 5156039 5443709 5045335 4590418 4865324 5118620 4779087 4660023 4886770 4812665 4754344
14539 4754344 4726134 5012392 5298335 5100814 4851238 4927570 4922921 5082312 5007004 5209363
14529 5209363 5106285 4694872 5155473 5501900 5261466 4931878 4981066 5117037 5388345 4998055
14519 4998055 4747555 4665908 4704520 4865905 5042576 4930568 4594126 4567858 5093520 5198384
14509 5198384 4933397 4881049 4961703 5183142 5085446 4929079 5249489 5203236 4933820 4953161
14499 4953161 4969218 5013232 4873849 4849475 4469621 4519585 4750930 4576942 4684262 4681512
14489 4681512 4820021 4986911 5274912 5399264 5551792 5065558 4904274 4414202 4711766
14480 4711766 4799855 4963525 5013641 4655765 4584361 4507871 4723434 4973602 4685426 4511915
14470 4511915 4974228 5124122 4995116 4581758 4730431 4944072 4873862 5112825 5223738 5321646
14460 5321646 4961287 5051022 4979322 5026183 4897975 4604402 4935859 4996003 4978949 5125366
14450 5125366 5100148 4847232 4790229 5114713 5179710 5246562 4847770 4627717 4886508 5086233
14440 5086233 4890486 4632540 4610795 4801917 4892691 4942161 5217952 5135851 5137786 5087543 5136560
14429 5136560 4770254 4872497 4843384 5019690 5268656 5169895 5139038 5093698 4407277 4501880
14419 4501880 4742699 5105135 5266245 5536259 5853970 4934594 4476630 4857416 4771713 4886422
14409 4886422 4999146 4855169 4618567 4822855 5135168 5273155 4839633 4896257 4911597 4934229
14399 4934229 5141409 4837395 4861094 4998787 5227266 5599921 5555414 5375395 5594014 5310149
14389 5310149 4731503 4848166 4790037 4737296 5156257 5194549 4851597 5024825 5245990 4813903
14379 4813903 4757986 4863036 5099478 5047517 4859023 5108013 5159019 5298029 5245130 5018752
14369 5018752 4829676 5091153 5119803 4867140 4828765 5061308 5205719 5034982 5043515 5058361
14359 5058361 4974880 4702395 4934476 4908653 4667335 4676364 4684196 4940504 5335601 5435606
14349 5435606 5483340 5353904 5010587 4716151 4825668 5048136 5031471 5306933 5146819 5044199
14339 5044199 4935167 4914735 4906206 5194462 5442479 5253348 4954428 5196636 5519898 5492121
14329 5492121 4974406 4985332 5572826 5493332 5167835 5059310 5160636 5153949 5339578 5112554
14319 5112554 4879235 4881524 4899226 4798123 4726546 4872151 5109542 4993764 5090348 4741624
14309 4741624 4956592 5040095 4909934 4765457 4836090 4790276 4928245 5051108 5061622 4795578
14299 4795578 4908611 4863470 4757378 4803060 5094593 4997988 5315107 5410088 4985374 4936514
14289 4936514 4850075 4796053 4869905 5239015 5194920 5086791 4640402 4734235 4854767 4871898
14279 4871898 5063482 5238338 4798111 5232025 5499430 4867953 4526600 4659806 4769624
14270 4769624 4920798 4655724 4828177 4856594 4724545 5153459 5152368 4884752 4772815 4873102
14260 4873102 4741770 4903583 5042916 5060832 4748361 5240003 5248265 5518315 5865567 5613143
14250 5613143 5551984 5452218 5208230 5258800 5528064 5361384 5410833 5732171 5736071 5571607
14240 5571607 5311664 5118999 5248387 5562250 5686726 5513439 5174468 4710368 5086265
14231 5086265 5272680 5547453 5417136 5365551 4966224 4756040 4741567 5014098 5237032 5179346
14221 5179346 5237302 5257597 5188823 5272035 5174492 5100671 5158543 5417619 5475598 5072132 5093740
14210 5093740 4867984 5341310 5302899 4803888 5213409 5046521 5090960 4869376 5052969 5448412
14200 5448412 5070552 5032382 4993180 5088003 5044570 5175187 4826706 4922651 5115576 5106667 5340423
14189 5340423 5176514 5332368 5471486 5117694 5185297 4879197 4793608 4829163 5000766 5029046
14179 5029046 5316046 5141763 5175417 5131860 5141113 5420682 5105341 5446076 5345979 4783001
14169 4783001 4558755 4752736 5380311 5484330 4966644 4872917 4993793 5475644 5218211 5185784
14159 5185784 4953861 5061219 4969341 4925774 4915924 4897476 5227978 5108313 5144726 5308564
$$ [...]
##END NTUPLES=NMR SPECTRUM
##END=
