##TITLE=1H_CA-8993-2
 CDCl3
 8 sc, 
 17.03.2022
##JCAMPDX= 6.0         $$ Bruker NMR JCAMP-DX V2.0
##DATA TYPE= NMR SPECTRUM
##DATA CLASS= NTUPLES
##ORIGIN= UXNMR, Bruker Analytische Messtechnik GmbH
##OWNER= root
$$ XWIN-NMR		Version 3.5
$$ Fri Mar 18 12:58:04 2022 Russian Standard Time (UT+4h)  she@DPX200
##.OBSERVE FREQUENCY= 200.131346
##.OBSERVE NUCLEUS= ^1H
##.ACQUISITION MODE= SIMULTANEOUS
##.ACQUISITION SCHEME= undefined
##.AVERAGES= 8
##.DIGITISER RES= 18
##SPECTROMETER/DATA SYSTEM= spect
##.PULSE SEQUENCE= zg30
##.SOLVENT NAME= CDCl3
##.SHIFT REFERENCE= (INTERNAL, CDCl3, 0, 15.7193)
##AUDIT TRAIL= $$ (NUMBER, WHEN, WHO, WHERE, WHAT)
$$ ##TITLE= Audit trail, XWIN-NMR		Version 3.5
$$ ##JCAMPDX= 5.01
$$ ##ORIGIN= Bruker BioSpin GmbH
$$ ##OWNER= she
$$ F:/spectra/data/she/nmr/H-F/1/pdata/1/auditp.txt
$$ ##AUDIT TRAIL=  $$ (NUMBER, WHEN, WHO, WHERE, WHAT)
(   1,<2022-03-18 12:56:28.92 +0400>,<she>,<DPX200>,
      <created by zg, POWCHK disabled, PULCHK disabled
       configuration hash MD5:
       00 E9 B6 7A A2 85 ED C7 34 08 36 98 17 FE 4E 26
       data hash MD5: 16K
       C0 8D 7B 59 5D 40 81 95 27 C8 1A 3A 5A B7 20 2E>)
(   2,<2022-03-18 12:56:31.65 +0400>,<she>,<DPX200>,
      <Start of raw data processing
       efp BC_mod = 2 LB = 0.24 FT_mod = 6 PKNL = 1 PHC0 = -17308.12 PHC1 = 11.20078 SI = 16K 
       data hash MD5: 16K
       4C 99 71 69 F2 0C 36 79 7D 69 7E B1 50 42 AD C1>)
(   3,<2022-03-18 12:56:43.25 +0400>,<she>,<DPX200>,
      <abs ABSG = 5 
       data hash MD5: 16K
       97 86 EB C7 2D D3 B4 18 4F AF 46 36 55 11 43 91>)
(   4,<2022-03-18 12:57:00.81 +0400>,<she>,<DPX200>,
      <pk PHC0 = 2.41059 PHC1 = -2.4 
       data hash MD5: 16K
       5D 43 A9 11 35 C5 03 A6 0B 1E 18 04 92 64 7A 70>)
(   5,<2022-03-18 12:57:04.39 +0400>,<she>,<DPX200>,
      <abs ABSG = 5 
       data hash MD5: 16K
       2A 8E 5E 3E 72 F6 24 84 A1 85 C2 77 55 04 D7 64>)
$$ ##END=
$$ 
$$ hash MD5
$$ 08 86 E5 EC 76 58 81 C6 0B 0D D4 A7 D9 D3 71 44
##$RELAX= 
##$RELAX= 
##$RELAX= 
##$RELAX= 
##$RELAX= 
##$RELAX= 
$$ Bruker specific parameters
$$ --------------------------
##$DU= <F:/spectra>
##$EXPNO= 1
##$NAME= <H-F>
##$PROCNO= 1
##$TYPE= <nmr>
##$USER= <she>
##$AMP= (0..31)
100 100 100 100 100 100 100 100 100 100 100 100 100 100 100 100 100 100 
100 100 100 100 100 100 100 100 100 100 100 100 100 100 
##$AQSEQ= 0
##$AQ_mod= 1
##$AUNM= <au_zg>
##$AUTOPOS= <>
##$BF1= 200.13
##$BF2= 200.13
##$BF3= 200.13
##$BF4= 200.13
##$BF5= 200.13
##$BF6= 200.13
##$BF7= 200.13
##$BF8= 200.13
##$BYTORDA= 1
##$CFDGTYP= 0
##$CFRGTYP= 5
##$CHEMSTR= <none>
##$CNST= (0..31)
1 1 145 1 1 1 1 1 1 1 1 1 1 1 1 1 1 1 1 1 1 1 1 1 1 1 1 1 1 1 1 1 
##$CPDPRG= <>
##$CPDPRG1= <>
##$CPDPRG2= <>
##$CPDPRG3= <>
##$CPDPRG4= <mlev>
##$CPDPRG5= <mlev>
##$CPDPRG6= <mlev>
##$CPDPRG7= <mlev>
##$CPDPRG8= <mlev>
##$CPDPRGB= <>
##$CPDPRGT= <>
##$D= (0..31)
0 1.2 0 0 0 0 0 0 0 0.06 0 0.03 0 0 0 0 0.0002 0 0 0 0 0 0 0 0 0 0 0 0 
0 0 0 
##$DATE= 1647593788
##$DBL= (0..7)
$$ [...]
##$SUBNAM2= <"">
##$SUBNAM3= <"">
##$SUBNAM4= <"">
##$SUBNAM5= <"">
##$SUBNAM6= <"">
##$SUBNAM7= <"">
##$SUBNAM8= <"">
##$SUBNAM9= <"">
##$SW= 18.0517287032376
##$SWIBOX= (0..15)
0 0 2 0 0 0 0 0 0 0 0 0 0 0 0 0 
##$SW_h= 3612.71676300578
##$TD= 16384
##$TD0= 1
##$TE= 0
##$TE2= 300
##$TE3= 300
##$TEG= 300
##$TL= (0..7)
0 120 120 120 120 120 120 120 
##$TP= (0..7)
150 150 150 150 150 150 150 150 
##$TP07= 0
##$TPNAME0= <>
##$TPNAME1= <>
##$TPNAME2= <>
##$TPNAME3= <>
##$TPNAME4= <>
##$TPNAME5= <>
##$TPNAME6= <>
##$TPNAME7= <>
##$TPOAL= (0..7)
0.5 0.5 0.5 0.5 0.5 0.5 0.5 0.5 
##$TPOFFS= (0..7)
0 0 0 0 0 0 0 0 
##$TUNHIN= 0
##$TUNHOUT= 0
##$TUNXOUT= 0
##$USERA1= <user>
##$USERA2= <user>
##$USERA3= <user>
##$USERA4= <user>
##$USERA5= <user>
##$V9= 5
##$VALIST= <valist>
##$VCLIST= <CCCCCCCCCCCCCCC>
##$VD= 0
##$VDLIST= <DDDDDDDDDDDDDDD>
##$VPLIST= <PPPPPPPPPPPPPPP>
##$VTLIST= <TTTTTTTTTTTTTTT>
##$WBST= 1024
##$WBSW= 4
##$XGAIN= (0..3)
0 0 0 0 
##$XL= 0
##$YL= 0
##$YMAX_a= 547740
##$YMIN_a= -1069133
##$ZGOPTNS= <>
##$ZL1= 120
##$ZL2= 120
##$ZL3= 120
##$ZL4= 120
##$ABSF1= 15.70943
##$ABSF2= -2.34242
##$ABSG= 5
##$ABSL= 3
##$ALPHA= 0
##$AQORDER= 0
##$ASSFAC= 0
##$ASSFACI= 0
##$ASSFACX= 0
##$ASSWID= 0
##$AUNMP= <proc_1d>
##$AZFE= 0.1
##$AZFW= 0.1
##$BCFW= 0
##$BC_mod= 2
##$BYTORDP= 0
##$COROFFS= 0
##$CY= -3
##$DATMOD= 1
##$DC= 0
##$DFILT= <>
##$DTYPP= 0
##$F1P= 0
##$F2P= 0
##$FCOR= 1
##$FTSIZE= 16384
##$FT_mod= 6
##$GAMMA= 0
##$GB= 0
##$INTBC= 1
##$INTSCL= 0
##$ISEN= 128
##$LB= 0.24
##$LEV0= 0
##$LPBIN= 0
##$MAXI= 10000
##$MC2= 0
##$MEAN= 0
##$ME_mod= 0
##$MI= 1.114404
##$NCOEF= 0
##$NC_proc= -5
##$NLEV= 6
##$NOISF1= 3.799351
##$NOISF2= 2.8
##$NSP= 0
##$NTH_PI= 0
##$NZP= 0
##$OFFSET= 15.71934
##$PC= 1
##$PHC0= -17305.71
##$PHC1= 8.800779
##$PH_mod= 1
##$PKNL= yes
##$PPARMOD= 0
##$PSCAL= 0
##$PSIGN= 0
##$REVERSE= no
##$SF= 200.130006446727
##$SI= 16384
##$SIGF1= 3
##$SIGF2= 2
##$SINO= 5.538805
##$SIOLD= 16384
##$SREGLST= <1H.CDCl3>
##$SSB= 0
##$STSI= 16384
##$STSR= 0
##$SW_p= 3612.71676300578
##$SYMM= 0
##$S_DEV= 0
##$TDeff= 16384
##$TDoff= 0
##$TI= <>
##$TILT= no
##$TM1= 0
##$TM2= 0
##$TOPLEV= 0
##$USERP1= <user>
##$USERP2= <user>
##$USERP3= <user>
##$USERP4= <user>
##$USERP5= <user>
##$WDW= 1
##$XDIM= 16384
##$YMAX_p= 368630810
##$YMIN_p= -295254
$$ End of Bruker specific parameters
$$ ---------------------------------
##NTUPLES= NMR SPECTRUM
##VAR_NAME=  FREQUENCY,     SPECTRUM/REAL,   SPECTRUM/IMAG
##SYMBOL=    X,             R,               I
##VAR_TYPE=  INDEPENDENT,   DEPENDENT,       DEPENDENT
##VAR_FORM=  AFFN,          ASDF,            ASDF
##VAR_DIM=   16384,         16384,           16384
##UNITS=     HZ,            ARBITRARY UNITS, ARBITRARY UNITS
##FACTOR=    0.220516191357247, 1,           1
##FIRST=     3145.91168046084, 0,            0
##LAST=      -466.805082544941, 0,           0
##MIN=       -466.805082544941, -295254,     0
##MAX=       3145.91168046084, 368630810,    0
$$ Real data points
##PAGE= N=1
##DATA TABLE= (X++(R..R)), XYDATA
$$ [...]
5656C67575Q956o445m7747j4622m159M4019J808J7965m0524k9366r140k6535K4441
5643B86226j6332J8709L0194k999m555K96M1397M0141j5413l9187J1647J3302
5631C63426l8651K5948L057J9319j8666m1419J0685L1911K3380n1817L7663R624
5619C74460P2051k3929k562J440l037M159j7125j3596j7693J2690L7488O7254
5607D91600K4501J0832J3236J6573J433N829J0145L805L1803K4917J1928k3442
5595F23160K2817O2932M0892N0925j5732P5881Q5728L287M0695M1168N5092K7972
5583A114817O6340K3699L5706P2594O1684P3943K7004j1894M0352O2651M9907
5572A616803j8382j8509k0978j6348k4921l666r756l2361K5318j2042m3344R591
$$ plain form
5656 367575 376531 370086 322339 307717 303558 347577 349385 367350 326826 297460 288320 261785 286226
5643 286226 269894 288603 318797 315798 311243 311539 352936 393077 377664 338477 350124 363426
5631 363426 324775 350723 353780 373099 354433 313014 323699 355610 378990 327173 364836 374460
5619 374460 446511 422582 420020 421460 418423 422582 405457 391861 374168 386858 424346 491600
5607 491600 516101 526933 540169 556742 558175 564004 574149 577954 609757 634674 646602 623160
5595 623160 645977 708909 749801 800726 784994 860875 946603 949890 990585 1031753 1086845 1114817
5583 1114817 1181157 1204856 1240562 1313156 1374840 1448783 1475787 1463893 1504245 1566896 1616803
5572 1616803 1598421 1579912 1558934 1542586 1517665 1513999 1504243 1471882 1497200 1485158 1441814 1451405
5560A451405J2254K7946J2576k9564O5880O0855j7377l367L893R698R7100M9552
5548A740851J8208K4283K9819N0401M5863Q589J7142j8082M1647N0872L6193J3785
5536B059571K1685R8565P9221M1808J35J25796J18396P8911O7151M9157O5246
5525B805642p179R531M6948K5862R759R6060O3250Q1164M1332Q9390M7062M7041
5513C355862P6020R7239J333L4617M9106R0346K6103K6578o498k2175p768N888
5501C726651M6334j0982N97L5130J00064R5851K4680K5945Q3442J15396J24949
5490D368057M7780J54100J50200J42898L2520p7294o5037l3099k9830l8711L5913
5479D687497M6780R138R6823M9094Q2709R9726J94966J56173J33034J91283K08890
$$ plain form
5560 1451405 1463659 1491605 1504181 1474617 1540497 1601352 1583975 1580608 1584501 1594199 1691299 1740851
5548 1740851 1759059 1783342 1813161 1863562 1909425 1918014 1935156 1917074 1958721 2009593 2045786 2059571
5536 2059571 2081256 2179821 2259042 2300850 2300985 2426781 2545177 2624088 2691239 2740396 2805642
5525 2805642 2798463 2807994 2854942 2880804 2890563 2986623 3049873 3131037 3172369 3261759 3308821 3355862
5513 3355862 3431882 3529121 3530454 3565071 3614177 3704523 3730626 3757204 3750706 3728531 3720763 3726651
5501 3726651 3772985 3762003 3762600 3797730 3897794 3993645 4018325 4044270 4127712 4243108 4368057
5490 4368057 4415837 4569937 4720137 4863035 4895555 4818261 4753224 4720125 4690295 4651584 4687497
5479 4687497 4734277 4743415 4840238 4889332 4972041 5071767 5266733 5422906 5555940 5747223 5956113
5468E956113K84182K84264M07848L18024L96508N01856N33986O94657M51122j31749
5458I696811m44801m50166m07865j68632n4051J771o545J07440J53680J05706
5448H533348J26805J77139K06315K27589K12204L15701L43736L02670L91022N12055
5438A1348584N71427O40293P45647Q70399R63706J196157J244505J403205J735451
5429B0719374J957560J011997p48026j636031j628416j077970o25593l28798j18288
5420A7525809L1367J82179K94527M00164M22377M63779N24165O09978O45061O89257
5410B1788663P79146R30638R44909J049264J183119J286211J484929J679925J930643
5401C3057447K122021K358027K726356L273617L617210K655145J164501Q28957
$$ plain form
5468 5956113 6240295 6524559 6932407 7250431 7646939 8148795 8682781 9377438 9828560 9696811
5458 9696811 9252010 8801844 8393979 8225347 8171296 8173067 8166522 8273962 8427642 8533348
5448 8533348 8660153 8837292 9043607 9271196 9483400 9799101 10142837 10445507 10836529 11348584
5438 11348584 11920011 12560304 13305951 14176350 15140056 16336213 17580718 18983923 20719374
5429 20719374 22676934 23688931 22940905 21304874 19676458 18598488 17972895 17644097 17525809
5420 17525809 17557176 17739355 18033882 18434046 18856423 19320202 19844367 20454345 21099406 21788663
5410 21788663 22567809 23498447 24443356 25492620 26675739 27961950 29446879 31126804 33057447
5401 33057447 35179468 37537495 40263851 43537468 47154678 49809823 50974324 51803281
5393E1803281J349803K186572L061910L929218M540742M991109N435098N644472
5385H2942205N782479N685242N397469N067766M609639L906713K788749J191481
5377A17371743q79299k806221m422519n295646n802040o039155o064226o041056
5369H0021581n865567n659846n250722m583517m153621m079461m116674l912826
5361D2399347l429271k909710k497606k167196j928873j673469j463766j328584
5353B5000872j254612j076798r17745q45609q53516p58007p01038o54452n79098
5344A7359997n68451n81922n31392n05969m16940l68900m14789l75341l64837
5335A3231456l60911k48433j99013j93568k43640k29734j35885j60265k45331
$$ plain form
5393 51803281 53153084 55339656 58401566 62330784 66871526 71862635 77297733 82942205
5385 82942205 88724684 94409926 99807395 104875161 109484800 113391513 116180262 117371743
5377 117371743 116492444 113686223 109263704 103968058 98166018 92126863 86062637 80021581
5369 80021581 74156014 68496168 63245446 58661929 54508308 50428847 46312173 42399347
5361 42399347 38970076 36060366 33562760 31395564 29466691 27793222 26329456 25000872
5353 25000872 23746260 22669462 21751717 20906108 20052592 19294585 18593547 17939095 17359997
5344 17359997 16791546 16209624 15678232 15172263 14755323 14386423 13971634 13596293 13231456
5335 13231456 12870545 12622112 12423099 12229531 11985891 11756157 11620272 11460007 11214676
5326A1214676j96468k04093k25874j70300l05100k92810k53905j84532k23062
5317I158532j84387k38483k71223k40418k14635k24694k08006j48881j87936k16781
5307G023088j69412j17231j84868j69366j12664j87644j59356q8854p3766q5798
5297E674129r3939r7132j33362n7447j09369l2318m7474q8658j09144o4292q7400
5286D753594q3196l5151j1646m0547l2121l1348j01098p5913j1342q5763n5378
5275D190091l6548p9401m3153j14977o0214N59l3125k1881J5349q2234k3333p414
5263C703719J4417L1005o760J1657l3728M6225M878N7939M1973j4067L7717Q0289
5251C975264L0582N855M5594o845M7664N0320J9780O5748J00816Q6049J21435
$$ plain form
5326 11214676 11018208 10814115 10588241 10417941 10112841 9820031 9566126 9381594 9158532
5317 9158532 8974145 8735662 8464439 8224021 8009386 7784692 7576686 7427805 7239869 7023088
5307 7023088 6853676 6736445 6551577 6382211 6269547 6081903 5922547 5833693 5759927 5674129
5297 5674129 5580190 5483058 5349696 5292249 5182880 5150562 5103088 5014430 4905286 4840994 4753594
5286 4753594 4670398 4635247 4623601 4583054 4550933 4519585 4418487 4342574 4331232 4245469 4190091
5275 4190091 4153543 4074142 4030989 3916012 3855798 3856357 3823232 3801351 3816700 3734466 3711133 3703719
5263 3703719 3718136 3749141 3742381 3754038 3720310 3766535 3771413 3829352 3871325 3857258 3894975 3975264
5251 3975264 4005846 4011701 4057295 4050450 4098114 4148434 4168214 4233962 4334778 4420827 4542262
5240D542262N4555P1375J03713M8096R1679J35520J00567L6774l2451J57220P8418
5229E387728N6989R0034J22604J40355J67439J02434J62672J61333J77834J05145
5219F674567J40555O7580J47490J46732K01848J50408J82625J84867J72664J69014
5209H238350J87258K36136K16280K89113K56756J87307J04247K37284L90757L47971
5199A0691459L95026L64498M10885L65791M32071M16313N69585N85276N64449
5190A4795353P26587P85407Q34613R24949J068263J358034J451710J854058K193012
5181B5991986K692226L237323L920148M818080O211482P544682Q772233R587257
5173G2775417J1228277J4852471K0609166J5536928o825475k1505847k2892056
$$ plain form
5240 4542262 4596817 4668192 4771905 4820001 4911680 5047200 5147767 5184541 5152090 5309310 5387728
5229 5387728 5444717 5534751 5657355 5797710 5965149 6067583 6230255 6391588 6569422 6674567
5219 6674567 6815122 6882702 7030192 7176924 7378772 7529180 7711805 7896672 8069336 8238350
5209 8238350 8425608 8661744 8878024 9167137 9423893 9611200 9715447 9952731 10343488 10691459
5199 10691459 11086485 11450983 11861868 12227659 12659730 13076043 13645628 14230904 14795353
5190 14795353 15521940 16307347 17141960 18066909 19135172 20493206 21944916 23798974 25991986
5181 25991986 28684212 31921535 35841683 40659763 46871245 54415927 63188160 72775417
5173 72775417 84003694 98856165 119465331 135002259 128176784 106670937 83778881
5166H3778881j7972584j2382757q292521n498461l861360k967882k432183k142175
5158B8228958j817654j616360j333979j026894q43490o89516n95049m76101l29761
5149A9500154l07950k05982p8853O9161J23848J69285L07938L64102M89470O21004
5139B1052177Q81411Q94287R92448J046960J127398J148127J095763R73957O60964
5130B9873492K62990j45124l84979l60054l75681l47954l71765l52960m09448
5121B7388517m58126n19664m51463l77040j83109l81K11296M32204O45222Q63827
5111B7551283J076312J305633J594756J807392K013653K156176K245564K160573
5103D1911342J911812J383481Q21360M23718R8970N0903N9779N083N3306k60118
$$ plain form
5166 83778881 65806297 53423540 45131019 39632558 35771198 32803316 30371133 28228958
5158 28228958 26411304 24794944 23460965 22434071 21590581 20901065 20306016 19829915 19500154
5149 19500154 19192204 18986222 18907369 18976530 19100378 19269663 19577601 19941703 20431173 21052177
5139 21052177 21933588 22827875 23820323 24867283 25994681 27142808 28238571 29212528 29873492
5130 29873492 30136482 29991358 29606379 29246325 28870644 28522690 28150925 27797965 27388517
5121 27388517 26930391 26410727 25959264 25582224 25399115 25398734 25610030 26042234 26687456 27551283
5111 27551283 28627595 29933228 31527984 33335376 35349029 37505205 39750769 41911342
5103 41911342 43823154 45206635 46027995 46451713 46550683 46601586 46661365 46666448 46719754 46459636
5093D6459636o93007j433604k026626k414540k531270k456377k174808j836076
5085C0893328j486096j166269q60826n62237l27289j10049J26735K33935M22699
5076B7163931N45851O28680O36493N40694M12428K97279J86291K22060K17436
5067C0851143R9629n8228m13124q16539j326287j703151j930620j970149j877027
5058B0855647j697524j534923j365481j190314r87943q88306q16421p26330o14998
5049A1033407m95843m88748m58250m21863l88389k63970l00678k74179k26871
5040G714616k57589k19247k05091k11229j97387j84746k12437k18418j61672j23526
5030E723274j17367j35391j57020j24399o3959q8889j07097j16047r1992p8219
$$ plain form
5093 46459636 45766629 44333025 42306399 39891859 37360589 34904212 32729404 30893328
5085 30893328 29407232 28240963 27380137 26817900 26490611 26380562 26507297 26741232 27163931
5076 27163931 27709782 28338462 28974955 29515649 29928077 30225356 30411647 30633707 30851143
5067 30851143 30950772 30892544 30479420 29662881 28336594 26633443 24702823 22732674 20855647
5058 20855647 19158123 17623200 16257719 15067405 14079462 13191156 12374735 11648405 11033407
5049 11033407 10537564 10048816 9590566 9168703 8780314 8516344 8215666 7941487 7714616
5040 7714616 7457027 7237780 7032689 6821460 6624073 6439327 6226890 6008472 5846800 5723274
5030 5723274 5605907 5470516 5313496 5189097 5125138 5036249 4929152 4813105 4721113 4642894
5020D642894o2512k6671k5451l7160l2196o1121k1911n1094p2303l8434o1076
5009D152965J5529p5301n2776K9939O4449l2453j04585q54N5028l3585o0957l7544
4997C919855J2650j3699n2732M0105l5405o263k5985J031L3691N5706Q0108J0262
4985D019324K9552O2235P2564M8404P1654M5639M9455O3498O8131R4410Q1118
4974D705984K0155J19228J08266Q7623Q4891J06170J06440J22166P6576P3801
4964E611300J09507J43507J59062J36710Q9061J21466K21684J19158J92676J07434
4954G011565J94479K30816K04148K77350K23672K42860L23761L03410L09935L07111
4944I629107L69926L48286M53407M80856M97349N28871O26825P30173P44412Q65424
$$ plain form
5020 4642894 4580382 4553711 4528260 4491100 4458904 4397783 4375872 4324778 4252475 4214041 4152965
5009 4152965 4168494 4093193 4040417 4070356 4134805 4102352 3997767 3996913 4051941 4018356 3957399 3919855
4997 3919855 3932505 3918806 3866074 3906179 3870774 3864511 3838526 3839557 3873248 3928954 4009062 4019324
4985 4019324 4048876 4111111 4183675 4232079 4303733 4349372 4398827 4462325 4530456 4624866 4705984
4974 4705984 4726139 4845367 4953633 5041256 5126147 5232317 5338757 5460923 5537499 5611300
4964 5611300 5720807 5864314 6023376 6160086 6249147 6370613 6592297 6711455 6904131 7011565
4954 7011565 7206044 7436860 7641008 7918358 8142030 8384890 8708651 9012061 9321996 9629107
4944 9629107 9999033 10347319 10800726 11281582 11778931 12307802 12934627 13664800 14409212 15274636
4934A5274636R85771J187647J250364J299091J549399J666498J699391J884926
4926B6797723J826308J673500J412613R47465M73574m5665m30234n66380n89839
4917C1499065o12543n03118m82360m26203n06519n32982m95179k71912q4949K4489
4907B7607789K53599N29234P20125R88789J258130J462696J683164J860959J937791
4898C8302276J916792J734170J426088R65136M46591K2966l20793m98904n46998
4889D3447324n13080n62451o76326r20845j197786j494785j840350k049599k096100
4880C2096002j962328j824941j466734j245355j010255p32072n72618l70538k07476
4871B2703685m610J05104J42169K88825L57711K73878K98183K22989K25670J66039
$$ plain form
4934 15274636 16260407 17448054 18698418 19997509 21546908 23213406 24912797 26797723
4926 26797723 28624031 30297531 31710144 32657609 33131183 33085518 32655284 32088904 31499065
4917 31499065 30886522 30383404 29901044 29474841 28968322 28435340 27940161 27668249 27583300 27607789
4907 27607789 27861388 28390622 29110747 30099536 31357666 32820362 34503526 36364485 38302276
4898 38302276 40219068 41953238 43379326 44344462 44791053 44814019 44493226 43994322 43447324
4889 43447324 42934244 42371793 41695467 40774622 39576836 38082051 36241701 34192102 32096002
4880 32096002 30133674 28308733 26841999 25596644 24586389 23854317 23281699 22911161 22703685
4871 22703685 22699075 22804179 22946348 23235173 23592884 23866762 24164945 24387934 24613604 24779643
4861B4779643K19898J53131l2654m07945p25638j088371j363034j512353j523286
4852A8499391j418474j218099j033690r51927r24640q80258p73986o58196o30715
4843A0009406m74466m14056l77475l41809l40164l16403k38880k28212k22947
4834G054994k47245k30013j84702j33315j46441j50182j47475j70964j41527j28558
4824E374572p0979j03565j16992r2354j07280m5628j52477r2477m3062p5499l2678
4813D441581o9543o3190o6934k8124j7311K0502p094l3587J5116m5669o9453m7780
4801D028514k9967l4734q107J6268m6437j1466o9781k5800L6083k4381o5776J6929
4789C781345L901L5879m586m9069j9693l3616l2530J5978M3908O818p4728k5044
$$ plain form
4861 24779643 24999541 25152672 25120018 24712073 23986435 22898064 21535030 20022677 18499391
4852 18499391 17080917 15862818 14829128 13877201 12952561 12072303 11298317 10640121 10009406
4843 10009406 9534940 9120884 8743409 8401600 8061436 7745033 7506153 7277941 7054994
4834 7054994 6807749 6577736 6393034 6259719 6113278 5963096 5815621 5644657 5503130 5374572
4824 5374572 5303593 5200028 5083036 4990682 4883402 4837774 4685297 4592820 4549758 4474259 4441581
4813 4441581 4372038 4308848 4241914 4213790 4196479 4216981 4209887 4176300 4191416 4145747 4076294 4028514
4801 4028514 3998547 3963813 3955706 3971974 3925537 3914071 3844290 3818490 3854573 3830192 3764416 3781345
4789 3781345 3785246 3821125 3816539 3767470 3747777 3714161 3681631 3697609 3741517 3748335 3673607 3648563
4777C648563N4654O2333K8154L9666K5716j2824O4247K5155M282Q9285j3293N8988
4765D074926J08076O0638N3899J166J31092J00528J72999J83268O8608P4093o871
4754E022422q9645j32383r9449m0815n1017j2309N5931J7269p754j1843J13267
4743D763674Q9692o345M4233O9632P5699N4191J02156L8489L0906J55832P8414
4732E496573K9406L6206N5377J3870Q9702L2310K0371J25020P4160M1998N5336
4721F070329P4616J32499J35210J08717J45839K12468J11844J51610J84003J51138
4711G478273J86685K38400K96230K64342K13517K02157K05112J58766P2752p770
4701I308464o7554o4706p3342k9650M3821R6430P0843J31715J66790J00419K54490
$$ plain form
4777 3648563 3703217 3765550 3793704 3833370 3859086 3846262 3910509 3935664 3939946 4029231 4015938 4074926
4765 4074926 4183002 4243640 4297539 4298705 4429797 4530325 4703324 4886592 4955200 5029293 5022422
4754 5022422 4932777 4800394 4700945 4660130 4609113 4596804 4652735 4670004 4662250 4650407 4763674
4743 4763674 4853366 4847021 4891254 4960886 5036585 5090776 5192932 5231421 5262327 5418159 5496573
4732 5496573 5525979 5562185 5617562 5631432 5721134 5753444 5773815 5898835 5972995 6014993 6070329
4721 6070329 6144945 6277444 6412654 6521371 6667210 6879678 6991522 7143132 7327135 7478273
4711 7478273 7664958 7903358 8199588 8463930 8677447 8879604 9084716 9243482 9316234 9308464
4701 9308464 9240910 9176204 9102862 9073212 9117033 9213463 9284306 9416021 9582811 9683230 9937720
4690I937720J57809J20829J14658J88704J64960Q9602J08885J47652R6104J49058
4680A1275981J42804J56711J60688J42822J36432J91756K00818K47753K33454
4671A2889219J77133L28160K71894K35084K70831K78514K89235L42898K66902
4662A5349870L12537L33000L77336M04954M59199M34822N64790N41604N89249
4653A9367361O64962P26727P96616Q60111Q76629R53475J062732J148445J189373
4644B7646431J187616J224437J158694J114217R81890R14607P41469P32502P31591
4635C6433454O02596O24021N51380M78925M51636M85943N48264N97667P76247
4626D1550133R22224J128939J322907J505614J641083J811327K014926K062987
$$ plain form
4690 9937720 10095529 10216358 10331016 10519720 10684680 10774282 10883167 11030819 11126923 11275981
4680 11275981 11418785 11575496 11736184 11879006 12015438 12207194 12408012 12655765 12889219
4671 12889219 13066352 13394512 13666406 13901490 14172321 14450835 14740070 15082968 15349870
4662 15349870 15662407 15995407 16372743 16777697 17236896 17671718 18236508 18778112 19367361
4653 19367361 20032323 20759050 21555666 22415777 23292406 24245881 25308613 26457058 27646431
4644 27646431 28834047 30058484 31217178 32331395 33313285 34227892 34969361 35701863 36433454
4635 36433454 37036050 37660071 38211451 38690376 39142012 39627955 40176219 40773886 41550133
4626 41550133 42472357 43601296 44924203 46429817 48070900 49882227 51897153 53960140
4618E3960140K080452K211065K240952K287609K374876K437372K426207K254915
4610G2273588J890012J214297K17267r74959k223807k891390l127075k947663
4602F3430270k498194j928968j338292p71021l04615J41085M80141Q16499J148824
4593E9175729J475447J673461J783751J702934J462722J121893N13430k10147
4585F8699220r37900j600916k173773k660254k995913l049125k927038k734891
4577D9619410k531532k293690j990420j703531j528517j337492j159670j025882
4569C6048676q69238p65220o81515m61432l62483k39283j47686j19936J822P0500
4559C2474205J28001K26703L21821M46630N70079P06522Q38030R37899J053416
$$ plain form
4618 53960140 56040592 58251657 60492609 62780218 65155094 67592466 70018673 72273588
4610 72273588 74163600 75377897 75595164 74620205 72396398 69505008 66377933 63430270
4602 63430270 60932076 59003108 57664816 56893795 56589180 56730265 57210406 58026905 59175729
4593 59175729 60651176 62324637 64108388 65811322 67274044 68395937 68909367 68699220
4585 68699220 67761320 66160404 63986631 61326377 58330464 55281339 52354301 49619410
4577 49619410 47087878 44794188 42803768 41100237 39571720 38234228 37074558 36048676
4569 36048676 35179438 34414218 33732703 33271271 32908788 32669505 32521819 32401883 32403705 32474205
4559 32474205 32602206 32828909 33150730 33597360 34167439 34873961 35711991 36649890 37703306
4550C7703306J197026J362015J422131J688715J788156J788556J882145K004635
4542E0836685K051387J956037J909806J757076J567869J329258J062204P87745
4534F3258067N01391J79062j52214m43914n08198o26382o12322n37342m38585
4525F0619563k52123j21588J65994L45092N38608O59403P88224Q25211Q24503
4516F4392887Q73151P63128Q07355M72132J31212k17565o41555r87103j240852
4507F4352790j422550j536076j698379j710352j705825j716657j771690j682151
4499E1109110j532600j554666j406079j168154j107368j021950q67080p72784
4491D1678429p52530o25752n54251n03124m83277n30851o27669o34451n32394
$$ plain form
4550 37703306 38900332 40262347 41684478 43373193 45161349 46949905 48832050 50836685
4542 50836685 52888072 54844109 56753915 58510991 60078860 61408118 62470322 63258067
4534 63258067 63759458 63938520 63786306 63342392 62834194 62207812 61595490 61058148 60619563
4525 60619563 60367440 60245852 60411846 60756938 61295546 61954949 62743173 63568384 64392887
4516 64392887 65266038 66029166 66836521 67308653 67439865 67222300 66580745 65593642 64352790
4507 64352790 62930240 61394164 59695785 57985433 56279608 54562951 52791261 51109110
4499 51109110 49576510 48021844 46615765 45447611 44340243 43318293 42451213 41678429
4491 41678429 40925899 40300147 39745896 39242772 38759495 38228644 37600975 36966524 36434130
4482C6434130n91612o73787p42803p82875p84623p92524q07197q05957p93917
4473B9658835p22347p50170o88819o54327n67811n13665m75910l77291l71063
4464B4537432l17822j68389j71228q6387o3997k5746J0413L9107J60393J58426
4454B4072202J86837K32859J79917K37167L07599L25495L07690K50379L87727
4445B6487872M22828N04061N94354N90327P13032R16815O45763L13355J81278
4436C1369685K52484L31507M54489O09784Q05586R43706J047195J077438J089401
4427C7981275J209159J248415J415526J545243J703863J910858K165781K394050
4419E1574170K726193L076107L497597M045845M700051N401211O127848P121656
$$ plain form
4482 36434130 35842518 35168731 34425928 33643053 32858430 32065906 31258709 30452752 29658835
4473 29658835 28936488 28186318 27497499 26843172 26275361 25761696 25285786 24908495 24537432
4464 24537432 24219610 24051221 23879993 23793606 23729609 23703863 23714276 23753383 23913776 24072202
4454 24072202 24259039 24491898 24671815 24908982 25216581 25542076 25849766 26100145 26487872
4445 26487872 26910700 27414761 28009115 28599442 29312474 30229289 30875052 31188407 31369685
4436 31369685 31622169 31953676 32408165 33017949 33823535 34767241 35814436 36891874 37981275
4427 37981275 39190434 40438849 41854375 43399618 45103481 47014339 49180120 51574170
4419 51574170 54300363 57376470 60874067 64919912 69619963 75021174 81149022 88270678
4411H8270678Q307064R752227J1387198J3220357J5119851J6809303J8259799
4404A81126477J9392384J9423539J6262967P823387n182826j6983039k3370586
4397A98492303k4248457k1879108j8254902j4607909j1569875r369695p644898
4390I0917459o365462n482271m811119m246020l754204l431508l208458l073767
4382E6544650k953174k737409k563554k452296k310022k084198j956766j827420
4374C7659811j607180j600620j411943j305513j197876j090612j094154j066954
4366B7284959r90969j003984r36935p27451o97863o87388n97242o30066o25363
4357B0387698n28641n32589m91352m05061l23485l91838l87064l04014l12423
$$ plain form
4411 88270678 96577742 106329969 117717167 130937524 146057375 162866678 181126477
4404 181126477 200518861 219942400 236205367 244028754 238845928 221862889 198492303
4397 198492303 174243846 152364738 134109836 119501927 107932052 98562357 90917459
4390 90917459 84551997 79069726 74258607 70012587 66258383 62826875 59618417 56544650
4382 56544650 53591476 50854067 48290513 45838217 43528195 41443997 39487231 37659811
4374 37659811 36052631 34452011 33040068 31734555 30536679 29446067 28351913 27284959
4366 27284959 26293990 25290006 24353071 23625620 22927757 22240369 21643127 21013061 20387698
4357 20387698 19859057 19326468 18835116 18430055 18106570 17714732 17327668 17023654 16711231
4348A6711231k90856k55979k23132k76895k50828k05988k58240k76497k26704
4339A4446112j84748k13938j93395k38246j87219j80576j88881j68798k13149
4330A2677162j66230j16674k13294j50009j08209j72419j68670j94029j61418
4321A1226210j88301j51382j03603o5228r1862j06195q0289j2519o8817r1114
4311A0266900r4771j12276j16975j06437j12311o8930r5073j24345m3992n7119
4301I334671j02091q1944p1025n3627j12888r0964q5913j18490m0706r5417l3602
4290H448004m4078n5205P0104K418J3207J513J7686j6089J093n2023N3995J1478
4278H452103L3454Q744J12577J10422Q9713R4532J14059P9451M4487j15829k44752
$$ plain form
4348 16711231 16420375 16164396 15941264 15664369 15413541 15207553 14949313 14672816 14446112
4339 14446112 14261364 14047426 13854031 13615785 13428566 13247990 13059109 12890311 12677162
4330 12677162 12510932 12394258 12180964 12030955 11922746 11750327 11581657 11387628 11226210
4321 11226210 11037909 10886527 10782924 10717696 10625834 10519639 10439350 10426831 10358014 10266900
4311 10266900 10172129 10059853 9942878 9836441 9724130 9655200 9560127 9435782 9391790 9334671
4301 9334671 9232580 9150636 9079611 9025984 8913096 8822132 8736219 8617729 8577023 8481606 8448004
4290 8448004 8403926 8348721 8418825 8421243 8434450 8435963 8453649 8437560 8438653 8386630 8440625 8452103
4278 8452103 8485557 8494301 8606878 8717300 8807013 8901545 9015604 9095055 9139542 9023713 8778961
4267H778961j94321l06441k41219j47569j03995m4602n9135o4889k3995K2164
4257G614959L5083m983Q003l2902l0938l5909l0735j3359K1491k0475K4557n7323
4245G477469n5273l7360K0975p3415q0714n8864j5193m4919k5473m5891l5570
4234G025772M0247N3444l106N2113n805J0081l1984J2430J1402P352O5671O5350
4222G302967N6166J6263N5344N9972O144L7346L8692j4175k1607l2559k4706m5090
4210G434757j3892L0976Q492K89L7050k0370O4574R2852J20719J16174R8683J32945
4198H103249J15480Q6775P8698J9384L8852K0875L9224R1101J49852J18906J57146
4187I019542P4760J0141k7472K5958j12136j79712o4577l7353l2577m7764m6189
$$ plain form
4267 8778961 8584640 8278199 8036980 7889411 7785416 7740814 7681679 7616790 7592795 7614959
4257 7614959 7650042 7645059 7653062 7620160 7589222 7553313 7522578 7509219 7530710 7510235 7534792 7477469
4245 7477469 7422196 7384836 7405811 7332396 7251682 7192818 7177625 7132706 7107233 7061342 7025772
4234 7025772 7066019 7119463 7116357 7168470 7162665 7172746 7140762 7153192 7164594 7171946 7237617 7302967
4222 7302967 7359133 7375396 7430740 7490712 7496856 7534202 7572894 7558719 7537112 7504553 7479847 7434757
4210 7434757 7420865 7451841 7460333 7460622 7497672 7477302 7541876 7634728 7755447 7871621 7970304 8103249
4198 8103249 8218729 8305504 8384202 8403586 8442438 8463313 8502537 8593638 8743490 8862396 9019542
4187 9019542 9094302 9104443 9076971 9102929 8990793 8811081 8746504 8709151 8676574 8628810 8582621
4176H582621k4366Q258k5780j4521N5569J11492J7335J64705J47765J45223J53047
4165I321348J54718J67198J25881J14776M3594k4116j18123r6766j66601k14407
4155I307502k47127k06910j31099k21956j39653j20681j28750j19400o3407q8224
4145G840295m1390m4743n8070j0650K014j1448m4431p960n5293j18339j08630
4134G341355j05549j63670j33609p1337q6670n7351l7043m9662K493K8076L1803
4123F698836K0669K748j6018L7570L7369l2190r648M0300N9945M9126P276O7989
4111F963972J07397J14716J59374K45140K50798K88432L24730L19232L29316M01881
4101I504988L37332J59414k8879r4485j22023j86875j64859j40112m5592m8231
$$ plain form
4176 8582621 8558255 8566513 8540733 8526212 8581781 8693273 8710608 8875313 9023078 9168301 9321348
4165 9321348 9476066 9643264 9769145 9883921 9927515 9903399 9785276 9688510 9521909 9307502
4155 9307502 9060375 8853465 8722366 8500410 8360757 8240076 8111326 7991926 7928519 7840295
4145 7840295 7798905 7754162 7696092 7685442 7687456 7676008 7631577 7623617 7568324 7449985 7341355
4134 7341355 7235806 7072136 6938527 6867190 6780520 6723169 6686126 6636464 6638957 6667033 6698836
4123 6698836 6719505 6722253 6706235 6743805 6781174 6748984 6739336 6779636 6839581 6888707 6895983 6963972
4111 6963972 7071369 7186085 7345459 7590599 7841397 8129829 8454559 8773791 9103107 9504988
4101 9504988 9842320 10001734 9972855 9878370 9756347 9569472 9404613 9264501 9218909 9170678
4091I170678j18070j26705j69845r1732j26819r4147j7313K9801J4666O375K90
4080H477179P3484R726J4675O8357P8981Q2628J35701J71734J00867J76573J82940
4069I572845J90205K54561K51672K29490L23781K95644L05904K96079L50782M25176
4059A2496139M30684M67003M83977M89935N79224O41216O36212O34652N66837
4050A7425879N54190N55458N26211N50074N27853N96478O48950O91797P10002
4041B2786892Q00476P92727P99668P50177N54713M39518L41039K80117J95695
4032B7741022J74066K53404K78036L68137M53773N49570M68214M26742K64808
4023C0977772J30239o8075k54526m31932n37239m87766m85410m01660k83096j47519
$$ plain form
4091 9170678 9052608 8925903 8756058 8664326 8537507 8443360 8426047 8455848 8470514 8476889 8477179
4080 8477179 8550663 8560389 8575064 8643421 8722402 8805030 8940731 9112465 9213332 9389905 9572845
4069 9572845 9763050 10017611 10269283 10498773 10822554 11118198 11424102 11720181 12070963 12496139
4059 12496139 12926823 13393826 13877803 14367738 14946962 15588178 16224390 16859042 17425879
4050 17425879 17980069 18535527 19061738 19611812 20139665 20736143 21385093 22076890 22786892
4041 22786892 23587368 24380095 25179763 25929940 26484653 26924171 27265210 27545327 27741022
4032 27741022 27915088 28168492 28446528 28814665 29268438 29818008 30286222 30712964 30977772
4023 30977772 31108011 31039936 30785410 30353478 29816239 29328473 28843063 28441403 28158307 28010788
4013B8010788j60970j09442m8555j00743k31566l70414n72452p33071r51263r85837
4003B3746475j060695j064346r82022q36753q09431p87460o50276o66008p16174
3994A6173310o76959o39407o92942o87749p01509o69526o15445n87479n44682
3985A0357612n31500m33137l82075m14726l65820l38490l22402k92743k99012
3976F977707k75615k62815k62856k69487k65411k25540k06437j63500j31724j36006
3966D778316j27637k05876j55454j36689r8068p4998j46757j66270j24397j16114
3956C426056p7041j03254n3844p0948q6578q1675o9945m8061p5212r309j01125
3945B649064q1206n4828n8361j11675n0113o4146o5633n7976j4621p4221n5485
$$ plain form
4013 28010788 27849818 27740376 27691821 27591078 27359512 26989098 26416646 25683575 24732312 23746475
4003 23746475 22685780 21621434 20639412 19802659 18993228 18205768 17555492 16889484 16173310
3994 16173310 15496351 14856944 14164002 13476253 12774744 12105218 11489773 10902294 10357612
3985 10357612 9826112 9392975 9010900 8596174 8230354 7891864 7569462 7276719 6977707
3976 6977707 6702092 6439277 6176421 5906934 5641523 5415983 5209546 5046046 4914322 4778316
3966 4778316 4650679 4444803 4289349 4152660 4054592 3979594 3832837 3666567 3542170 3426056
3956 3426056 3349015 3245761 3191917 3120969 3034391 2952716 2882771 2834710 2759498 2750189 2649064
3945 2649064 2567858 2513030 2454669 2342994 2292881 2228735 2163102 2105126 2090505 2016284 1960799
3934A960799n3580o8189o2129p0768l7642l5889o2855k4453l5718m5061l7132
3923A427383j9233m6208n469K905k9332l6322l4592m4397k4130K2118m5190k3350
3911A144183j999n5968o1706L6507k2241k3284J2839J0345j3430l1435K2982m0578
3899I76215l4615K6136P36K9793n3165m6442m159l0594j8551O5364q3814l5694
3887G91210k606j9810m1107l604l1759m683N441l1362j6444k6985J3656j0679
3875F21268j7037q46P9j2121k7675K0517n202o8462N763L7230p6250l9494j6313
3862D21457j8175M940o6163L8808P5374l891l4022k1366k0311J5760K5987J7593
3850D35991K018k7119n6129m743k0084l2603qJ1933O581l4813k9565J7822Q113
$$ plain form
3934 1960799 1907219 1839030 1776901 1706133 1668491 1632602 1569747 1545294 1509576 1464515 1427383
3923 1427383 1408150 1361942 1356473 1359378 1330046 1293724 1259132 1214735 1190605 1212723 1167533 1144183
3911 1144183 1142184 1086216 1024510 1061017 1038776 1015492 1028331 1038676 1025246 993811 1016793 976215
3899 976215 941600 967736 968472 998265 945100 898658 894499 863905 845354 910718 826904 791210
3887 791210 788604 768794 727687 724083 692324 687641 693082 661720 645276 618291 631947 621268
3875 621268 604231 603385 603464 591343 563668 584185 578983 510521 516284 553514 477264 437770 421457
3862 421457 403282 408222 342059 380867 456241 452350 418328 396962 376651 392411 418398 435991
3850 435991 438009 410890 354761 350018 329934 297331 297323 309256 315837 281024 251459 269281 277394
3837B77394J3131m0242O393K4948K1787k7777l7374n9463j4266L2307m097N834
3825A98575J7393m8732j254m152M0847Q19k9016K9107p410M3868j1359m729p042
3812B16915N506k9766n4775K2097M7050l0231J012J4625j3050m5961k0256N9368
3800A72534k9595k539J4544m3122J8873k807K0213J9760n7396L2246J6545J629
3788A60885j9488J1510O5835j3471l1011k5041r506M299J2165r120l8348K143
3776A10852P152J8979o0316K901K319p383K5325k3577J4784O080k4393L8293j0799
3763A00217l4684K1621j9424N960L2814r447n1088R572K6835J4519k3246J2350
3751H5999k6338l6561K3352j9006L4420P4734j9043L3034k7729p7008M5318K1796
$$ plain form
3837 277394 290525 250283 256676 281624 303411 275634 238260 178797 164531 196838 192741 198575
3825 198575 215968 167236 165982 161830 202677 203496 174480 203587 196177 240045 228686 223957 216915
3812 216915 222421 192655 137880 159977 207027 176796 177808 192433 179383 133422 113166 172534
3800 172534 142939 140400 154944 111822 130695 127888 148101 167861 110465 142711 159256 160885
3788 160885 141397 152907 218742 205271 174260 149219 139713 144012 156177 147057 108709 110852
3776 110852 118004 136983 76667 79568 81887 74504 99829 76252 91036 97116 72723 111016 100217
3763 100217 65533 87154 67730 73690 106504 97057 45969 55541 82376 96895 73649 85999
3751 85999 59661 23100 46452 27446 61866 136600 117557 150591 122862 45854 91172 112968
3739A12968l9053R293m3691N4480j2772j6435p259K3968N1105k7838o4375K5213
3727F5604N6132r501l5776k797Q272M311O7636l6k8216j4856j662L3764M6478
3714A89353m5522L116J1293n174N4188k0721r883l01L7848k925p7125P139L8038
3701A79324J3348j2210j487j5717q721j1056K1928J3658j2863P2036R143j8411
3689B28972m422k187j2609Q187K2528P947K3599m2795J0845l8902n4525K6699
3677A73337M8659j1041m1717l0917K8182j873J5127J2107J480l7317j2354K4073
3665A67746N3721j6858P076j310m4354k749K7930O2471l2817K4315J6700J9479
3653B81350l0602K8352O610j585q104L624P3992k6728m089l5845M2975n3J642
$$ plain form
3739 112968 73915 83208 39517 93997 81225 64790 57531 81499 132604 104766 40391 65604
3727 65604 121736 112235 76459 73662 81934 86245 153881 153845 125629 110773 109111 142875 189353
3714 189353 143831 146947 158240 153066 207254 186533 176650 176349 214197 211272 134147 141286 179324
3701 179324 192672 180462 178975 163258 154537 143481 165409 179067 166204 238240 247383 228972
3689 228972 224550 222363 209754 217941 240469 248416 272015 229220 240065 201163 146638 173337
3677 173337 221996 210955 169238 138321 166503 164630 179757 191864 193344 156027 143673 167746
3665 167746 221467 204609 211685 210375 166021 163272 191202 253673 220856 245171 261871 281350
3653 281350 250748 279100 285710 284125 276021 279645 353637 326909 322820 286975 329950 329897 331539
3640C31539K5500J3209N1022J994J2364K2137m2768P73J39L8780m607J2634L4178
3627D96894K3524K3732J9495l4315M8364O0280N3214L7370k0021K8693n3855P3403
3615G56778k2938M3621M1838J2197P5525Q4420J4263J0933O4451L2068L4909L9432
3603A187497l3556J2724N4328N1380J9734j2365O7021j7961l7333K4574R351j183
3591A324211m1229N4172n362J6860j8927p2915L165L1128m5868k5101K3086K2204
3579A265424r167k7940L5939l5515l3522m2141M0091k101J3874k4207k982P153
3567A184906l2622n263O067l7390Q400k7765M8816L6706R033J0725j8074K3667
3555A207206j1305L345M4032p181L4250R4838L9064m2508n111M4017J8583O5263
$$ plain form
3640 331539 357039 370248 421270 423264 435628 457765 414997 415770 415909 454689 450082 462716 496894
3627 496894 520418 544150 563645 529330 577694 637974 691188 728558 708537 737230 683375 756778
3615 756778 733840 777461 819299 831496 907021 991441 1005704 1016637 1081088 1113156 1148065 1187497
3603 1187497 1153941 1166665 1220993 1272373 1292107 1279742 1346763 1328802 1291469 1316043 1325394 1324211
3591 1324211 1282982 1337154 1331792 1348652 1329725 1256810 1259975 1291103 1245235 1220134 1243220 1265424
3579 1265424 1256257 1228317 1264256 1228741 1195219 1153078 1193169 1191068 1204942 1180735 1177753 1184906
3567 1184906 1152284 1147021 1153088 1115698 1124098 1096333 1145149 1181855 1190888 1201613 1183539 1207206
3555 1207206 1195901 1199246 1243278 1236097 1270347 1365185 1404249 1361741 1356630 1400647 1419230 1484493
3543A484493J7870L9490N3820J705O808L3074O2582O7845M8696M905L2561P0068
3531A923917M6569K4535J0732O9698L6343N9281M9053Q5868M7161M4635J8380
3520B416172N6981N9904J7249P7292O2228N5771N6006L6911Q3199Q8314N3679
3509C063706R581M2678O0509M9745L5899M3591P7288R1771J4627P9642K6882N7029
3497C652948J16895Q4353J9434P2457N6162M7552R2431P3340M4425R8227M3237
3486D401461O5707Q1313L1019R4478k9611J16239R6012M2314Q6454R7666O6389
3475E149441Q5339J15359P1519K5703K5100Q8227N6690R593j6044k0672J1027
3464E601282N896J939j7335N6135N2643O0078R601J26052Q2706r626L5947P5902
$$ plain form
3543 1484493 1502363 1541853 1595673 1597378 1604186 1637260 1699842 1767687 1816383 1821288 1853849 1923917
3531 1923917 1970486 1995021 2005753 2075451 2111794 2171075 2220128 2305996 2353157 2397792 2416172
3520 2416172 2473153 2533057 2550306 2627598 2689826 2745597 2801603 2838514 2921713 3010027 3063706
3509 3063706 3073287 3115965 3176474 3226219 3262118 3305709 3382997 3474768 3489395 3569037 3595919 3652948
3497 3652948 3769843 3854196 3873630 3946087 4002249 4049801 4142232 4215572 4259997 4358224 4401461
3486 4401461 4467168 4548481 4579500 4673978 4644367 4760606 4856618 4898932 4985386 5083052 5149441
3475 5149441 5234780 5350139 5421658 5447361 5472461 5560688 5617378 5626971 5610927 5590255 5601282
3464 5601282 5607178 5609117 5591782 5647917 5700560 5760638 5770239 5896291 5978997 5969371 6005318 6081220
3452F081220N0593L2555L1441O9024M4385N9228O6491M3502R4929J37839Q9134
3441F800341J02946R4127P6165J11427J22530J08317J06521J12088J32148Q2189
3431G848799J05200J23855J54374J71187J37255J36143J65185Q7621J25090K10359
3421I265068J18875J78114J75514K08660J38247J68280J58186J45051J42170J91912
3411A0890077J60858J14869J65058J19190J55236J01398N1395P1192M0433K9120
3401A1898826O2138N9551K8134K6228j8288l5590J2995L0793M9045k0286l2393
3390A2061153j7832m4465l8289n8137m0628m9703k0594l5256k5742k0138k6934
3379A1683435J1208J5186M8617K1157J8890P4883M9140J11968L5734P4072O4251
$$ plain form
3452 6081220 6131813 6164368 6195809 6264833 6309218 6368446 6434937 6478439 6573368 6711207 6800341
3441 6800341 6903287 6997414 7073579 7185006 7307536 7415853 7522374 7634462 7766610 7848799
3431 7848799 7953999 8077854 8232228 8403415 8540670 8676813 8841998 8929619 9054709 9265068
3421 9265068 9383943 9562057 9737571 9946231 10084478 10252758 10410944 10555995 10698165 10890077
3411 10890077 11050935 11165804 11330862 11450052 11605288 11706686 11758081 11829273 11869706 11898826
3401 11898826 11960964 12020515 12048649 12074877 12056589 12020999 12033994 12064787 12113832 12093546 12061153
3390 12061153 12043321 11998856 11960567 11902430 11861802 11812099 11791505 11756249 11730507 11710369 11683435
3379 11683435 11694643 11709829 11758446 11779603 11798493 11873376 11922516 12034484 12070218 12144290 12208541
3368A2208541Q3010J06256Q6706P9498J38166J93616J96863J86837J50049K09626
3358A3639168K52911K13035K09041K94941K54277K92564K76057L04104L77837
3349A6113935L21890L45383L73302M12045M31066M20278L73442M66026N30266
3340A9787633N28448N65903N42686O50904O57870O70665O36374P56108Q45699
3331B5642290Q34141R07505J059184J119214J175744J341546J467311J635935
3323C5182870J796088J995277K203027K386378K589876K760895L005402L154714
3315E5074527L227066L180230L116261K950279K607024K220507J759028J371604
3307G5506526R61337O62626M66390M18639M20122N17437N94202O28532P06533
$$ plain form
3368 12208541 12291551 12397807 12484513 12564011 12702177 12895793 13092656 13279493 13429542 13639168
3358 13639168 13892079 14105114 14314155 14609096 14863373 15155937 15431994 15736098 16113935
3349 16113935 16435825 16781208 17154510 17566555 17997621 18417899 18791341 19257367 19787633
3340 19787633 20316081 20881984 21424670 22075574 22733444 23404109 24040483 24796591 25642290
3331 25642290 26476431 27383936 28443120 29562334 30738078 32079624 33546935 35182870
3323 35182870 36978958 38974235 41177262 43563640 46153516 48914411 51919813 55074527
3315 55074527 58301593 61481823 64598084 67548363 70155387 72375894 74134922 75506526
3307 75506526 76467863 77130489 77596879 78015518 78435640 78953077 79547279 80175811 80882344
3298H0882344O03315L21257J09606l22510p44351j110767j462735j689206j899291
3289G4687662j976997j947150j857187j725619j548660j353823j189116j040682
3281F2048428p75012p05047n64564l78673k22478k5792O0267K23690L55062M85347
3271F0501228N66710O78232P55358Q31603R51230J078179J057900J162368J226226
3262F8809034J350621J479802J554967J701860J821107J946962J965513K169786
3254H2799652K317633K564402K876728L088153L492396L949294M290895M580505
3246A09959658M882636N111954N235631N174796M954817M487571L771996L059914
3238A46638973K322707J526830P64138J80017j61035l61279n73162n86305o97191
$$ plain form
3298 80882344 81485659 81806916 81916522 81594012 80849661 79738894 78276159 76586953 74687662
3289 74687662 72710665 70763515 68906328 67180709 65632049 64278226 63089110 62048428
3281 62048428 61273416 60568369 60003805 59625132 59402654 59376862 59437129 59660819 60015881 60501228
3271 60501228 61067938 61746170 62501528 63333131 64284361 65362540 66420440 67582808 68809034
3262 68809034 70159655 71639457 73194424 74896284 76717391 78664353 80629866 82799652
3254 82799652 85117285 87681687 90558415 93646568 97138964 101088258 105379153 109959658
3246 109959658 114842294 119954248 125189879 130364675 135319492 139807063 143579059 146638973
3238 146638973 148961680 150488510 151252648 151432665 151271630 150910351 150337189 149750884 149053693
3229A49053693p14507q10900j043338j399074j816429k337378k908732l356578
3221A34666757l650547l692454l687612m846563o758878p580458p276390o456279
3213I0717576n668628m912412m271545l752563l274963k977045k625025k299787
3205F0935608k148948j813552j588321j358345j224347j052559q19874o32671
3197E0296991m28499k98739o3375J81502N63068Q41559J075450J333495J913383
3188E5414835K981014L455217M59149l245010m487483m044100k876036j983223
3180D5674363j283008p81724n23958l70028j69840q7618K9770J60978K75750L41061
3170D3265746L55822M27821L80953K87728L10685K36540J77058J85944K20152
$$ plain form
3229 149053693 148339186 147528286 146484948 145085874 143269445 140932067 138023335 134666757
3221 134666757 131016210 127323756 123636144 118789581 112030703 104450245 97173855 90717576
3213 90717576 85048948 80136536 75864991 72112428 68837465 65860420 63235395 60935608
3205 60935608 58786660 56973108 55384787 54026442 52802095 51749536 50929662 50296991
3197 50296991 49868492 49569753 49506378 49687880 50250948 51092507 52167957 53501452 55414835
3188 55414835 58395849 61851066 62310215 59065205 54577722 50533622 47657586 45674363
3180 45674363 44391355 43609631 43085673 42715645 42545805 42458187 42487957 42648935 42924685 43265746
3170 43265746 43621568 44049389 44430342 44718070 45028755 45265295 45442353 45628297 45848449
3161D5848449K65778L42877L75567M90612Q04586J364872J396534J58293j456226
3152D9591342j932636j576162r67849m16095M671K89923M67081N95937P46117
3143D6802329P77220P84195Q81218R43331R31294R18416R34378R12359Q99828
3134E4784568Q88157J024407J128838J260197J544178J821614K101645K537730
3126F7091334K988985L306036L789151M174321M526889M864175N060216N108043
3118A00909150N061123M859092M587215M215493L753366L213619K675588K089697
3110A31364343J537481J020226N58727J84600j74284m32877p12651r31697j151641
3101A31262227j495018j713293k048112k368477k685484k849632k990854l088935
$$ plain form
3161 45848449 46114227 46457104 46832671 47323283 48127869 49492741 50889275 51047568 49591342
3152 49591342 47658706 46082544 45114695 44698600 44703271 44993194 45460275 46056212 46802329
3143 46802329 47579549 48363744 49244962 50188293 51119587 52038003 52972381 53884740 54784568
3134 54784568 55672725 56697132 57825970 59086167 60630345 62451959 64553604 67091334
3126 67091334 70080319 73386355 77175506 81349827 85876716 90740891 95801107 100909150
3118 100909150 105970273 110829365 115416580 119632073 123385439 126599058 129274646 131364343
3110 131364343 132901824 133922050 134480777 134665377 134491093 134058216 133345565 132413868 131262227
3101 131262227 129767209 128053916 126005804 123637327 120951843 118102211 115111357 112022422
3093A12022422l017477k952535k765366k609552k450552k315983k172227k147912
3085I1590818k109024k113010k079106k124405k182091k384626k517228k568610
3077G3512718k664313k631169k563137k373406k255927k102161j761534j584039
3069E5577032j282050r50454p54424m46388k11746J5794L16562M38479O36051
3060E3338856P56743Q29483Q45151P52885O65629M78431J63564j00855m81842
3051E7248045o54973q50199j139333j453000j600408j731746j850735j929645
3043D6038006j944210j941018j960187j917248j717523j713228j587766j388253
3035C1868573j257522j177824j112874r83078r53631q16776q06692o85929o75710
$$ plain form
3093 112022422 109004945 106052410 103287044 100677492 98226940 95910957 93738730 91590818
3085 91590818 89481794 87368784 85289678 83165273 80983182 78598556 76081328 73512718
3077 73512718 70848405 68217236 65654099 63280693 61024766 58922605 57161071 55577032
3069 55577032 54294982 53344528 52590104 52143716 51931970 51947764 52264326 52702805 53338856
3060 53338856 54095599 54925082 55770233 56523118 57188747 57667178 57830742 57729887 57248045
3051 57248045 56593072 55742873 54603540 53150540 51550132 49818386 47967651 46038006
3043 46038006 44093796 42152778 40192591 38275343 36557820 34844592 33256826 31868573
3035 31868573 30611051 29433227 28320353 27337275 26383644 25566868 24760176 24074247 23398537
3026B3398537n98466n92647n20900n12292n02893m43521m27317m04394l98400
3017A8997707l27934k90142k61779k93296k08336j97215j62130j04899m8334L27
3007A7103969J8649J24196J52997K45272J56316J94029J81791K09755K12571J36578
2997A8736123J4067l5151r6909k28160l23808l60246m24263m94663m93983m29712
2987A5863295m85184m67914l65198m27338l18684l00302l01785k35571k13506
2978A2747813j99887j76786j08713j68778j37301j12827r2033j35464n7226l1370
2968A1527428m7919K1966j01113o0205j0017j5411j6549n111J147p852k3334K8767
2956A1291797J01814N4297O5171P9474P2398Q5871J86152J25558J14834J33255
$$ plain form
3026 23398537 22800071 22207424 21686524 21174232 20671339 20227818 19800501 19396107 18997707
3017 18997707 18669773 18379631 18117852 17824556 17616220 17419005 17256875 17151976 17103642 17103969
3007 17103969 17122618 17246814 17399811 17645083 17801399 17995428 18177219 18386974 18599545 18736123
2997 18736123 18750190 18715039 18618130 18389970 18066162 17705916 17281653 16786990 16293007 15863295
2987 15863295 15378111 14910197 14544999 14117661 13798977 13498675 13196890 12961319 12747813
2978 12747813 12547926 12371140 12262427 12093649 11956348 11843521 11751488 11616024 11558798 11527428
2968 11527428 11479509 11501475 11400362 11340157 11330140 11314729 11298180 11293069 11294216 11286364 11263030 11291797
2956 11291797 11393611 11447908 11513079 11592553 11664951 11750822 11936974 12062532 12177366 12310621
2946A2310621J31281K40300J96033J67641K71943L22421K34421K20157K71770
2937A4366588K82311K41367K69949K67604K75675K53423L05553K67676L59145
2928A6889291L89506L77931M23238M62013M92323N70671N39222N93421N62430
2919B1300046O35781O55609P44999P46618P10699P34188O38121O31447N65976
2910B7363484N18506M85725N78025O04726O26056O19059O88620P46570Q12122
2901C3042893Q44569Q50460Q42798Q95706R50786R56835J080608J165560J270228
2892D1900443J332658J392061J478998J559674J741415J906247K127278K290370
2884E5729144K515948K638275K842136K996446L077395L232606L488465L766896
$$ plain form
2946 12310621 12441902 12682202 12878235 13045876 13317819 13640240 13874661 14094818 14366588
2937 14366588 14648899 14890266 15160215 15427819 15703494 15956917 16262470 16530146 16889291
2928 16889291 17278797 17656728 18079966 18541979 19034302 19604973 20144195 20737616 21300046
2919 21300046 21935827 22591436 23336435 24083053 24793752 25527940 26166061 26797508 27363484
2910 27363484 27881990 28367715 28945740 29550466 30176522 30795581 31484201 32230771 33042893
2901 33042893 33887462 34737922 35580720 36476426 37427212 38384047 39464655 40630215 41900443
2892 41900443 43233101 44625162 46104160 47663834 49405249 51311496 53438774 55729144
2884 55729144 58245092 60883367 63725503 66721949 69799344 73031950 76520415 80287311
2876H0287311M279206M836624N317231N891670O502254P185260P992367Q892984
2868A31184907J0132106J1367307J2764798J4401558J6079307J7773165J9574891
2861B33278039K1376290K3117518K4333520K4603594K2627797J5857833L436219
2854C68630810j1906218k4737702l1768826l2825996l0174574k6058308k1795571
2847A89363615j8017305j5118702j2947475j1277481r911580q867556p835084
2840A05388432o889079o129517n426305m809117m432016m100014l747576l545211
2832F6309597l290706l089386k767575k582100k431862k320257k150843j972941
2824D5703927j966614j824674j792045j718003j605107j505721j414433j279500
$$ plain form
2876 80287311 84566517 89403141 94720372 100612042 107114296 114299556 122291923 131184907
2868 131184907 141317013 152684320 165449118 179850676 195929983 213703148 233278039
2861 233278039 254654329 277771847 302105367 326708961 349336758 365194591 368630810
2854 368630810 356724592 331986890 300218064 267392068 237217494 211159186 189363615
2847 189363615 171346310 156227608 143280133 132002652 122091072 113223516 105388432
2840 105388432 98499353 92369836 86943531 82134414 77702398 73602384 69854808 66309597
2832 66309597 63018891 59929505 57161930 54579830 52147968 49827711 47676868 45703927
2824 45703927 43737313 41912639 40120594 38402591 36797484 35291763 33877330 32597830
2816C2597830j224738j086239r77559r95933j000831q51863q23347p51192p14512
2807B4171616p32212p28701o09575n24888n20305n14217n24144m47509m45816
2798A9124249m73127m25914m17265m91232m26013m15580m54534m27071l57464
2789A5236049l84783k90227l64821l79561l31069k98161l15899l16444l26126
2780A2228958l25815k83559k62232l12488k99774k67551k22183k20436k23891
2771I811029j43828j64571j56331j98752j52866q5785k07728j89028k12518k07966
2761H091656j44574j85135j76404j97447j56015j72680j30775j15109j66197j65244
2751F482076j65482j84000j64957j89230j68290j10818j40298j11256p1676o9374
$$ plain form
2816 32597830 31373092 30286853 29309294 28313361 27312530 26460667 25637320 24886128 24171616
2807 24171616 23439404 22710703 22101128 21576240 21055935 20541718 20017574 19570065 19124249
2798 19124249 18651122 18225208 17807943 17316711 16890698 16475118 16020584 15593513 15236049
2789 15236049 14851266 14561039 14196218 13816657 13485588 13187427 12871528 12555084 12228958
2780 12228958 11903143 11619584 11357352 11044864 10745090 10477539 10255356 10034920 9811029
2771 9811029 9667201 9502630 9346299 9147547 8994681 8908896 8701168 8512140 8299622 8091656
2761 8091656 7947082 7761947 7585543 7388096 7232081 7059401 6928626 6813517 6647320 6482076
2751 6482076 6316594 6132594 5967637 5778407 5610117 5499299 5359001 5247745 5176069 5106695
2741E106695m7202r2233r8072j01245j16636p0814j20060j09767p2274o1003m5287
2730D172102j1876k1266l5385o5637n5770p5381j24811o2547n3965n4598o1734
2719C549132r0031q8330j1657K0882Op3747r0872J26L969n1104k4240j0839p9487
2706C053808r574L2439k5991l6940K5416l2571m0192m8576l0130m3211j07167
2695B737311J599k2552q4088m3356n6514m1059m7357p1322j4917m4444p2100k8296
2683B212905k9630k901q364r4840J5264K6489k4328M276K8186l7042k9574K2538
2671B082979k7179m9447K6452M389m6714m205n6134o1637j6080K2991L1342n6593
2659A850164k0240j3087J4733j0890p2203j220l8511n0791j6261j8800p1532j5101
$$ plain form
2741 5106695 5059493 4967260 4869188 4767943 4651307 4580493 4460433 4350666 4278392 4217389 4172102
2730 4172102 4160226 4138960 4103575 4037938 3982168 3906787 3781976 3719429 3665464 3610866 3549132
2719 3549132 3459101 3370771 3359114 3379996 3380002 3306255 3215383 3215509 3219478 3168374 3144134 3133295 3053808
2706 3053808 3044234 3076673 3050682 3013742 3039158 3006587 2966395 2917819 2887689 2844478 2737311
2695 2737311 2738910 2716358 2632270 2588914 2532400 2491341 2443984 2372662 2357745 2313301 2241201 2212905
2683 2212905 2183275 2180374 2172010 2077170 2092434 2118923 2094595 2098871 2127057 2090015 2060441 2082979
2671 2082979 2055800 2006353 2032805 2037194 1990480 1986275 1930141 1868504 1852424 1875415 1906757 1850164
2659 1850164 1829924 1816837 1831570 1820680 1748477 1747257 1708746 1657955 1641694 1622894 1551362 1536261
2647A536261l0329k5010K8036J6756R228p652j5603k4310J1720o202M270J5857
2635A513022K6205n5724J722O5609k2841J4324j359p9408N958k4224m1626J7886
2623A419544j3572m3814k3204L4688l2386m9689l9052L8740j4370J6196M8149
2612A341230K2988m8441p467L0672m802L9812j5513J150M0141n0657k8764j4079
2600A306270j2085L5657k8083K7438M7146j3707M4806l5925J6152M2190M8322
2589A478181Q2130N6307J3057j0856P6388L6255N3606L453O7722J72011M6977
2578B075231M3859R4604M0563L5379O5485O2878K3932P786j14711j13675j18983
2567B102348j50185j25869j22872j15890q1243l6986p7076o7669n0155n2241N8166
$$ plain form
2647 1536261 1505932 1480922 1508958 1525714 1534942 1527290 1511687 1487377 1499097 1492895 1497165 1513022
2635 1513022 1539227 1483503 1485225 1550834 1527993 1542317 1540958 1461550 1467508 1443284 1401658 1419544
2623 1419544 1405972 1362158 1338954 1373642 1341256 1291567 1252515 1291255 1276885 1293081 1341230
2612 1341230 1364218 1315777 1308310 1338982 1334180 1373992 1358479 1359629 1399770 1349113 1320349 1306270
2600 1306270 1294185 1329842 1301759 1329197 1376343 1362636 1407442 1371517 1387669 1429859 1478181
2589 1478181 1560311 1616618 1629675 1618819 1695207 1731462 1785068 1788521 1856243 2028254 2075231
2578 2075231 2119090 2213694 2254257 2289636 2355121 2417999 2441931 2449717 2335006 2221331 2102348
2567 2102348 1952163 1826294 1703422 1587532 1506289 1469303 1392227 1324558 1274403 1222162 1280328
2556A280328n2322l5985m6248r255l5282n8591q3155j0060L0140o2397o8250l105
2544H45818k1334m9284M208k5365L0986j2463j09204J2228P4840o2373m5861j0896
2532F31300j5453k3566L29J0040m4123L751k5933k7584L9868m5599l6118j9380
2520D47532q54l8102K745p591k6048m2451P3568M821l152L742l4422j8980l2555
2507C28253L0992L237L7124j274k6542L5602r378K7564k4865j2078j6151K2492
2495C94976k5702m207J9166k9456N5037K64k2842l4722l8046k0542J6058j4713
2483B95271r040k8155k7963j1274K0639m2300J4663K3229l7139Q287k5596J8231
2471A98853M963J105l251k0654J7787J2289k4134n733J5116r6q545L2252N925
$$ plain form
2556 1280328 1228006 1192021 1145773 1136518 1101236 1042645 959490 949430 979570 917173 848923 845818
2544 845818 824484 775200 779408 754043 785029 772566 663362 675590 750430 688057 642196 631300
2532 631300 615847 592281 592610 602650 558527 562278 536345 508761 548629 503030 466912 447532
2520 447532 446678 408576 411321 403730 377682 335231 408799 413620 410468 414210 379788 360808 328253
2507 328253 359245 362482 399606 398332 371790 407392 398014 425578 400713 388635 372484 394976
2495 394976 369274 365067 384233 354777 409814 410078 387236 352514 314468 293926 309984 295271
2483 295271 286231 258076 230113 218839 239478 197178 211841 235070 197931 206218 180622 198853
2471 198853 203816 204921 201670 181016 198803 211092 186958 181225 196341 196245 187700 219952 225877
2458B25877j2077l7528J4842M863J7452L9509n5362k1877K3796J3763m367k7815
2446A81076N0568j912k1917J0970m7136k0493M7700K6811k6595l8152J5090O865
2434A82875j0363q72M529j2034n5478k3984K2486R7188o174n4861K5970K4799
2422A94081K3082q221n1997k1337l8835K1897J0702J8839l3417k3714M3399J1656
2410A46135j6022n9946J1553K0392n9850j7864j4505l744l3746Q3307N900k1560
2398D0050j0048L4994N629j6361m0656J4508K7315J1498K6716L8388m8739k8739
2386E4555J2526J3944k7704Q927J6004m2073q319p093J8440o8449l0112K3619
2374c5735N8609K983n2141K545M2383N343j3462K0510J4327k1254L2323m1210
$$ plain form
2458 225877 213800 176272 191114 195977 213429 252938 197576 175699 199495 213258 208891 181076
2446 181076 231644 229732 207815 218785 171649 151156 198856 225667 199072 160920 176010 182875
2434 182875 172512 171640 176169 164135 108657 84673 107159 204347 198173 143312 169282 194081
2422 194081 217163 208942 156945 135608 96773 118670 129372 148211 114794 91080 134479 146135
2410 146135 130113 70167 81720 102112 42262 24398 9893 6149 -27597 55710 61610 40050
2398 40050 30002 64996 70625 54264 13608 28116 55431 66929 93645 132033 83294 54555
2386 54555 67081 81025 53321 62248 78252 36179 27860 20767 39207 -29242 -59354 -35735
2374 -35735 22874 25857 -26284 -23739 18644 23987 10525 31035 45362 24108 56431 15221
2362A5221l1187k4789j7192M6441J9554n8583k625j4470P2814k4225L8606K6449
2350D6014m9130M4446k220m6252j3456M6040j382p7219J458K0266m0496k171M2141
2337c1961N3426j608m2718p797M9335M553j1573l8529j9468O0369l9462j7569
2325d3002J6940o828R22M2176j6454l1132M7483k3250j8059L0942o5394L867m477
2312f6266M673j5709L5188P8570k462m6752j0715K07l7769l1690q455K2743O4167
2299a4270K0636m0556J5402j3412k1610j2841j4177l6406M7829j7843q02J5490
2287g2560k2442K778L5314J1139J1485o169L046M1108O6j1541K1584o937j520
2274E351k4701l2485J188N925q270j3812k194n217J9409k8115j0029L7009P860
$$ plain form
2362 15221 -15966 -40755 -57947 -11506 8048 -50535 -53160 -67630 5184 -19041 19565 46014
2350 46014 -3116 41330 39110 -7142 -20598 25442 24060 -53159 -51701 -31435 -71931 -74102 -31961
2337 -31961 21465 19857 -22861 -30658 18677 23230 11657 -26872 -46340 14029 -25433 -43002
2325 -43002 -26062 -32890 -31968 10208 -6246 -37378 10105 -13145 -31204 -262 -65656 -61789 -66266
2312 -66266 -61593 -77302 -42114 36456 33994 -12758 -23473 -23266 -61035 -92725 -101180 -78437 -14270
2299 -14270 6366 -34190 -18788 -32200 -53810 -66651 -80828 -117234 -69405 -87248 -88050 -72560
2287 -72560 -95002 -92224 -56910 -45771 -34286 -40455 -37409 3699 3765 -7776 13808 6871 5351
2274 5351 -19350 -51835 -50647 -44722 -52992 -66804 -68998 -74215 -54806 -82921 -92950 -55941 -48081
2261d8081K1628k4188k5134q533L4440m177j1043L213N1379k102k6490J7029J8075
2248c984M4260j1733k7940K9621j6287j3479J851m261M1604m2699J0976n471o899
2235d441L9916J6573L219l2111K8038l4694m7033M0304k7989O715L2681q421k9153
2222a6396k682j9087N1524P618m0593L4263L3202R000R468K403j8746l8505K0453
2209C1922r815j7366J5383N1968K9713l3300q068l5863K4927K0784Q342j5129
2197F3498J985R366N4690K4897o0330O1575M8196L7925J7382K8245l798j9184
2185B64447j2223k882L5513j0480K7470N5067m5769j1488L4933L5416J2064k2373
2173C59695L9695M1673Q900Q60K8715J5016L6289K5548N0542Q9699o825k0296
$$ plain form
2261 -48081 -26453 -50641 -75775 -84308 -49868 -54045 -65088 -61875 -10496 -12598 -39088 -22059 -3984
2248 -3984 40276 28543 603 30224 13937 458 2309 -1952 39652 -3047 7929 2458 -4441
2235 -4441 35475 52048 55267 23156 51194 16500 -30533 9771 -18218 -11503 21178 12757 -16396
2222 -16396 -19078 -38165 13359 20977 -19616 14647 47849 56849 66317 68720 49974 11469 31922
2209 31922 22107 4741 20124 72092 101805 68505 60437 24574 49501 70285 78627 63498
2197 63498 65483 74849 129539 154436 94106 155681 203877 241802 259184 287429 283631 264447
2185 264447 252224 249342 284855 274375 301845 356912 311143 299655 334588 370004 382068 359695
2173 359695 399390 441063 449963 450823 479538 494554 530843 556391 606933 696632 689807 669511
2161F69511O0119l1355N878M804N4690R1548L498N4779N6328K0341J645M2147
2149A033933L5031P1843P3804l3133J28292Q4551J2148J06160Q0146J36901J00521
2138A830197J09477K10831J97482J82997K37021K70420J27362J89078K18968L56611
2128C930444M64690O24582P52009J001200J232855J460062J404912J826117K540226
2119A5237097M023431K147339k492009m100482l728230k583095j698319j114207
2111E691525p55216n39014m45080k78135l26469k78536j80814j09171j08939j80440
2101B489711k83010k34316j53407j43986j69982r0277r9069j8204j26885k8888
2091A141687o0016j8796r38q3653n4787k2777q4705j04291r2012j2656m4018l9517
$$ plain form
2161 669511 729630 698275 704153 708957 763647 855195 858693 913472 969800 990141 991786 1033933
2149 1033933 1068964 1140807 1214611 1181478 1309770 1394321 1406469 1512629 1592775 1729676 1830197
2138 1830197 1939674 2150505 2347987 2530984 2768005 3038425 3165787 3354865 3573833 3930444
2128 3930444 4395134 5019716 5771725 6772925 8005780 9465842 10870754 12696871 15237097
2119 15237097 19260528 21407867 18915858 14815376 11087146 8504051 6805732 5691525
2111 5691525 4936309 4397295 3952215 3674080 3347611 3069075 2888261 2779090 2670151 2489711
2101 2489711 2206701 1972385 1818978 1674992 1505010 1414733 1315664 1297460 1170575 1141687
2091 1141687 1081671 1062875 1061937 978284 923497 900720 816015 711724 619712 607056 563038 523521
2079E23521M6953r2145m5872l7761L820J6842l7607M7896j1634n5693n3826J099
2067C05593M8556O170m0468K5945k162k9375r122K2992p571l4280l1457n4343
2055B00478Q417K4243k1581l4921L426J2889k4569o2689K5397M9031l8649n0558
2043I0914j455J0365L2047m8949k0962k8276J9405m324P348J8785n5135m2396
2031b2633K9949O0570k7416l2769j4055m5230K6325L7570m5608j973L3246l6037
2019c8061o518K521N7523o4415K8240k3673K1487k746P4m7592L3884n505q634
2006e3415K0346L815l1536J273L1007p4353K7215N868J576l435m35R69j1848L4820
1992d8133O677p2407J6345p449n892K7105N4668L8265o1424m026R899l9361K4570
$$ plain form
2079 523521 570474 478329 432457 394696 398516 415358 377751 425647 414013 358320 304494 305593
2067 305593 354149 360319 319851 345796 343634 314259 305137 328129 320558 286278 254821 200478
2055 200478 208895 233138 211557 176636 180062 192951 168382 105693 131090 180121 141472 90914
2043 90914 89459 99824 131871 82922 61960 33684 53089 48765 56113 74898 19763 -22633
2031 -22633 7316 67886 40470 7701 -6354 -51584 -25259 12311 -33297 -35270 -2024 -38061
2019 -38061 -44579 -42058 15465 -48950 -20710 -44383 -22896 -25642 -25568 -73160 -39276 -44781 -53415
2006 -53415 -33069 -29254 -60790 -59517 -28510 -102863 -75648 -69780 -68204 -71639 -72074 -71105 -82953 -48133
1992 -48133 -41456 -113863 -97518 -104967 -110859 -83754 -29086 9179 -52245 -56271 -46372 -85733 -61163
1979f1163j6050l395j1280j2022K6576K2828m0635j2152L2313m4820J9215n905
1967a06490L735m2523k4701P7092j4102n552K710L9313k6912K4129p0403L5773
1955a07931j9284k0102P1120N9896l8902p014n3024j4012L5404o1586j0511m7189
1943b13135M0556K3144j6911Q082N2285k5014L0260l5368P633L836j0219m5024
1931a79875k3141L4352M9690l2852J2671K5396p8985J9197k3951O982L6493J1819
1919a42204K5193m4663O075L3776l842J9909k5373R229M256L6478n987q6963j7131
1906a91247L2416K8721L6897k7280l3508o42K1045m1256k3898Q1917O0149k5723
1894h2409q2922l5874K7743O3270L5l1534k7811o4636K6717K9130L037J3323m1460
$$ plain form
1979 -61163 -77213 -80608 -91888 -103910 -77334 -54506 -95141 -107293 -74980 -119800 -100585 -106490
1967 -106490 -102755 -145278 -169979 -92887 -106989 -112541 -109831 -70518 -97430 -73301 -143704 -107931
1955 -107931 -127215 -147317 -76197 -16301 -55203 -62217 -115241 -129253 -93849 -155435 -165946 -213135
1943 -213135 -172579 -149435 -166346 -158264 -105979 -130993 -100733 -136101 -128468 -124632 -134851 -179875
1931 -179875 -203016 -168664 -118974 -151826 -139155 -113759 -192744 -173547 -197498 -190516 -154023 -142204
1919 -142204 -117011 -161674 -155599 -121823 -125665 -105756 -131129 -121900 -117644 -81166 -87153 -174116 -191247
1906 -191247 -158831 -130110 -93213 -120493 -154001 -154643 -133598 -174854 -198752 -116835 -56686 -82409
1894 -82409 -165331 -201205 -173462 -110192 -110157 -141691 -169502 -234138 -207421 -178291 -175254 -161931 -203391
1881b03391M744J2066J8881M2230o80j154k328L0247J2566o4950l488L9463K8066
1868h7728J3620m3093J2944k0952l9521K2059N5928j2382k0012j0554K4681J6532
1856h8478N065K2728o2304l3878J9601l099L8478l217M422P18m5866M356o121
1843a47595k4532o085M3973N7332o014k2788K3407l9135m1944q651L4873L5797
1831a01362l0828j6775L94K4322n179n4393J7083M2317k1152j8336J5903j6650
1819a64656o771L6300J285j6870m9934K8612J1719m604M0292k7461j3088M98J6982
1806a47696j5726J2964N0J7741L3266j2464n1397K1778M2161m1240j3832p0072
1794b24467K2705M9568N3546j0792j1944M6221k7062K596m6024l4609R116j9561
$$ plain form
1881 -203391 -198647 -186581 -167700 -125470 -126150 -127304 -129632 -99385 -86819 -151769 -155257 -115794 -87728
1868 -87728 -74108 -117201 -104257 -125209 -164730 -142671 -86743 -99125 -119137 -129691 -105010 -88478
1856 -88478 -83413 -60685 -122989 -156867 -137266 -140365 -101887 -105104 -100682 -99964 -145830 -141474 -147595
1843 -147595 -172127 -178212 -134239 -76907 -82921 -105709 -82302 -121437 -163381 -172032 -137159 -101362
1831 -101362 -132190 -148965 -148571 -124249 -129428 -183821 -166738 -124421 -145573 -163909 -148006 -164656
1819 -164656 -171427 -135127 -133842 -150712 -200646 -172034 -160315 -164919 -124627 -152088 -165176 -164678 -147696
1806 -147696 -163422 -150458 -150408 -132667 -99401 -111865 -163262 -141484 -99323 -140563 -154395 -224467
1794 -224467 -201762 -152194 -98648 -109440 -121384 -75163 -102225 -99629 -145653 -180262 -171146 -190707
1782a90707L6124K1189j0958n7505k5383K0655J6382L0906r102O774L906J273
1770a56446J4514M8o1888K5135k894P7882r744l1005J1634K5640r227j1007K2473
1757a04885k5891o8151M4084M2215K8395m1536n9688J8141L6773l0627J6967K9022
1745a15181o6775m747J7204L1626P698L037k5311J5585l2898K9712m0648J8443
1733a62255J7356k5911J6561l6528K1784j1041K34n113Q868J1983J6800m2112
1721a89374K6097P366k8010P66J1793K4457k1122K9947j5945N171K4044m5258
1709a70068l1473M9592j408J2379K2671J6751k1842j0979j5712j2885Q8P3430
1697h9456J4065p2718n170p1292P089N3715J8761l0340J3752J6123q817L8531
$$ plain form
1782 -190707 -154583 -133394 -144352 -201857 -227240 -206585 -190203 -159297 -168399 -161625 -157719 -156446
1770 -156446 -141932 -141884 -203772 -178637 -181531 -103649 -113393 -144398 -132764 -107124 -116351 -127358 -104885
1757 -104885 -130776 -198927 -154843 -112628 -84233 -125769 -185457 -167316 -130543 -161170 -144203 -115181
1745 -115181 -181956 -186703 -169499 -137873 -130175 -127138 -152449 -136864 -169762 -140050 -180698 -162255
1733 -162255 -144899 -170810 -154249 -190777 -168993 -180034 -179800 -184913 -176045 -164062 -147262 -189374
1721 -189374 -163277 -155911 -183921 -183155 -171362 -146905 -168027 -138080 -154025 -148854 -124810 -170068
1709 -170068 -201541 -151949 -153357 -140978 -118307 -101556 -123398 -134377 -150089 -162974 -162886 -89456
1697 -89456 -75391 -148109 -153279 -224571 -217482 -163767 -145006 -175346 -161594 -145471 -154288 -115757
1685a15757j4380K2894l8993r599j1327K2835J8097J2985j425n3247j06331L3754
1673b40494M0826j1653j8201P5009M0527n589j287k5279J6108l0931j502J3486
1661a48980Q384k6996K4174P172J8157k6510K4356p416K5021l2377m7172J8388
1649a63799K2371L1486M2500k9825m6969L5725J4408o0914K3075M2976o9777K177
1637a56566J2940K0044K4642J0678o0574j9236J7175k7646j8036N7419l953Q850
1625a34263j447k5035J2411m206K8490m25n7298N3172K4736P962j6194k5231k1526
1612a58854q43M4931j3664L3296K1054l8957l696k6411K4628k1234j1217K2814
1600a28153n822J993k4630L1161J9357K1644k3050O937j2091j5019J1967l09q703
$$ plain form
1685 -115757 -130137 -107243 -146236 -155835 -167162 -144327 -126230 -113245 -114670 -167917 -274248 -240494
1673 -240494 -199668 -211321 -229522 -154513 -113986 -119575 -120862 -146141 -130033 -160964 -162466 -148980
1661 -148980 -140596 -167592 -143418 -136246 -118089 -144599 -120243 -127659 -102638 -135015 -182187 -163799
1649 -163799 -141428 -109942 -67442 -97267 -144236 -108511 -94103 -155017 -131942 -88966 -158743 -156566
1637 -156566 -143626 -123582 -98940 -88262 -148836 -168072 -150897 -178543 -196579 -139160 -143113 -134263
1625 -134263 -135710 -160745 -148334 -152540 -124050 -124475 -181773 -128601 -103865 -95903 -112097 -137328 -158854
1612 -158854 -159697 -114766 -128430 -95134 -74080 -113037 -116733 -143144 -118516 -139750 -150967 -128153
1600 -128153 -133975 -131982 -156612 -125451 -106094 -84450 -107500 -100563 -112654 -127673 -115706 -116015 -124718
1587a24718O6599K4023m1442n4910m4601N3438n4495J7792O4086J8723j615L2061
1575d5059M456o8949j7381Q309J9760j8965J5624k9921K2435P58m163l921j59
1562a17176L6107j1724q4664N9844j3301r349J7376j482m6656K3162M2916k703
1550a07650L1685M0444o6618n2082K2491m2001N0550J4155j2528q893N293K9302
1538i5852n3109l0520J6320J3567L0084M2133l2465l6609j850k0885l7609O2142
1526a44653L8327j5331j1466r58k0531Q097P124L7704m715r118j2460K8831L8163
1513f0986n3724J4731k3905k0342K5526M2181m1413l2948k6681M9281k6636L9811
1501a15105j8838k0199k8535n690L7266K7393j636J6101O983K7668p8132k5888
$$ plain form
1587 -124718 -58119 -34096 -75538 -130448 -175049 -121611 -176106 -158314 -94228 -75505 -77120 -45059
1575 -45059 -40603 -109552 -126933 -118624 -98864 -117829 -102205 -132126 -109691 -108933 -113096 -117017 -117176
1562 -117176 -81069 -92793 -177457 -117613 -130914 -140263 -122887 -124369 -171025 -147863 -104947 -107650
1550 -107650 -75965 -35521 -102139 -154221 -131730 -173731 -123181 -109026 -121554 -130447 -125154 -95852
1538 -95852 -148961 -179481 -163161 -149594 -119510 -77377 -109842 -146451 -148301 -169186 -206795 -144653
1526 -144653 -106326 -121657 -133123 -134081 -154612 -146515 -139391 -101687 -106402 -115520 -127980 -99149 -60986
1513 -60986 -114710 -99979 -123884 -144226 -118700 -76519 -117932 -150880 -177561 -128280 -154916 -115105
1501 -115105 -133943 -154142 -182677 -188367 -151101 -123708 -125344 -109243 -102260 -74592 -152724 -178612
1489a78612L5743q944J2345l5433K8445K5071K3238l88n2609k7883K6158n95J6546
1476a36918l4969P311L4063j1483L6866K1304j736m4942L3664p32m7378L5949
1464a09001K1956M474k421o4896l322k736K9622L8872q668O156L8212k3520p6192
1451a51464L6313K6355j343K6711l024n5354o045J5862k2542M1414L9277k2897
1439g6737k1208k5097N799j7806N789O651J8593r330m1347K2973K3517j2129K350
1426a17982J5905L0972J4812n412j4332K0049K0950N814jL623o9299l1624N4064
1413g2461J0148m2067K4549M3521j4890m8818m3910k459K2428l138J9380n285
1401a13002j272L0634J1096k517K4754j7952o5221N7419J7515k9867l2288k193
$$ plain form
1489 -178612 -142869 -151813 -139468 -174901 -146456 -121385 -98147 -98535 -151144 -179027 -152869 -153464 -136918
1476 -136918 -171887 -164576 -130513 -141996 -105130 -83826 -85562 -130504 -96840 -97572 -144950 -109001
1464 -109001 -87045 -82571 -84992 -149888 -153210 -155946 -126324 -87452 -96120 -89964 -51752 -75272 -151464
1451 -151464 -115151 -88796 -90139 -63428 -66452 -121806 -127851 -111989 -134531 -93117 -53840 -76737
1439 -76737 -97945 -123042 -117243 -135049 -129260 -122609 -104016 -113346 -154693 -131720 -108203 -120332 -117982
1426 -117982 -102077 -71105 -56293 -61705 -76037 -55988 -35038 -29224 -29225 -25602 -94901 -126525 -72461
1413 -72461 -62313 -104380 -79831 -36310 -51200 -100018 -143928 -146387 -123959 -127097 -107717 -113002
1401 -113002 -114274 -83640 -72544 -75061 -50307 -68259 -133480 -76061 -58546 -88413 -120701 -122894
1389a22894l0308L421O449k120Q0789j4168M574k0608j3598L6080M606k753K9467
1376d1063k4326j8138L525j3170J0148k082J7147K0773o112k4443j2667n249k7387
1363a23044N313K0677N8146O648o0236P9282k5161m0312M605j3885j3893m1889
1351a43749K0170O5763J5280k0027r418j0079r973K1537n305K2772j3650l3191
1339i9870L4438l801j4830l5982L150l315q640J6927j1138L8910j4753J4004K3298
1326f1602k6427j4809m429N923l4526J3895L4282l5697K8207O280j8574J3077
1314i4400j4219L2469J6601J2039J0840l349j4339K5155L694o9063J4667L6375
1302d3530k8159J4382k143k0877k1230K8857J3126l1650m455J9892K6896o476
$$ plain form
1389 -122894 -153202 -149781 -143332 -145452 -64663 -78831 -74257 -94865 -108463 -72383 -67777 -70530 -41063
1376 -41063 -65389 -83527 -80002 -93172 -83024 -85106 -67959 -47186 -53298 -77741 -90408 -95657 -123044
1363 -123044 -117731 -97054 -38908 -32260 -92496 -13214 -38375 -78687 -74082 -87967 -101860 -143749
1351 -143749 -123579 -57816 -42536 -62563 -71981 -82060 -92033 -70496 -75801 -53029 -66679 -99870
1339 -99870 -65432 -69233 -84063 -120045 -116895 -120210 -128850 -111923 -123061 -84151 -98904 -84900 -61602
1326 -61602 -88029 -102838 -107267 -101344 -135870 -121975 -87693 -123390 -95183 -88903 -107477 -94400
1314 -94400 -108619 -76150 -59549 -47510 -36670 -40019 -54358 -29203 -25509 -94572 -79905 -43530
1302 -43530 -71689 -57307 -59450 -80327 -101557 -72700 -59574 -91224 -95679 -75787 -48891 -55367
1290e5367l6254J4834J3669j2561n659L6462J4075k9668K2510l5022n2566K3120
1278a02427J1745j2263J776n863j6127J5178K3086O991m1391J257K1399l701R890
1265i0450j742J4581J814J4135l4611k7805L6556J9422l0496J2819J8232m951
1253g2496l6840j1677M4073L9460k6725j8971J8299j2603n382j2614J1173P812
1241g6491J2166j2611q065Q037L8836k0604J9005j041j4314o576q572K7807m0786
1228h3209k4931N3854J8476L0623l2525m73J3242m1963j8643o413L3182J6102
1216d2678r896j8977J9006M2743k0434o9718K5690L9825K4484o896j7846k3560
1204e8257n2395J0435N5269J7963P574k2959k6942j6760L2607K485k1544M0331
$$ plain form
1290 -55367 -91621 -76787 -63118 -75679 -81338 -44876 -30801 -60469 -37959 -72981 -125547 -102427
1278 -102427 -90682 -102945 -101169 -107032 -123159 -107981 -84895 -77904 -119295 -118038 -96639 -100340 -90450
1265 -90450 -92192 -77611 -75797 -61662 -96273 -124078 -87522 -68100 -98596 -85777 -67545 -72496
1253 -72496 -109336 -121013 -76940 -37480 -64205 -83176 -64877 -77480 -82862 -95476 -84303 -76491
1241 -76491 -64325 -76936 -85001 -76964 -38128 -58732 -39727 -40768 -55082 -61658 -70230 -42423 -83209
1228 -83209 -108140 -54286 -35810 -5187 -37712 -38185 -24943 -66906 -85549 -91962 -58780 -42678
1216 -42678 -52574 -71551 -52545 -9802 -30236 -99954 -74264 -34439 -9955 -16851 -34697 -58257
1204 -58257 -110652 -100217 -44948 -26985 -19411 -42370 -69312 -86072 -53465 -50980 -72524 -32193
1192c2193K1195j5350L2524L6573j7730l7751m1372J1550K1020m7330O7343l3476
1180c4997p2641l09L5563L8309o204J5210M294k8166K6342n3590q964L9308k5480
1167g1325M3624o5371K7177K9051j7785j0233K381Q3685n5147j6515J2017J1281
1155b7160m0025K8292k1073j3381K1838k5202l911K288J9175J4019N6178k6834
1143a5796k7633k9697J6340J7729K2240k032n298j7516l2333L2999o210l005n2085
1130a02297L5691K9265k4358N7151J5041j5810j3599l1100q123l3429J6376N1612
1118b3580n369L01k935n647J2271J9074j973q082n1533K4547L0843K146m0242
1105e0179m589l005p882P5429m1573l3677P678m4445J7704J4735j2929L5377O7423
$$ plain form
1192 -32193 -10998 -26348 6176 42749 25019 -12732 -54104 -42554 -21534 -68864 -1521 -34997
1180 -34997 -107638 -107947 -72384 -34075 -40279 -25069 -20775 -48941 -22599 -76189 -85153 -45845 -71325
1167 -71325 -27701 -93072 -65895 -36844 -54629 -64862 -62481 21204 -33943 -50458 -38441 -27160
1155 -27160 -67185 -38893 -59966 -73347 -51509 -76711 -80622 -78334 -59159 -45140 11038 -15796
1143 -15796 -43429 -73126 -56786 -39057 -16817 -18849 -24147 -41663 -73996 -40997 -47207 -50212 -102297
1130 -102297 -66606 -37341 -61699 -4548 10493 -5317 -18916 -50016 -58139 -91568 -75192 -23580
1118 -23580 -28949 -28648 -31583 -37230 -24959 -5885 -7858 -15940 -67473 -42926 -12083 -9937 -50179
1105 -50179 -54768 -57773 -65655 9774 -31799 -65476 -57798 -102243 -84539 -69804 -82733 -47356 20067
1092B0067l0340j0449J9319k6767l2376K9892m1277K5237J0586J8879j996m671
1080b3896K0572K046o2026M1325J8736m9937o014K2017K6161j3237R409R757j024
1067f111j3613j0568N0599j917l6197k1528J0639L6756n7822L1909K8710l8580
1055b7723l817p752P145o733K0197K4559J8471q686l8513K0558j0221l5256K1767
1042b6004K0380p965k6245K2912L2385l5654k9070K0892M9645L820J9928k6443
1030A8581k9999j925L1653q219l726N687N734l5714K7706J6404J1689k9385k5177
1017a6691J4528M6514o9151n0241L2221R837M2243o549J1220K4164R149k5085
1005B2159o4265k1285j0363P538J00790N339k9033M228m7988K962n622M457M628
$$ plain form
1092 20067 -10273 -20722 -1403 -28170 -60546 -30654 -71931 -46694 -36108 -17229 -19225 -23896
1080 -23896 -3324 -1278 -63304 -21979 -3243 -53180 -59194 -37177 -11016 -24253 -14844 -5087 -6111
1067 -6111 -19724 -30292 20307 18390 -17807 -39335 -28696 8060 -49762 -17853 10857 -27723
1055 -27723 -31540 -39292 -32147 -38880 -18683 5876 24347 15661 -22852 -2294 -12515 -47771 -26004
1042 -26004 -5624 -13589 -39834 -16922 15463 -20191 -49261 -28369 21276 25096 45024 18581
1030 18581 -11418 -13343 18310 10091 6365 12052 17786 -17928 9778 26182 37871 8486 -16691
1017 -16691 -2163 44351 -24800 -75041 -42820 -32983 9260 2711 13931 38095 47244 22159
1005 22159 -42106 -63391 -73754 -66216 34574 39913 10880 15108 -32880 -29918 -35540 -31083 -26455
992b6455P0600L9373m6788l5734p890q067k5771K5097K3013j5588L7738K0716
980E0244J3080L032n8750m9041K5303J4272p52o851j8546q314K66M4835J5775
967B4553m3454M0375N7831m5083J8047r481l0953j604m1207O548M8099j5010J6884
954B5545l4242k9160K3261J0992J1889l6887K8723J9216o1379L9562j3910L0218
942A3828K9041K4067k4198j5725k0766o036N9712o1254n6141J8889M9188k3436
930a2831j6666K983k1302q673N0715M0715n742q9432m0618L3593M2257O2468O54
917C8121k7516l821O1586Q857n5969j2670m132m909K4218P4433l5238k7848j3092
904B2020q564j8605O130J3745k2900o752P293J9496j0948m046M2439r774l751
$$ plain form
992 -26455 44145 83518 36730 996 -6894 -14961 -40732 -15635 7378 -8210 29528 50244
980 50244 63324 66356 7606 -41435 -16132 -1860 -2612 -9463 -28009 -36323 -36057 8778 24553
967 24553 -18901 21474 79305 34222 52269 42788 11835 10231 -30976 -24428 23671 8661 25545
954 25545 -8697 -37857 -14596 -3604 8285 -28602 121 19337 -42042 -2480 -16390 13828
942 13828 42869 66936 42738 27013 6247 211 59923 -1331 -57472 -38583 10605 -12831
930 -12831 -29497 -26514 -47816 -56489 -5774 34941 29199 -60233 -100851 -67258 -25001 37467 38121
917 38121 10605 6784 68370 77227 21258 8588 4456 -453 23765 98198 62960 35112 22020
904 22020 13456 -5149 981 14726 -8174 -14926 -7633 11863 915 -3131 39308 29534 25783
891B5783Q498O641Q043J347K835k7801K6025J1629l1734j1863N4486j6781k5840
878C1268k0620O098L7974k0614K3565L6051p2203P57K1399k8253k1696L1036N4417
865G9179m1738r322K3406k2979k9409j7199N1433k2903J5109L0103q491l3835
853A3354P926K9787L5329n7744m500M0242n8293J8307N8228o1611k6530K0441
841A4936N7191L6650l0939m9887J2029Q1023k6018o4982N5574J667m2112K2870
829F8002j6894l5012J7450M6121J3118J0036j8780m624m1932j9837J5633m113
817B9168J2919P260o7550k873M7626j51K5066j2717K092L9667J2574M839q283
804H9637o1247k6910N6718N7905k420k4378N271n8590n5253K5625N4982P125J6359
$$ plain form
891 25783 34281 40922 48965 50312 53147 25346 51371 63000 31266 19403 73889 57108 31268
878 31268 10648 16746 54720 34106 57671 93722 21519 22276 43675 15422 -6274 24762 79179
865 79179 37441 28119 51525 28546 -863 -18062 33371 10468 25577 55680 47189 13354
853 13354 21280 51067 86396 28652 24152 64394 6101 24408 82636 21025 -5505 14936
841 14936 72127 108777 77838 27951 39980 121003 94985 30003 85577 87244 45132 68002
829 68002 51108 16096 33546 79667 92785 102821 84041 79417 37485 17648 33281 29168
817 29168 42087 49347 -18203 -21076 26550 26399 51465 38748 40840 80507 93081 97920 89637
804 89637 28390 1480 58198 116103 113683 89305 94576 35986 -19267 6358 61340 68465 84824
791H4824K519k7941O196n1246k8194M3245k1187O9472M212J6109O830l9984k067
778F2788r990l7444J5806R773J09K3050r219k4650N1349K5173L6546p2518o512
765F4261r96L3503j6350L155j261o2379O5823j4792r440N6041K87n2840J5097
752H0109r832K8152j6708j4654k4551L0253p45l0307L9082L9549q725k3753R384
739I7254k4648J1574J0596l8816k4169K9309q438J6284J3397J2161o540O530K9106
726A23600l1395m3244l3536K9778K5896p996k615L918j5403J1813J3015Q41l4084
713D0588O462K6383M3989j8925k2146Q995j8224j0905O041N797M8730K2421l1406
700A07800k4012J4989L0434J8354n075j3859j6188k3622K5389m0383j1676O6560
$$ plain form
791 84824 87343 59402 65598 14352 -13842 29403 8216 77688 81900 98009 104839 64855 62788
778 62788 52798 15354 31160 40933 41042 64092 54873 30223 81572 106745 143291 70773 64261
765 64261 63265 96768 80418 83573 82312 19933 85756 70964 61524 117565 117852 65012 80109
752 80109 70277 98429 81721 67067 42516 72769 72024 41717 80799 120348 111623 87870 97254
739 97254 72606 84180 94776 55960 31791 61100 52662 68946 82343 94504 87964 94494 123600
726 123600 92205 48961 15425 45203 71099 63103 60488 64406 49003 60816 73831 74672 40588
713 40588 47050 73433 117422 98497 76351 85346 67122 56217 62258 68055 116785 139206 107800
700 107800 83788 98777 129211 147565 142490 128631 112443 88821 114210 73827 62151 128711
688A28711K1653n7019k8606N4J3283L3538l0525K1874j3100m910J9525L90k8788
675G6080J6231k0972P173K3086j1228M1168k3337j495j2997j3815K6014J0347
663A16255l6761K583M267m5851J1495K2586K9079K2183j2598J1847K5441m9363
651A01163m8170Q274M8805M3890M759o9116n0576K0284j0433O499J92M8206r003
638I4774J6184J897n2680M3383K9666m1415m603K7349Q953Q627q321J5917k3570
625A16161N389k1196K4811j105K3385n418k9497j4040l7219M5987L4039k9836
613A11461l7997J0679P1907m789j4700j3757n2470J1831Q54k2449K5601K0181
601A06352q243R955k1340M4274O7976r014j5391m2194j3289k674r438j1720r533
$$ plain form
688 128711 150364 93345 64739 64793 78076 111614 81089 102963 89863 84953 104478 104868 76080
675 76080 92311 71339 78512 101598 90370 131538 108201 106706 93709 79894 105908 116255
663 116255 79494 82077 86344 40493 51988 74574 103653 125836 113238 125085 150526 101163
651 101163 52993 61267 110072 153962 158721 89605 39029 59313 48880 55379 55571 103777 94774
638 94774 110958 112855 60175 103558 133224 91809 87206 114555 123508 132135 123814 139731 116161
625 116161 121550 100354 125165 124060 147445 142027 112530 98490 61271 107258 141297 111461
613 111461 73464 84143 156050 151261 136561 122804 70334 82165 83019 60570 86171 106352
601 106352 98109 108064 86724 130998 198974 189960 174569 132375 119086 116412 106974 95254 85721
588H5721K7137m379L7233k6796m9954N960L0492N3235m6267J4879K1200p5455
576G3006K5052J9568l1668J6339j4220N3208M8435l1676J9654j7023q9527N906
564G7054J7002l1802N5176l5956M5396J4196p464m6857L4679M7814l848n2480
552A12910K7083J7291n4171k9213K3492j630J1919M2282q479N298J5503L6909
540A99194n5469N859K1347o1512K4584j6289l5658K0424p640J7150O186K7162
528A45338l1248j6646j2627j3751j4686K8104N9787l876N132q265k7958l1865
516G7439J8286L8459K7876j9578K9490k4175l9388p160k0224J9654L6031j3075
504A23635J8745L7712j4191K1146j498k2642K9571m0545j0497J7376o2484K1279
$$ plain form
588 85721 112858 108479 145712 118916 68962 74922 105414 158649 112382 127261 148461 73006
576 73006 98058 117626 85958 102297 88077 141285 189720 158044 177698 160675 71148 77054
564 77054 94056 62254 117430 81474 126870 141066 133602 86745 121424 169238 165390 112910
552 112910 139993 157284 103113 73900 97392 95762 107681 149963 141484 146782 162285 199194
540 199194 143725 149584 170931 109419 134003 117714 82056 102480 94840 111990 118176 145338
528 145338 114090 97444 84817 71066 56380 84484 144271 140395 145527 137262 109304 77439
516 77439 95725 134184 162060 142482 171972 147797 108409 101249 81025 100679 136710 123635
504 123635 142380 180092 165901 187047 185549 162907 192478 151933 141436 158812 96328 117607
492A17607j2761M6353J0315j511j0678k2926J0258K2562K1078o3243L132M9186
480A69372o5274L120M5555K4011n018m8402K625O620O282P837k3184J1058m1118
467I3484O9848J4574k7176K7740l7302j1824K3174k3820N354K9725r334k3006
455A31437j734o6198L9086N7946j2883k2546j0106n51P819L8970r328N0481n086
442A97307k9443J0318n9462l0061N6399j3811L4932j980j9259M2912m4973J0518
430A53397K9769K6504k1180j0325M674j0208j5207J099J8757l9410j5550M3835
418A66155J5646n7617j1668q481J7597N461K7311q688m2201K0624M2718Q298K9865
405B05020l1135j3540M3344l2455p084k1943j7217L5737K0821k2393M7193j4663
$$ plain form
492 117607 104846 151199 161514 160003 149325 126399 136657 159219 180297 117054 120186 169372
480 169372 104098 107218 152773 176784 171766 123364 125989 132609 138891 146728 123544 134602 93484
467 93484 163332 177906 150730 178470 141168 129344 152518 128698 134052 163777 154443 131437
455 131437 129703 63505 102591 160537 147654 125108 115002 114451 122270 161240 151912 202393 197307
442 197307 167864 178182 118720 88659 145058 131247 166179 164199 144940 187852 142879 153397
430 153397 183166 209670 188490 178165 182839 172631 157424 158523 177280 137870 122320 166155
418 166155 181801 124184 112516 104035 121632 127093 154404 145716 103515 124139 166857 175155 205020
405 205020 173885 160345 203689 171234 164150 142207 124990 160727 181548 159155 206348 191685
393A91685l3710K1062j1494M6675l1111P307J4899j395l1786J6773k7590L2878
381A94193L5006j1325j0270r317L5830k8463O551K8163p467n8295N885n1127M0501
368A69865N3364l7248l4732L6341J0976n1089K6177J0940J2913N575r229j667
356A92186m5540k0789K0361J0541K9811l1013N6260K0703l6356j7731j622K982
344A79793j6541M0194L2541m542n2563J0961k847m4397o880K4201Q0249l50p665
331B32154M4279N632j7833j6785n1475j4643j1677k4857O2165R515j1115L4836
319B40196m0173l4912J2811J5896J9702j7667J4009k472k0381K9357j9078n1946
307A45342L3993Q964J4082L8949l5113k7651N552j9716J3852K0525K3659K3637
$$ plain form
393 191685 157975 179037 167543 214218 183107 190414 205313 203918 172132 188905 161315 194193
381 194193 229199 217874 207604 198287 234117 205654 212205 240368 232901 174606 180491 129364 169865
368 169865 223229 185981 151249 187590 198566 147477 173654 184594 197507 203082 193853 192186
356 192186 146646 125857 146218 156759 186570 155557 211817 232520 196164 178433 176811 179793
344 179793 163252 203446 235987 231445 178882 189843 186996 142599 135719 159920 240169 239819 232154
331 232154 276433 282065 264232 247447 195972 181329 169652 144795 206960 216475 205360 240196
319 240196 200023 165111 177922 193818 213520 195853 209862 207390 187009 216366 197288 145342
307 145342 179335 188299 202381 241330 206217 178566 184118 164402 178254 198779 222438 246075
295B46075n878m5410j6460M8955J813k7748J0978J7022o685l2877l4805j5296
283A39684k808q920J5778L5533j71o40k6746O2373L7651m6802J3584l297P795
270B23014k3619K7196m5085k1733N596N652Q2308K0202N056l9057k7926j8565
258A93039J4520K6516o492K2558K3418k1295l90J0378K8187m0015k9511k450M739
245B23202m5698Q499K3076r465J4812j9909n781j6272M7166J7968L1342k0139
233B48801o0362J8917L0678M189J4484k5739k5415R940M4027K7507k0947l0690
221B35390m7497q207J0164L8651k0605j7815L0098L2143j3655k857M400j4717
209B25493k921K0222P815n1287J7183O32k1121L1892J4579M662p452j3885r469
$$ plain form
295 246075 240197 194787 178327 227282 229095 201347 212325 229347 222662 189785 154980 139684
283 139684 136876 127956 143734 179267 179096 178456 151710 214083 251734 204932 218516 215219 223014
270 223014 199395 226591 181506 159773 165369 171021 253329 273531 278587 239530 211604 193039
258 193039 207559 234075 227583 250141 273559 252264 251874 262252 290439 250424 220913 218463 223202
245 223202 177504 186003 209079 199614 214426 194517 188736 172464 219630 237598 268940 248801
233 248801 188439 207356 238034 242223 256707 230968 205553 215493 259520 287027 266080 235390
221 235390 187893 179686 189850 228501 207896 190081 220179 252322 238667 235810 240210 225493
209 225493 222572 242794 250609 199322 216505 217137 196016 227908 242487 247149 239697 225812 216343
196B16343K9135k1835n8129O7017m4153L3384L4469l2496J7965J6170N8746j5324
184C01292k7412n970m4829j5988M1247K7694l2266K672m3849M526O9906j6015
172B61008m9098j9169J7011r419L1171R630j76J0547K271m3152j612M441P511
159B20964K2097R307N9562m4230j6722K3100m0325j4717L0367L162K8915L7266
147C18746k3347k291m9942o548L787m6367J1161J8211m060J2132n1686K1864J8943
134B20603J6522L6315j9522J4510M715O745k1854l4405j9533j2281M0594J1013
122B43422j091k9049j7527K0486J2285J3738j1670q41m063O853J6454l711N716
109B51002J5861l6087K189j2160j6145M2413M9006Q711j4128R28N651k496r092
$$ plain form
196 216343 245478 223643 165514 232531 188378 221762 256231 223735 241700 257870 316616 301292
184 301292 273880 267910 223081 207093 248340 276034 243768 246440 202591 207117 277023 261008
172 261008 211910 192741 209752 200333 231504 241134 240958 251505 253776 210624 209012 213453 220964
159 220964 243061 252368 311930 267700 250978 274078 233753 219036 249403 252565 281480 318746
147 318746 295399 293108 243166 236618 240405 194038 205199 223410 219350 231482 179796 201660 220603
134 220603 237125 273440 253918 268428 273143 279888 258034 223629 204096 191815 232409 243422
122 243422 242331 213282 195755 216241 228526 242264 230594 229753 225690 232543 248997 245286 251002
109 251002 266863 230776 232965 220805 204660 247073 296079 304790 290662 291590 297241 294745 285653
96B85653l086J9436k6484n141K768k0840J9342j1638r299n450N641K4105k1070
83B53937P032k4527M05L7733j4029R765K236q066J8657L092k9791J7302L568K8564
69C05878J4357k1575l7969P983j1832j9214O034j0106N2167k5093m6542J4866
57B28954M8653m859j6952J0436k625k839m4759K4337q385r527L8982K6831j5041
44B73206l702n661j8861j4706J0053J9922K0624r307L1668K9073j6057j3851l1521
31B70880K2161k92l4588J8578j5914o488L5343k20J3907k6378L448r799l43M957
17B75252K313k8354N6186l284l4307L87r404K2910P713k070l6819J4827J5844
4B81194Q767N319k3912j1774
$$ plain form
96 285653 282567 302003 275519 270378 273146 252306 271648 260010 250711 245261 250902 275007 253937
83 253937 260969 236442 236847 274580 260551 270316 272552 264486 283143 286235 256444 273746 277314 305878
69 305878 320235 298660 260691 268674 256842 237628 243662 233556 285723 260630 214088 228954
57 228954 277607 272748 255796 266232 263607 260768 216009 240346 231961 222434 261416 288247 273206
44 273206 269504 263843 244982 230276 240329 260251 280875 271568 303236 332309 316252 302401 270880
31 270880 293041 292749 258161 276739 260825 254337 289680 289460 303367 276989 280437 270638 270295 275252
17 275252 277565 249211 305397 302113 267806 268193 258789 281699 289412 287342 250523 265350 281194
4 281194 289961 295280 271368 259594
0B59594
$$ plain form
0 259594
$$ Imaginary data points
##PAGE= N=2
##DATA TABLE= (X++(I..I)), XYDATA
16383a598372l59K2466L0167j9365O8373K7747M8668N7316K1279J3218J4397m27
16371a314892L3231M7063M7228M7520m429M5946K9833J8047M9859L1001J1411
16360i58182M2542M3610K1979J6698M9016L7899j0268L9687L4775J1770K6418
16349f44056j0201J0395N4634L7041L3762L1128J0256K4257P5603K9576M362J8023
16337c25220L3594M3198L0652L8084L1592K7631P726K8123L674j0096L0040L7400
16325b3602L353O3773J4861L3427q676J6838L3407N6584J8028L2366N2922J5363
16313C08644J1734J479J9768L5536L6542R10L9930q367O6690K9309M3730J4253
16301F00158j0070L4576k2442N3228J6782M8475K3922k759M5199K590J322L5740
$$ plain form
16383 -1598372 -1598731 -1576265 -1546098 -1565463 -1497090 -1469343 -1420675 -1363359 -1342080 -1328862 -1314465 -1314892
16371 -1314892 -1281661 -1234598 -1187370 -1139850 -1144279 -1098333 -1068500 -1050453 -1000594 -969593 -958182
16360 -958182 -915640 -872030 -850051 -833353 -784337 -746438 -756706 -717019 -682244 -670474 -644056
16349 -644056 -654257 -643862 -589228 -552187 -518425 -487297 -477041 -452784 -377181 -347605 -343243 -325220
16337 -325220 -291626 -248428 -217776 -179692 -148100 -120469 -112743 -84620 -80946 -91042 -61002 -23602
16325 -23602 -20249 43524 58385 91812 83136 99974 133381 189965 207993 240359 293281 308644
16313 308644 320378 321857 341625 377161 413703 414613 454543 446176 512866 542175 585905 600158
16301 600158 590088 624664 602222 655450 672232 720707 744629 741870 787069 789659 790981 826721
16289H26721N4120K8675L9263J8314j019N5061L3513Q769p858m7275P0611M7056
16277A125951K1947K2478L0790k4779R75P6157j0812J7649N6740M29N4108J1127
16265A382760k3490L9029J5619k8527N6403o62J1311J2645L3883M4809L248K4186
16253A571214J1733J3725K1927l73O0797K2843P826L7692J3087J6550M5411j4824
16241A807608k7807O895L1429J7188K9065J4932J1925l3187J2097M0106J3989
16230A924240K8394M3652K639O550j8888K00O9990j3794K7934L1702L8161l8512
16218B102268K549j9434N0750J5325L764j8681N815J3371L9512J3272j1663o278
16206B190570L3149J4436k2299J9919O5941M217l731K173l5801J8330L6395N454
$$ plain form
16289 826721 880841 909516 948779 967093 966074 1021135 1054648 1063417 1055559 1008284 1078895 1125951
16277 1125951 1147898 1170376 1201166 1176387 1177362 1253519 1242707 1260356 1317096 1317525 1371633 1382760
16265 1382760 1359270 1398299 1413918 1385391 1441794 1441132 1452443 1465088 1498971 1543780 1547028 1571214
16253 1571214 1582947 1596672 1618599 1618226 1679023 1701866 1709692 1747384 1760471 1777021 1822432 1807608
16241 1807608 1779801 1786696 1818125 1835313 1864378 1879310 1891235 1858048 1870145 1910251 1924240
16230 1924240 1952634 1996286 1998925 2005475 1986587 1986787 2056777 2042983 2070917 2102619 2140780 2102268
16218 2102268 2104817 2085383 2136133 2151458 2155222 2136541 2142356 2155727 2195239 2208511 2196848 2190570
16206 2190570 2223719 2238155 2215856 2235775 2301716 2305933 2302202 2304375 2268574 2286904 2323299 2328753
16194B328753K9683O3763j8566J9743J0915r2142L2160J07102P287r0643p353
16183B390702M2147K8116P480J2835J3928L1712L8668m9602j3720J8850K6408
16172B547524L8754m384k40k1412l094N1266k3143o307K3332J3002j8732M4615
16160B641181J3698j9599k467k0001k0328o119N6634j1199j4858M6039L6225J4892
16148B714098k9510L5052Q478j6474O702J4347Q588k7143j5748M3792L3802j9287
16136B756697M0213k162k7143q431P095L0065K3146N174m2216m341j5699J4723
16124B777121L5347j5829k6951K4675j0836k7262L1515L4741l0924j0917J7143
16113B797823j5147j8058j3582J6094M8612J8890K9130N7561n5604l0142K332
$$ plain form
16194 2328753 2358436 2422199 2403633 2423376 2434291 2342149 2374309 2481411 2488698 2398055 2390702
16183 2390702 2432849 2460965 2468445 2481280 2495208 2526920 2565588 2515986 2502266 2521116 2547524
16172 2547524 2586278 2581894 2581654 2560242 2557148 2608414 2585271 2578964 2602296 2615298 2596566 2641181
16160 2641181 2654879 2635280 2632813 2612812 2592484 2586365 2642999 2631800 2616942 2662981 2699206 2714098
16148 2714098 2684588 2719640 2728118 2711644 2718346 2732693 2741281 2714138 2698390 2742182 2775984 2756697
16136 2756697 2796910 2794748 2767605 2759174 2766269 2796334 2819480 2824654 2782438 2778097 2762398 2777121
16124 2777121 2812468 2796639 2769688 2794363 2783527 2756265 2787780 2822521 2791597 2780680 2797823
16113 2797823 2782676 2764618 2751036 2767130 2815742 2834632 2863762 2921323 2865719 2835577 2837909
16102B837909j7380J6015M5962j4114K16L1099k8118j3412Q280N4309J5091k0675
16090B915182j0286p669j7887k3960J8509J9044J0829P738l0877L5098k1066j4696
16078B879959K1370k1553R397j5272O614L6143m098j3891n2302M3315N2465j7967
16066B924180Q1645l0624n0791K9970l8153m102o541j5006o495N542K5135l2897
16054B881863M0520P783l5057K8209K2810k0144k1399l3413q374K5537R450K4497
16042B922282k908L4926m5290l6201J4699N979M1551J0948R134K3998N2281n5199
16030B976200p4209O747R740L920J1722N4894R810k2782r636k8452n1328O332
16018B892958L3058j3860L772J971j5999M0380q166k9588N078J9041J351k3809
$$ plain form
16102 2837909 2820529 2836544 2882506 2868392 2868608 2899707 2871589 2858177 2866457 2920766 2935857 2915182
16090 2915182 2904896 2897227 2879340 2855380 2873889 2892933 2903762 2911500 2880623 2915721 2894655 2879959
16078 2879959 2901329 2879776 2889173 2873901 2880515 2916658 2912560 2898669 2846367 2889682 2942147 2924180
16066 2924180 3005825 2975201 2924410 2954380 2916227 2912125 2905584 2890578 2884083 2889625 2914760 2881863
16054 2881863 2922383 2930166 2895109 2923318 2946128 2925984 2904585 2871172 2862798 2888335 2897785 2922282
16042 2922282 2919374 2954300 2909010 2872809 2887508 2893487 2935038 2945986 2955120 2979118 3031399 2976200
16030 2976200 2901991 2908738 2918478 2922398 2934120 2989014 2998824 2976042 2966406 2937954 2886626 2892958
16018 2892958 2926016 2912156 2915928 2917899 2901900 2942280 2934114 2904526 2909604 2928645 2929996 2906187
16006B906187j6702n804L0436K8053L315J1346L4636L541n0970j1909j7706n050
15994B909373L2377k6534l260l365J6622K0944j793L031Q770j1493L2815Q713
15982B986200J0546k906m4P870l5317k2554l3391O557K2076q022K8248k7490q187
15969B923586L8259R23l0144k9386k453N2850k3628p31L6830o0116k4157P4070
15957B955903N8536j6049j8273K473j4887m9277L885K9484J0408M067K087j5380
15945B952977j2798j2410K9210k9355k875m3J0458J3519k5253M1329j0132j6046
15933B938581j3470L4478J0368J8458l8493j5180K0323L3405j3595q4507N818
15922B896186K5223N2694n6137p946N9485L4218n4247k2241M4130L2690l0836
$$ plain form
16006 2906187 2889485 2883681 2914117 2942170 2945485 2956831 2991467 2995008 2944038 2932129 2914423 2909373
15994 2909373 2941750 2915216 2911956 2908591 2925213 2946157 2944364 2947395 2956165 2944672 2977487 2986200
15982 2986200 2996746 2993840 2993796 3001666 2966349 2943795 2910404 2916961 2939037 2931015 2959263 2931773 2923586
15969 2923586 2961845 2962768 2932624 2903238 2900785 2953635 2930007 2929276 2966106 2905990 2881833 2955903
15957 2955903 3014439 2998390 2980117 2982590 2967703 2918426 2922311 2951795 2962203 2966270 2968357 2952977
15945 2952977 2940179 2927769 2956979 2927624 2924749 2924706 2935164 2948683 2923430 2964759 2954627 2938581
15933 2938581 2925111 2959589 2969957 2988415 2949922 2934742 2955065 2988470 2974875 2890368 2896186
15922 2896186 2921409 2974103 2917966 2910020 2969505 3003723 2949476 2927235 2971365 3004055 2973219
15911B973219o983J711n8838j266J3064n111N648k2133j7839N0666P5590o4513
15899B943215P249k580j5539j526J3032J338k6841K0081M3357j337l7461N1138
15887B994126l0491M0551L25r5111j5640J18069J6816n8275n7338l4090l8421
$$ plain form
15911 2973219 2966236 2967947 2909109 2907843 2920907 2915796 2921444 2899311 2881472 2932138 3007728 2943215
15899 2943215 2950464 2947884 2932345 2930819 2943851 2945189 2918348 2938429 2981786 2980449 2942988 2994126
15887 2994126 2963635 3004186 3004511 2909400 2893760 3011829 3028645 2970370 2913032 2878942 2840521
$$ [...]
##END NTUPLES=NMR SPECTRUM
##END=
