##TITLE=1H_CA-8993-1
 CDCl3
 8 sc, 
 17.03.2022
##JCAMPDX= 6.0         $$ Bruker NMR JCAMP-DX V2.0
##DATA TYPE= NMR SPECTRUM
##DATA CLASS= NTUPLES
##ORIGIN= UXNMR, Bruker Analytische Messtechnik GmbH
##OWNER= root
$$ XWIN-NMR		Version 3.5
$$ Fri Mar 18 10:56:47 2022 Russian Standard Time (UT+4h)  she@DPX200
##.OBSERVE FREQUENCY= 200.131346
##.OBSERVE NUCLEUS= ^1H
##.ACQUISITION MODE= SIMULTANEOUS
##.ACQUISITION SCHEME= undefined
##.AVERAGES= 8
##.DIGITISER RES= 18
##SPECTROMETER/DATA SYSTEM= spect
##.PULSE SEQUENCE= zg30
##.SOLVENT NAME= CDCl3
##.SHIFT REFERENCE= (INTERNAL, CDCl3, 0, 15.7182)
##AUDIT TRAIL= $$ (NUMBER, WHEN, WHO, WHERE, WHAT)
$$ ##TITLE= Audit trail, XWIN-NMR		Version 3.5
$$ ##JCAMPDX= 5.01
$$ ##ORIGIN= Bruker BioSpin GmbH
$$ ##OWNER= she
$$ F:/spectra/data/she/nmr/H-F/1/pdata/1/auditp.txt
$$ ##AUDIT TRAIL=  $$ (NUMBER, WHEN, WHO, WHERE, WHAT)
(   1,<2022-03-18 10:54:22.17 +0400>,<she>,<DPX200>,
      <created by zg, POWCHK disabled, PULCHK disabled
       configuration hash MD5:
       00 E9 B6 7A A2 85 ED C7 34 08 36 98 17 FE 4E 26
       data hash MD5: 16K
       78 5B E4 DA 82 4C E5 A1 C9 5F 2B 92 EB 5C 04 C4>)
(   2,<2022-03-18 10:54:24.48 +0400>,<she>,<DPX200>,
      <Start of raw data processing
       efp BC_mod = 2 LB = 0.24 FT_mod = 6 PKNL = 1 PHC0 = -17310.92 PHC1 = 12.40078 SI = 16K 
       data hash MD5: 16K
       B8 0D A7 4A DF 97 B0 36 8D C8 E2 07 35 DB D7 E3>)
(   3,<2022-03-18 10:54:46.46 +0400>,<she>,<DPX200>,
      <pk PHC0 = 5.025584 PHC1 = -5.4 
       data hash MD5: 16K
       B2 7A E2 FE 17 03 78 8C 5E 12 D5 D9 5A 50 73 46>)
(   4,<2022-03-18 10:54:49.62 +0400>,<she>,<DPX200>,
      <abs ABSG = 5 
       data hash MD5: 16K
       4F B1 36 5C 63 E9 A6 CC F8 99 1D AA 67 C2 78 F0>)
(   5,<2022-03-18 10:55:28.06 +0400>,<she>,<DPX200>,
      <abs ABSG = 5 
       data hash MD5: 16K
       60 A5 35 E6 EB E8 56 87 4F 45 58 64 B4 CF E7 E8>)
$$ ##END=
$$ 
$$ hash MD5
$$ 8A 17 3D 8C 6B 23 E2 04 E8 18 19 02 EE 63 C2 6B
##$RELAX= 
##$RELAX= 
##$RELAX= 
##$RELAX= 
##$RELAX= 
##$RELAX= 
$$ Bruker specific parameters
$$ --------------------------
##$DU= <F:/spectra>
##$EXPNO= 1
##$NAME= <H-F>
##$PROCNO= 1
##$TYPE= <nmr>
##$USER= <she>
##$AMP= (0..31)
100 100 100 100 100 100 100 100 100 100 100 100 100 100 100 100 100 100 
100 100 100 100 100 100 100 100 100 100 100 100 100 100 
##$AQSEQ= 0
##$AQ_mod= 1
##$AUNM= <au_zg>
##$AUTOPOS= <>
##$BF1= 200.13
##$BF2= 200.13
##$BF3= 200.13
##$BF4= 200.13
##$BF5= 200.13
##$BF6= 200.13
##$BF7= 200.13
##$BF8= 200.13
##$BYTORDA= 1
##$CFDGTYP= 0
##$CFRGTYP= 5
##$CHEMSTR= <none>
##$CNST= (0..31)
1 1 145 1 1 1 1 1 1 1 1 1 1 1 1 1 1 1 1 1 1 1 1 1 1 1 1 1 1 1 1 1 
##$CPDPRG= <>
##$CPDPRG1= <>
##$CPDPRG2= <>
##$CPDPRG3= <>
##$CPDPRG4= <mlev>
##$CPDPRG5= <mlev>
##$CPDPRG6= <mlev>
##$CPDPRG7= <mlev>
##$CPDPRG8= <mlev>
##$CPDPRGB= <>
##$CPDPRGT= <>
##$D= (0..31)
0 1.2 0 0 0 0 0 0 0 0.06 0 0.03 0 0 0 0 0.0002 0 0 0 0 0 0 0 0 0 0 0 0 
0 0 0 
##$DATE= 1647586461
##$DBL= (0..7)
$$ [...]
##$SUBNAM2= <"">
##$SUBNAM3= <"">
##$SUBNAM4= <"">
##$SUBNAM5= <"">
##$SUBNAM6= <"">
##$SUBNAM7= <"">
##$SUBNAM8= <"">
##$SUBNAM9= <"">
##$SW= 18.0517287032376
##$SWIBOX= (0..15)
0 0 2 0 0 0 0 0 0 0 0 0 0 0 0 0 
##$SW_h= 3612.71676300578
##$TD= 16384
##$TD0= 1
##$TE= 0
##$TE2= 300
##$TE3= 300
##$TEG= 300
##$TL= (0..7)
0 120 120 120 120 120 120 120 
##$TP= (0..7)
150 150 150 150 150 150 150 150 
##$TP07= 0
##$TPNAME0= <>
##$TPNAME1= <>
##$TPNAME2= <>
##$TPNAME3= <>
##$TPNAME4= <>
##$TPNAME5= <>
##$TPNAME6= <>
##$TPNAME7= <>
##$TPOAL= (0..7)
0.5 0.5 0.5 0.5 0.5 0.5 0.5 0.5 
##$TPOFFS= (0..7)
0 0 0 0 0 0 0 0 
##$TUNHIN= 0
##$TUNHOUT= 0
##$TUNXOUT= 0
##$USERA1= <user>
##$USERA2= <user>
##$USERA3= <user>
##$USERA4= <user>
##$USERA5= <user>
##$V9= 5
##$VALIST= <valist>
##$VCLIST= <CCCCCCCCCCCCCCC>
##$VD= 0
##$VDLIST= <DDDDDDDDDDDDDDD>
##$VPLIST= <PPPPPPPPPPPPPPP>
##$VTLIST= <TTTTTTTTTTTTTTT>
##$WBST= 1024
##$WBSW= 4
##$XGAIN= (0..3)
0 0 0 0 
##$XL= 0
##$YL= 0
##$YMAX_a= 525524
##$YMIN_a= -1040384
##$ZGOPTNS= <>
##$ZL1= 120
##$ZL2= 120
##$ZL3= 120
##$ZL4= 120
##$ABSF1= 15.71824
##$ABSF2= -2.33361
##$ABSG= 5
##$ABSL= 3
##$ALPHA= 0
##$AQORDER= 0
##$ASSFAC= 0
##$ASSFACI= 0
##$ASSFACX= 0
##$ASSWID= 0
##$AUNMP= <proc_1d>
##$AZFE= 0.1
##$AZFW= 0.1
##$BCFW= 0
##$BC_mod= 2
##$BYTORDP= 0
##$COROFFS= 0
##$CY= -3
##$DATMOD= 1
##$DC= 0
##$DFILT= <>
##$DTYPP= 0
##$F1P= 0
##$F2P= 0
##$FCOR= 1
##$FTSIZE= 16384
##$FT_mod= 6
##$GAMMA= 0
##$GB= 0
##$INTBC= 1
##$INTSCL= 0
##$ISEN= 128
##$LB= 0.24
##$LEV0= 0
##$LPBIN= 0
##$MAXI= 10000
##$MC2= 0
##$MEAN= 0
##$ME_mod= 0
##$MI= 1.114404
##$NCOEF= 0
##$NC_proc= -6
##$NLEV= 6
##$NOISF1= 3.799351
##$NOISF2= 2.8
##$NSP= 0
##$NTH_PI= 0
##$NZP= 0
##$OFFSET= 15.71824
##$PC= 1
##$PHC0= -17305.89
##$PHC1= 7.00078
##$PH_mod= 1
##$PKNL= yes
##$PPARMOD= 0
##$PSCAL= 0
##$PSIGN= 0
##$REVERSE= no
##$SF= 200.130006665443
##$SI= 16384
##$SIGF1= 3
##$SIGF2= 2
##$SINO= 5.538805
##$SIOLD= 16384
##$SREGLST= <1H.CDCl3>
##$SSB= 0
##$STSI= 16384
##$STSR= 0
##$SW_p= 3612.71676300578
##$SYMM= 0
##$S_DEV= 0
##$TDeff= 16384
##$TDoff= 0
##$TI= <>
##$TILT= no
##$TM1= 0
##$TM2= 0
##$TOPLEV= 0
##$USERP1= <user>
##$USERP2= <user>
##$USERP3= <user>
##$USERP4= <user>
##$USERP5= <user>
##$WDW= 1
##$XDIM= 16384
##$YMAX_p= 349205831
##$YMIN_p= -849861
$$ End of Bruker specific parameters
$$ ---------------------------------
##NTUPLES= NMR SPECTRUM
##VAR_NAME=  FREQUENCY,     SPECTRUM/REAL,   SPECTRUM/IMAG
##SYMBOL=    X,             R,               I
##VAR_TYPE=  INDEPENDENT,   DEPENDENT,       DEPENDENT
##VAR_FORM=  AFFN,          ASDF,            ASDF
##VAR_DIM=   16384,         16384,           16384
##UNITS=     HZ,            ARBITRARY UNITS, ARBITRARY UNITS
##FACTOR=    0.220516191357247, 1,           1
##FIRST=     3145.69143278913, 0,            0
##LAST=      -467.025330216653, 0,           0
##MIN=       -467.025330216653, -849861,     0
##MAX=       3145.69143278913, 349205831,    0
$$ Real data points
##PAGE= N=1
##DATA TABLE= (X++(R..R)), XYDATA
$$ [...]
5520A5058281L1992Q2549P5313j26190q0013K181p6534n60q0516k9455k9758j1718
5508A4815572j7661p2703K7341j39113j45463q5135j06259j0537K6593R985p2045
5497A4230575n4012N9245o8495m4246m6836l0152o9504l7656N8581j41969L6967
5486A3892498j3354K669k6816l6377o9832J5932r1588Q9176J87543m7492j9374
5475A3882985L758R03O0130j0954j18159J30431k804p8534Q4743O984N5377J01647
5463A4116507R3335k68O2444N1970P7019R5139k326M7907J5414J25023N9022J39972
5451A4881158J69283J02086K38914J81192K7917J24488J31131P039P5328J77600
5441A6116136J29434Q4337O1138M5372J1916J14558K03609J66829J26698Q8495
$$ plain form
5520 15058281 15090273 15172822 15248135 15121945 15041932 15044113 14967579 14967019 14886503 14857048 14827290 14815572
5508 14815572 14797911 14725208 14752549 14613436 14467973 14382838 14276579 14266042 14292635 14302620 14230575
5497 14230575 14176563 14235808 14167313 14123067 14076231 14046079 13976575 13938919 13997500 13855531 13892498
5486 13892498 13879144 13881813 13854997 13818620 13748788 13764720 13673132 13762308 13949851 13902359 13882985
5475 13882985 13886743 13887646 13947776 13936822 13818663 13949094 13946290 13867756 13952499 13959483 14014860 14116507
5463 14116507 14209842 14209574 14272018 14323988 14401007 14496146 14493820 14541727 14557141 14682164 14741186 14881158
5451 14881158 15050441 15152527 15391441 15572633 15600550 15725038 15856169 15863208 15938536 16116136
5441 16116136 16245570 16329907 16391045 16436417 16448333 16562891 16766500 16933329 17060027 17148522
5431A7148522J09094K12141K93215J24146K33404K53990K03825L92573K61193
5422A9232103L24517L77889M43623L64229L51089M68443N45814M95150N29903
5413B3132760N84449O04383N41745N72986P29879O81567N68411O44086P30866
5404B8791132O74916Q47014P76622Q43970O29322O01419P95547O18802N92153
5395C5170897P31991P11765O66887Q16658Q58684R07001J147478J228663J416477
5386D3656501J514136J718672J908309K257156K418303K791552K999076L290731
5378F2554436L591085L790268L973182M158980M279808M234622M045838L737292
5370I4365511L342337K526824J647771M46931n73868j797973k677090l588649
$$ plain form
5431 17148522 17257616 17469757 17762972 17887118 18120522 18374512 18578337 18970910 19232103
5422 19232103 19556620 19934509 20378132 20742361 21093450 21561893 22107707 22602857 23132760
5413 23132760 23717209 24321592 24863337 25436323 26166202 26847769 27416180 28060266 28791132
5404 28791132 29466048 30313062 31089684 31933654 32562976 33164395 33959942 34578744 35170897
5395 35170897 35902888 36614653 37281540 38098198 38956882 39863883 41011361 42240024 43656501
5386 43656501 45170637 46889309 48797618 51054774 53473077 56264629 59263705 62554436
5378 62554436 66145521 69935789 73908971 78067951 82347759 86582381 90628219 94365511
5370 94365511 97707848 100234672 101882443 102329374 101755506 99957533 97280443 93691794
5362I3691794m181251m466163m590958m590851m500286m332285m248934l701027
5354E9080039l328853l166529k888689k614122k192397k189044k000427j634078
5346C9065900j555891j454980j325585j293569j124811r85740q79044q83989q09033
5337B8753258q30139q25552q03861n86047o67170p02792n50077o34064m39594
5328B2713962n41789m80180l96063l88270m07722m96437l60896l03300l61255
5319A8978050k33803k14653l38170k63143j92382j36213j59264l63112j81797
5310A6895513k32063r8612j14172k18350j72804j5413j01253p7622j40427p9013
5300A5645784j78003o9072j33922k25645j46957j35838k35041j30353j38917j21674
$$ plain form
5362 93691794 89510543 85044380 80453422 75862571 71362285 67030000 62781066 59080039
5354 59080039 55751186 52584657 49695968 47081846 44889449 42700405 40699978 39065900
5346 39065900 37510009 36055029 34729444 33435875 32311064 31325324 30446280 29562291 28753258
5337 28753258 27923119 27097567 26293706 25707659 25040489 24337697 23787620 23153556 22713962
5328 22713962 22172173 21691993 21295930 20907660 20499938 20003501 19642605 19339305 18978050
5319 18978050 18744247 18529594 18191424 17928281 17735899 17599686 17440422 17077310 16895513
5310 16895513 16663450 16564838 16450666 16232316 16059512 16044099 15942846 15865224 15724797 15645784
5300 15645784 15467781 15398709 15264787 15039142 14892185 14756347 14521306 14390953 14252036 14130362
5290A4130362l2941j31368j65359r3238n5523k48611j25112k39830O306J6843
5280A3061529j68586q1594r0672j54716r5272j01137j04687j66452j69540j95610
5270A1733263j66748m0200q5631j69627k10770p6127P2206k05044k5585n1953
5260A0773784J0009r3509n5491k2186q0513r6286P9915j6862p6139K5780k3813
5249A0424689k9868j2238r1803o452J34068n008N5174J05836j3582m4963J9234
5238A0535087Q5850M5483N287O2006j19193Q1208N1749n4482m0811J4366O4713
5227A0731263j26309k1236Q4310R6302K1490J24M8025o35K16069O5904K8322J25221
5215A1268850J27097J25233J94756K66679K32371J60161J80698L56788L46018
$$ plain form
5290 14130362 14097421 13966053 13800694 13707456 13651933 13403322 13278210 13038380 13044686 13061529
5280 13061529 12892943 12811349 12720677 12565961 12470689 12369552 12264865 12098413 11928873 11733263
5270 11733263 11566515 11526315 11440684 11271057 11060287 10984160 11056366 10851322 10825737 10773784
5260 10773784 10783793 10690284 10634793 10612607 10532094 10435808 10515723 10498861 10422722 10448502 10424689
5249 10424689 10394821 10382583 10290780 10284328 10418396 10413388 10468562 10574398 10560816 10515853 10535087
5238 10535087 10620937 10666420 10671707 10733713 10614520 10695728 10747477 10692995 10652184 10666550 10731263
5227 10731263 10604954 10583718 10668028 10764330 10785820 10785944 10833969 10833334 11049403 11115307 11143629 11268850
5215 11268850 11395947 11521180 11715936 11982615 12214986 12375147 12555845 12912633 13258651
5206A3258651L19833L28167L73883K28824M42792M15459M07413L06584K93387
5197A6374993M61255L20288K55302R7752K36433J88642J26029L1905J26410J88885
5187A8407894Q5653j5379j34919K6446o2778j18818l2807K0762o5975R4528K50263
5176A8454870J84193L57232L25211L96912L80770N43040N06221N94036M34381
5167B2176866M89269L78680K62478K36733J85062J96817L1146j01698q1415l09876
5157B3464062k70737l69001m46840l76607o45329o05805m75829n04461m48468
5148A9320985l29115m15761j46628k50142j51417M218o6548J5297R4186R0800
5138A8165875Q5795O6673M0660J48468l342j85657k0492n2001o6256l22009m13374
$$ plain form
5206 13258651 13578484 13906651 14280534 14509358 14952150 15367609 15775022 16081606 16374993
5197 16374993 16836248 17156536 17411838 17509590 17746023 17934665 18060694 18092599 18219009 18407894
5187 18407894 18493547 18478168 18343249 18369695 18306917 18188099 18155292 18176054 18110079 18204607 18454870
5176 18454870 18639063 18996295 19321506 19718418 20099188 20642228 21148449 21742485 22176866
5167 22176866 22666135 23044815 23307293 23544026 23729088 23925905 23957051 23855353 23773938 23464062
5157 23464062 23193325 22824324 22377484 22000877 21355548 20749743 20273914 19769453 19320985
5148 19320985 18991870 18576109 18429481 18179339 18027922 18032140 17965592 17980889 18075075 18165875
5138 18165875 18251670 18318343 18359003 18507471 18504129 18318472 18297980 18245979 18179723 17857714 17444340
5127A7444340k81135m11075n03313m75890n73962m69281n31120n45880l12812
5118A3339872k98827m49373l15228k62473j79382k38254l33806j80638j58909
5109A0922982j11423j55206j35073j61497j43338p9717m1279j45642j13654n1439
5099I784714n9213o627k0830j11909l4635n9705q082l9787j4776l6762j03067
5088I289321M7842j14308l9047O8853m2066O3148j5013o4642Q7391m3700l5586
5077I202193M6913l5376J8980K8002p2816Q2535O7018O0569J24770O6786J06561
5066I696135P729j52592j3442m8737k25207j39613n2593j27453K0209J4435j27589
5055H851282j58245M2400L9563r2020k9726p2890p0645J9889l0598j5596J0166
$$ plain form
5127 17444340 17163205 16752130 16248817 15772927 15198965 14729684 14198564 13652684 13339872
5118 13339872 13041045 12591672 12276444 12013971 11834589 11596335 11262529 11081891 10922982
5109 10922982 10811559 10656353 10521280 10359783 10216445 10136728 10095449 9949807 9836153 9784714
5099 9784714 9725501 9718874 9698044 9586135 9551500 9491795 9483713 9443926 9429150 9392388 9289321
5088 9289321 9337163 9222855 9183808 9252661 9210595 9273743 9258730 9194088 9281479 9237779 9202193
5077 9202193 9249106 9213730 9232710 9260712 9187896 9270431 9337449 9398018 9522788 9589574 9696135
5066 9696135 9703864 9551272 9537830 9489093 9263886 9124273 9071680 8944227 8964436 8978871 8851282
5055 8851282 8693037 8735437 8775000 8682980 8653254 8580364 8509719 8529608 8499010 8483414 8493580
5044H493580n3931O9728J7195M7313K1736m9501K1497O2229l1711k0927k6080
5033H551128M4624M9982M6865n564N272N9835o5557P1087J18854J23767J32850
5022I133143P7370J4052J29959J40345K02916J01009o0594m0918n6602R2090q0246
5011I652524J6336L617n6850K0989K3004p399O0141R2625O2623L9663p0263R1558
4999I928568N4585N8727J11027R8976J58279R9620M4746J8846J02391J81111J33797
4988A0990673J23883J05220J21540J58800J60588R6450J97291K25678K46552K55728
4978A2682403J80026J35984K41192K25936K03034L75982K74592J81250L57047
4969A4857446L97562K87598M50179M64383N00063O36420M44441N37447N90100
$$ plain form
5044 8493580 8439649 8509377 8526572 8573885 8595621 8546120 8567617 8629846 8598135 8577208 8551128
5033 8551128 8595752 8645734 8692599 8687035 8692307 8752142 8686585 8757672 8876526 9000293 9133143
5022 9133143 9210513 9224565 9354524 9494869 9697785 9798794 9738200 9697282 9640680 9732770 9652524
5011 9652524 9668860 9672477 9615627 9636616 9659620 9652221 9712362 9804987 9867610 9907273 9837010 9928568
4999 9928568 9983153 10041880 10152907 10251883 10410162 10509782 10554528 10573374 10675765 10856876 10990673
4988 10990673 11114556 11219776 11341316 11500116 11660704 11757154 11954445 12180123 12426675 12682403
4978 12682403 12862429 12998413 13239605 13465541 13668575 14044557 14319149 14500399 14857446
4969 14857446 15255008 15542606 15992785 16457168 16957231 17593651 18038092 18575539 19165639
4960A9165639O90341P22318M86885M44307M19081L64007L11378J82297J87906
4951B2974159J22458J22048J09414N5127R9577p3926M8884n3313R0000J60968
4941B3655396M9903J14670J57114K15597K55096L09897L97851L58677M28713M38364
4931B6381278L49655L63246M09936K89857J91092j9647p7210P136o9594j25674
4921B7700075k02537k93501l78130l11670l60951m07776m08915n08140n06212
4912B4322243m90869l91250l53794l02567j74499k26799k24461j54533M0608J19895
4902B2163974P3374j388n5972M5008J08602N5291Q6848R1738j7311j47525m3156
4891B2359483j30368k20876k15888l34672l38184k35753k24473j79935k96363
$$ plain form
4960 19165639 19855980 20578298 21065183 21509490 21928571 22292578 22603956 22786253 22974159
4951 22974159 23096617 23218665 23328079 23383206 23482783 23408857 23457741 23404428 23494428 23655396
4941 23655396 23705299 23819969 23977083 24192680 24447776 24757673 25155524 25514201 25942914 26381278
4931 26381278 26730933 27094179 27504115 27793972 27985064 27965417 27888207 27895343 27825749 27700075
4921 27700075 27497538 27204037 26825907 26514237 26153286 25745510 25336595 24828455 24322243
4912 24322243 23831374 23440124 23086330 22783763 22609264 22382465 22158004 22003471 22044079 22163974
4902 22163974 22237348 22235960 22179988 22224996 22333598 22388889 22475737 22567475 22550164 22402639 22359483
4891 22359483 22229115 22008239 21792351 21457679 21119495 20883742 20659269 20479334 20182971
4882B0182971k45730k19662j49064j77698r4300k9465o646l8748j41798L2829
4872A9112689j01066M0145n7834R308K1506L38J27062J04306K3576K2264Q2814
4861A9385108n1862M3601P5719J27319J04928l9925K4505n1280k3354J945r4451
4850A9502253n1093j7517n4428M1021N0191J6761j42505j18731Q0536O0026Q5239
4839A9451753k0688J587j71191o6272j54008n7823O3396m4602J80691J05692L788
4828A9292323N3334J6510j20765j11575J8110K9662O2868R5267M6762q46l340
4817A9378310L3356Q6025R9707M13P2538K22341J99069K60332K87674J63802L68278
4806B1171845M58293M13033M05042L77190L71425L92309L59669K71996L02306
$$ plain form
4882 20182971 19937241 19717579 19568515 19390817 19296517 19267052 19260406 19221658 19079860 19112689
4872 19112689 19011623 19051768 18993934 19003242 19024748 19025086 19152148 19256454 19280030 19302294 19385108
4861 19385108 19333246 19376847 19452566 19579885 19684813 19644888 19669393 19618113 19594759 19596704 19502253
4850 19502253 19451160 19433643 19379215 19420236 19470427 19487188 19344683 19225952 19306488 19366514 19451753
4839 19451753 19431065 19432652 19261461 19195189 19041181 18983358 19046754 19002152 19182843 19288535 19292323
4828 19292323 19345657 19362167 19241402 19129827 19147937 19177599 19240467 19335734 19382496 19381650 19378310
4817 19378310 19411666 19497691 19597398 19597811 19670349 19892690 20091759 20352091 20639765 20803567 21171845
4806 21171845 21630138 22043171 22448213 22825403 23196828 23589137 23948806 24220802 24523108
4797B4523108K24667K50683L16052M01650K95378J91919M20929M44726M83327
4788B7552439N20228O47604O92712P15180Q05558Q84451R26170R64763J020376
4779C4729481J110749J102101J176371J293193J393420J569476J662852J767052
4771D5804695J976507K344094K675392K975275L390100M008204M945853O162515
4763G4282635P512722R197635J1329813J3653661J5858741J6409203J3819570
4756A62063980Q102288p9804q028598j3885372j6146399j5544139j3594273j0776618
4748I2111065q328748o507832n138474m172481l250382k498652k096397j794455
4740E8323644j235462q97797p20733m67450j09601Q2355J05378K63755L32291
$$ plain form
4797 24523108 24747775 24998458 25314510 25716160 26011538 26203457 26624386 27069112 27552439
4788 27552439 28072667 28720271 29412983 30128163 30933721 31818172 32744342 33709105 34729481
4779 34729481 35840230 36942331 38118702 39411895 40805315 42374791 44037643 45804695
4771 45804695 47781202 50125296 52800688 55775963 59166063 63174267 68120120 74282635
4763 74282635 81795357 90992992 102322805 115976466 131835207 148244410 162063980
4756 162063980 170166268 170086464 162057866 148172494 132026095 116481956 102887683 92111065
4748 92111065 83782317 77274485 72136011 67963530 64713148 62214496 60118099 58323644
4740 58323644 57088182 56190385 55469652 55002202 54892601 54974956 55080334 55344089 55676380
4731E5676380L83482M27355L80137K93315N54026O94815P64144P73787R95603
4722F0943044J356593J625411J973455K467142K883937L182981L953707M739779
4714H3126049N681023O790350Q396295J0345901J2523432J4685426J5705427J4394309
4706A71648212J0170087L900193k972160r702991j4485248j5829583j5046193
4699A27682317j2973697j0470356q086835o248219n041444m019026l149789k675964
4691G5016987k322775j803605j408956j291255j208887j072397r55770j004213
4683F3949129q62284o47354n99501o12512m79363k75412j32114k01936l64191
4674E9774462l26975l57377n44066m53637n38368m55888m70103l41778k57035
$$ plain form
4731 55676380 56059862 56487217 56867354 57160669 57714695 58409510 59173654 59947441 60943044
4722 60943044 62299637 63925048 65898503 68365645 71249582 74432563 78386270 83126049
4714 83126049 88807072 95597422 103993717 114339618 126863050 141548476 157253903 171648212
4706 171648212 181818299 185718492 182746332 173043341 158558093 142728510 127682317
4699 127682317 114708620 104238264 96151429 89903210 84861766 80842740 77692951 75016987
4691 75016987 72694212 70890607 69481651 68190396 66981509 65909112 64953342 63949129
4683 63949129 63086845 62439491 61839990 61227478 60748115 60472703 60340589 60138653 59774462
4674 59774462 59447487 59090110 58546044 58092407 57554039 57098151 56628048 56286270 56029235
4665E6029235j21210j42118j44704L5601L07600L10306L41518M62224N86824P78283
4655E8443559P48379Q49061O44970N71014P26807N45546M13394M02155J90335
4646F3535220K33382K19858L02609M28246M79536O51110P43996J067358J183402
4637F8844717J110248J271879J289774J255395J192051J087650R41420Q63551
4629G7856685P58846O53853N84188O43702O97108P15129Q93518R80020J054615
4620H4837664J319001J393066J680379K005075K083425K461521K607238K605884
4612A00993253K836404K619354K685057K476492K114960J870184J424105J031408
4604A18051217Q30808Q09076Q44536Q46623J088983J314142J630982J735325J742964
$$ plain form
4665 56029235 55908025 55765907 55621203 55656804 55964404 56274710 56616228 57078452 57665276 58443559
4655 58443559 59191938 60040999 60685969 61256983 61983790 62529336 62942730 63344885 63535220
4646 63535220 63768602 63988460 64291069 64719315 65198851 65849961 66593957 67661315 68844717
4637 68844717 69954965 71226844 72516618 73772013 74964064 76051714 76993134 77856685
4629 77856685 78615531 79269384 79853572 80497274 81194382 81909511 82803029 83783049 84837664
4620 84837664 86156665 87549731 89230110 91235185 93318610 95780131 98387369 100993253
4612 100993253 103829657 106449011 109134068 111610560 113725520 115595704 117019809 118051217
4604 118051217 118882025 119691101 120535637 121382260 122471243 123785385 125416367 127151692 128894656
4595A28894656J724719J706106J592134J386614R94381P69984M87175Q2774k66299
4586A37372244m97055o54082r09430j136583j288261j397482j525919j616108
4578A28347324j733895j798072j985085j893852j972880k025051j920084j980053
4570A13038352j781755j739997j608628j531304j574473j528800j495679j491943
4562A00285773j460224j529347j502642j420255j469666j595626j566171j427363
4554H8314479j636020j547966j535005j621764j496192j438495j220256j177020
4546G6641761j301682j120442j087354j035684r54888q53079q68876r32727q73123
4537F7613906q57813p92794p53760q31422p74473o74036o22961p78561o86108
$$ plain form
4595 128894656 130619375 132325481 133917615 135304229 136298610 137068594 137555769 137638543 137372244
4586 137372244 136875189 136221107 135311677 134175094 132886833 131489351 129963432 128347324
4578 128347324 126613429 124815357 122830272 120936420 118963540 116938489 115018405 113038352
4570 113038352 111256597 109516600 107907972 106376668 104802195 103273395 101777716 100285773
4562 100285773 98825549 97296202 95793560 94373305 92903639 91308013 89741842 88314479
4554 88314479 86678459 85130493 83595488 81973724 80477532 79039037 77818781 76641761
4546 76641761 75340079 74219637 73132283 72096599 71141711 70288632 69419756 68487029 67613906
4537 67613906 66756093 65963299 65209539 64378117 63603644 62929608 62306647 61528086 60841978
4528F0841978q52243p44648p19588p21614p88594q61699p95221o25502o83047
4519E4049822p99585p10282n99592n90569o56607o06200n93079m96773m19410
4510D8577725m34033m52515m59901l61472l63140l17286k25159k92382l81221
4501D5290616j85781k21726k75624k59595l19757j74421k27344n3047j04394j50447
4491D3318480j17643j55158o5973J8328j58518r0610l1434O555m2225J2592Q3113
4480D2777507J03047J02981J22358M4638J76692J02489J65202K89063J58617K40257
4470D4282851K75485L18480K34688K51680M68825M87134M97165N23545P31192
4461D8071045O77399N56274N82881M33606M16664J90995M18800P22474P35862
$$ plain form
4528 60841978 59989735 59245087 58525499 57803885 57015291 56153592 55358371 54732869 54049822
4519 54049822 53250237 52539955 51940363 51349794 50693187 50086987 49493908 48997135 48577725
4510 48577725 48143692 47691177 47231276 46869804 46506664 46189378 45964219 45671837 45290616
4501 45290616 45104835 44883109 44607485 44347890 44028133 43853712 43626368 43573321 43468927 43318480
4491 43318480 43200837 43045679 42979706 42998034 42839516 42748906 42717472 42724027 42681802 42694394 42777507
4480 42777507 42880554 42983535 43105893 43150531 43327223 43429712 43594914 43883977 44042594 44282851
4470 44282851 44558336 44876816 45111504 45363184 45832009 46319143 46816308 47339853 48071045
4461 48071045 48748444 49304718 49887599 50321205 50737869 50928864 51347664 52070138 52806000
4452E2806000P44974J009751J045826J039871Q44465O46773N03593M57096J43314
4443E9241663L26828N54121N35664Q29726R36102J038340R49121R51092P89046
4434F6151703O63182P10348Q08721Q83201J138904J401228J524688J717037J774888
4425G6773900J787838J877845J724724J884139K082133K234733K816624L326676
4417I4508612L764104M304914N084384N666387O419518P266613Q217320R550298
4409A44782150J0844879J1920884J2866505J3106935J1717500Q853417M242146
4402B18334416j030248n973550r897155j1934241j2332176j1651112j0276304
4395A55239630q843196p676258o562354n718888n087063m366672l956999l729857
$$ plain form
4452 52806000 53550974 54560725 55606551 56646422 57490887 58137660 58641253 59098349 59241663
4443 59241663 59568491 60122612 60658276 61488002 62424104 63462444 64411565 65362657 66151703
4434 66151703 66814885 67525233 68333954 69217155 70356059 71757287 73281975 74999012 76773900
4425 76773900 78561738 80439583 82164307 84048446 86130579 88365312 91181936 94508612
4417 94508612 98272716 102577630 107662014 113328401 119747919 127014532 135231852 144782150
4409 144782150 155627029 167547913 180414418 193521353 205238853 214092270 218334416
4402 218334416 217304168 211330618 201433463 189499222 177167046 165515934 155239630
4395 155239630 146396434 138720176 132157822 126438934 121351871 116985199 113028200 109298343
4387A09298343l432403l324069l190604l017796k884891k918698k684227k533426
4379H5312229k309888k219251k030242j764415j763128j566142j561814j420207
4371G0677142j487817j442600j423793j375746j309754j124232j244580j147780
4363F0120840q43555p95873r07767q00295o72083n91115o62945n86491m79903
4354E3780813m10065l50033l58065l87261k88369j90838j97687j62947k69852
4345E1165696k50365j80593j54910k10008k70572k00650k54482j97171j59463
4336D9287482k64221k24255l07130k19517l19202l15059l40601l74288l79370
4327D6543839l76755l97020l66053l92943k80129l77243l11091l76558k20363
$$ plain form
4387 109298343 105865940 102541871 99351267 96333471 93448580 90529882 87845655 85312229
4379 85312229 83002341 80783090 78752848 76988433 75225305 73659163 72097349 70677142
4371 70677142 69189325 67746725 66322932 64947186 63637432 62513200 61268620 60120840
4363 60120840 59277285 58481412 57573645 56773350 56101267 55510152 54847207 54260716 53780813
4354 53780813 53370748 53020715 52662650 52275389 51987020 51796182 51598495 51435548 51165696
4345 51165696 50915331 50734738 50579828 50369820 50099248 49898598 49644116 49446945 49287482
4336 49287482 49023261 48799006 48491876 48272359 47953157 47638098 47297497 46923209 46543839
4327 46543839 46167084 45770064 45404011 45011068 44730939 44353696 44042605 43666047 43445684
4318D3445684j26726l06958j80083k38675j90807j85863r1176j04657r6534j49221
4308D1774984o8096p5199L006q5466j12515o8606l6639j1021j29191P006J5569
4297D1213832j76440q1490k0772n7973k156p6834p3937k18178m9217k02071j44624
4286D0110140q9594j26815k88184n3243r5386O4633M0893k5394P728P3114O0565
4275C9678457j2803J03785J50184N4057j8280N2580J50596O5430j2755K3198m3720
4264D0190729p9458o3149Q6394K1767k3867j48815N3688J09184K4466P1860J49029
4253D0391828J45855K17579J37888k7642l297J45478R4094J34308M9223J97117
4243D1482431J74220K37973K52612J85681P4342J80724L74141R5386J02593J71585
$$ plain form
4318 43445684 43318958 43012000 42831917 42593242 42402435 42216572 42125396 42020739 41924205 41774984
4308 41774984 41706888 41631689 41634695 41549229 41436714 41368108 41331469 41320448 41191257 41198263 41213832
4297 41213832 41037392 40955902 40935130 40877157 40875001 40798167 40724230 40506052 40456835 40254764 40110140
4286 40110140 40020546 39893731 39605547 39552304 39456918 39521551 39562444 39537050 39544778 39617892 39678457
4275 39678457 39665654 39769439 39919623 39973680 39955400 40007980 40158576 40224006 40211251 40234449 40190729
4264 40190729 40111271 40048122 40134516 40156283 40132416 39983601 40037289 40146473 40170939 40242799 40391828
4253 40391828 40537683 40755262 40893150 40865508 40862211 41007689 41101783 41236091 41285314 41482431
4243 41482431 41656651 41894624 42147236 42332917 42407259 42587983 42962124 43057510 43160103 43331688
4233D3331688J50293J41736P4732M7410K5060n631P8896l3314l6460K00871K2396
4222D3997677K05098K00873K16597L61761L60461L77950M07253N23680N27610
4213D7178960L58255L59171K70691K76430K49137J84698J34910J60009K05430
4204D9377691O0885K24587J62720J28614J69316J35575L10607K88947K11751K78838
4194E1349531L15649L38555L85760M74696N61366O01376M72111N30183N14719
4185E5543946L83039L47243L64797K00892K31035Q9862j18803k84819l65672m09831
4175E5981689m75734o67020n28745m90444n64888n48784l71356l77909l18780
4166E1638029j80646l00989q1910n6594o23j98186j51538l30133m31697l38879
$$ plain form
4233 43331688 43481981 43623717 43698449 43745859 43770919 43765288 43844184 43810870 43774410 43975281 43997677
4222 43997677 44202775 44403648 44620245 44982006 45342467 45720417 46127670 46651350 47178960
4213 47178960 47537215 47896386 48167077 48443507 48692644 48877342 49012252 49172261 49377691
4204 49377691 49438576 49663163 49825883 49954497 50123813 50259388 50569995 50858942 51070693 51349531
4194 51349531 51665180 52003735 52389495 52864191 53425557 54026933 54499044 55029227 55543946
4185 55543946 55926985 56274228 56639025 56839917 57070952 57160814 57042011 56757192 56391520 55981689
4175 55981689 55505955 54838935 54310190 53819746 53254858 52706074 52334718 51956809 51638029
4166 51638029 51457383 51156394 51074484 51017890 51017267 50819081 50667543 50337410 49905713 49566834
4156D9566834m04707m99463m31127m26197o44682o81223n54983m53668o27101
4147D4843683o77991n58156m37106l42378l58241l45942k70319j59301k77716
4138D1416533j98506j00371l06305k44978j81721j76774q3878j23376q0614j41556
4128C9778454p0218J7335O7406J09844J14479K05979K26972K20028J48957L71654
4118D1190890J67335P2707N0213J11875j11391k61090k20212l52431n52861m50723
4108C9644312j98626k81414k46802j56506k00391o5152k3223q7828P284O4423
4098C8456077J29382P1029k501J8674l2905L3278q1980o0682K4212J54692R0367
4087C8799643P7905J20894J25005L21298K37217L59009J42692K07196M00373K41254
$$ plain form
4156 49566834 49162127 48662664 48231537 47805340 47160658 46479435 45924452 45470784 44843683
4147 44843683 44165692 43607536 43170430 42828052 42469811 42123869 41853550 41694249 41416533
4138 41416533 41218027 41117656 40811351 40566373 40384652 40207878 40124000 40000624 39920010 39778454
4128 39778454 39708236 39725571 39792977 39902821 40017300 40223279 40450251 40670279 40819236 41190890
4118 41190890 41358225 41430932 41481145 41593020 41481629 41220539 41000327 40647896 40095035 39644312
4108 39644312 39445686 39164272 38917470 38760964 38560573 38495421 38472198 38384370 38391654 38456077
4098 38456077 38585459 38656488 38653987 38672661 38639756 38673034 38591054 38530372 38554584 38709276 38799643
4087 38799643 38877548 38998442 39123447 39444745 39681962 40040971 40183663 40390859 40791232 41032486
4077D1032486K21654K03308J48479J83625K12363K80743L34511L14118M06431
4068D3337718L10291M38223M54184M04371N86914L92351L90437M72678M47291
4059D7234458M96391N49854N53711N46288N92794P05704P56086Q52165Q73144
4050E3160595R31338R55653Q29397R40148Q08209O19570O46898L01253J05568
4041E9298629j41640j86512k44290m12610l95469k43827l70437l29956j85860
4032E6788028k27580j39000k52755l07255j05078k47875m84879l59777m23035
4023E4240794o25455m40248n93143p05262n22224n35459n78589n60455n70478
4014D9109481q01075q03616p50824q99151p87829q73684q88430r62606q20838
$$ plain form
4077 41032486 41254140 41457448 41605927 41789552 42001915 42282658 42617169 42931287 43337718
4068 43337718 43648009 44086232 44540416 44944787 45531701 45924052 46314489 46787167 47234458
4059 47234458 47730849 48280703 48834414 49380702 49973496 50679200 51435286 52287451 53160595
4050 53160595 54091933 55047586 55876983 56817131 57625340 58244910 58891808 59193061 59298629
4041 59298629 59156989 58970477 58726187 58313577 57918108 57674281 57303844 56973888 56788028
4032 56788028 56560448 56421448 56168693 55861438 55756360 55508485 55023606 54663829 54240794
4023 54240794 53615339 53175091 52581948 51876686 51354462 50819003 50240414 49679959 49109481
4014 49109481 48308406 47504790 46753966 45854815 45066986 44193302 43304872 42342266 41521428
4005D1521428p89152q45505p42505q61462p55701p07898p08542p41865p18883
3996C4649915p03765q14682p20174o08036o23492n92443o72469o08240o82301
3987B8624313m86389n08761n33910m52403m23550n81181m89122l59769l71099
3978B4418129l74684l35241l24927m59695m51945l02818l90124l10041m24939
3969B1043715l07546l43317m00597l70323m27475l22722m03810m41462m75717
3960A7550746l93691m20354k36896k60206l10701l04278l08635k57372l13725
3951A4744888k07169l24521k07108j77554k65206k93830j43726j73466j78739
3942A2773569j41457k84720q6573k09519j87123j36794j68251j14774j35734j58031
$$ plain form
4005 41521428 40732276 39886771 39144266 38282804 37527103 36819205 36110663 35368798 34649915
3996 34649915 33946150 33131468 32411294 31803258 31179766 30587323 29914854 29306614 28624313
3987 28624313 28137924 27629163 27095253 26642850 26219300 25638119 25148997 24789228 24418129
3978 24418129 24043445 23708204 23383277 22923582 22471637 22168819 21778695 21468654 21043715
3969 21043715 20736169 20392852 19992255 19621932 19194457 18871735 18467925 18026463 17550746
3960 17550746 17157055 16736701 16499805 16239599 15928898 15624620 15315985 15058613 14744888
3951 14744888 14537719 14213198 14006090 13828536 13563330 13269500 13125774 12952308 12773569
3942 12773569 12632112 12347392 12260819 12051300 11864177 11727383 11559132 11444358 11308624 11150593
3932A1150593p8234r4339j12295n7806j61526q7991k6414j73656j21978q7613
3922A0148741m8902n6737q7337K8359N2769p3308j15845r967l099p6010K0644
3911I779308k4239j63146l1734p9645o2505j73746j97778M5058l9788n1615j32299
3900H867871p4154n2565j73406o2035l0221j36749m3962j67380r4962n4397j11789
3889G866251p7607p1691l9481l2489m8182j14025q1820p3923k0310k3767j29238
3878G153718j27164j1969q591k4200q131q461l4565j06825k3698j06787K6025
3867F719352j49644K7253J20547q1940j9302p155o4015q5978j48999o5920N3331
3856F297530L4077p6432k4238K7888m1811J7476p1852o4009j7209J0975j9137
$$ plain form
3932 11150593 11072359 10978020 10865725 10807919 10646393 10558402 10531988 10358332 10236354 10148741
3922 10148741 10099839 10043102 9955765 9984124 10036893 9963585 9847740 9837773 9834674 9758664 9779308
3911 9779308 9755069 9591923 9560189 9480544 9418039 9244293 9046515 9091573 9051785 9000170 8867871
3900 8867871 8793717 8741152 8567746 8505711 8475490 8338741 8294779 8127399 8032437 7978040 7866251
3889 7866251 7788644 7716953 7677472 7644983 7596801 7482776 7400956 7327033 7306723 7282956 7153718
3878 7153718 7026554 7014585 7005994 6981794 6973663 6965202 6930637 6823812 6800114 6693327 6719352
3867 6719352 6569708 6596961 6717508 6635568 6616266 6609111 6545096 6459118 6310119 6244199 6297530
3856 6297530 6331607 6255175 6230937 6258825 6217014 6234490 6162638 6098629 6081420 6092395 6073258
3845F073258N910j8661o7652O6943K8982p357p0959N244j46108j2217L3402K103
3833E892888R9895p8690q219N1079Q4694J7185l3770l2779O0779N583L682j051
3821F061276K4651o2711m718k0687J9689o8561q5116L8756L4142j41666l8237
3810E756818N2469L4839m0918j42689n9188J89093n377q0263L156J00718O3044
3799E871702l7296j07449n3460J02243N8539p1852l177o4528N4519P5284r4833
3788E729692K5236o5174j6950M4780K9996o5814r5474n107J30281j9873m9445
3777E642148j8329l2427J07154M089q6008q0656p148j9203N4232m4080q5804R5020
3765E528988L0656q0798M621l6936j9878N7525J7109O4580o1432o9872j716m9468
$$ plain form
3845 6073258 6079168 6060507 5992855 6059798 6088780 6081423 6010464 6015708 5869600 5857383 5890785 5892888
3833 5892888 5992783 5914093 5905874 5956953 6041647 6058832 6025062 5992283 6053062 6058645 6062327 6061276
3821 6061276 6085927 6023216 6018498 5997811 6017500 5948939 5863823 5902579 5936721 5795055 5756818
3810 5756818 5809287 5844126 5803208 5660519 5601331 5790424 5785047 5704784 5707940 5808658 5871702
3799 5871702 5834406 5726957 5673497 5775740 5834279 5762427 5759250 5694722 5749241 5824525 5729692
3788 5729692 5754928 5689754 5672804 5717584 5747580 5681766 5586292 5581185 5711466 5691593 5642148
3777 5642148 5623819 5591392 5698546 5702635 5616627 5535971 5528823 5509620 5563852 5519772 5433968 5528988
3765 5528988 5559644 5478846 5483467 5446531 5426653 5484178 5501287 5565867 5504435 5434563 5432847 5383379
3753E383379j5324L0260m4403o4517r0452j7994L3825p7364n6742R7549p9346
3742E098871L6551L3831j2394j73213r639J01476j7305q3599j500J39587o6856
3731E045810j31038L4130M4115m375r993j7851K6828M1090M7547j9131P2996q6060
3719E044068j9197k6641M7290O2463m3113k6665J21178J54891k5335o7039j10480
3708E111420N1992J34452M7056q647P8801L5995q3516R4524J10445J5763O7819
3697E656104P5909o9485k8465J19354k2723L3058N1246P9197L6545K1884O9610
3686F022234j7263L7168O5744J01645J74319O2099O8187O2261J63969P1440J15497
3675F927300R9456q3187j029K4299J5665k7011j54230K1526O0206P451J11212
$$ plain form
3753 5383379 5368055 5398315 5353912 5289395 5198943 5180949 5214774 5137410 5080668 5178217 5098871
3742 5098871 5135422 5169253 5156859 4983646 4974007 5075483 5058178 4974579 4973079 5112666 5045810
3731 5045810 4914772 4948902 4993017 4988642 4978649 4960798 4987626 5028716 5076263 5057132 5130128 5044068
3719 5044068 5024871 4998230 5045520 5107983 5064870 5038205 5159383 5314274 5288939 5221900 5111420
3708 5111420 5163412 5297864 5344920 5336273 5415074 5451069 5367553 5462077 5572522 5588285 5656104
3697 5656104 5732013 5662528 5634063 5753417 5730694 5763752 5814998 5894195 5930740 5952624 6022234
3686 6022234 6004971 6042139 6107883 6209528 6383847 6445946 6514133 6576394 6740363 6811803 6927300
3675 6927300 7026756 6943569 6942540 6966839 6982504 6955493 6801263 6822789 6882995 6890446 7001658
3664G001658M1816p8995P0744J03854J09215k0167k5550K27079J42115Q0277J49127
3653G801173J53067J0838R5898J84002O0240J41698K48143R2520R8617q1832M7137
3642H851501Q3199l003N5250J2165L0790N1551J39487J28684L8402J09373K9249
3631I526648J04930J40527J1900J45377J06864J22312K46561J31075R6986K26292
3621A0859472Q8882J57957J80195J48803J10767J25665J62138J53661J16844M9446
3611A2153830O1856J45572R9137J1163P8130j50148p7529o5482M889J6343j3528
3600A2264233j62992n1363k9691j20250K0978n3647Q9620J8828m8100O974R0998
3589A2025588j11285N4361K04172j5559K3294J09156J57473N3393j6244r3331
$$ plain form
3664 7001658 7043474 6964479 7035223 7139077 7248292 7228125 7202575 7429654 7571769 7652046 7801173
3653 7801173 7954240 7965078 8060976 8244978 8305218 8446916 8695059 8787579 8886196 8804364 8851501
3642 8851501 8934700 8931697 8986947 8999112 9029902 9081453 9220940 9349624 9388026 9497399 9526648
3631 9526648 9631578 9772105 9784005 9929382 10036246 10158558 10405119 10536194 10633180 10859472
3621 10859472 10948354 11106311 11286506 11435309 11546076 11671741 11833879 11987540 12104384 12153830
3611 12153830 12215686 12361258 12460395 12471558 12549688 12399540 12322011 12256529 12261418 12277761 12264233
3600 12264233 12101241 12049878 12020187 11899937 11920915 11867268 11956888 11975716 11927616 11934590 12025588
3589 12025588 11914303 11968664 12172836 12157277 12180571 12289727 12447200 12500593 12484349 12391018
3579A2391018Q9153L5934N7541P6829o4432J8367q6321K3628M261k2858j19966
3568A2403154L7087Q5374p2312n0760P0922k9025o4832l1225k8756J8068J40438
3557A2478133Q7796J6888Q8136N9098J48887J20611K41297o3527R6443J91454
3547A3465216J84356J41977J35436K63949J06571K11421K49537J77138J97977
3538A5133578J29391K91706J84114K04299J58888K42420L25051L30260K81632
3529A7281339L41893L54269L03517L48174M31444M42945N08036N27258M30702
3520B0969577O12785O88867N81865P41701O51876N57221O90427O18868O66665
3511B6779852O32232N93801N04894M61848M25385N23856M98416M24534M77192
$$ plain form
3579 12391018 12480171 12516105 12573646 12650475 12586043 12604410 12518089 12541717 12545978 12523120 12403154
3568 12403154 12440241 12525615 12453303 12402543 12473465 12444440 12379608 12348383 12319627 12337695 12478133
3557 12478133 12565929 12582817 12670953 12730051 12878938 12999549 13240846 13177319 13273762 13465216
3547 13465216 13649572 13791549 13926985 14190934 14297505 14508926 14758463 14935601 15133578
3538 15133578 15262969 15554675 15738789 15943088 16101976 16344396 16669447 16999707 17281339
3529 17281339 17623232 17977501 18281018 18629192 19060636 19503581 20011617 20538875 20969577
3520 20969577 21582362 22271229 22853094 23594795 24246671 24803892 25494319 26113187 26779852
3511 26779852 27412084 28005885 28510779 28972627 29398012 29921868 30420284 30844818 31322010
3502C1322010N30841M53877M12410M20252M47887M14537M16329L12726K54096
3493C4984965L70865K24998J29497J55285M3206N7644l2020M5154r3882j02269
3483C5783443m9735l7524Q340l5561j129j5281R0381O6952r9199J36445J21265
3472C5968397J29896k8955J46184J04296J01410J98689J23030K39536K01468K25625
3462C7409576K63282K06650L69169L47855L87984M15924L70775L32541L56216
3453D0459972M62696N33341N71704M55875M31288N83224M59441M82983O35084
3444D5075608N30766M51373N02503N67491O02400N46328M42513N02250M98329
3435D9719561M35539M51021N56705M72326L94049K69523L99508K72072J82498
$$ plain form
3502 31322010 31852851 32306728 32719138 33139390 33587277 34001814 34418143 34730869 34984965
3493 34984965 35355830 35580828 35710325 35865610 35908816 35966460 35934440 35979594 35885712 35783443
3483 35783443 35733708 35696184 35704524 35668963 35667834 35652553 35742934 35809886 35710687 35847132 35968397
3472 35968397 36098293 36069338 36215522 36319818 36421228 36619917 36742947 36982483 37183951 37409576
3462 37409576 37672858 37879508 38248677 38596532 38984516 39400440 39771215 40103756 40459972
3453 40459972 40922668 41456009 42027713 42483588 42914876 43498100 43957541 44440524 45075608
3444 45075608 45606374 46057747 46560250 47127741 47730141 48276469 48718982 49221232 49719561
3435 49719561 50155100 50606121 51162826 51635152 52029201 52298724 52698232 52970304 53152802
3426E3152802J68878J83999J25774J33278Q2998p7939p0666j06690j56352k84221
3416E3151861k96075k37176l25913l16541m46389n10565m87630m64506m99927
3407D9567139n21361n07896m54819n25758n88303n04359m43490m00318m44876
3398D5175959l83063l51505m12849k92990k52492j55398k37489j86550r5069j56552
3388D2652002j8612l7598j34083m2874o9716M8400m0312K3875J6235J7072J62288
3377D2576677J29802K36798K31506J42866K61297N10912M12671L39540L64422
3368D5206491L01934L70631M22489L78014M15666M07095M83460N26748N15864
3359D9028392N87866N71412M65321N78961O76341P01645P90975P88784Q28471
$$ plain form
3426 53152802 53321680 53505679 53631453 53764731 53847729 53769790 53699124 53592434 53436082 53151861
3416 53151861 52855786 52618610 52292697 51976156 51529767 51019202 50531572 50067066 49567139
3407 49567139 49045778 48537882 48083063 47557305 46969002 46464643 46021153 45620835 45175959
3398 45175959 44792896 44441391 44028542 43735552 43483060 43327662 43090173 42903623 42808554 42652002
3388 42652002 42633390 42595792 42461709 42418835 42349119 42397519 42357207 42381082 42397317 42414389 42576677
3377 42576677 42706479 42943277 43174783 43317649 43578946 44089858 44502529 44842069 45206491
3368 45206491 45508425 45879056 46301545 46679559 47095225 47502320 47985780 48512528 49028392
3359 49028392 49616258 50187670 50652991 51231952 51908293 52609938 53400913 54189697 55018168
3350E5018168Q80231Q70052R75732J069758J132736J189812J192327J289225J421499
3341F5039540J455148J512172J581974J696607J723257J805126K001888J953211
3333G8768923K011102J895307K037598J913421J937617J737263J605707J530646
3325I3437584J509698J498346J311493J451787J401074J448980J384730J685304
3317A05128996J634846J577954J561375J627508J469405J460165J283734J185197
3309A16929180J182829R87810Q50752R09828R34103R69224J085177J188518J270400
3300A26307821J250987J424983J503470J519763J485140J637844J834157J735971
3292A38700136J727869J806443J935304K048769K142564K274991K294755K491761
$$ plain form
3350 55018168 55898399 56768451 57744183 58813941 59946677 61136489 62328816 63618041 65039540
3341 65039540 66494688 68006860 69588834 71285441 73008698 74813824 76815712 78768923
3333 78768923 80780025 82675332 84712930 86626351 88563968 90301231 91906938 93437584
3325 93437584 94947282 96445628 97757121 99208908 100609982 102058962 103443692 105128996
3317 105128996 106763842 108341796 109903171 111530679 113000084 114460249 115743983 116929180
3309 116929180 118112009 119099819 119950571 120860399 121794502 122763726 123848903 125037421 126307821
3300 126307821 127558808 128983791 130487261 132007024 133492164 135130008 136964165 138700136
3292 138700136 140428005 142234448 144169752 146218521 148361085 150636076 152930831 155422592
3284A55422592K545013K685342K853015L004058K978474L237945L396301L388568
3276A79511308L526661L527398L424523L229649L025259K899150K717231K453796
3268B04314975K249568K182130K111581J909004J846705J719313J669394J468799
3260B19471469J322345J200155R45043P95830M83280K95902K98274J57133N2568
3251B25021999P4827j3429j21520j15108l09839n14563p58445r08069j130749
3242B21225104j609454j884752k092711k210048k329270k586135k554542k625522
3234B03332670k698583k827782k990748l143115l386897l500708l690375m032460
3226A77062002m270378m490771m517557m542821m440211m330516m248218m228735
$$ plain form
3284 155422592 157967605 160652947 163505962 166510020 169488494 172726439 176122740 179511308
3276 179511308 183037969 186565367 189989890 193219539 196244798 199143948 201861179 204314975
3268 204314975 206564543 208746673 210858254 212767258 214613963 216333276 218002670 219471469
3260 219471469 220793814 221993969 222939012 223734842 224218122 224514024 224812298 224969431 225021999
3251 225021999 225096826 225083397 224961877 224846769 224536930 224022367 223263922 222355853 221225104
3242 221225104 219615650 217730898 215638187 213428139 211098869 208512734 205958192 203332670
3234 203332670 200634087 197806305 194815557 191672442 188285545 184784837 181094462 177062002
3226 177062002 172791624 168300853 163783296 159240475 154800264 150469748 146221530 141992795
3218A41992795m061998l790685l552723l443966l248858l009136k951454k893035
3210A15040940k677060k482167k485933k287221k146347k019315j977293j832094
3202I7133510j755639j649140j540548j403744j253604j164655j030240j071951
3194H6263989j102285r88964r77530q76939p83349p60265p20194o82063o44855
3185G8727545o52777o21797m47465n31424m32251l33777l59648l56895l17699
3176G4673812k06522n7828r615P4416L15550J70963K37631K48354L52723M64519
3166G6264003M15779M17418L28228L27248J82687K13580J66627K44223K66393
3157G8826186J54676K12724J36798K13949K94473M27592L64673M55150P70503
$$ plain form
3218 141992795 137930797 134140112 130587389 127143423 123894565 120885429 117933975 115040940
3210 115040940 112363880 109881713 107395780 105108559 102962212 100942897 98965604 97133510
3202 97133510 95377871 93728731 92188183 90784439 89530835 88366180 87335940 86263989
3194 86263989 85161704 84172740 83195210 82318271 81534922 80774657 80054463 79372400 78727545
3185 78727545 78074768 77452971 77005506 76474082 76041831 75708054 75348406 74991511 74673812
3176 74673812 74467290 74409462 74399847 74474263 74789813 74960776 75198407 75446761 75799484 76264003
3166 76264003 76679782 77097200 77425428 77752676 77935363 78148943 78315570 78559793 78826186
3157 78826186 78980862 79193586 79330384 79544333 79838806 80266398 80631071 81086221 81856724
3148H1856724P58651Q47509J199892J258664J294630J449297J677841J775753
3140I2118961J694003J799796J655847J593946J573440J429620J109243R45958
3132A03920814Q94632P01245M94109M67299L01631J65802L5194J09422k2101k03870
3122A06864177j59696j60707q3109k41613k76961j19432l44908k95540m03686
3113A04778525l76374l63298l32150l22140l24903m78853m43490m56715n88171
3104A01092431n83095n12012m02054n08949l91108n11618l26641k27288k24277
3095I7405389n5738r8111k09158k63876l34253l76479n49788o53017q31028j033551
3085I3000390j382628j411007j487603j628775j764342j801030j767141j682083
$$ plain form
3148 81856724 82615375 83462884 84662776 85921440 87216070 88665367 90343208 92118961
3140 92118961 93812964 95612760 97268607 98862553 100435993 101865613 102974856 103920814
3132 103920814 104815446 105516691 106010800 106478099 106779730 106945532 106980726 107090148 107068047 106864177
3122 106864177 106704481 106543774 106460665 106219052 105942091 105822659 105477751 105182211 104778525
3113 104778525 104402151 104038853 103706703 103384563 103059660 102580807 102137317 101680602 101092431
3104 101092431 100509336 99997324 99595270 99086321 98695213 98183595 97856954 97629666 97405389
3095 97405389 97349651 97251540 97042382 96778506 96444253 96067774 95517986 94864969 94033941 93000390
3085 93000390 91617762 90206755 88719152 87090377 85326035 83525005 81757864 80075781
3077H0075781j638024j519510j509328j392175j280479j043608r95009r32791
3069F9764857p46933p23727p17436p41927o63897o47004n74545q28589r52262
3060F3168537r25606r82548j042312j102083j159031j252717j275901j243842
3052E4184497j308290j318083j231583j235205j130884j003410r37814j095255
3044D4923973r71012p03108p52782o85853o18499o27670o60290o25506o73726
3035C8605527n65557m48846n74181m72432m02975m57803n27331n31325m81654
3026C4143423m60826m63869m28741m89057m21802l11961m38649l67755l57145
3017C0403618l50593j84767k76599k26296k71345j7235j30203j50867j09650k02172
$$ plain form
3077 80075781 78437757 76918247 75408919 74016744 72736265 71692657 70697648 69764857
3069 69764857 69017924 68294197 67576761 66834834 66170937 65523933 64949388 64120799 63168537
3060 63168537 62242931 61260383 60218071 59115988 57956957 56704240 55428339 54184497
3052 54184497 52876207 51558124 50326541 49091336 47960452 46957042 46019228 44923973
3044 44923973 43952961 43249853 42497071 41811218 41192719 40565049 39904759 39279253 38605527
3035 38605527 38039970 37591124 37016943 36544511 36141536 35683733 35156402 34625077 34143423
3026 34143423 33682597 33218728 32789987 32300930 31879128 31567167 31128518 30760763 30403618
3017 30403618 30053025 29868258 29591659 29365363 29094018 29076783 28946580 28795713 28686063 28483891
3007B8483891o7165n4251n4262j36174r6878p1853k16276j98994j10605j94615
2997B7282818j43638k70845k85202k99566j81323j66437r258J461o9527j63705
2987B5694778p0137J4092m6073R2667Q1640M720M8856P2714R7386K35434N7623
2976B6283700J49291J32613p826O3136J44982J76543l0231R3062Q6315P2385K22927
2965B7386897Q8780J48204J51336K66074L33703J98660L26536L06683L68095M50075
2955C0025043M13764M30070M46022M63317N38962N50863O52697N81550O02959
2946C4705247N91528O31042O04288P68221P26118P66108P61862Q13563R08870
2937D1276847P91887Q82917R23764R73633R83832R64006R16219J069317J084234
$$ plain form
3007 28483891 28416726 28362475 28308213 28172039 28075161 28003308 27787032 27588038 27477433 27282818
2997 27282818 27139180 26868335 26583133 26283567 26102244 25935807 25926549 25928010 25858483 25694778
2987 25694778 25624641 25638733 25592660 25685327 25766967 25771687 25820543 25893257 25990643 26226077 26283700
2976 26283700 26432991 26565604 26557778 26620914 26765896 26942439 26912208 27005270 27091585 27163970 27386897
2965 27386897 27475677 27623881 27775217 28041291 28374994 28573654 28900190 29206873 29574968 30025043
2955 30025043 30438807 30868877 31314899 31778216 32317178 32868041 33520738 34102288 34705247
2946 34705247 35296775 35927817 36532105 37300326 38026444 38792552 39554414 40367977 41276847
2937 41276847 42068734 42951651 43875415 44849048 45832880 46796886 47713105 48782422 49866656
2928D9866656J102883J133584J253211J408998J434666J600252J771803J722468
2920F1294521J970820J995707J964772K122622J891512J689395J425760J111005
2912G5466114J028319P99475P70722Q59788J066371J173702J258420J528690J574538
2903H5526139J740821J818716K127850K265065K163328K316092K514817K849760
2895A03322588L188368L553607L885747M359440N158942N679638O414544P267905
2887A42830779Q080242Q848281R180491Q832507P588680N611927L546354K160391
2879A96679652J629360J812512K872374M009824N052630O027627O769387P328794
2871B32182160P876043Q372774Q738566R162503R604118R822021R812114R915625
$$ plain form
2928 49866656 50969539 52103123 53356334 54765332 56199998 57800250 59572053 61294521
2920 61294521 63265341 65261048 67225820 69348442 71239954 72929349 74355109 75466114
2912 75466114 76494433 77293908 78064630 78924418 79990789 81164491 82422911 83951601 85526139
2903 85526139 87266960 89085676 91213526 93478591 95641919 97958011 100472828 103322588
2895 103322588 106510956 110064563 113950310 118309750 123468692 129148330 135562874 142830779
2887 142830779 150911021 159759302 168939793 177772300 185360980 190972907 194519261 196679652
2879 196679652 198309012 200121524 202993898 207003722 212056352 218083979 224853366 232182160
2871 232182160 240058203 248430977 257169543 266332046 275936164 285758185 295570299 305485924
2863C05485924R810233R430469Q989895P758731N433874K296705k102673o483125
2855C40620033j0244077j2836536j4243557j4766924j4558346j3870188j3197486
2848B46902919j2223685j1286626j0301421r509896q609527p824638p075131o209541
2840A73862454n716005n096588m582777m080324l801837l417290l213791l228927
2832A40724915l193620l328809l522626l714155l950005m111121m008771m034248
2824A10861560l863595l844719l811286l649208l474418l332786k969267k959626
2816H2956655k884771k551713k548551k402340k433876k287792k076400k074566
2808F3696646j756614j853628j661102j482832j563470j528429j421828j329107
$$ plain form
2863 305485924 315296157 324726626 333716521 341475252 346909126 349205831 347103158 340620033
2855 340620033 330375956 317539420 303295863 288528939 273970593 260100405 246902919
2848 246902919 234679234 223392608 213091187 203581291 194971764 187147126 180071995 173862454
2840 173862454 168146449 163049861 158467084 154386760 150584923 147167633 143953842 140724915
2832 140724915 137531295 134202486 130679860 126965705 123015700 118904579 114895808 110861560
2824 110861560 106997965 103153246 99341960 95692752 92218334 88885548 85916281 82956655
2816 82956655 80071884 77520171 74971620 72569280 70135404 67847612 65771212 63696646
2808 63696646 61940032 60086404 58425302 56942470 55379000 53850571 52428743 51099636
2800E1099636j250828j229045j254872j255064j205835j132568j194962j108910
2792D1467552j129260j093916j142883j002896j017889r22388j101393q42693
2784C3214234q11119q91140p83353p14814p70355o86999o23030o51763p04555
2775B6577106p09953n86171n81379n15186n20968o14993o10094m64671n19090
2766B1454601n09147l52133m83334m57880l56466l92974m12742l80490l71391
2757A7738044m17455l75431k88138k88139l28611l59832l48547l94822k58265
2748A4678804k91571k33088l13231k79355j81476k36617j86112k54805k52867
2739A2449682q8944j05053j66778j93586j58371j45829j44395j62312k23334j46298
$$ plain form
2800 51099636 49848808 48619763 47364891 46109827 44903992 43771424 42576462 41467552
2792 41467552 40338292 39244376 38101493 37098597 36080708 35158320 34056927 33214234
2784 33214234 32403115 31511975 30728622 30013808 29243453 28556454 27933424 27281661 26577106
2775 26577106 25867153 25280982 24699603 24184417 23663449 23048456 22438362 21973691 21454601
2766 21454601 20945454 20593321 20109987 19652107 19295641 18902667 18489925 18109435 17738044
2757 17738044 17320589 16945158 16657020 16368881 16040270 15680438 15331891 14937069 14678804
2748 14678804 14387233 14154145 13840914 13561559 13380083 13143466 12957354 12702549 12449682
2739 12449682 12360738 12255685 12088907 11895321 11736950 11591121 11446726 11284414 11061080 10914782
2729A0914782k01516j08295k14898k26576j0798j67736j82255j28952q5827j48703
2719I439226k08580j10120j27292o9414j05942j75989j11487J6052k37826j18100
2709H190528j04683p2965k49083j31476n7752N2736j29920j39209n9232j42747
2699G156197j56324p0692r5561q4564p7630j07055j23048j47683p4971j2316q9309
2688F117044p1211n7987j15263j33938J5077k5768q9672j42181p2576J0028j94562
2677E238991o1928j2725m2405p8025p5506J5310L989j13599r0535n7070P574p9608
2665D654463q455j74186p1973n8518N8905k0739r7428r6047K6060j9079l2068
2654D160935p0970N311r1611M3987M9700r9740m1459m2185M9035O2612j94484
$$ plain form
2729 10914782 10713266 10604971 10390073 10163497 10152699 9984963 9802708 9673756 9587929 9439226
2719 9439226 9230646 9120526 8993234 8923820 8817878 8641889 8530402 8546454 8308628 8190528
2709 8190528 8085845 8012880 7763797 7632321 7574569 7627305 7497385 7358176 7298944 7156197
2699 7156197 6999873 6929181 6833620 6749056 6671426 6564371 6441323 6293640 6218669 6206353 6117044
2688 6117044 6045833 5987846 5872583 5738645 5753722 5727954 5638282 5496101 5423525 5433553 5238991
2677 5238991 5177063 5164338 5121933 5043908 4968402 4983712 4987701 4874102 4783567 4726497 4734071 4654463
2665 4654463 4646008 4471822 4399849 4341331 4400236 4379497 4282069 4186022 4212082 4193003 4160935
2654 4160935 4089965 4095276 4003665 4047652 4097352 3997612 3956153 3913968 3963003 4025615 3831131
2643C831131L613O3025N566K199j16210L480m0474p2641L3091j33846L7518O5921
2631C682373l2214r5291p2613N4141M3684j4172r0961k1101n1977p400n0200k4818
2619C319451m0725M9774l6307k5622m5899M3367q0218P4281p610N5358k3111m6015
2607C236724L0000L7108k193O2895m2255n1201P9839K6044m2609K450l9559J752
2595C298995L1326m662r1460j6078J13239L4482K6299J1701J7034M9307M0403
2584C510586p1877N3913P4869L4272J2042K753o7170R8788R195l9832m9079k2733
2572C545727l3486J0122j40434k18735r856j00803j34907l4558n5273j16464j6703
2561B694630L359r4309p4702r6232j8805j5085J5100N8640k11398l4846j2442
$$ plain form
2643 3831131 3834744 3897769 3903335 3905534 3789324 3792804 3752330 3679689 3712780 3578934 3616452 3682373
2631 3682373 3650159 3554868 3482255 3536396 3580080 3565908 3474947 3453846 3401869 3394469 3344269 3319451
2619 3319451 3278726 3328500 3292193 3266571 3220672 3264039 3183821 3258102 3250492 3305850 3282739 3236724
2607 3236724 3266724 3303832 3301639 3364534 3322279 3271078 3350917 3376961 3334352 3336802 3297243 3298995
2595 3298995 3330321 3325659 3234199 3218121 3331360 3365842 3392141 3403842 3420876 3470183 3510586
2584 3510586 3438709 3492622 3567491 3601763 3613805 3616558 3549388 3648176 3657371 3617539 3568460 3545727
2572 3545727 3512241 3522363 3381929 3163194 3153338 3052535 2917628 2883070 2827797 2711333 2694630
2561 2694630 2697989 2603680 2528978 2432746 2413941 2398856 2413956 2472596 2261198 2226352 2213910
2550B213910R3300m1541j79979L9680l6802j18769J4559j25336Q051R7754j40910
2539A823917l6889m7009m1995K4331n4735K2417M7376j3357r7038k6194q0699
2528A520125n4953q3692J8744k7895r5290J2977j3133O8558J4011j16983k0476
2517A221993M0458j5831P283P788j929j3375j15236n3355J09370m9251O7229P2489
2505A277633j24411o3388N1746k0631k3738j47652m9999o9707m6842K7685J00968
2494I11664L2410J491j31347j3481P956L9395Q223M1771n993j16358L672k5899
2482G53504q8184O3525O6553p9319k924m0599m520m6738J3478J8734N157K0893
2470F79560m9032L9836l3036O8488n3401J5811l3676K3942P3803J9811j4227j49110
$$ plain form
2550 2213910 2307210 2265669 2085690 2125370 2088568 1969799 1984358 1859022 1867073 1964827 1823917
2539 1823917 1787028 1740019 1698024 1722355 1667620 1690037 1737413 1724056 1627018 1600824 1520125
2528 1520125 1465172 1381480 1400224 1372329 1277039 1290016 1276883 1345441 1359452 1242469 1221993
2517 1221993 1262451 1246620 1253903 1261691 1259762 1246387 1131151 1077796 1187166 1137915 1205144 1277633
2505 1277633 1153222 1089834 1141580 1120949 1097211 949559 899560 829853 783011 810696 911664
2494 911664 944074 945565 814218 800737 808693 848088 856311 898082 892089 775731 779403 753504
2482 753504 665320 728845 795398 716079 713155 672556 668036 621298 634776 653510 658667 679560
2470 679560 630528 670364 637328 705816 652415 668226 634550 658492 732295 752106 737879 588769
2458E88769N1328Q8026o7017j5252k8219J6836J4M026j2494k6245n0219m9515
2446E00038K7965m1785M4373J023n8768J630L5764l1182k6369n113J00031K8273
2434E75880m6330l9229J9338n9804R2843m9021j0856o258p2831M5239J0425l8329
2422D21067J0209N0717m5481L2006j2077o0660o4692K1447k0540L600Q7149q7390
2410C35355o5924O8473J4537q674k0900k6583P0586L0769l8287l723m412m5709
2398C05508j5096k2802O515k7267K4162o3383N6973P3761N8735k8285n1759P3152
2386C90214M4771o5174K92p4667n6735m5417L6098l4884l6100J7074J2197n9252
2374A28417M803j2187M1571p1958Q8494L0796K1364q871q2980o0758N7857q600
$$ plain form
2458 588769 640097 728123 661106 645854 617635 634471 634485 638511 626017 599772 549553 500038
2446 500038 528003 486218 530591 531614 472846 474476 510240 479058 452689 447576 547607 575880
2434 575880 529550 490321 509659 449855 542698 493677 482821 476563 403732 448971 459396 421067
2422 421067 431276 481993 436512 468518 456441 395781 331089 352536 331996 335596 422745 335355
2410 335355 269431 337904 352441 343767 322867 296284 366870 397639 359352 355629 351217 305508
2398 305508 290412 267610 274125 246858 271020 207637 264610 338371 397106 368821 317062 390214
2386 390214 434985 369811 370103 295436 238701 193284 229382 194498 158398 175472 187669 128417
2374 128417 133220 121033 162604 90646 179140 209936 231300 222429 139449 78691 136548 127948
2362A27948j4288R3128q4327K0836k2817O672k3137j0114r4568j8193m5449N0005
2350a4304m6110O8467P5022k2212N3855K2864R5187k3129k9380n1545o9818P3527
2338A32424n1067k0845n5232L4713L3148N8133n6908n8500N8092K0323k7705R706
2326G6282J5073J020K573J02999r6469r022J1222p7250p4207J08373M8286l2252
2314G6628n023m9985L8228M0196Q989p7909L15K0080J1353j5041m7874O6506l2665
2301C3798J9512K7741j1831p658l6836p4276K7112J27078P0360m5529r7081Q6213
2289A18603K9716j21104m025j44524M3235J39831j00929p9060M1950p743M9130
2278c4920L1235j6744J74J5658J10031r2172J00354L8013p2495k0721R1232m7533
$$ plain form
2362 127948 113660 206788 122461 143297 120480 127152 104015 93901 -667 -18860 -64309 -14304
2350 -14304 -60414 8053 83075 60863 114718 137582 232769 209640 180260 128715 58897 132424
2338 132424 81357 60512 5280 39993 73141 131274 74366 15866 73958 94281 66576 76282
2326 76282 91355 92375 94948 197947 101478 92456 103678 26428 -47779 60594 108880 76628
2314 76628 71605 21620 59848 100044 109033 31124 31439 51519 62872 47831 -43 66463 33798
2301 33798 53310 81051 69220 61562 24726 -49550 -22438 104640 175000 129471 32390 118603
2289 118603 148319 27215 23190 -121334 -78099 61732 -39197 -118257 -76307 -84050 -34920
2278 -34920 -3685 -20429 -20255 -4597 105434 13262 113616 151629 79134 58413 149645 102112
2266A02112j03340j05590J9147J23234O2106l7461M0060j00981o3612P9230J2581
2255B7486j1904n3842N4553l130M8926n1930j18273P613R1203j2875R191L3413
2243B0431j7247N7547M3886Q061j0659o7536K587Q7872l3885P028l9774Q7282
2231A45593M259j5647J720L0605k4722j27827q977r82M0608J6785L4285m0882
2219E4818M7306l065p593M9814P4965j9093l8556k6553P8229M8501J0056O6700
2207C35529k1882l9084m6799J12173q1381O1430M3417o7156R7319J5506J3924
2196D22996L7018N9537J7913o8771Q384N3955J18034m7034L1721M9721r545j02460
2184E71469m758O7745o2632K8088J4311L6308L6626L2121P5519K8959j28N8539
$$ plain form
2266 102112 -1228 -106818 -87671 35563 97669 60208 100268 -713 -64325 14905 27486
2255 27486 15582 -38260 16293 13163 62089 10159 -108114 -100501 -9298 -22173 -12982 20431
2243 20431 3184 60731 104617 112678 102019 34483 37070 124942 91057 98085 58311 145593
2231 145593 149852 134205 135925 166530 141808 13981 5004 4022 44630 61415 95700 54818
2219 54818 102124 99059 91466 141280 216245 197152 158596 132043 210272 258773 268829 335529
2207 335529 313647 274563 227764 339937 258556 319986 363403 296247 393566 409072 422996
2196 422996 460014 519551 537464 468693 477077 531032 649066 602032 633753 683474 673929 571469
2184 571469 566711 634456 571824 599912 614223 650531 687157 719278 794797 823756 823628 882167
2172H82167L6437L8384J34991J0295J54772R5676m3273j16303M8832Q5414J33754
2161A461146Q6694j575J68126N606K4362j4024N2162R5863L105P4343j2239j0294
2149A933275J80331J65290K17778O2802K31266K62616J95735K13005J48229K06825
2139C817152K58220K75014L41795M22308M92856L29831L74096M47087N52053M91331
2129G801743O47089Q19243J039370J454607J851995K224823K761442L510309M275937
2120B6386558M615520L351023M98765k564939m096648m536212m270838l295939
2112A6087290k567739j958772j483520j099510r81091p33171n19901l94441l96310
2103E952835m11170l91963m26339l33889k94414k06146l43216j45591k68686k44826
$$ plain form
2172 882167 918604 956988 1091979 1102274 1257046 1352722 1309449 1193146 1241978 1327392 1461146
2161 1461146 1547840 1546265 1714391 1719997 1744359 1730335 1782497 1878360 1881465 1955808 1943569 1933275
2149 1933275 2113606 2278896 2496674 2559476 2790742 3053358 3249093 3462098 3610327 3817152
2139 3817152 4075372 4350386 4692181 5114489 5607345 5937176 6311272 6758359 7310412 7801743
2129 7801743 8448832 9268075 10307445 11762052 13614047 15838870 18600312 22110621 26386558
2120 26386558 31002078 34353101 34851866 32286927 28190279 23654067 19383229 16087290
2112 16087290 13519551 11560779 10077259 8977749 7996658 7263487 6743586 6349145 5952835
2103 5952835 5541665 5149702 4723363 4389474 4095060 3888914 3545698 3400107 3131421 2886595
2093B886595j25510j22130j3330j65562m0944j60594q7399j56867j52145j72632
2083A689482o7582l166k03867O9557j21973K0031j13348j19277k3675o5202j8565
2072A042415q0733k302N1365J5319j12824k4156M873j78236l5730j3418m939k4428
2060F37206J9504o144R146K9200q9193m9420o3884n5576n6326K4001Q0818l1450
2048D47882m3938K3137j8145Q709j38436o2543P4771J684L724k2690n8411p9314
2036A36430n4287o2213O3481J38812j3494K6400n4759j2201m5652q0859L4972
2025G6630O093j34255K6705Q2436j29132L0182P3999P558k6750o5774N0692O1792
2013F0176j00112l9864o131O2215Q721l3952N4509l5164l6419o8592J08902k1997
$$ plain form
2093 2886595 2761085 2638955 2625625 2460063 2419119 2258525 2171126 2014259 1862114 1689482
2083 1689482 1621900 1618734 1414867 1484424 1362451 1382482 1269134 1149857 1126182 1060980 1042415
2072 1042415 961682 959380 1010745 1026064 913240 889084 893957 715721 679991 666573 661634 637206
2060 637206 656710 650566 659712 688912 599719 550299 486415 430839 374513 398514 479332 447882
2048 447882 403944 427081 408936 417645 279209 216666 291437 293121 296845 274155 215744 136430
2036 136430 82143 19930 83411 222223 208729 235129 180370 168169 122517 41658 76630
2025 76630 82723 -51532 -24827 57609 -71523 -41341 32658 40216 13466 -52308 -1616 60176
2013 60176 -39936 -79800 -85931 -23716 -14995 -48947 5562 -29602 -66021 -134613 -25711 -47708
2001d7708l7525o0047q8785M4642O3510M2704m2175j02705M9006l463P759K9397
1989a45390j0910N0149o9714P888n624j5918K7992o8470N967J9347k9641K229
1977b32095n3915O6145P410K8773l8899O3727L3471j9026J9174m2282o555n699
1965a79771J3197K4005N9554k9295m5492L1101K469l5214j1571q739M0253k9612
1953a69115n1863j7051K0140M6175J6925m0023k2829J7949o0354J8518n2442j8143
1941c12113J21961p6598k4028J04877m4359Q1665n3328j67731O1319J59826m1525
1930a90034r0598m0793k7919M333N5289p8334L4158k3138J1523q833O4961K2738
1918b66647L9432j0591k5222k9161j14986Q8521j027L8788o0926n303K0727k3261
$$ plain form
2001 -47708 -85233 -145280 -234065 -189423 -125913 -83209 -125384 -228089 -179083 -182546 -174787 -145390
1989 -145390 -156300 -106151 -175865 -167977 -173601 -189519 -161527 -229997 -224030 -204683 -234324 -232095
1977 -232095 -286010 -219865 -212455 -183682 -222581 -158854 -125383 -144409 -125235 -167517 -174072 -179771
1965 -179771 -166574 -142569 -83015 -112310 -157802 -126701 -124232 -159446 -171017 -179756 -139503 -169115
1953 -169115 -220978 -238029 -217889 -171714 -154789 -194812 -217641 -199692 -260046 -241528 -293970 -312113
1941 -312113 -190152 -266750 -290778 -185901 -230260 -148595 -201923 -369654 -308335 -148509 -190034
1930 -190034 -280632 -321425 -349344 -345011 -289722 -368056 -333898 -357036 -345513 -354346 -289385 -266647
1918 -266647 -227215 -237806 -263028 -292189 -407175 -318654 -319681 -280893 -341819 -347122 -326395 -349656
1906c49656q7057K9633L1007J18646L4717k106Q278j4177m7809p6781L7166J374
1894c16765N7571M8398k0074J329k7595j796q2452o14K1288l0309M8764o602M123
1881c04734J7281N0309o9695m6552o6188o1857N6508O7340J7025M5210l0781K0863
1869c05271R7002j6442k909l0646K1667J0091m4013n8138K6889N63k2505n4424
1857c78136J23712N0224o606j1340j0239J0111M8467N3440K5036M1367q7593j17369
1845b58926K0251r033M7886P310j03679n0138N7167q446M3017J7883j4740l0843
1833b82291j8389N9159l7676o0043r211o1719L4466M3131Q2413o8698l8297L3231
1821c23924o472J6502l4264J1914k1137J38252K401p0024o3760K7334J54583m4204
$$ plain form
1906 -349656 -436713 -407080 -376073 -257427 -222710 -224816 -216538 -230715 -278524 -355305 -318139 -316765
1894 -316765 -259194 -210796 -230870 -229541 -257136 -258932 -341384 -341998 -320710 -351019 -302255 -308857 -304734
1881 -304734 -287453 -237144 -306839 -353391 -419579 -481436 -424928 -357588 -340563 -295353 -326134 -305271
1869 -305271 -208269 -224711 -227620 -258266 -236599 -226508 -270521 -328659 -301770 -301207 -323712 -378136
1857 -378136 -254424 -204200 -210806 -222146 -232385 -222274 -173807 -120367 -95331 -53964 -141557 -258926
1845 -258926 -238675 -247708 -199822 -192512 -296191 -346329 -289162 -297608 -254591 -236708 -251448 -282291
1833 -282291 -300680 -241521 -279197 -339240 -348451 -410170 -375704 -332573 -250160 -318858 -357155 -323924
1821 -323924 -330396 -313894 -348158 -336244 -357381 -219129 -216728 -286752 -350512 -323178 -168595 -212799
1809b12799j76332J16644M2903p0300o8190j6820L334j06490O8525R8706L2439
1798b88380m686O249l0054j01733L9445J1250N606M0712J672O8403K3346k9070
1786b57240l2489l7442J3675N5931j1389k9011J001r1730P7337Q26J12500m6642
1774b44673J5634M3184l4840q943L1840p1273q2731M0881P9018l9733l2090j4421
1762c18147N0566l2397N7550N2794k6778k3492l2632j01372j35234N2168j330
1751d58304N6657M6911m6692j6430M0879J01430l2246p9708J4059N8284O9693
1740b45467n0306O7876n5743L0249K860m6269k7168k469J1155l0745k9743Q8080
1728b87690P513p4969m2285P5187L2686M826Q9987o0447q9326N5903l8549o6545
$$ plain form
1809 -212799 -389131 -272487 -229584 -299884 -368074 -384894 -381560 -488050 -419525 -320819 -288380
1798 -288380 -293066 -286817 -316871 -418604 -379159 -367909 -362303 -321591 -319919 -251516 -228170 -257240
1786 -257240 -289729 -327171 -313496 -257565 -268954 -297965 -296964 -388694 -311357 -310531 -198031 -244673
1774 -244673 -229039 -185855 -220695 -229638 -197798 -269071 -351802 -310921 -231903 -271636 -303726 -318147
1762 -318147 -267581 -299978 -242428 -189634 -216412 -239904 -272536 -373908 -509142 -456974 -458304
1751 -458304 -401647 -354736 -401428 -417858 -376979 -275549 -307795 -387503 -373444 -315160 -245467
1740 -245467 -295773 -227897 -283640 -253391 -250531 -296800 -323968 -326437 -315282 -346027 -375770 -287690
1728 -287690 -280177 -355146 -397431 -322244 -289558 -284732 -194745 -255192 -344518 -288615 -327164 -393709
1716c93709Q2572K3728p5469K1604L4245M1182O4115k3399P3168M9279j61921
1705b64605j1903l87P0089k4139j36942N5571R0481o2996n3761O2228k5301j1080
1693c12745k2952M6587q201j3243p5951l3237M3042J0764r805Q414Q0371N7818
1681b29138j298l1251k3931m761O752o1564k1795o6948R2864K2149P5365J4358
1669b29198k0048m3168J708K9391m2599r9011O5497O3997r066o3880j21424N3880
1657d13921N5683J8432j757n5113j3768K2557N5266J1411p3373N8032K8315l5106
1645c43342L3097m298P1354N5721P313J6318r6160j9270R4400j8658r0813J7743
1633b76595p5357M2110O0954o2227o7820J19446m8620P6101m3646m4974R6843
$$ plain form
1716 -393709 -311137 -287409 -362878 -341274 -307029 -265847 -201732 -225131 -151963 -102684 -264605
1705 -264605 -276508 -276895 -206806 -230945 -367887 -312316 -221835 -284831 -338592 -276364 -301665 -312745
1693 -312745 -335697 -289110 -297311 -310554 -386505 -419742 -376700 -365936 -375741 -367327 -286956 -229138
1681 -229138 -230436 -261687 -285618 -290379 -283627 -345191 -366986 -433934 -341070 -318921 -243556 -229198
1669 -229198 -249246 -292414 -290706 -261315 -303914 -402925 -337428 -273431 -282497 -346377 -467801 -413921
1657 -413921 -358238 -339806 -341563 -396676 -410444 -387887 -332621 -321210 -394583 -336551 -308236 -343342
1645 -343342 -310245 -314543 -243189 -187468 -180155 -163837 -259997 -279267 -184867 -203525 -294338 -276595
1633 -276595 -351952 -309842 -248888 -311115 -378935 -259489 -308109 -232008 -275654 -320628 -223785
1622b23785r532m0482O4529O6850M5394m0724j04507r0512K2018j77N1760o9126
1610c28294J077P081L3315M2318K6024L878q595M2319j00756k9655K5205l7989
1598c24072O565K7880L437N8499J28m0505l1156R0299r9480L858j05461N0865
1586c59143J21945n474r734R0904Q3107p5376q4682Q571M5171n1369j8934N8947
1574a96067k1621M9662l7248o8782Q7935J0960p2185n6380J5782J3806l3659R5761
1562b12036j3893m9545O1441n1715l1305l4959N2786l5009L1033J4738K766N0698
1550b15000l0599L9324l2674n5726L9151m8965J6047J07686m6949N3143O4498
1539a10064m4607o231j16243n1079M7274m746J2542M7286l0339L2870J0274n2798
$$ plain form
1622 -223785 -233317 -273799 -209270 -142420 -97026 -137750 -242257 -332769 -310751 -310928 -259168 -328294
1610 -328294 -327217 -320136 -286821 -244503 -218479 -214601 -223196 -180877 -281633 -311288 -286083 -324072
1598 -324072 -317507 -289627 -286190 -227691 -227563 -268068 -299224 -208925 -308405 -304547 -410008 -359143
1586 -359143 -237198 -242672 -252406 -161502 -78395 -153771 -238453 -229882 -184711 -236080 -255014 -196067
1574 -196067 -217688 -168026 -205274 -274056 -186121 -175161 -247346 -303726 -287944 -274138 -307797 -212036
1562 -212036 -225929 -275474 -214033 -265748 -297053 -332012 -279226 -314235 -283202 -268464 -265698 -215000
1550 -215000 -245599 -206275 -238949 -294675 -255524 -304489 -288442 -180756 -227705 -174562 -110064
1539 -110064 -154671 -160902 -277145 -328224 -280950 -285696 -273154 -225868 -256207 -223337 -213063 -265861
1527b65861Q1835l4227J8723p3224m9313L2909J2508K8405m80m3745n2000L2872
1515c11598P3603n6373P8894K7999j09845R3346k5521k7654R3849N02L9985n1460
1503a74273o9612L2853J2523p226J3556j6616j3584M31l4826k4366N9540J0950
1491b10650l4684R432k5442k8458Q3572l8138l6837L710j1258l349P3449K3630
1479a95023m6882L8706m8205K987r1190N4453J7518P3404m8352k0434l8899O5800
1467b36117M4020l9920j8676m0949j3535k8477J3265J38504L9559j20906P3521
1456a89711l0074l7547k2489Q83J03070m0291k3750l7898J31311m404j66566J9232
1444b98234N2267p1597L0265K2205j12981k0822O0421J22000m9994J4091O4718
$$ plain form
1527 -265861 -184026 -218253 -199530 -272754 -322067 -289158 -276650 -248245 -248725 -292470 -344470 -311598
1515 -311598 -237995 -294368 -215474 -187475 -297320 -203974 -229495 -257149 -163300 -162798 -122813 -174273
1503 -174273 -243885 -211032 -198509 -205735 -192179 -208795 -222379 -221948 -256774 -281140 -221600 -210650
1491 -210650 -245334 -235902 -261344 -289802 -206230 -244368 -281205 -277495 -288753 -292102 -218653 -195023
1479 -195023 -241905 -203199 -251404 -248417 -339607 -285154 -267636 -194232 -242584 -263018 -301917 -236117
1467 -236117 -192097 -232017 -250693 -291642 -305177 -333654 -320389 -181885 -142326 -263232 -189711
1456 -189711 -219785 -257332 -279821 -278938 -175868 -216159 -239909 -277807 -146496 -150900 -317466 -298234
1444 -298234 -245967 -317564 -287299 -265094 -378075 -398897 -338476 -216476 -266470 -252379 -187661
1433a87661L3920r1737K6233L5086P6329Q3145n3529j20385l9872J9367q9105
1422c08209l6399J07286L9648j8780k3072p7272M359M5088j0530j2988M286J9255
1410b67328j0164l4445l3372Q7401J7881j09567M6794O740O0929n6565Q5288n3557
1398b59965j6838K7700k0023O7445j2411L9075Q798Q6084o9491j22769q2978P5558
1386b79815n2680n9427K3912O8060P2681p6767K668M8961Q6449l4261j31457R1326
1374b40350O3901O6246n6806L3351j22642M7070j5924m8703J69138k5261r1641
1363b21621j5213J7850L399J43499m6996l3116r7054r1975R5077K6560k1594R6871
1351a44313k6820l9060q589L986L2804k4568m3324M9784M0919r0279O3500K5755
$$ plain form
1433 -187661 -153741 -245478 -219245 -184159 -107830 -24685 -78214 -198599 -238471 -219104 -308209
1422 -308209 -344608 -237322 -197674 -216454 -239526 -316798 -312439 -267351 -277881 -290869 -286583 -267328
1410 -267328 -277492 -311937 -345309 -257908 -240027 -349594 -302800 -296060 -235131 -291696 -206408 -259965
1398 -259965 -276803 -249103 -269126 -201681 -214092 -175017 -166219 -80135 -149626 -272395 -355373 -279815
1386 -279815 -332495 -391922 -368010 -299950 -227269 -304036 -301368 -252407 -165958 -200219 -331676 -240350
1374 -240350 -176449 -110203 -167009 -133658 -256300 -209230 -225154 -273857 -104719 -129980 -221621
1363 -221621 -236834 -218984 -215585 -72086 -119082 -152198 -249252 -341227 -246150 -219590 -241184 -144313
1351 -144313 -171133 -210193 -218782 -214796 -181992 -206560 -249884 -200100 -159181 -249460 -185960 -160205
1339a60205j2624n123j5517q4711l1457J34040J0570J4373l6313K2252l8019L0428
1327a72306L5272J4392k2747J7992l2139l7410j04494J5497J03027k3654K5422
1316a81148L0228O1292p7510r6179j3068O6041m621j5565L5452M8315k2080j3473
1304a82316P2562o0305p2843j9335K0731M9653o349J7699m8100Q2806J6770K1508
1292a07519J552n7203l3894J1712N3734P7898j05704k2574J6316J9897j7051j5235
1280a78071L7554n739J6820j4390k8244Q6153L812j36340R9180K564o362o1467
1268a84530Q1042J5181n7148k0303q6846o176O1112R507l8515M8406J11343o4898
1256a31825k995K7469N3617m5592p321P8162o9961l9230J09043j1468k02028J2158
$$ plain form
1339 -160205 -172829 -177952 -193469 -278180 -309637 -175597 -165027 -150654 -186967 -164715 -202734 -172306
1327 -172306 -137034 -122642 -145389 -127397 -159536 -196946 -301440 -285943 -182916 -206570 -181148
1316 -181148 -150920 -89628 -167138 -263317 -276385 -210344 -214965 -230530 -195078 -146763 -168843 -182316
1304 -182316 -109754 -170059 -242902 -262237 -241506 -191853 -198202 -180503 -228603 -145797 -129027 -107519
1292 -107519 -105967 -163170 -197064 -185352 -131618 -53720 -159424 -181998 -165682 -145785 -162836 -178071
1280 -178071 -140517 -146256 -129436 -143826 -172070 -85917 -82105 -218445 -119265 -116701 -123063 -184530
1268 -184530 -103488 -88307 -145455 -165758 -252604 -258780 -197668 -188161 -226676 -178270 -66927 -131825
1256 -131825 -134820 -107351 -53734 -99326 -106647 -28485 -98446 -137676 -28633 -40101 -242129 -229971
1244b29971M3395O1302k8307l9450J42444p3305K336j6170P203M6677j32142p8862
1232b94850O560Q3954J23659l3255n2169O4278O5352n3755k3066k9581n6458M4286
1220a55045N807q903K499q0809J00703k5791n5371N4693M2016N0764o1491J495
1208a29433m0563L3270q266k8108p5313N7619k733O6353o3834N829k6535j7437
1196b29151Q4844L1007p3874K8643o1175N4990J7636r2961O8483l559N9504o963
1184a22576q8683p9308N3761l1373K2617J54258J9488m7438P6521m8849n8969
1173a50551N2820M5669J01554l9711q1527r462L6524r1171P478J0762O4015P0833
1161A7233j15680l6343L2190j694p5437M9104M6028l3777l0385K17r987Q525L8500
$$ plain form
1244 -229971 -186576 -125274 -153581 -193031 -50587 -123892 -121556 -137726 -130523 -83846 -215988 -294850
1232 -294850 -288290 -204336 -80677 -113932 -166101 -101823 -36471 -90226 -113292 -142873 -199331 -155045
1220 -155045 -149238 -158141 -155642 -236451 -135748 -161539 -216910 -162217 -120201 -69437 -130928 -129433
1208 -129433 -169996 -136726 -144992 -173100 -248413 -190794 -193527 -127174 -191008 -185179 -211714 -229151
1196 -229151 -144307 -113300 -187174 -158531 -219706 -164716 -147080 -240041 -171558 -175117 -115613 -122576
1184 -122576 -211259 -290567 -236806 -268179 -245562 -91304 -71816 -119254 -42733 -91582 -150551
1173 -150551 -97731 -52062 49492 9781 -71746 -81208 -44684 -135855 -128377 -117615 -53600 17233
1161 17233 -98447 -134790 -102600 -104294 -179731 -130627 -84599 -118376 -148761 -148544 -158531 -150006 -111506
1148a11506l234K56J21442j33188n7023P4812R9905L6370J1048n062q1693j03112
1136a50985N6874N2873l1783r7813J39361J04173j30100k4318n1329J277J01144
1125c0626r4625p8700Q5046Q8066j3445k3825N285l2591j9602L3345M4222l4300
1113g1750l7755R74p8257J4113J58734n4969o2514R3010r063j1727n3886j48736
1101b61826N5964J02514N591l9302J3531J1172N1908o0406N6894M9149k03118
1090b17929N8732m384p4401J70681m9650l6143k1603N9258O3714N629p3709J4711
1078a05094J3085l5641m1035J1718j2440r8057K8520J35950L3377k2036j7467
1067a09120J04710o4942l4242o7888J2204N7868k6094L5176k4295j008N989l9788
$$ plain form
1148 -111506 -114740 -114484 6958 -126230 -183253 -108441 -8536 27834 38882 33820 -47873 -150985
1136 -150985 -94111 -41238 -73021 -170834 -31473 72700 -57400 -81718 -133047 -131770 -30626
1125 -30626 -125251 -203951 -118905 -30839 -44284 -68109 -62824 -95415 -115017 -81672 -37450 -71750
1113 -71750 -109505 -108531 -186788 -172675 -13941 -68910 -131424 -38414 -47477 -59204 -113090 -261826
1101 -261826 -205862 -103348 -97757 -137059 -123528 -112356 -60448 -120854 -63960 -14811 -217929
1090 -217929 -159197 -163581 -237982 -67301 -116951 -153094 -174697 -115439 -51725 -46096 -119805 -105094
1078 -105094 -92009 -127650 -168685 -156967 -169407 -267464 -238944 -102994 -69617 -91653 -109120
1067 -109120 -4410 -69352 -103594 -171482 -159278 -101410 -127504 -92328 -116623 -117631 -111642 -151430
1055a51430P2489L9701R1905j868r1281K2502P1593O6512j28513Q3026J4165n4602
1043C4199k2604M398o5065K9233p9628J42452L7057j28362j4196Q8232n3721K7472
1031e33J9682j14154J226K1408K8211n1848Q9519K6306O3780P218j09740n8391
1019g7316N1727j7621j12103J03325j5753p727q48R1087l0499J1600r352o0251
1007g3731K1456n9076r063O8083j4253L3110N0753N7828p1219k2333Q104k1k8767
994c9129l3466N2517L1189J9163o4150k3491O5541k5824m7002O8924J15182J1314
982A30768q5114M7146k3624r8846l7150R0671O172L8058M935k1717j14998M0322
970b3377l7366J1097O7893R225j5533L495K6991K5524p0538Q2553J5625n4736
$$ plain form
1055 -151430 -78941 -39240 52665 50797 -40484 -17982 53611 120123 -8390 74636 88801 34199
1043 34199 11595 15993 -49072 -19839 -99467 42985 80042 -48320 -62516 25716 -28005 -533
1031 -533 19149 -95005 -93779 -72371 -44160 -96008 -6489 19817 83597 90815 -18925 -77316
1019 -77316 -25589 -43210 -155313 -51988 -67741 -75468 -76316 14771 -15728 -4128 -13480 -73731
1007 -73731 -52275 -111351 -120414 -52331 -66584 -33474 17279 75107 3888 -18445 -10341 -10362 -39129
994 -39129 -72595 -20078 11111 30274 -33876 -57367 8174 -17650 -64652 4272 119454 130768
982 130768 45654 92800 69176 -29670 -66820 23851 30023 68081 73016 51299 -63699 -23377
970 -23377 -60743 -49646 18247 27472 11939 15434 42425 67949 -2589 79964 95589 40853
958D0853L562j8036L0364j6262o5871N64M203j6448P1575M1259m4318O1644l9744
945E3345L9522K4488j2560j40149K6208P9660j37433k1204R2642K1057m6791k8818
933e0033r2760Q8190k604J9498Q9150L2957r7684L1669Q769J663M1489M373o4004
920A0673L7601k9941K111M353P8495j26890n7017L6643r816l1612P5227l242l4009
907d7424J38404o46q842l0963P1526o4775o92J1827j0873l73p709J1471O2963
894A23894n4349j18604K2104N0400L4913j4924l7326Q1907M8729j04252K2081
883E4573j3164q4455L4544l2262O5063O5556L2686K5382j02276Q488J09909m7084
871A16960j7525j8075K3691R5947p2472o8659K0432L6208J6844q0531o0288o3017
$$ plain form
958 40853 44415 26379 56743 40481 -25390 -24826 -20623 -37071 34504 75763 31445 93089 53345
945 53345 92867 117355 104795 -35354 -9146 70514 -66919 -88123 4519 25576 -21215 -50033
933 -50033 -142793 -54603 -57207 -37709 51441 84398 -13286 18383 27152 28815 70304 74677 10673
920 10673 48274 18333 20444 24797 103292 -23598 -80615 -43972 -53788 -85400 -10173 -13415 -47424
907 -47424 90980 90334 81492 50529 122055 57280 56588 68415 57542 57169 49460 60931 123894
894 123894 69545 -49059 -26955 23445 58358 43434 6108 88015 136744 32492 54573
883 54573 41409 -43046 -8502 -40764 24299 89855 122541 147923 45647 54135 164044 116960
871 116960 99435 81360 105051 200998 128526 59867 80299 116507 133351 52820 -7468 -70485
859g0485M4219K1212N2464l3482n0126L6886J5482M430j2773J41812R8836j14223
847A34252l3373r7824m5296M9189k7483l908J166N5424M4700K0759j17511q3941
835a03846O2993J74414N9699r4286L0778n6360P7983P715j59361k9790L9372N6608
823F5919M3387K5947n0260j52204n8003K34713m5082J0993r0631m43K3298K8707
811C6341n3977l3243O8070Q4610P7076p1499P511r162k4420j2295J7092l0369
799E5735o062R0944m9435m3981n0658J0995R320M3915N2164n0206l8110m340j7363
786B918M0876K7599O4377l343M8142p3637J3175O106o8747L7180J478M6548M2897
773A85569O0509r2148q4520K678M1945q478M1859m9165n9463J06647m671r3985
$$ plain form
859 -70485 -26266 -5054 47410 13928 -36198 688 16170 20600 7827 149639 248475 134252
847 134252 100879 3055 -42241 6948 -20535 -24443 -23277 32147 76847 97606 -19905 -103846
835 -103846 -40853 133561 193260 98974 129752 73392 151375 159090 -271 -30061 9311 65919
823 65919 109306 135253 84993 -67211 -125214 109499 64417 75410 -15221 -15664 7634 36341
811 36341 -17636 -50879 17191 101801 178877 107378 114889 105727 81307 69012 86104 55735
799 55735 49673 140617 91182 47201 -3457 7538 16858 60773 112937 62731 24621 20281 2918
786 2918 43794 71393 135770 132427 180569 106932 120107 126213 57466 94646 96124 142672 185569
773 185569 246078 153930 69410 72088 114033 105555 147414 98249 38786 145433 140762 46777
761D6777j3961J9471l1138p586P4102k1315M5071J844M0559k4902L3750J0719
749A73391P062M6420K3782k2200K434j3828O515n2087j7771l4433J3647J0010
737A42942l088o6265l7341k6363J11317J22976q4808k5010K484K1622k7734p4754
725E5978J3649K1984O9258r961o249K9944N2855n1195l1948q436j12543M5415
713F8751P7273j5319q9573Q9693m1215L8078O2134k0921o6349m3486O5959M4140
701A69165m102m9334O3446K0915P7910j13709j25813K1666O9317M3691P8557n8742
689A92967R819j8993J3356r642j7827J0579j4465l7447p6011O0874J6665p2344
677E7531L803J81647q19j5121L2118k5659o6047o4906q8510J35041M5356m1019
$$ plain form
761 46777 32816 52287 21149 13563 87665 66350 111421 113265 153824 128922 162672 173391
749 173391 180453 226873 250655 228455 230889 217061 223576 171489 153718 119285 132932 142942
737 142942 139854 73589 36248 9885 121202 244178 159370 134360 136844 158466 130732 55978
725 55978 69627 91611 160869 150908 144659 174603 227458 176263 144315 135879 23336 68751
713 68751 146024 130705 41132 130825 89610 127688 189822 168901 102552 59066 125025 169165
701 169165 165063 115729 179175 200090 278000 164291 38478 60144 129461 173152 251709 192967
689 192967 202786 183793 197149 187507 169680 180259 165794 128347 52336 113210 129875 57531
677 57531 61334 242981 242162 227041 259159 233500 167453 102547 14037 149078 194434 153415
665A53415K5319J00491p395m5178l7011o058j04335M8363J6608J7130j9666R952
653A51635k6930M2925J0478m0094r863M0887R453n5465p4523J08261J09762o2532
641B03994j7006j24895q855N6361J6679J10570l980k6070o1539m9951N2486P0198
629B17992R9157l4345J2335n6778q6547r9285L0040M9648M8365K1770L4750j9691
617B17411r5992R5750Q461P182j1695L9044j2759l8830K2494M2079R684O166j0031
604B78964N8323J3903j54642q070L8983N7898j12663M6137O752r7256r091J50995
592B70233J4198l0766j24882J37258k0801q4447J4995R5431m5339o1771R479P4446
580B48034j2428J0586N7804k5186J8477o9136J21806p4536j3167M8344J0144n9398
$$ plain form
665 153415 178734 279225 271830 226652 189641 183583 79248 127611 144219 161349 141683 151635
653 151635 124705 167630 178108 138014 128151 169038 178491 123026 48503 156764 266526 203994
641 203994 186988 62093 53238 109599 126278 236848 232868 206798 145259 95308 147794 217992
629 217992 317149 282804 295139 238361 151814 52529 82569 132217 180582 202352 237102 217411
617 217411 121419 217169 225630 232812 221117 260161 247402 208572 231066 273145 282829 288995 278964
604 278964 337287 351190 196548 188478 227461 285359 172696 218833 225585 128329 119238 270233
592 270233 284431 253665 128783 266041 245240 160793 175788 271219 225880 164109 173588 248034
580 248034 235606 246192 303996 278810 297287 228151 349957 275421 262254 310598 320742 261344
568B61344K0116K0912K7022m5128k9651l9130l5193R129R7692J17906j45294J7055
556B76780M8171n1475m0844k1759J32842m0492j33845J26501p3118j15192M2025
545A49594M4644K0278q589l6844j760J8301K4448P5836j5264J6173l9808p335
533B39674R3862k7590j32082R371J19502K2236k4156j18123p0657J19520J7768
522B49325J00118K801j03476q943O4522J3163p054k507L9097p8625P1353r447
510C30327j4634l7470K4801J8620j6910k5970J8229l2565O022K805r3289J72735
498C52701M303K9377k8709k9231O772j01183J4613P3612P1714q766o5563p5915
486B43725k177J9777r026M9029j0813K6550J3244l2172k8718j9799Q7356m2869
$$ plain form
568 261344 281460 302372 329394 284266 254615 215485 180292 189421 287113 405019 259725 276780
556 276780 324951 273476 232632 210873 343715 303223 169378 295879 222761 107569 149594
545 149594 194238 214516 205927 169083 167323 185624 210072 285908 270644 286817 247009 239674
533 239674 333536 305946 173864 183235 302737 324973 300817 182694 112037 231557 249325
522 249325 349443 352244 248768 239825 304347 317510 310456 307949 347046 268421 339774 330327
510 330327 315693 278223 303024 321644 304734 278764 296993 264428 270450 273255 179966 352701
498 352701 357004 386381 357672 328441 335213 234030 248643 322255 393969 385203 319640 243725
486 243725 241548 261325 252299 301328 290515 317065 330309 298137 269419 249620 336976 294107
474B94107l6635k4306j2840l0660P6908L44M8675Q7193q1165k6998p0235J57355
462C81743K327m0350m2829j8836q5571O5586K2405j14581N1146J09825l5476J651
450B97040k1508P0100L189K0389n4857m1891M1257L6521k8086J8729N3814q987
438C85710J0286j04435O4831p8764J904R5260J5786n7873N7629k6786j01035J3156
426B75669M8940P1879n038r205o736O87o4012L3070j00977N3289R95M5414K4214
413C68189q5064K226K1888o048k8110J26011o0219n9589L949m5027M9613P473
401B95292j2563k1563k1140J39790j9223p6335M4439q3330N5507m80j16490O7628
389B51532P1590R13n6256N5428j0049L5056R7713p9579o3338j0139q6617L0233
$$ plain form
474 294107 257472 233166 220326 189666 266574 266918 315593 402786 321621 294623 224388 381743
462 381743 384070 343720 300891 282055 196484 262070 284475 169894 221040 330865 295389 297040
450 297040 275532 345632 348821 369210 314353 272462 313719 350240 322154 340883 394697 385710
438 385710 395996 291561 356392 277628 279532 374792 390578 332705 390334 363548 262513 275669
426 275669 324609 396488 391450 382245 375509 376196 312184 345254 244277 297566 298561 343975 368189
413 368189 283125 285351 307239 301191 273081 399092 338873 279284 283233 238206 287819 295292
401 295292 282729 261166 240026 379816 360593 284258 328697 245367 300874 300394 183904 251532
389 251532 323122 324035 267779 323207 313158 348214 445927 366348 303010 292871 206254 236487
377B36487J32496m5345m8489j14883J65392J958n7924J00423P974q0986m4098
366B53005R5995j13197K0256Q7718J5619O155J08545q7463N1159m9224l1869j8850
354C37849K9566O5584L4733j13644l9525O0932K9037J5096k9194p5915M1350k5662
342C30207l9600k4425O1792R0049K9853m1406l3838o5689J16244l3302p1134m1693
330B77058j9775N5848K8393M6889n1262r2105j003P5120m1671M2520j47P2038
318C91903p9812m2038M1635N8325L4942K7022o4608N1855l1190l4614j8938R0914
306D25396M1564k0895J1676j11674m787P8606k3874K551K5051n2064Q5888m8598
294D08840p6289P3384J6908k2614j05492Q8707J3681j0319L7676l6700j13708
$$ plain form
377 236487 368983 323638 275149 160266 325658 327616 269692 370115 378089 297103 253005
366 253005 349000 235803 256059 343777 359396 365551 474096 386633 437792 388568 356699 337849
354 337849 367415 432999 467732 354088 314563 375495 404532 419628 390434 314519 355869 330207
342 330207 290607 266182 327974 418023 447876 406470 372632 306943 423187 389885 318751 277058
330 277058 257283 313131 341524 388413 337151 245046 244043 319163 277492 320012 319865 391903
318 391903 312091 270053 311688 370013 404955 431977 367369 419224 388034 353420 334482 425396
306 425396 466960 446065 457741 346067 341280 419886 396012 398563 423614 371550 457438 408840
294 408840 332551 405935 422843 400229 294737 383444 397125 386806 424482 387782 274074
283B74074O953J6112k5840M3108K3051P756o9597L0102L7621M501R8547j6947
271D29441n7896j2716o795J4387M7319N4389p7210q790P0686k9707m1522J6636
259C98222n2891j30713J01865K6222K3644J11263l4794J1191K6303l146j51063
248C26103l1807M4440J00519N297j41994M0848L5072n6289K0246P284M0411P7357
236D67487m1402Q9001P1566L3123j07036p2644M638O2453q1065P373K4211n3252
224D04453j8163L0353N7593M1975k7600m3906P6928o9562j9963K9127n187k9122
212D26926r4495k4547O8503k5542J7420j536p0248p9074J38675L9709j9511P1168
200D47448r641r412p193J8797j1043P1400R5889l2252l1797l7246l4849o4128
$$ plain form
283 274074 281027 297139 271299 314407 337458 345214 275617 305719 343340 347841 446388 429441
271 429441 371545 358829 352034 366421 413740 468129 390919 382129 452815 423108 381586 398222
259 398222 345331 214618 316483 342705 366349 477612 442818 454009 480312 477166 326103
248 326103 294296 338736 439255 444552 302558 343406 378478 322189 342435 349719 390130 467487
236 467487 426085 515086 586652 619775 512739 440095 444733 507186 426121 433494 457705 404453
224 404453 386290 416643 474236 516211 488611 444705 521633 452071 432108 461235 456048 426926
212 426926 332431 307884 376387 350845 368265 366729 296481 217407 356082 395791 376280 447448
200 447448 437807 428395 421202 439999 428956 500356 596245 563993 532196 494950 460101 395973
188C95973j4527K9066Q0003M4263n3647k1006l9010M9651J513j4639n1738J1838
176D17740Q3201l3080J3670L4351m4214J4193j8894Q796N5737M5577j5697n0827
164E10553J02882q7628k0628O6433m5467m8958k1039L6693l5069k9295q961M4568
152D64084N884O0117O8713q7733N815l7333Q040o3970K8072M4451j48499K7911
140C75552J22672k85k6665j873q3993l5106Q6590n8977N9016L4129K4563j0715
128D84908k7278L0465q2006N8421o205L2914K6864l9465M6037p2137L7836N052
116D95406P0170l4797N4478nj8291p8767J03386m9061m1336L3257l6502p7727
104D20211q2166Q7073M6775m7536q8046Q9091O3398j3543L349N4721J258n6551
$$ plain form
188 395973 381446 410512 490515 534778 481131 460125 421115 470766 472279 457640 405902 417740
176 417740 500941 467861 481531 515882 471668 485861 466967 475763 531500 577077 561380 510553
164 510553 613435 525807 505179 571612 526145 477187 456148 492841 457772 428477 419516 464084
152 464084 469968 530085 598798 511065 516880 479547 487587 423617 451689 496140 347641 375552
140 375552 498224 497939 471274 469401 385408 350302 436892 377915 436931 471060 495623 484908
128 484908 457630 488095 406089 464510 458305 491219 518083 478618 524655 452518 490354 495406
116 495406 565576 530779 585257 585252 566961 488194 591580 542519 501183 534440 497938 420211
104 420211 338045 425118 471893 424357 336311 425402 488800 475257 478606 533327 534585 478034
92D78034k000N5238j2569J00191N0084j13726l2213R6437n7809j1411m1645J3982
80E22593j1819L4871P221j9852p2299L0205n4697P3828R768q2150O3083J2156
68E12908K6729P7674l134q831J9161M351l5982n6140k2985P0751J7375k1741o1294
55E18842m277k1617p462N4583j0701M1135m8615J4152K5639k8952Q2585r0089
43E25223m0539K596M832M0238k727j1059K2870m329m1685l8213J202j0558Q3232
30E31083q757J6847O1557K3880Q863l9595l4184l4824O0779k438m6793p9684J15973
17E72707R0801p176J6801o64o1485j7167P0310k9247p7344j6145m0871j4663K181
4D88038P0338L7685J3306m6120
$$ plain form
92 478034 476034 531272 518703 618894 668978 555252 523039 619476 561667 550256 508611 522593
80 522593 510774 545645 552866 533014 460715 490920 436223 510051 519819 437669 500752 512908
68 512908 539637 617311 614177 605346 624507 628858 592876 536736 513751 584502 601877 580136 518842
55 518842 514565 492948 485486 540069 529368 570503 521888 536040 561679 532727 615312 525223
43 525223 484684 487280 492112 532350 529623 518564 541434 537105 495420 457207 458409 447851 531083
30 531083 522326 539173 600730 624610 633473 593878 559694 524870 585649 583211 536418 456734 572707
17 572707 663508 656332 673133 672469 610984 593817 664127 634880 557536 541391 500520 485857 488038
4 488038 558376 596061 609367 563247
0E63247
$$ plain form
0 563247
$$ Imaginary data points
##PAGE= N=2
##DATA TABLE= (X++(I..I)), XYDATA
16383c608057J0332R2374N814L0017J07497Q5505J37668K1731J4326N8411O2512
16372b981870L0218K9722Q3710N3040Q4649J24169L8426R8017K1964K5042P3695
16361b319218K163J01339R3796O4576r4O7921J02182O6784Q5641N8463N1372P3694
16349a551381k9198m900J26314P458N0081m4201J17554J48301R9116l195K0087
16338a063964Q1823J7503Q0972M6175N0348O3481O9584P5222K2208M8567Q1763
16327d26318P62J823J37008R2053O8955j2158j1636R3317J9545k5405J80805J62885
16315B81636n2389P3504Q6216k5193K7131O1323N6422K6485j1513M8584Q2192
16304F54398J20296Q5101J0477k2638J9025N6260R1047K0517O8308Q7055m32m9286
$$ plain form
16383 -3608057 -3597725 -3505351 -3499537 -3469520 -3362023 -3276518 -3138850 -3117119 -3102793 -3044382 -2981870
16372 -2981870 -2951652 -2921930 -2838220 -2785180 -2700531 -2576362 -2537936 -2439919 -2417955 -2392913 -2319218
16361 -2319218 -2317055 -2215716 -2121920 -2057344 -2057438 -1989517 -1887335 -1820551 -1734910 -1676447 -1625075 -1551381
16349 -1551381 -1580579 -1585479 -1459165 -1451707 -1401626 -1445827 -1328273 -1179972 -1080856 -1084051 -1063964
16338 -1063964 -982141 -964638 -883666 -837491 -787143 -723662 -654078 -578856 -556648 -508081 -426318
16327 -426318 -425556 -423733 -286725 -194672 -125717 -137875 -149511 -56194 -36649 -62054 118751 281636
16315 281636 229247 302751 388967 363774 390905 452228 508650 535135 523622 572206 654398
16304 654398 774694 859795 870272 847634 866659 922919 1013966 1034483 1102791 1189846 1189414 1140128
16292A140128J01774K4256K8862Q7417N8137L0908J31721L7944R8278k3900J7416
16281A732941Q5342J6188Q0226K3977m5122l6679R5067P2918o669O8863L2048
16270B119100O4179J8291M2378L3758Q8068P1066K8915N7247N7334j7611M0428
16259B603153O956n5414R4135O8698J4752l4283O5129P9545R633J00860N2776
16248C005940k5057L3013K2301O6388P5655K86j2260K07k5825Q9950K7001k6798
16236C230801R3998L5581j4348Q8769J8003L9299L859Q9401l2596L2309R9335
16225C684411k3124M0470k4685J8160K1578J04164J43965m4559j7030J4646J1578
16214C929574P0557n408j1027L0180k593J9003J06494O3345l7857L4549l1741
$$ plain form
16292 1140128 1241902 1266158 1295020 1382437 1440574 1471482 1603203 1641147 1739425 1715525 1732941
16281 1732941 1818283 1834471 1914697 1938674 1893552 1856873 1951940 2024858 2018189 2087052 2119100
16270 2119100 2183279 2201570 2243948 2277706 2365774 2436840 2465755 2523002 2580336 2562725 2603153
16259 2603153 2610109 2554695 2648830 2717528 2732280 2697997 2763126 2842671 2852304 2953164 3005940
16248 3005940 2980883 3013896 3036197 3102585 3178240 3178526 3166266 3166473 3140648 3230598 3257599 3230801
16236 3230801 3324799 3360380 3346032 3434801 3452804 3492103 3495962 3585363 3552767 3585076 3684411
16225 3684411 3661287 3701757 3677072 3695232 3716810 3820974 3964939 3920380 3903350 3917996 3929574
16214 3929574 4000131 3994723 3983696 4013876 4011283 4030286 4136780 4200125 4162268 4196817 4165076
16203D165076P1601N0035l4352K5063q5635k3067K0288O1945Q2133l2024N8942
16192D360005J05807N2342o1748n3528J37102J5752n8588K9944L0824l4743M3956
16181D567125L1859J4826L5690m4543P7081J7971j00000L8855J17253K0424j36814
16170D639727P5145k6075N0109J84926j6685q1652L5908k5314R57O1194n5430
16159D842810N5716L7907N3697k1619J7342N9620L3013k1876J0648l756J25054
16148E188556k4293q9288j8839n3241N7338Q28J05745K1935m6121K8311n3414
16137E117517m6972L0204Q4487l6665p98M8338k8749j11328K9667J02768R2804
16126E281273j423l3104n1848o989N2862M1730k8247M6007J1738r6355q769J17797
$$ plain form
16203 4165076 4236677 4286712 4252360 4277423 4191788 4168721 4189009 4250954 4333087 4301063 4360005
16192 4360005 4465812 4518154 4456406 4402878 4539980 4555732 4497144 4527088 4557912 4523169 4567125
16181 4567125 4598984 4613810 4649500 4604957 4682038 4700009 4600009 4638864 4756117 4776541 4639727
16170 4639727 4714872 4688797 4738906 4923832 4907147 4825495 4861403 4836089 4837046 4898240 4842810
16159 4842810 4898526 4936433 4990130 4968511 4985853 5045473 5078486 5056610 5067258 5063502 5188556
16148 5188556 5164263 5074975 5056136 5002895 5060233 5061061 5166806 5188741 5142620 5170931 5117517
16137 5117517 5070545 5100749 5185236 5148571 5147773 5196111 5167362 5056034 5085701 5188469 5281273
16126 5281273 5279850 5246746 5194898 5187909 5240771 5282501 5254254 5300261 5311999 5215644 5206875 5324672
16114E324672M5253j3170K9774K3783K0504m0604j23910l993O8564j1964K8749
16103E347658J28160n3461o141j5348l4080K5236L2002l1265q5911N6484L1743
16092E395077k5468o9056J81753m4613p9924J052O8173r0783l5207J37424K7571
16081E465999p3464j3569M0317N4970N0657j9408j6315L4250j32382K5504M031
16070E420590P401j3248n324J15069j0973l9531k9209O6896n9550N0212m68M2864
16058E544729k6556K6155O7380N146n654p2869L4665o6114o2503k8576L9621R2578
16046E548002L987j09122J2446J01982j68815L1135P3761k5777j3310R3908K7763
16035E575960n6276L2451q2135l7618r081M0396L4638J13619l2069l2289l3219
$$ plain form
16114 5324672 5369925 5356755 5386529 5410312 5430816 5390212 5266302 5262309 5330873 5318909 5347658
16103 5347658 5475818 5422357 5416216 5400868 5366788 5392024 5424026 5392761 5306850 5363334 5395077
16092 5395077 5369609 5300553 5482306 5437693 5357769 5358821 5426994 5336211 5301004 5438428 5465999
16081 5465999 5392535 5378966 5419283 5474253 5524910 5505502 5489187 5523437 5391055 5416559 5420590
16070 5420590 5427991 5414743 5409419 5524488 5513515 5473984 5444775 5511671 5452121 5502333 5501865 5544729
16058 5544729 5518173 5544328 5611708 5616854 5611200 5538331 5572996 5506882 5444379 5415803 5455424 5548002
16046 5548002 5551989 5442867 5455313 5557295 5388480 5419615 5493376 5467599 5454289 5548197 5575960
16035 5575960 5519684 5552135 5470000 5432382 5423301 5463697 5498335 5611954 5579885 5547596 5514377
$$ [...]
##END NTUPLES=NMR SPECTRUM
##END=
