##TITLE=1H_CA-8981x-2
 DMSO
 8 sc, 
 17.03.2022
##JCAMPDX= 6.0         $$ Bruker NMR JCAMP-DX V2.0
##DATA TYPE= NMR SPECTRUM
##DATA CLASS= NTUPLES
##ORIGIN= UXNMR, Bruker Analytische Messtechnik GmbH
##OWNER= root
$$ XWIN-NMR		Version 3.5
$$ Thu Mar 17 10:51:31 2022 Russian Standard Time (UT+4h)  she@DPX200
##.OBSERVE FREQUENCY= 200.131346
##.OBSERVE NUCLEUS= ^1H
##.ACQUISITION MODE= SIMULTANEOUS
##.ACQUISITION SCHEME= undefined
##.AVERAGES= 8
##.DIGITISER RES= 18
##SPECTROMETER/DATA SYSTEM= spect
##.PULSE SEQUENCE= zg30
##.SOLVENT NAME= DMSO
##.SHIFT REFERENCE= (INTERNAL, DMSO, 0, 15.7326)
##AUDIT TRAIL= $$ (NUMBER, WHEN, WHO, WHERE, WHAT)
$$ ##TITLE= Audit trail, XWIN-NMR		Version 3.5
$$ ##JCAMPDX= 5.01
$$ ##ORIGIN= Bruker BioSpin GmbH
$$ ##OWNER= she
$$ F:/spectra/data/she/nmr/H-F/1/pdata/1/auditp.txt
$$ ##AUDIT TRAIL=  $$ (NUMBER, WHEN, WHO, WHERE, WHAT)
(   1,<2022-03-17 10:50:14.92 +0400>,<she>,<DPX200>,
      <created by zg, POWCHK disabled, PULCHK disabled
       configuration hash MD5:
       00 E9 B6 7A A2 85 ED C7 34 08 36 98 17 FE 4E 26
       data hash MD5: 16K
       46 80 07 91 83 79 B8 47 65 A8 CB 09 A8 AE 60 EF>)
(   2,<2022-03-17 10:50:17.15 +0400>,<she>,<DPX200>,
      <Start of raw data processing
       efp BC_mod = 2 LB = 0.24 FT_mod = 6 PKNL = 1 PHC0 = -16948.97 PHC1 = 8.000776 SI = 16K 
       data hash MD5: 16K
       11 41 C2 77 C4 9D 54 02 A0 E8 FD C1 2D A9 E6 B9>)
(   3,<2022-03-17 10:50:32.62 +0400>,<she>,<DPX200>,
      <pk PHC0 = -3.148762 PHC1 = 4 
       data hash MD5: 16K
       7B 7C 7E BC 94 76 DA 9A AE 88 85 BB 9E 44 4C E1>)
(   4,<2022-03-17 10:50:35.71 +0400>,<she>,<DPX200>,
      <abs ABSG = 5 
       data hash MD5: 16K
       22 77 80 41 25 C7 9B FC E7 77 6B AA 1C 10 65 61>)
$$ ##END=
$$ 
$$ hash MD5
$$ 52 82 5D CF B0 6F 3D 2B 1B DE 87 02 6C 0B ED 42
##$RELAX= 
##$RELAX= 
##$RELAX= 
##$RELAX= 
##$RELAX= 
##$RELAX= 
$$ Bruker specific parameters
$$ --------------------------
##$DU= <F:/spectra>
##$EXPNO= 1
##$NAME= <H-F>
##$PROCNO= 1
##$TYPE= <nmr>
##$USER= <she>
##$AMP= (0..31)
100 100 100 100 100 100 100 100 100 100 100 100 100 100 100 100 100 100 
100 100 100 100 100 100 100 100 100 100 100 100 100 100 
##$AQSEQ= 0
##$AQ_mod= 1
##$AUNM= <au_zg>
##$AUTOPOS= <>
##$BF1= 200.13
##$BF2= 200.13
##$BF3= 200.13
##$BF4= 200.13
##$BF5= 200.13
##$BF6= 200.13
##$BF7= 200.13
##$BF8= 200.13
##$BYTORDA= 1
##$CFDGTYP= 0
##$CFRGTYP= 5
##$CHEMSTR= <none>
##$CNST= (0..31)
1 1 145 1 1 1 1 1 1 1 1 1 1 1 1 1 1 1 1 1 1 1 1 1 1 1 1 1 1 1 1 1 
##$CPDPRG= <>
##$CPDPRG1= <>
##$CPDPRG2= <>
##$CPDPRG3= <>
##$CPDPRG4= <mlev>
##$CPDPRG5= <mlev>
##$CPDPRG6= <mlev>
##$CPDPRG7= <mlev>
##$CPDPRG8= <mlev>
##$CPDPRGB= <>
##$CPDPRGT= <>
##$D= (0..31)
0 1.2 0 0 0 0 0 0 0 0.06 0 0.03 0 0 0 0 0.0002 0 0 0 0 0 0 0 0 0 0 0 0 
0 0 0 
##$DATE= 1647499814
##$DBL= (0..7)
120 120 120 120 120 120 120 120 
##$DBP= (0..7)
150 150 150 150 150 150 150 150 
##$DBP07= 0
##$DBPNAM0= <>
##$DBPNAM1= <>
##$DBPNAM2= <>
##$DBPNAM3= <>
##$DBPNAM4= <>
$$ [...]
##$SUBNAM2= <"">
##$SUBNAM3= <"">
##$SUBNAM4= <"">
##$SUBNAM5= <"">
##$SUBNAM6= <"">
##$SUBNAM7= <"">
##$SUBNAM8= <"">
##$SUBNAM9= <"">
##$SW= 18.0517287032376
##$SWIBOX= (0..15)
0 0 2 0 0 0 0 0 0 0 0 0 0 0 0 0 
##$SW_h= 3612.71676300578
##$TD= 16384
##$TD0= 1
##$TE= 0
##$TE2= 300
##$TE3= 300
##$TEG= 300
##$TL= (0..7)
0 120 120 120 120 120 120 120 
##$TP= (0..7)
150 150 150 150 150 150 150 150 
##$TP07= 0
##$TPNAME0= <>
##$TPNAME1= <>
##$TPNAME2= <>
##$TPNAME3= <>
##$TPNAME4= <>
##$TPNAME5= <>
##$TPNAME6= <>
##$TPNAME7= <>
##$TPOAL= (0..7)
0.5 0.5 0.5 0.5 0.5 0.5 0.5 0.5 
##$TPOFFS= (0..7)
0 0 0 0 0 0 0 0 
##$TUNHIN= 0
##$TUNHOUT= 0
##$TUNXOUT= 0
##$USERA1= <user>
##$USERA2= <user>
##$USERA3= <user>
##$USERA4= <user>
##$USERA5= <user>
##$V9= 5
##$VALIST= <valist>
##$VCLIST= <CCCCCCCCCCCCCCC>
##$VD= 0
##$VDLIST= <DDDDDDDDDDDDDDD>
##$VPLIST= <PPPPPPPPPPPPPPP>
##$VTLIST= <TTTTTTTTTTTTTTT>
##$WBST= 1024
##$WBSW= 4
##$XGAIN= (0..3)
0 0 0 0 
##$XL= 0
##$YL= 0
##$YMAX_a= 204896
##$YMIN_a= -221740
##$ZGOPTNS= <>
##$ZL1= 120
##$ZL2= 120
##$ZL3= 120
##$ZL4= 120
##$ABSF1= 15.74358
##$ABSF2= -2.30827
##$ABSG= 5
##$ABSL= 3
##$ALPHA= 0
##$AQORDER= 0
##$ASSFAC= 0
##$ASSFACI= 0
##$ASSFACX= 0
##$ASSWID= 0
##$AUNMP= <proc_1d>
##$AZFE= 0.1
##$AZFW= 0.1
##$BCFW= 0
##$BC_mod= 2
##$BYTORDP= 0
##$COROFFS= 0
##$CY= -3
##$DATMOD= 1
##$DC= 0
##$DFILT= <>
##$DTYPP= 0
##$F1P= 0
##$F2P= 0
##$FCOR= 1
##$FTSIZE= 16384
##$FT_mod= 6
##$GAMMA= 0
##$GB= 0
##$INTBC= 1
##$INTSCL= 0
##$ISEN= 128
##$LB= 0.24
##$LEV0= 0
##$LPBIN= 0
##$MAXI= 10000
##$MC2= 0
##$MEAN= 0
##$ME_mod= 0
##$MI= 1.114404
##$NCOEF= 0
##$NC_proc= -6
##$NLEV= 6
##$NOISF1= 3.799351
##$NOISF2= 2.8
##$NSP= 0
##$NTH_PI= 0
##$NZP= 0
##$OFFSET= 15.73257
##$PC= 1
##$PHC0= -16952.12
##$PHC1= 12.00078
##$PH_mod= 1
##$PKNL= yes
##$PPARMOD= 0
##$PSCAL= 0
##$PSIGN= 0
##$REVERSE= no
##$SF= 200.130003799036
##$SI= 16384
##$SIGF1= 3
##$SIGF2= 2
##$SINO= 5.538805
##$SIOLD= 16384
##$SREGLST= <1H.CDCl3>
##$SSB= 0
##$STSI= 16384
##$STSR= 0
##$SW_p= 3612.71676300578
##$SYMM= 0
##$S_DEV= 0
##$TDeff= 16384
##$TDoff= 0
##$TI= <>
##$TILT= no
##$TM1= 0
##$TM2= 0
##$TOPLEV= 0
##$USERP1= <user>
##$USERP2= <user>
##$USERP3= <user>
##$USERP4= <user>
##$USERP5= <user>
##$WDW= 1
##$XDIM= 16384
##$YMAX_p= 476611501
##$YMIN_p= -245477
$$ End of Bruker specific parameters
$$ ---------------------------------
##NTUPLES= NMR SPECTRUM
##VAR_NAME=  FREQUENCY,     SPECTRUM/REAL,   SPECTRUM/IMAG
##SYMBOL=    X,             R,               I
##VAR_TYPE=  INDEPENDENT,   DEPENDENT,       DEPENDENT
##VAR_FORM=  AFFN,          ASDF,            ASDF
##VAR_DIM=   16384,         16384,           16384
##UNITS=     HZ,            ARBITRARY UNITS, ARBITRARY UNITS
##FACTOR=    0.220516191357247, 1,           1
##FIRST=     3148.55923273269, 0,            0
##LAST=      -464.157530273086, 0,           0
##MIN=       -464.157530273086, -245477,     0
##MAX=       3148.55923273269, 476611501,    0
$$ Real data points
##PAGE= N=1
##DATA TABLE= (X++(R..R)), XYDATA
$$ [...]
8492A411623Q5164k5980N0473J69958n2890l0135q3169P3016O6894o2045J24741
$$ 1411623 1496787 1470807 1521280 1691238 1638348 1608213 1525044 1598060 1664954 1602909 1727650
8481A727650M5954M3984R2613l5293K2157l6292Q7050J78855P4159Q9207J08356
$$ 1727650 1773604 1817588 1910201 1874908 1897065 1860773 1947823 2126678 2200837 2290044 2398400
8470B398400J7809Q9792J37140O9661L3436R0194P6040K00759J28307J89852Q0930
$$ 2398400 2416209 2506001 2643141 2712802 2746238 2836432 2912472 3113231 3241538 3431390 3512320
8459C512320J39419K26031L06236K41066J54793K58931M42201L76502L54026M15104
$$ 3512320 3651739 3877770 4184006 4425072 4579865 4838796 5280997 5657499 6011525 6426629
8449F426629K71062J92066L95995J27879K3864J13829n1943P706m3888n9446O5158
$$ 6426629 6697691 6889757 7285752 7413631 7437495 7551324 7499381 7507087 7463199 7403753 7468911
8438G468911J05968M1408J3717L3652q7599k17027k54973j58260k67071k90441
$$ 7468911 7574879 7616287 7630004 7663656 7576057 7359030 7104057 6945797 6678726 6388285
8428F388285k40407j71870k5808o0828l8440l5763m5558J07334J35175Q3923J62480
$$ 6388285 6147878 5976008 5950200 5889372 5850932 5815169 5769611 5876945 6012120 6096043 6258523
8417F258523K62686J86082K40234L45185L97050M25716L66435M79218N33621O09111
$$ 6258523 6521209 6707291 6947525 7292710 7689760 8115476 8481911 8961129 9494750 10103861
8407A0103861N29177M04171L29369L02674R1838K248r3642j53298j43938q6317
$$ 10103861 10633038 11037209 11366578 11669252 11761090 11763338 11669696 11516398 11372460 11286143
8397A1286143m9730j60328o6591j12315k26875k31307l44786m20319n15306m81719
$$ 11286143 11236413 11076085 11009494 10897179 10670304 10438997 10094211 9673892 9158586 8676867
8387H676867n60108n60944n11305m13599l04839l92408k00175r6086k19333k04128
$$ 8676867 8116759 7555815 7044510 6630911 6326072 5933664 5733489 5637403 5418070 5213942
8377E213942k3750j36371j56235J6298J00818O8198Q5459J15692J16863Q7763
$$ 5213942 5190192 5053821 4897586 4913884 5014702 5082900 5168359 5284051 5400914 5488677
8367E488677J51613K12407K61857K53068N9376l7081q9880j02680j57013r7011
$$ 5488677 5640290 5852697 6114554 6367622 6426998 6389917 6300037 6197357 6040344 5943333
8357E943333k05284n9153n8642j5044j5646k2301j88635k27955k39989l14577
$$ 5943333 5738049 5678896 5620254 5605210 5589564 5567263 5378628 5150673 4910684 4596107
8347D596107k72624k44147k66079l03794l40884j92070j19560j81599j02442q8519
$$ 4596107 4323483 4079336 3813257 3509463 3168579 2976509 2856949 2675350 2572908 2484389
8337B484389k33367j35573q6707j06027j43663J9094K361o9546J3369r9420m9800
$$ 2484389 2251022 2115449 2028742 1922715 1779052 1798146 1800507 1730961 1744330 1644910 1595110
8326A595110o9191m6290P152q9660j23853o4949j37865K8553O6188K905R529m2692
$$ 1595110 1525919 1479629 1486781 1397121 1273268 1208319 1070454 1099007 1165195 1168100 1177629 1134937
8314A134937p9715M915n3804n1442M1075p5143q1707m091k777P196M2855j00543
$$ 1134937 1055222 1060137 1006333 954891 995966 920823 839116 835025 832248 839444 882299 781756
8302G81756q4830N4537k1791k6561n1026N1857J7973K2004j867J2001j10145J6461
$$ 781756 696926 751463 729672 703111 652085 703942 721915 743919 742052 754053 643908 660369
8290F60369l2751p2715M4382P364l7826M2000K5688m7195m5548o6509n267L1427
$$ 660369 627618 554903 599285 606649 568823 610823 636511 589316 543768 477259 471992 503419
8278E03419M8927K9358j5712m4751k6309m972n9094r1078J3785n5478O6830J6459
$$ 503419 552346 581704 565992 521241 494932 489960 430866 339788 353573 298095 364925 381384
8266C81384J2123K5874Q14m2121L355L1002m3934r6284J17363o374m8364q5771
$$ 381384 393507 419381 420195 378074 381429 412431 368497 272213 389576 383202 334838 249067
8254B49067m4206k6544j9845Q3221Q0051P4826r5464M5190k1214j80962J3541
$$ 249067 204861 178317 158472 241693 321744 396570 301106 346296 325082 144120 157661
8243A57661j0576J6729Q3514j8807m4785O158k0527k7490l6129p401l0162R754
$$ 157661 147085 163814 247328 228521 183736 189894 169367 141877 105748 98347 68185 77939
8231G7939K2144Q0427Q0040j23544J5314K0058j6945o1804K4233o9275J29681
$$ 77939 100083 180510 260550 137006 152320 172378 155433 93629 117862 48587 178268
8220A78268M4288K4934p141n5217k7169j2284l4449R3277k9316o6161k8046J06224
$$ 178268 222556 247490 240349 185132 157963 145679 111230 204507 175191 109030 80984 187208
8208A87208K4183k560q5533q6281m923r486j5400J5925N7759P8604q6197K0756
$$ 187208 211391 208831 123298 37017 32094 22608 7208 23133 80892 159496 73299 94055
8196I4055J5918k2914L0243L92379O49312p08983k27391j81816j61032J45888
$$ 94055 109973 87059 117302 509681 1158993 450010 222619 40803 -120229 25659
8186B5659K9186J7974J3965J4880p6680j7208J0528J2838n6704J09383n6926m6328
$$ 25659 54845 72819 86784 101664 24984 7776 18304 31142 -25562 83821 26895 -19433
8174a9433k7006J14131Q8889r929r6421m7047N4419o8120O1493N0086M3551p7741
$$ -19433 -46439 67692 156581 146652 50231 3184 57603 -10517 50976 101062 144613 66872
8162F6872o0849K3754L6777k666o4069j5418l7788P4280j3151L8843L3781o9443
$$ 66872 6023 29777 66554 63888 -181 -15599 -53387 20893 7742 46585 80366 10923
8150A0923L3160j17748k7041R6389O2833p028N2486O9929J8538q9672p5788Q7747
$$ 10923 44083 -73665 -100706 -4317 58516 51488 103974 173903 192441 102769 26981 114728
8138A14728J1100k0507m3921P4692n3195l7268R8569p5411r4890K2469L2366L7974
$$ 114728 125828 105321 61400 136092 82897 45629 144198 68787 -26103 -3634 28732 66706
8126F6706K2048l2523M6562o4800p1646K7417K0598l5734M0623O5345n6621j9303
$$ 66706 88754 56231 102793 37993 -33653 -6236 14362 -21372 19251 84596 27975 8672
8114H672P131P537L8178l736Q2132k0252r7753M3699O723n2333j11808Q1084K3014
$$ 8672 15803 23340 61518 57782 139914 119662 21909 65608 72331 19998 -91810 -10726 12288
8101A2288J5971M5316n960M264J5065q0520k1256O1568M4334R435l5889P066L5472
$$ 12288 28259 73575 67615 71879 86944 6424 -14832 46736 91070 100505 64616 71682 107154
8088A07154n099j7667J7771N8245J2489j5398K713n8944l9072J01362o8617o7926
$$ 107154 102055 84388 102159 160404 172893 157495 160208 101264 62192 163554 94937 27011
8076B7011J7030J26732p0263n5365j3526j9395L7490O101J08174n8648L1369n6013
$$ 27011 44041 170773 100510 45145 31619 12224 49714 55815 163989 105341 136710 80697
8064H0697N1631l0164j50161O7728R2000m3337p8523l6605M0355j17440P2689
$$ 80697 132328 102164 -47997 19731 111731 68394 -10129 -46734 -6379 -123819 -51130
8053e1130Q7074o9166n1175R1285R0271J8085K0071o8713o8420P0753l4878J4166
$$ -51130 35944 -33222 -84397 6888 97159 115244 135315 66602 -1818 68935 34057 48223
8041D8223P387p9556j29N0942N4489n0445Q6369O6642j00799N6804p0198m679
$$ 48223 55610 -23946 -24075 26867 81356 30911 117280 183922 83123 139927 69729 65050
8029F5050n162N2972l7982j09341O865R4941M8205K6446k3718o7843O068m1182
$$ 65050 59888 112860 74878 -34463 -27598 67343 115548 141994 118276 50433 56501 15319
8017A5319L94l2282L7807p0260k026J15832q9648q35L6763O1317J677n0441o1674
$$ 15319 15713 -16569 21238 -49022 -51048 64784 -24864 -25699 11064 72381 74058 23617 -38057
8004c8057j6693R3224l104K7848n9726Q4451o092J1720p1803n7852j19l4070J7460
$$ -38057 -54750 38474 35370 63218 3492 87943 81851 93571 21768 -36084 -36203 -70273 -52813
7991e2813J83660j3036m1212j04236l8729m1622Q4209M6378L8466L8128m8273
$$ -52813 130847 117811 76599 -27637 -66366 -107988 -23779 22599 61065 99193 50920
7980E0920r6270r9886R605J563K9532k2149O0141K5287J0907k503p06l0176j4302
$$ 50920 -45350 -145236 -135631 -134068 -104536 -126685 -66544 -41257 -30350 -32853 -33559 -63735 -78037
7967g8037O7165L1784M6566Q4274m4900n2066o4807n9447L5206M0722k812k0505
$$ -78037 -10872 20912 67478 151752 106852 54786 -10021 -69468 -34262 6460 3648 -16857
7955a6857o5936J53k380O4617L7461K6369M1182n6239j3569J578L6289n3004J7529
$$ -16857 -82793 -82640 -85020 -20403 17058 43427 84609 28370 14801 16379 52668 -336 17193
7942A7193Q1790p1613k7732M9911l352k3194K6878L6008j04514p863Q1787P002
$$ 17193 98983 27370 -362 49549 46197 23003 49881 85889 -18625 -26488 55299 62301
7930F2301K8831o9961j0147R9976m9472q5591j8429N3496k115l0350N9038m8453
$$ 62301 91132 21171 11024 111000 61528 -24063 -42492 11004 8889 -21461 37577 -10876
7918a0876O3855J2594j49776k0873O2933L3413j6753P3655K2942q1121j1301O6958
$$ -10876 52979 65573 -84203 -105076 -42143 -8730 -25483 48172 71114 -10007 -21308 45650
7906D5650J2276K3546l0992m2072p2716j1740J00583k8780n4456P799J0815n4378
$$ 45650 57926 81472 50480 8408 -64308 -76048 24535 -4245 -58701 -50902 -40087 -94465
7894i4465M2646L1605k7726M2822J69J1737o1443m988j411p7186n2353K4362J74300
$$ -94465 -51819 -20214 -47940 -5118 -4949 6788 -54655 -59643 -61054 -138240 -190593 -166231 8069
7881H069M8906J1839p9458k4706M5153n5220Q0012L9774J778P6136q8140k4356
$$ 8069 56975 68814 -10644 -35350 9803 -45417 34595 74369 76147 152283 64143 39787
7869C9787n1444o414M9735m9130q4453P9229Q5597m2955M246K8734P770L0412
$$ 39787 -11657 -18071 31664 -17466 -101919 -22690 62907 19952 24198 52932 60702 91114
7857I1114k154j01900M7193J40608q5671k4701r1820l8079J9178L1815K8622l5271
$$ 91114 88960 -12940 34253 174861 89190 64489 -27331 -65410 -46232 -14417 14205 -21066
7845b1066l6540K4893k217J32657j5162k1415K0384L0453m770j9287k3533p9272
$$ -21066 -57606 -32713 -34930 97727 82565 61150 81534 111987 107217 87930 64397 -14875
7833a4875M1348k8387n3721M181l777k6464M7866K901K5392M6029q2087L4069
$$ -14875 26473 -1914 -55635 -51454 -55231 -81695 -33829 -30928 -5536 40493 -41594 -7525
7821g525p481l3322N4240M4202J7683q1930l526L8822P6503j05798j32396P6169
$$ -7525 -15006 -48328 5912 50114 67797 -14133 -17659 21163 97666 -8132 -140528 -64359
7809f4359K9515n7217J78009l4421o9453O998K7258p862q023n6218j1844J01289
$$ -64359 -34844 -92061 85948 51527 -17926 -10928 16330 8468 445 -55773 -67617 33672
7797C3672q9552m3856J26533l638N2513r133M9701k8635p1180j40135n9178J25507
$$ 33672 -55880 -99736 26797 23159 75672 66539 116240 87605 16425 -123710 -182888 -57381
7785e7381O1041j24993O6203K6565o5025K9004M6608J5588j2745l8383P3888q4461
$$ -57381 3660 -121333 -55130 -28565 -93590 -64586 -17978 -2390 -15135 -53518 20370 -64091
7773f4091O689p51J9441R6098j00241M5771l2194N3468j06245K4872J11122M5432
$$ -64091 -57402 -58153 -38712 57386 -42855 2916 -29278 24190 -82055 -57183 53939 99371
7761I9371k061l2033q2011m0626L8860L6378m1496J8744K6068k2289m9925J3833
$$ 99371 97310 65277 -16734 -57360 -18500 17878 -23618 -4874 21194 -1095 -51020 -37187
7749c7187O7985M1163j06284m2094L1389J1507M5433m8425k06k9622n0047R2383
$$ -37187 30798 71961 -34323 -76417 -45028 -33521 11912 -36513 -36719 -66341 -116388 -24005
7737b4005N1692J5337P891K7647j42323n4071O299R8045L5718J574o9219K9603
$$ -24005 27687 43024 50915 78562 -63761 -117832 -111533 -13488 22230 23804 -45415 -15812
7725a5812O0617o7385l3209m5387M490j2356K9455Q5987K9871j58957k7380R8080
$$ -15812 44805 -22580 -55789 -101176 -96686 -109042 -79587 6400 36271 -122686 -150066 -51986
7713e1986M3311j2796p961j6929l9080J1949k958M1962Q5585r2180j7373m7561
$$ -51986 -8675 -21471 -29432 -46361 -85441 -73492 -76450 -34488 51097 -41083 -58456 -106017
7701a06017k6700J29851q4676k4385J16676j4984M4018j19623L4256K9891J8659
$$ -106017 -132717 -2866 -87542 -111927 4749 -10235 33783 -85840 -51584 -21693 -3034
7690c034K5782n2978l8198O7023R674k1530p9035K2282O3372K6899N5886j8798
$$ -3034 22748 -30230 -68428 -1405 8269 -13261 -92296 -70014 -6642 20257 76143 57345
7678E7345r3983N9394O8501k0809k2886q5049R183r525j6778m146k3934n3797
$$ 57345 -36638 22756 91257 70448 47562 -37487 -28304 -37829 -54607 -58753 -82687 -136484
7666a36484k139J4585P7102l0318Q4403j596J6269j1906q7510l0151Q2447O0939
$$ -136484 -138623 -124038 -46936 -77254 7149 5553 21822 9916 -77594 -107745 -25298 35641
7654C5641N5351j4672j14559m3655J10022N1450q8654l5234n0059L5545m6036
$$ 35641 90992 76320 -38239 -81894 28128 79578 -9076 -44310 -94369 -58824 -104860
7643a04860k7521K1230J45257M5120n418n6429n6885P791O4666K7123n7605q6482
$$ -104860 -132381 -111151 34106 79226 73808 17379 -39506 -31715 32951 60074 2469 -84013
7631h4013N2380j9896J2331R2320j8087p0307O117L7742o0570r5083R7968M882
$$ -84013 -31633 -51529 -39198 53122 35035 -35272 -29155 8587 -51983 -147066 -49098 -44216
7619d4216q3505O3664n6886N1571R0887L6022P3972o7801q0647J55601N7308j22731
$$ -44216 -127721 -64057 -120943 -69372 21515 57537 131509 63708 -16939 138662 195970 73239
7607G3239o2036l5007j4573L0188q2535O7121p9257Q1904l0477N9502J6715j4481
$$ 73239 11203 -23804 -38377 -8189 -90724 -23603 -102860 -20956 -51433 8069 24784 10303
7595A0303k9091Q7560r8627j1835o586p5682K7442R3145j495n6405j0899j7577
$$ 10303 -18788 68772 -29855 -41690 -48276 -123958 -96516 -3371 -4866 -61271 -72170 -89747
7583h9747j4942q48L4929L7787K0145M1532O6680k8004m9279K4292M9190j42249
$$ -89747 -104689 -105537 -70608 -32821 -12676 28856 95536 67532 18253 42545 91735 -50514
7571e0514J2879r439k0298k8163n014L2089L4236j11493K2348J11071J05981j62352
$$ -50514 -37635 -47074 -67372 -95535 -100549 -68460 -34224 -145717 -123369 -12298 93683 -68669
7559f8669J7463j7271j18M394m3244J4288P3550k0753Q2971j0038j21445J7324
$$ -68669 -51206 -68477 -68595 -64201 -107445 -93157 -19607 -40360 42611 32573 -88872 -71548
7547g1548R0969O2879n6645J8605J9699j3395l9654j2551m9558O220Q0774m8958
$$ -71548 19421 82300 25655 44260 63959 50564 10910 -1641 -51199 -44979 35795 -13163
7535a3163M1833J0152K3169r2445m3388R6812L635j07266J7625N5376m9641O0074
$$ -13163 28670 38822 61991 -30454 -73842 22970 26605 -80661 -63036 -7660 -57301 2773
7523B773m2298N7215L7643l166r1042O7242j0711n6783K7208k0721O3585j2467
$$ 2773 -39525 17690 55333 52167 -38875 28367 17656 -39127 -11919 -32640 30945 18478
7511A8478l7889r0329O7570R1014k6664m0832j4205m6437M9745m3340k8689n0865
$$ 18478 -19411 -109740 -42170 48844 22180 -18652 -32857 -79294 -29549 -72889 -101578 -152443
7499a52443L0107J25307l7463J6138L9416q4493m3909k2610j9349Q1784l31Q0562
$$ -152443 -122336 2971 -34492 -18354 21062 -63431 -107340 -129950 -149299 -67515 -67846 12716
7487A2716n9457O9797k2946o172k8373Q384J233q8074P0J6144K7477j5555k4182
$$ 12716 -46741 23056 110 -6062 -34435 -26051 -24818 -112892 -112822 -96678 -69201 -84756 -108938
7474a08938L0230R9467K187q2118M1050J3852Q7974M0430o3968o1500K5865j01172
$$ -108938 -78708 20759 22946 -59172 -18122 -4270 83704 124134 60166 -1334 24531 -76641
7462g6641k3890K5549O9391L3389r3790Q9255L9675m5685p1476J5712L6988J2485
$$ -76641 -100531 -74982 -5591 27798 -65992 23263 62938 17253 -54223 -38511 -1523 10962
7450A0962P0352m0968l6017R523o0695O9485k245n0274J5598k0251M6585M7296
$$ 10962 81314 40346 4329 13852 -46843 22642 20397 -29877 -14279 -34530 12055 59351
7438E9351n6778N093j1903N4020n6890n540K3030o8389m8878K7645j306M3173
$$ 59351 2573 7666 -4237 49783 -7107 -12647 10383 -58006 -106884 -79239 -80545 -37372
7426c7372o9946L9327K7454K5933o6019o4003M2193m2763N9746n821K5000J4786
$$ -37372 -107318 -67991 -40537 -14604 -80623 -144626 -102433 -145196 -85450 -91271 -66271 -51485
7414e1485r644m3231P5524M7298n3548j380L4355o9501r6739O1132k4981L4177
$$ -51485 -61129 -104360 -28836 18462 -35086 -36466 -2111 -71612 -168351 -107219 -132200 -98023
7402i8023O7696M3359o5976K3572J2010P9597j5611M2849l4648M9685P3289j59475
$$ -98023 -30327 13032 -52944 -29372 -17362 62235 46624 89473 54825 104510 177799 18324
7390A8324j3390M0341q9522k3632K2262l6167P6692L2201j890j8449j07862k6624
$$ 18324 4934 45275 -44247 -67879 -45617 -81784 -5092 27109 25219 6770 -101092 -127716
7378a27716O309l2110J79028m4680j51141J2191J54835n6236O4196P180l9405
$$ -127716 -121407 -153517 25511 -19169 -170310 -158119 -3284 -59520 4676 11856 -27549
7367b7549O0485Q3488j05032k2611O6168K2479o5523j1277m1627R032L7920K8733
$$ -27549 32936 116424 11392 -11219 54949 77428 11905 628 -40999 -31967 5953 34686
7355C4686J8332j9789j35397K0611L4100K3083O7080L1541n7837N2089k9526p9085
$$ 34686 53018 33229 -102168 -81557 -47457 -24374 42706 74247 16410 68499 38973 -40112
7343d0112L3776K2208p0811L3446O1461l9162P3245J26755j03825j29577P1109
$$ -40112 -6336 15872 -54939 -21493 39968 806 74051 200806 96981 -32596 38513
7332C8513p0920N3339L8281o3742n6024J03658o3339q2636L2857Q8070L7545J4558
$$ 38513 -32407 20932 59213 -4529 -60553 43105 -20234 -102870 -70013 18057 55602 70160
7320G0160J2622j6758j12017J2703M1031L1647L1770R696o305m9207j0944l4277
$$ 70160 82782 66024 -45993 -33290 7741 39388 71158 80854 74549 25342 14398 -19879
7308a9879j1264O8280q9323O5268K2565k384K298o0867O3959j3635J6812k170
$$ -19879 -31143 37137 -52186 13082 35647 33263 35561 -25306 38653 25018 41830 39660
7296C9660r5939L6110J21875l0310p6114L2394J084n179J9881m9927p0828L0513
$$ 39660 -56279 -20169 101706 71396 -4718 27676 28760 23581 43462 -6465 -77293 -46780
7284d6780l884J10786M0082j24335l3593K4512q3404J7322K8631j8894L2661j6815
$$ -46780 -50664 60122 100204 -24131 -57724 -33212 -116616 -99294 -70663 -89557 -56896 -73711
7272g3711k3622J43013j4091o9346M3349o8877o810R0791m4822m540O797p7314
$$ -73711 -97333 45680 31589 -37757 5592 -63285 -70095 20696 -24126 -28666 -21869 -99183
7260i9183o9737L7964J02907N742N1625M3334J7771m2039n8161l8298k4759L4111
$$ -99183 -168920 -130956 -28049 -22307 29318 72652 90423 48384 -9777 -48075 -72834 -38723
7248c8723L1418o469j2264m1424P7578K238K6187q9523l5637L3719p197O2554
$$ -38723 -7305 -13774 -26038 -67462 10116 12354 38541 -50982 -86619 -52900 -60097 2457
7236B457o5319K8848m1871m7235j2780R1547q373J7276N1175k1960j522P1416
$$ 2457 -62862 -34014 -75885 -123120 -135900 -44353 -52726 -35450 15725 -6235 -7757 63659
7224F3659K6502N5772o3276j15252p643Q3712M9505O627o533j13846O359R799
$$ 63659 90161 145933 82657 -32595 -40238 43474 92979 99606 93073 -20773 -14414 -4615
7212d615R434l5872L1403o9557J6239j5381J24506o9462q1222k3742K4536j3834
$$ -4615 4819 -31053 350 -69207 -52968 -68349 56157 -13305 -94527 -118269 -93733 -107567
7200a07567R124L2632r744L3842L7941p2821M6919l6348L356j4004k5132P3241
$$ -107567 -98443 -65811 -75555 -41713 -3772 -76593 -29674 -66022 -62666 -76670 -101802 -28561
7188b8561p8398j7706P3058J38179o3513o0161Q0607l2529r2939Q1271o3293j8481
$$ -28561 -106959 -124665 -51607 86572 23059 -37102 43505 10976 -81963 -692 -63985 -82466
7176h2466N6925o4283l7908K6257l1747O3501l587L9518k0913j4563L1253J909
$$ -82466 -25541 -89824 -127732 -101475 -133222 -69721 -73308 -33790 -54703 -69266 -38013 -36104
7164c6104l0426P6808p1376r1252Q3475N5134M1095l4345l845o0962J1050k3047
$$ -36104 -66530 10278 -61098 -152350 -68875 -13741 27354 -6991 -10836 -71798 -60748 -83795
7152h3795P4200M0612n1167M9735J9608m8367P7369m0715M94N963K5568l1159
$$ -83795 -9595 31017 -20150 29585 49193 826 78195 37480 37974 43937 69505 38346
7140C8346k7397N0841o3326k7126k9993K6118M765N6009J00991m6529r8135J8411
$$ 38346 10949 61790 -1536 -28662 -58655 -32537 -27772 28237 129228 82699 -15436 2975
7128B975J09945p5939M9774j15319n270J13425k2111m1015o8469L3849O2103K7108
$$ 2975 112920 36981 86755 -28564 -33834 79591 57480 16465 -52004 -18155 43948 71056
7116G1056o4041q5933k3161J78684P435j2745j24563o8975O7519Q9083q3246J0745
$$ 71056 7015 -78918 -102079 76605 84040 71295 -53268 -122243 -54724 34359 -48887 -38142
7104c8142N2221K7491o1021M5628K9716p1061k9977R9822m9984j58743J05038
$$ -38142 14079 41570 -19451 26177 55893 -15168 -45145 54677 4693 -154050 -49012
7093d9012N4023M9940K8765J243q8930O6680J0697j26441L8168J6538K874J7043
$$ -49012 5011 54951 83716 84959 -3971 62709 73406 -53035 -14867 1671 4545 21588
7081B1588m133J23123l5376r0601n6184O5293Q2794o1102m7587J7717m296J478
$$ 21588 17455 140578 105202 14601 -41583 23710 106504 45402 -2185 15532 11236 12714
7069A2714P1210J0846N0681l8895j34270n0424Q8039M5089n0288q0879L5667o0075
$$ 12714 83924 94770 145451 106556 -27714 -78138 9901 54990 4702 -76177 -40510 -100585
7057a00585l9736J66401n2079k1158J25721k493j18338J8840K7973K243L0008
$$ -100585 -140321 26080 -25999 -47157 78564 76071 -42267 -23427 4546 6789 36797
7046C6797o4424Q5663m31o8930j3797N5240O5594l0243r1358m5739P3168L644
$$ 36797 -27627 58036 57605 -11325 -25122 30118 95712 65469 -25889 -71628 1540 5184
7034E184R1389L7972L1145j08586k8446L0630j9938K1638m8100p4351m5659N4950
$$ 5184 96573 134545 165690 57104 28658 59288 39350 60988 12888 -61463 -107122 -52172
7022e2172J592M4611m9403O9846Q113k2395q3397N6766N140K4905j9129J1831
$$ -52172 -50580 -5969 -55372 14474 22587 192 -83205 -26439 -21299 3606 -15523 -3692
7010c692j169k8311L8320j5327N7607Q0073n574l0098n0120M406l6372j00617
$$ -3692 -4861 -33172 5148 -10179 47428 127501 121927 91829 41709 46115 9743 -90874
6998i0874M3058j6779l1269P6673J46422p7565m1080m6659J03309J8147r2276
$$ -90874 -47816 -64595 -95864 -19191 127231 49666 8586 -38073 65236 83383 -8893
6987h893o7697J1207M6101K5747k8301m6817O7496o7228o4610R9035K4621q931
$$ -8893 -76590 -65383 -19282 6465 -21836 -68653 -1157 -68385 -132995 -33960 -9339 -18270
6975a8270k6982J400M4774O8769l9093j24118l2730N5517J1544K4281j3612N7603
$$ -18270 -45252 -43852 922 69691 30598 -93520 -126250 -70733 -59189 -34908 -48520 9083
6963I083L5398j233o679p733M6311k0266n2743o9849P7149O7917m5406q289k2520
$$ 9083 44481 43248 36569 28836 75147 54881 2138 -67711 9438 77355 31949 23660 1140
6950A140j15251R8519J26644p5680o1166p9382J12643J5672k1088L8102K7665
$$ 1140 -114111 -15592 111052 35372 -25794 -105176 7467 23139 2051 40153 67818
6939F7818m3589M0106m973k4207j7145j2964P3930o0475k8904N982K1911q9361
$$ 67818 24229 64335 59362 35155 18010 5046 78976 18501 -10403 -4421 17490 -71871
6927g1871J35872k6748j10163O1397M4872Q988L6538J6154Q3244Q051k6990p916
$$ -71871 64001 37253 -72910 -11513 33359 42347 78885 95039 178283 186334 159344 151428
6915A51428q8911M206n2980m556o6546J03650L574r5936P4280j7614p7196k5452
$$ 151428 62517 66723 13743 9187 -57359 46291 49865 -46071 28209 10595 -66601 -92053
6903i2053K1665R9777M5036m6918n7389q3859R2065P1848k414k7922Q1723J6594
$$ -92053 -70388 29389 74425 27507 -29882 -113741 -21676 50172 47758 19836 101559 118153
6891A18153q9129P1834K0249N7772o6813j06085P7035k4224n4281K8054R7951
$$ 118153 29024 100858 121107 178879 112066 5981 83016 58792 4511 32565 130516
6880A30516m033k1169j5261n2936k4489m3881J0605Q0160Q1008o7379j13574J1523
$$ 130516 126483 105314 90053 37117 12628 -31253 -20648 59512 140520 73141 -40433 -28910
6868b8910p4980J27694O0217q9759N7702k9310l1589K9542j9890o1652L4247L2269
$$ -28910 -103890 23804 84021 -5738 51964 22654 -8935 20607 717 -60935 -26688 5581
6856E581K1006q2298P9829l849L3394o5401M879J9507L6457J5398k5731k2867
$$ 5581 26587 -55711 24118 20269 53663 -11738 -6859 12648 49105 64503 38772 15905
6844A5905q470L6952j4092J3208J7347P353N784N6237K0846o6262j03465Q7032
$$ 15905 7435 44387 30295 43503 60850 68203 73987 130224 151070 84808 -18657 68375
6832F8375P6906k994o8576P607k717o423O8587P6980j05351o5930Q0716k4717
$$ 68375 145281 142287 73711 81318 78601 72178 140765 217745 112394 46464 127180 102463
6820A02463m5788N7136o742L4434n0592k1296q5216N3065m2534L7533J209j238
$$ 102463 56675 113811 107069 141503 90911 69615 -15601 37464 -5070 32463 33672 32434
6808C2434j2149k7423M933l3956l2303M8683O4521M3835n124J8999l257m4505
$$ 32434 20285 -7138 -2205 -36161 -68464 -19781 44740 88575 83451 102450 99193 54688
6796E4688j09265j0348Q3455Q9557j1203m1918M721P7435p8060p1611M1504L4776
$$ 54688 -54577 -64925 18530 108087 96884 54966 59687 137122 59062 -12549 28955 63731
6784F3731J7348k1334n3138p1899O8928o3197k147O1551J3870L5788m8746l4506
$$ 63731 81079 59745 6607 -65292 3636 -59561 -61708 -157 13713 49501 755 -33751
6772c3751M5326q6811j1333K8421P5229L5620M4250q6036Q176J6509N6621k1103
$$ -33751 11575 -75236 -86569 -58148 17081 52701 96951 10915 19091 35600 92221 71118
6760G1118p792o2999p4828P2728k7566k626O5170O0647n4834J5960O6959n3538
$$ 71118 63326 327 -74501 -1773 -29339 -31965 33205 93852 39018 54978 121937 68399
6748F8399r595P13J1740n073R804q7454M8780j09296K5792k1004Q3342p2N5519
$$ 68399 58804 59517 71257 66184 75988 -11466 37314 -71982 -46190 -67194 16148 16076 71595
6735G1595j2999L9862q373j22761j9231K0192Q0997k9674O5606J2325j7119p4584
$$ 71595 58596 98458 90085 -32676 -51907 -31715 49282 19608 85214 97539 80420 5836
6723E836M314K8014L9597J0512m8563m9662K2723P6999q0470o4012O4392K0194
$$ 5836 10150 38164 77761 88273 39710 -9952 12771 89770 9300 -54712 9680 29874
6711B9874Q08J2976k0095R340J24072L233K5198j39871O9001m1511j01108n4212
$$ 29874 30682 43658 23563 32903 156975 160208 185406 45535 114536 73025 -28083 -82295
6699h2295J40018N3741J1273m4956o5736j138m1969J9890K5707K875K6568l0868
$$ -82295 57723 111464 122737 77781 12045 10907 -31062 -11172 14535 17410 43978 13110
6687A3110r192K0570n6048J13520n1340p8585o6564R1444O296J3625K3360m0194
$$ 13110 3918 24488 -31560 81960 30620 -47965 -114529 -23085 -16789 -3164 20196 -19998
6675a9998j7237Q172J8152J70594q588p6556j5415o358j7876o5072n880L5738
$$ -19998 -37235 -29063 -10911 159683 151095 74539 59124 52766 34890 -30182 -36062 -324
6663c24M6033n8028n1908R9061p9666k9082M3357L2246N6778r0037O208k9042
$$ -324 45709 -12319 -64227 34834 -44832 -73914 -30557 1689 58467 -31570 -25362 -54404
6651e4404K3335R0908M6431k9871N5074N3061k5896p5866K0410J3591o0842n1168
$$ -54404 -31069 59839 106270 76399 131473 184534 158638 82772 103182 116773 55931 4763
6639D763M0558P8466l790o4043m5597o6722O6659P335L6934j0307l524L6544Q627
$$ 4763 45321 123787 119997 55954 10357 -56365 10294 17629 54563 44256 40732 77276 85903
6626H5903K3225M7860Q4835n8992j02455J2065n5277M7977R261j3344K8698l1779
$$ 85903 109128 156988 241823 182831 80376 92441 37164 85141 94402 81058 109756 77977
6614G7977m0181K4199R1534m9649J8626p996j7473j6615l3258J7143j4963M9169
$$ 77977 37796 61995 153529 103880 122506 114510 97037 80422 47164 64307 49344 98513
6602I8513K0203k9035j15758Q3471k1903n6744P1383Q4317l0993N7739J0463L6534
$$ 98513 118716 89681 -26077 57394 35491 -21253 50130 134447 103454 161193 171656 208190
6590B08190o2973p0861n5214L6334j8724k4205M4192j4998L2320l4649R1875m8816
$$ 208190 145217 74356 19142 55476 36752 12547 56739 41741 74061 39412 131287 82471
6578H2471O4941p567N0059k1552Q851p6128P502J13751k1019j06456J10329O496
$$ 82471 147412 139845 189904 168352 177203 101075 108577 222328 201309 94853 205182 211678
6566B11678J0288j07190M8066M0089n6347o3235M0681J12732l1062m7423J5517
$$ 211678 221966 114776 162842 202931 146584 83349 124030 236762 205700 158277 173794
6555A73794o4233j5985J3248m860J6113p5404J7359J08955k9111J09680J08703
$$ 173794 109561 93576 106824 101964 118077 42673 60032 168987 139876 249556 358259
6544C58259j69702P8542L057k1744k6743l6103m2564l0320P4139j0923r3593J9312
$$ 358259 188557 267099 270156 248412 221669 185566 143002 112682 186821 175898 82305 101617
6532A01617L0195M1606P756l9425j8195l3984M4871L4125p421K8721M6259l2155
$$ 101617 131812 173418 181174 141749 123554 89570 134441 168566 161145 189866 236125 203970
6520B03970j26537l2680J2006M7293N1730P6147r3695K7009N8493J816k3168l4128
$$ 203970 77433 44753 56759 104052 155782 231929 138234 165243 223736 225552 202384 168256
6508A68256L7841L1737p6292M3151k4093J2237j9919J5051n3217L0528k1218K9921
$$ 168256 206097 237834 161542 204693 180600 192837 172918 187969 134752 165280 144062 173983
6496A73983R6142j21652p712M0919J155R617J23696o104N1417q7650q741M916
$$ 173983 270125 148473 140761 181680 182835 192452 316148 310044 361461 273811 265070 269986
6484B69986p218R215r8149Q998K1430N0107k1967j7673J0503L9898j7718J4779
$$ 269986 262768 271983 173834 182832 204262 254369 232402 214729 225232 265130 247412 262191
6472B62191Q5808R412m033o0472j01399K4493O6349N15J06409r1574l6623o7871
$$ 262191 347999 357411 353378 292906 191507 216000 282349 282864 389273 297699 261076 193205
6460A93205N5588p650j0853o0081L3999k0712j02162O6507P9905J4726m9785n3516
$$ 193205 248793 241143 230290 170209 204208 183496 81334 147841 227746 242472 192687 139171
6448A39171N7096R2494O816K8503M3251q2734j06451J5070J0925L6112O6951n2749
$$ 139171 196267 288761 295577 324080 367331 284597 178146 193216 204141 240253 307204 254455
6436B54455J37k095O8233k6019L7090K4059n7479M7384L24O877j07950P735n5830
$$ 254455 254592 252497 320730 294711 331801 355860 298381 345765 346089 352966 245016 252751 196921
6423A96921Q5363K9614l0457J26324m3321j39591P8023k3349L0857n3916l4362
$$ 196921 282284 311898 281441 407765 364444 224853 302876 279527 310384 256468 222106
6412B22106J30616o1384K5911k3253l331K9570p512R283K7320Q1707n8462N1624
$$ 222106 352722 291338 317249 293996 290665 320235 312723 322006 349326 431033 372571 424195
6400D24195L4442p183o5279j2595n867L6481M8137L2876p1839k9657l6700l6120
$$ 424195 458637 451454 386175 373580 367713 404194 452331 485207 413368 383711 347011 310891
6388C10891J06923O1657k2464o1630P3027K415K7794p343n8876o8191R6269K4325
$$ 310891 417814 479471 457007 395377 468404 470819 498613 491270 432394 364203 460472 484797
6376D84797k8658l5222O6550j0864o4528Q7959j4423J25652o277l8688o4132N521
$$ 484797 456139 420917 487467 476603 412075 500034 485611 611263 604986 566298 502166 507687
6364E07687K6806k3562o6558O9784k2834n8962P9485L4312o6053p1700P9153K8044
$$ 507687 534493 510931 444373 514157 491323 432361 511846 546158 480105 408405 487558 515602
6352E15602J9462j1657L0712L6305N0488p5464r7614Q3032L7175j3112M2571j9481
$$ 515602 535064 523407 554119 590424 640912 565448 467834 550866 588041 574929 617500 598019
6340E98019m9342J278K566M2125L6413R4855M582m7833L7888R220J0233K9038
$$ 598019 548677 549955 552521 594646 631059 725914 730496 682663 720551 729771 740004 769042
6328G69042m0472P0315J16211J1045O0407N277j21151N8227m0710l6990K0117
$$ 769042 728570 798885 915096 926141 986548 991825 870674 928901 888191 851201 871318
6317H71318P8302k7317r3541P427J0647K21498L9179m8361J0297m6637J47888
$$ 871318 949620 922303 828762 836189 846836 1068334 1107513 1059152 1069449 1022812 1170700
6306A170700j3908k1054l1472J24881J56712k0878M6765K66J0365N7170N6475
$$ 1170700 1156792 1135738 1104266 1229147 1385859 1364981 1411746 1412012 1422377 1479547 1536022
6295A536022q5798m5318L3914R3486P7476O5784p3336R8752Q7463m2510J01640
$$ 1536022 1450224 1404906 1438820 1532306 1609782 1675566 1602230 1700982 1788445 1745935 1847575
6284A847575J18270L9038Q1935j41342o8287Q3595J56487Q2837J43687O4079l9929
$$ 1847575 1965845 2004883 2086818 1945476 1877189 1960784 2117271 2200108 2343795 2407874 2367945
6273B367945J04009J23747P0874J53469R9072J7165J09047J47482N7246J42370
$$ 2367945 2471954 2595701 2666575 2820044 2919116 2936281 3045328 3192810 3250056 3392426
6263C392426Q7881J85717Q8752J29155J76455J96126J55945J60775J80700J40165
$$ 3392426 3480307 3666024 3754776 3883931 4060386 4256512 4412457 4573232 4753932 4894097
6253D894097J13225J35085K33766J81028J63514J94459J60802J52588P1806R2279
$$ 4894097 5007322 5142407 5376173 5557201 5720715 5915174 6075976 6228564 6300370 6392649
6243F392649J08642J05046K7710j5971J47659M4746n365K5035M4262m2323j2310
$$ 6392649 6501291 6606337 6634047 6618076 6765735 6810481 6805116 6830151 6874413 6832090 6819780
6232F819780N591o5118j45266j34380l4678r1184j40332m6457l47545q0430j37188
$$ 6819780 6825371 6760253 6614987 6480607 6445929 6354745 6214413 6167956 5820411 5739981 5602793
6221E602793r8822P0747j57066j28761n4011j8878n8844p4183j10738M6932k0834
$$ 5602793 5503971 5574718 5417652 5288891 5234880 5216002 5157158 5082975 4972237 5019169 4998335
6210D998335j4748L2961n6004K8658J791J44552L9908J66020N7757J6599J61189
$$ 4998335 4983587 5016548 4960544 4989202 4990993 5135545 5175453 5341473 5399230 5415829 5577018
6199E577018J39726K3378K25512K41627J55085K12051K37285J99442K31856K66607
$$ 5577018 5716744 5740122 5965634 6207261 6362346 6574397 6811682 7011124 7242980 7509587
6189G509587K78094K98660K09407K51660L86800J91533J78297J83565K36772K55532
$$ 7509587 7787681 8086341 8295748 8547408 8934208 9125741 9304038 9487603 9724375 9979907
6179I979907R0812J30636J17521N9l4656J02126Q883j70995p6101j08323j84705
$$ 9979907 10070719 10201355 10318876 10318935 10284279 10386405 10395288 10224293 10148192 10039869 9855164
6168I855164j31081l04650j57503k51502l87273l46421j77194l32942l57424l14512
$$ 9855164 9724083 9419433 9261930 9010428 8623155 8276734 8099540 7766598 7409174 7094662
6158G094662l19744k11807k18930k70665l29651k64958k11334k52528k90802j82621
$$ 7094662 6774918 6563111 6344181 6073516 5743865 5478907 5267573 5015045 4724243 4541622
6148D541622j71207j57986j55424j23039j38116j09107k04454j16277r4508j77401
$$ 4541622 4370415 4212429 4057005 3933966 3795850 3686743 3482289 3366012 3271504 3094103
6138C094103n9308j6823j07389j28160p8183r530O094r1169p0925k1897j33366
$$ 3094103 3034795 3017972 2910583 2782423 2704240 2694710 2700804 2609635 2538710 2516813 2383447
6127B383447j30131L0307l8957o9514l3900l2163o4671J8667m5865J4937o005
$$ 2383447 2253316 2283623 2244666 2175152 2141252 2109089 2044418 2063085 2017220 2032157 2026152
6116B026152L8824k05339j32013o0317J6550P9288p5861j4800p7724M7418K5602
$$ 2026152 2064976 1859637 1727624 1667307 1683857 1763145 1687284 1672484 1594760 1642178 1667780
6105A667780l2401J8459r4320j76886p564L1017N812L3827L0773j841l8113p2663
$$ 1667780 1635379 1653838 1559518 1382632 1375068 1406085 1411897 1445724 1476497 1474656 1436543 1363880
6093A363880K6249R9278N5648k8437P990j13263j3709k790o7951O694K3511M7785
$$ 1363880 1390129 1489407 1545055 1516618 1524608 1411345 1397636 1394846 1326895 1333589 1357100 1404885
6081A404885r4253o0868k4917l1120O7892J76095J441j528o6949j06610Q4083
$$ 1404885 1310632 1249764 1224847 1193727 1261619 1437714 1439155 1437627 1370678 1264068 1348151
6070A348151k2910o9471J04473L6749m2780n0271l2845n3585J00951L2170Q1609
$$ 1348151 1325241 1255770 1360243 1396992 1354212 1303941 1271096 1217511 1318462 1350632 1432241
6059A432241l9621j25832j5460Q7337O4751j762n0706k882J05633k0887K9313
$$ 1432241 1392620 1266788 1251328 1338665 1403416 1401654 1350948 1348066 1453699 1432812 1462125
6048A462125j2572p1382M5762O5194L8005j7041m3698N8393M1335m8945j0922
$$ 1462125 1449553 1378171 1423933 1489127 1527132 1510091 1466393 1524786 1566121 1517176 1506254
6037A506254Q7402O0520m7088j24299R4008P0671J45018Q0871n1989m374P3400
$$ 1506254 1593656 1654176 1607088 1482789 1576797 1647468 1792486 1873357 1821368 1816994 1890394
6026A890394j6033J7443K8325R3296O1881J4081O6584J18343J2761qM814k6234
$$ 1890394 1874361 1891804 1920129 2013425 2075306 2089387 2155971 2274314 2287075 2287067 2291881 2265647
6014B265647J13465O7305O7600R5933Q7733n8833Q2690K39896q8535R0596R0915
$$ 2265647 2379112 2446417 2514017 2609950 2697683 2638850 2721540 2961436 2872901 2963497 3054412
6003C054412J08985Q9095M7566Q8976J23708J62808M5445J11113J60411J37396
$$ 3054412 3163397 3252492 3300058 3389034 3512742 3675550 3720995 3832108 3992519 4129915
5993D129915J00460K43492K51702J86370J21406J12614J47223J64011K57718K18880
$$ 4129915 4230375 4473867 4725569 4911939 5033345 5145959 5293182 5457193 5714911 5933791
5983E933791J59456K07910K20296K81048J03545O0136J21001J24426J22339J09904
$$ 5933791 6093247 6301157 6521453 6802501 6906046 6966182 7087183 7211609 7333948 7443852
5973G443852M3512m7037j4535J01309q4911j3j00384K5194P0951p580L1363j1372
$$ 7443852 7487364 7440327 7425792 7527101 7442190 7442177 7341793 7366987 7437938 7430358 7461721 7450349
5961G450349N1386j00164k4601l9412L9424m5204L5648Q6006R0158M6609m8722
$$ 7450349 7501735 7401571 7376970 7337558 7376982 7331778 7367426 7453432 7543590 7590199 7541477
5950G541477R1333K0085Q8458L0568O3063M424K3151J4820l3589k6308L811j19041
$$ 7541477 7632810 7652895 7741353 7771921 7834984 7839408 7862559 7877379 7843790 7817482 7821293 7702252
5938G702252k37835n3827L1271k12743r7025j21285j10663o1606j38605r1896
$$ 7702252 7464417 7410590 7441861 7229118 7132093 7010808 6900145 6838539 6699934 6608038
5928F608038j68116k4315l1010j9054q4902p9378k1955o539m5017j0594J7402
$$ 6608038 6439922 6415607 6384597 6365543 6280641 6201263 6179308 6172769 6127752 6117158 6134560
5917F134560k7004K4058p4804J4962L3751l2472K1772q5629r0854K4172m4582
$$ 6134560 6107556 6131614 6056810 6071772 6105523 6073051 6094823 6009194 5918340 5942512 5897930
5906E897930j89655N0043p6158r9950m3933l8083j45963j39111j3941l452J5933
$$ 5897930 5708275 5758318 5682160 5582210 5538277 5500194 5354231 5215120 5201179 5197727 5213660
5895E213660M5940r1752j19503n8170m0260L5032K8882l81l299r2389P6436j3340
$$ 5213660 5259600 5167848 5048345 4990175 4949915 4984947 5013829 5013448 5010149 4917760 4994196 4980856
5883D980856m4804k9833j8422M0077r2687O783j38177m9099N3769l6283p4465
$$ 4980856 4936052 4906219 4887797 4927874 4835187 4841970 4703793 4654694 4708463 4672180 4597715
5872D597715j80693j38799o7870o1334j63428r5963q2893j82763j03307j26445
$$ 4597715 4417022 4278223 4210353 4149019 3985591 3889628 3806735 3623972 3520665 3394220
5862C394220j27213k17961j76810q4304l6124j30138j1541n7887j04643K6217
$$ 3394220 3267007 3049046 2872236 2787932 2751808 2621670 2610129 2552242 2447599 2473816
5852B473816M6231j36184j54430l8150o7240j2404L7628j01568j29250l4549p3651
$$ 2473816 2520047 2383863 2229433 2191283 2124043 2111639 2149267 2047699 1918449 1883900 1810249
5841A810249j0505o1234r6247n1584K7105m9964N2630n7495k3276n1021j12918
$$ 1810249 1799744 1738510 1642263 1590679 1617784 1567820 1620450 1562955 1539679 1488658 1375740
5830A375740j051j7129M5852j4281r543q7061j7500N7384p6781n7663m8019m3257
$$ 1375740 1374689 1357560 1403412 1389131 1379588 1292527 1275027 1332411 1255630 1197967 1149948 1106691
5818A106691O2981L7991L8914J776J4195m3581L026j87807J964j4209J04604N8439
$$ 1106691 1169672 1207663 1246577 1248353 1262548 1218967 1221993 1034186 1036150 1021941 1126545 1184984
5806A184984p4049R6966n9523q6687o2256Q3830l6764l7174K6033J7028r7413
$$ 1184984 1110935 1207901 1148378 1061691 999435 1083265 1046501 1009327 1035360 1052388 954975
5795I54975K2417k6600l2774K834j401N4896K2395J2757j48784M1296K9353P2006
$$ 954975 977392 950792 918018 920852 919451 974347 996742 1009499 860715 902011 931364 1003370
5783A003370p7577j11328m7227o6l6040J6379l952j5405k1965n0648R3947M0688
$$ 1003370 925793 814465 767238 767172 731132 747511 743559 728154 706189 655541 749488 790176
5771G90176R5491O1372J2701j30221q6875P3569j4169m0300P062q9875J4493r621
$$ 790176 885667 947039 959740 829519 742644 816213 802044 761744 768806 678931 693424 683803
5759F83803P9225K6017k5690o0321k4752K7069l7192k2020P0228L1495J9866n8217
$$ 683803 763028 789045 763355 703034 678282 705351 668159 646139 716367 747862 767728 709511
5747G09511q8587O8889N5068k3800m3456n3461J6199n876m2010K3702k9605M9068
$$ 709511 620924 689813 744881 721081 677625 624164 640363 634487 592477 616179 586574 635642
5735F35642M5328k3348j2331K9477o6320k2663P3291J4260m7252m4157J5279J1830
$$ 635642 680970 657622 645291 674768 608448 585785 659076 673336 626084 581927 597206 609036
5723F09036j5462M1690N5218K1922O9783j0346M0361m8178J2477L2982L962N7719
$$ 609036 593574 635264 690482 712404 782187 771841 812202 764024 776501 809483 813445 871164
5711H71164o2066j02134J16405M4785j05306L798L5002j0866m9341j69696L8821
$$ 871164 809098 706964 823369 868154 762848 766646 801648 790782 741441 571745 610566
5700F10566J10085m3279J7548R0862o0253j00178N9375Q5112M8083m5651O4996
$$ 610566 720651 677372 694920 785782 725529 625351 684726 769838 817921 772270 837266
5689H37266j2186q456O1711L4593l3170n373K1000m5665q7676K458L2538j07529
$$ 837266 825080 816624 878335 912928 879758 874385 895385 849720 762044 764502 797040 689511
5677F89511k0361p611j2218R1835q7941O4311J9541L0877k6147m3361N8451l590
$$ 689511 669150 661539 649321 741156 653215 717526 737067 767944 741797 698436 756887 753297
5665G53297K131M315Q3692O9203m1221l2954J18462j8785j18930m0944K6049L243
$$ 753297 755428 759743 843435 912638 871417 838463 956925 938140 819210 778266 804315 807558
5653H07558l6198K3653P6935k9988p068Q7349J1761m9310l1408n228P3537J38023
$$ 807558 771360 795013 871948 841960 834892 922241 934002 884692 853284 848056 921593 1059616
5641A059616l4931j634j7421j0464R7381L3845j25379J1417m6755O6985Q4187
$$ 1059616 1024685 1023051 1005630 995166 1092547 1126392 1001013 1012430 965675 1032660 1116847
5630A116847l8982l9353Q1095j04132K3052P0895j7216J04189J4843k0647L0436
$$ 1116847 1077865 1038512 1119607 1015475 1038527 1109422 1092206 1196395 1211238 1190591 1221027
5619A221027k5221K1589P127l9888m503l5477R0588L5790o9436m0194R9871N9845
$$ 1221027 1195806 1217395 1224522 1184634 1180131 1144654 1235242 1271032 1201596 1161402 1261273 1321118
5607A321118J20223N3332m504j39590L8395M3500q1851m8321N5787l622R8811
$$ 1321118 1441341 1494673 1490169 1350579 1388974 1432474 1350623 1302302 1358089 1354467 1453278
5596A453278j33349J9209m112n3034R3418J00138Q9513M788r3548M8350k3202
$$ 1453278 1319929 1339138 1335026 1281992 1375410 1475548 1565061 1569849 1476301 1524651 1501449
5585A501449M248M688n4364K2287O2902m0485k371K1968O6598M9478L467Q9061
$$ 1501449 1505697 1510385 1456021 1478308 1541210 1500725 1498354 1520322 1586920 1636398 1639865 1728926
5573A728926K4300k3279j35401p1118P3701J909Q0213R5913j01718O5834Q3645
$$ 1728926 1753226 1729947 1594546 1523428 1597129 1599038 1679251 1775164 1673446 1739280 1822925
5562A822925r8174K106R310N6052Q1002j23670N3652L4676M020m6269L6917Q9923
$$ 1822925 1724751 1726857 1736167 1792219 1873221 1749551 1803203 1837879 1841899 1795630 1832547 1922470
5550A922470J5440J39739J138q5953O5006r7899N136N7580Q9747N5196l6439n2137
$$ 1922470 1937910 2077649 2078787 1992834 2057840 1959941 1965077 2022657 2112404 2167600 2131161 2079024
5538B079024Q0145N9337J48141l17K2782K3146J02805P3815L7941O4359j9749
$$ 2079024 2159169 2218506 2366647 2366330 2389112 2412258 2515063 2588878 2626819 2691178 2671429
5527B671429L3325J7060L3731L2490Q3988J34010M9280J21546J38220n8410J17148
$$ 2671429 2704754 2721814 2755545 2788035 2872023 3006033 3055313 3176859 3315079 3256669 3373817
5516C373817L1431K0949M1296M9880J38597O9457J14499L8055J03578O887J65494
$$ 3373817 3405248 3426197 3467493 3517373 3655970 3725427 3839926 3877981 3981559 3988446 4153940
5505D153940J56240J37794j7554L1683K21885J39746J11882Q4005J63396J29059
$$ 4153940 4310180 4447974 4430420 4462103 4683988 4823734 4935616 5019621 5183017 5312076
5495E312076O6556J20603K04138J99202J6135L0199J63298J18085J18562J74275
$$ 5312076 5378632 5499235 5703373 5902575 5918710 5948909 6112207 6230292 6348854 6523129
5485F523129Q0554Q3652J51409J9059J73066N6317J23723K06878J21692N4418
$$ 6523129 6603683 6687335 6838744 6857803 7030869 7087186 7210909 7417787 7539479 7593897
5475G593897L3814J55264O5356J26710k7859P1248J31637L2249J85422J42470
$$ 7593897 7627711 7782975 7848331 7975041 7947182 8018430 8150067 8182316 8367738 8510208
5465H510208J01678k2225L2735R2578L6168J13038Q7340L2033K2315M1720J42624
$$ 8510208 8611886 8589661 8622396 8714974 8751142 8864180 8951520 8983553 9005868 9047588 9190212
5454I190212P5317J37458J54800J79421K6345L568J9076J20558J14163N3541Q1529
$$ 9190212 9265529 9402987 9557787 9737208 9763553 9767121 9786197 9906755 10020918 10074459 10155988
5443A0155988N9450k0679Q0445J17387J14944R2649J40863J51164Q6650J44900
$$ 10155988 10215438 10194759 10275204 10392591 10507535 10600184 10741047 10892211 10978861 11123761
5433A1123761O3070J00602L9109J19358J08696J10144P2949M8315J03042K3511
$$ 11123761 11186831 11287433 11326542 11445900 11554596 11664740 11737689 11786004 11889046 11912557
5423A1912557J15565J54373R9827l2641o7860J2722R9604l0382O326m137l5754
$$ 11912557 12028122 12182495 12282322 12249681 12181821 12194543 12294147 12263765 12270091 12265954 12230200
5412A2230200q5684P1138n7796Q9681r0233j71299j13166k2931k3888q5965K2511
$$ 12230200 12144516 12215654 12157858 12247539 12157306 11986007 11872841 11849910 11826022 11740057 11762568
5401A1762568K3235l6504r0223m2504m5979o7738m3428j64985j35123j17402j90853
$$ 11762568 11785803 11749299 11659076 11616572 11570593 11502855 11459427 11294442 11159319 11041917 10851064
5390A0851064j30869p9284j22268j68345j41172j70106o1970q1363o1940j07948
$$ 10851064 10720195 10640911 10518643 10350298 10209126 10039020 9977050 9895687 9833747 9725799
5380I725799o5391m9382k1426j49057l9977J2544j3166q8075L6489L6716l345
$$ 9725799 9660408 9611026 9589600 9440543 9400566 9413110 9399944 9311869 9348358 9385074 9381729
5369I381729P6639N6236L1290J31253J9817O8650Q2366O6526O5856O1939J31255
$$ 9381729 9458368 9514604 9545894 9677147 9696964 9765614 9847980 9914506 9980362 10042301 10173556
5358A0173556P4585R563N7859J610J19333J83479J4033j4474R893J66661J51431
$$ 10173556 10248141 10257704 10315563 10317173 10436506 10619985 10634018 10619544 10629437 10796098 10947529
5347A0947529J8208J63041J38582N3862J6588Q8959K9061J20894K12165M5705
$$ 10947529 10965737 11128778 11267360 11321222 11337810 11426769 11455830 11576724 11788889 11834594
5337A1834594J30715J60318K50899K55999J63477K09478J37558K54717K03124
$$ 11834594 11965309 12125627 12376526 12632525 12796002 13005480 13143038 13397755 13600879
5328A3600879K55625K07177K25836L86100L40413L99231K71047L37016L81485
$$ 13600879 13856504 14063681 14289517 14675617 15016030 15415261 15686308 16023324 16404809
5319A6404809L36131L98940K78052M04231L07311L68690L63886L48954M04551
$$ 16404809 16740940 17139880 17417932 17822163 18129474 18498164 18862050 19211004 19615555
5310A9615555M59455L98834L90365N23815N52614M92586N01578N86051N90130
$$ 19615555 20075010 20473844 20864209 21388024 21940638 22433224 22934802 23520853 24110983
5301B4110983O40959O08114O38338P38120O98824O55932Q20008Q22810Q94954
$$ 24110983 24751942 25360056 25998394 26736514 27435338 28091270 28911278 29734088 30629042
5292C0629042P46459P72399R22434R53067Q60452Q25147P38413P59153P62801
$$ 30629042 31375501 32147900 33070334 34023401 34883853 35709000 36447413 37206566 37969367
5283C7969367Q70405J057323J090202J180018J072520J106453J273297J225288
$$ 37969367 38839772 39897095 40987297 42167315 43239835 44346288 45619585 46844873
5275D6844873J339399J301619J343556J322174J272789J239643J279912J188156
$$ 46844873 48184272 49485891 50829447 52151621 53424410 54664053 55943965 57132121
5267E7132121J338821J415838J443757J737554J746236J814202J969423K220601
$$ 57132121 58470942 59886780 61330537 63068091 64814327 66628529 68597952 70818553
5259G0818553K371311K629948K750031K894315L060455L204371L170230L441502
$$ 70818553 73189864 75819812 78569843 81464158 84524613 87728984 90899214 94340716
5251I4340716L765959M132723M340637M661807N147839N608456O040102O662309
$$ 94340716 98106675 102239398 106580035 111241842 116389681 121998137 128038239 134700548
5243A34700548P515443Q482510R552054J0938065J2404509J3902684J5770262
$$ 134700548 142215991 150698501 160250555 171188620 183593129 197495813 213266075
5236B13266075J7627013J9783280K2227027K5210639K7916716L0324512L1753700
$$ 213266075 230893088 250676368 272903395 298114034 326030750 356355262 388108962
5229C88108962L0804405K7155804K0322371J0219959j761794j3933588k4436130
$$ 388108962 418913367 446069171 466391542 476611501 474849707 460916119 436479989
5222D36479989l2027759l5074610l4589275l2122153k8872271k5199802k1778032
$$ 436479989 404452230 369377620 334788345 302666192 273793921 248594119 226816087
5215B26816087j8856945j6251485j4093998j2483312j1274819j0368821r348132
$$ 226816087 207959142 191707657 177613659 165130347 153855528 143486707 134138575
5208A34138575q389901p647055o846684n987342n457905m796214m304420l997159
$$ 134138575 125748674 118101619 111254935 105267593 99809688 95013474 90709054 86711895
5200H6711895l652280l567612l402304l198827l044434k893681k736206k562327
$$ 86711895 83059615 79492003 76089699 72890872 69846438 66952757 64216551 61654224
5192F1654224k481704k191180j997107j903623j740540j710769j583794j548590
$$ 61654224 59172520 56981340 54984233 53080610 51340070 49629301 48045507 46496917
5184D6496917j528929j385856j278961j207830j038557j121380j219630j003664
$$ 46496917 44967988 43582132 42303171 41095341 40056784 38935404 37715774 36712110
5176C6712110j024363j049620j035207r61721q21338q49895p11100p23112o59195
$$ 36712110 35687747 34638127 33602920 32641199 31819861 30969966 30258866 29535754 28876559
5167B8876559o50384n88873n74082n07255m79980m53825n53176n49662m79373
$$ 28876559 28226175 27637302 27063220 26555965 26075985 25622160 25068984 24519322 24039949
5158B4039949l43138m60065m05116m26805n27535l80148l87997m09141l78620
$$ 24039949 23696811 23236746 22831630 22404825 21877290 21497142 21109145 20700004 20321384
5149B0321384l68592l73783m68340k51117m50651m74169l55870m20768l96339
$$ 20321384 19952792 19579009 19110669 18859552 18408901 17934732 17578862 17158094 16761755
5140A6761755l63958l53669k93293l97217l18317l80392l15417j39982k19428
$$ 16761755 16397797 16044128 15750835 15353618 15035301 14654909 14339492 14199510 13980082
5131A3980082k58034o1808o9659j41021j61576k56551K0552J5990j25001j56080
$$ 13980082 13722048 13660240 13590581 13449560 13287984 13031433 13051985 13067975 12942974 12786894
5121A2786894q4911j99093j10878J9867n5888p2620o9655o4420j42289j69486
$$ 12786894 12701983 12502890 12392012 12411879 12355991 12283371 12213716 12149296 12007007 11837521
5111A1837521r4788j24692j13054o3418j28096k7208j77439j37335k11091j36289
$$ 11837521 11742733 11618041 11504987 11441569 11313473 11286265 11108826 10971491 10760400 10624111
5101A0624111k7131j19274j71783o2440M3077j09882q9500r9691p3949k6776L7710
$$ 10624111 10596980 10477706 10305923 10243483 10286560 10176678 10087178 9987487 9913538 9886762 9924472
5090I924472o6241p1489j9925l8137l9768l8236q4441o1397j1789r7557J0390
$$ 9924472 9858231 9786742 9766817 9728680 9688912 9650676 9566235 9504838 9493049 9395492 9405882
5079I405882k7435j02269k0572j06053j12445j2934n8645j04987j46724j74296
$$ 9405882 9378447 9276178 9255606 9149553 9037108 9024174 8965529 8860542 8713818 8539522
5069H539522n129n2666r1517N534o3580L5704k9936j17543O581j16727J978q0386
$$ 8539522 8534393 8481727 8390210 8395744 8332164 8367868 8337932 8220389 8226970 8110243 8112221 8031835
5057H031835j9618J21988M1323Q5218M9961n6043J12034J04767J5895J38411Q6796
$$ 8031835 8012217 8134205 8175528 8260746 8310707 8254664 8366698 8471465 8487360 8625771 8712567
5046H712567R4234R5628N0368J48198J74062J74205O8314P2732Q4551J7219J36617
$$ 8712567 8806801 8902429 8952797 9100995 9275057 9449262 9517576 9590308 9674859 9692078 9828695
5035I828695N6855J693J38742P742L0039k499J18954q1999q7638j4341Q4547n9798
$$ 9828695 9885550 9887243 10025985 10033727 10063766 10061267 10180221 10098222 10010584 9996243 10080790 10020992
5023A0020992j20232N3146J227j22615p4953j04196k3043J8792R3508R4871j6069
$$ 10020992 9900760 9953906 9955133 9832518 9757565 9653369 9630326 9649118 9742626 9837497 9821428
5012I821428J03282l700p2150L1095Q615N6883J2741r0723l5650J47703L4147
$$ 9821428 9924710 9921010 9848860 9879955 9888570 9945453 9958194 9867471 9831821 9979524 10013671
5001A0013671o1138J06333n5809o5173N6654M1811m4376p6061m4604P5948p5435
$$ 10013671 9952533 10058866 10003057 9937884 9994538 10036349 9991973 9915912 9871308 9947256 9871821
4990I871821n5061p5679j90749m8340l0114m6126p5793j20088p8335j29893n3805
$$ 9871821 9816760 9741081 9550332 9501992 9471878 9425752 9349959 9229871 9151536 9021643 8967838
4979H967838j17059j01701r4535o7782j69889o6031l9941K5009k4790j28506k4772
$$ 8967838 8850779 8749078 8654543 8586761 8416872 8350841 8310900 8335909 8311119 8182613 8157841
4968H157841J159L1403r5543J926K3858j07523M5850J8371l0892k9059q4919q6653
$$ 8157841 8159000 8190403 8094860 8096786 8120644 8013121 8058971 8077342 8046450 8017391 7932472 7845819
4956G845819j8187j00053p74n4605k7780q8728k06693N4488k06745j00528M1614
$$ 7845819 7827632 7727579 7726805 7672200 7644420 7555692 7348999 7403487 7196742 7096214 7137828
4945G137828j5467M963m3008m3482l1975R0828p0794j19444L8258k8476L4792
$$ 7137828 7122361 7127324 7084316 7040834 7008859 7099687 7028893 6909449 6947707 6919231 6954023
4934F954023R0776J10352j4426J30069J15442O0650J34853J03407J06589K38668
$$ 6954023 7044799 7155151 7140725 7270794 7386236 7446886 7581739 7685146 7791735 8030403
4924H030403K04435P7321J43388J73465L25393J37174J83165L17561J06018J35853
$$ 8030403 8234838 8312159 8455547 8629012 8954405 9091579 9274744 9592305 9698323 9834176
4914I834176K90883K37904K26615J83221K13464K17167J79239M5504K09673J05061
$$ 9834176 10125059 10362963 10589578 10772799 10986263 11203430 11382669 11428173 11637846 11742907
4904A1742907J43868J39030J09458N5363J31275J29085K2571J00609Q5538q6908
$$ 11742907 11886775 12025805 12135263 12190626 12321901 12450986 12473557 12574166 12659704 12572796
4894A2572796P8105L1530m8883O2965o6938j00808k08329J5668n3634j64655j96210
$$ 12572796 12650901 12682431 12633548 12696513 12629575 12528767 12320438 12336106 12282472 12117817 11921607
4883A1921607j54336j07992k54855j64705p9723p4157j10173r3713j38017k09943
$$ 11921607 11767271 11659279 11404424 11239719 11159996 11085839 10975666 10881953 10743936 10533993
4873A0533993j35956k78916j86740j20650j32746j98262j85590k14557k57908
$$ 10533993 10398037 10119121 9932381 9811731 9678985 9480723 9295133 9080576 8822668
4864H822668j08341N857j20688j52799q0981j05076K822n6274r6721n7959k335
$$ 8822668 8714327 8720184 8599496 8446697 8365716 8260640 8263462 8207188 8110467 8052508 8050173
4853H050173N316O7296n6Q009N4925J45220Q8702m2814J41370O5964Q0671J06518
$$ 8050173 8055489 8122785 8122729 8130738 8185663 8330883 8419585 8376771 8518141 8584105 8664776 8771294
4841H771294J47508J26363J64738Q5787J52934J64538J70749J73364J56256M2693
$$ 8771294 8918802 9045165 9209903 9295690 9448624 9613162 9783911 9957275 10113531 10156224
4831A0156224P3367K62151J40460J73441K35869K10625J00029K17167K70674J99020
$$ 10156224 10229591 10491742 10632202 10805643 11041512 11252137 11352166 11569333 11840007 12039027
4821A2039027J47672J22709K44998J44248J71438J09371J12764L29938K82233
$$ 12039027 12186699 12309408 12554406 12698654 12870092 12979463 13092227 13422165 13704398
4812A3704398K03228J54399J69161L99191L62821L39318K29012J73823M23944
$$ 13704398 13907626 14062025 14231186 14630377 14993198 15332516 15561528 15735351 16159295
4803A6159295L65225L95843M46424M00683M68363N66726N79521N61983O90802
$$ 16159295 16524520 16920363 17366787 17767470 18235833 18802559 19382080 19944063 20634865
4794B0634865O73606P48365Q18848Q40284J092001J219473J173711J339226J395538
$$ 20634865 21308471 22056836 22875684 23715968 24807969 26027442 27201153 28540379 29935917
4785B9935917J421980J539570J707830J622070J678840J665511J607071J511434
$$ 29935917 31357897 32897467 34605297 36227367 37906207 39571718 41178789 42690223
4777D2690223J296034J161019R63075P48826N30990K80148L36726J34420L9642
$$ 42690223 43986257 45147276 46110351 46859177 47390167 47670315 48007041 48141461 48181103
4768D8181103J039j32168n183p3654j08297j54889l27285m72934m91342n61544
$$ 48181103 48182142 48049974 48044791 47971137 47862840 47707951 47380666 46907732 46416390 45854846
4758D5854846p54471j064148j273743j392641j546004j701266j807316j760333
$$ 45854846 45100375 44036227 42762484 41369843 39823839 38122573 36315257 34554924
4750C4554924j876932j786713j587614j716837j473143j707891j344828j135642
$$ 34554924 32677992 30891279 29303665 27586828 26113685 24405794 23060966 21925324
4742B1925324j230349j076774r54407q43571q18072q03866p14401o84969o67798
$$ 21925324 20694975 19618201 18663794 17820223 17002151 16198285 15483884 14798915 14131117
4733A4131117o56288m31872m40870n86534m74153m39264l21666m85047l64744
$$ 14131117 13474829 13042957 12602087 12015553 11541400 11102136 10780470 10295423 9930679
4724I930679l18535l63037l06323j70247k38008l48486l00492k19192j70941k59991
$$ 9930679 9612144 9249107 8942784 8772537 8534529 8186043 7885551 7666359 7495418 7235427
4714G235427j58278k29438k30555l5254p8403j34914k17594j75436j71138j61804
$$ 7235427 7077149 6847711 6617156 6581902 6503499 6368585 6150991 5975555 5804417 5642613
4704E642613q9642j21634j26241q5480r0981j43293n274j55072r6107j10870m3324
$$ 5642613 5552971 5431337 5305096 5219616 5128635 4985342 4980068 4824996 4728889 4618019 4574695
4693D574695j56168r9332j36822j99759n5017J4240j19556l7200o145j08510j86932
$$ 4574695 4418527 4319195 4182373 3982614 3927597 3941837 3822281 3785081 3778936 3670426 3483494
4682C483494m0746n6511K6121j32481r9758m8164p3592l2319l9739n3796j19409
$$ 3483494 3442748 3386237 3412358 3279877 3180119 3131955 3058363 3026044 2986305 2932509 2813100
4671B813100J5475q7810N838o4883m5509j02453N866j44889l9770Q3078n2000
$$ 2813100 2828575 2740765 2746603 2681720 2636211 2533758 2539624 2394735 2354965 2438043 2386043
4660B386043k891L4533o1206k9593k5333o9512l6210p4096N157l7839p2331m094
$$ 2386043 2383152 2417685 2356479 2326886 2301553 2232041 2195831 2121735 2126892 2089053 2016722 2012628
4648B012628n7695L3334o8358m7955p2803N0501M1389j00187r1876M8670r395
$$ 2012628 1954933 1988267 1919909 1871954 1799151 1849652 1891041 1790854 1698978 1747648 1738253
4637A738253m7832k6790n0661o2131N9700N3227r5266j1665M0120p1241p060J01123
$$ 1738253 1690421 1663631 1612970 1550839 1610539 1663766 1568500 1556835 1596955 1525714 1518654 1619777
4625A619777m2995j24083k480L9816j8995K1510L7302l9799l2771K5971p5838
$$ 1619777 1576782 1452699 1450219 1490035 1471040 1492550 1529852 1490053 1457282 1483253 1407415
4614A407415p9554K6025j5872r70M8870p4475m5396q6795M1773P6662M5500L1918
$$ 1407415 1327861 1353886 1338014 1337044 1385914 1311439 1266043 1179248 1221021 1297683 1343183 1375101
4602A375101n7257M6914j11698O9J2796M2683q136R6196q705j79336J0063n3686
$$ 1375101 1317844 1364758 1253060 1253129 1265925 1308608 1300472 1396668 1387963 1208627 1218690 1165004
4590A165004L9306J11453l2389J9443p172p5896N9585K2519m5188J0126p0494
$$ 1165004 1204310 1315763 1283374 1302817 1295645 1219749 1279334 1301853 1256665 1266791 1196297
4579A196297L4126j04837p4378M4106L1450N504L3425r862j24036K1839p3930
$$ 1196297 1230423 1125586 1051208 1095314 1126764 1132268 1165693 1155831 1031795 1053634 979704
4568I79704O2977J82994j06096j37826J9325J06565J6970j05381k0566K4354P5362
$$ 979704 1042681 1225675 1119579 981753 1001078 1107643 1124613 1019232 998666 1023020 1098382
4557A098382o8956n1563L0005m5147r6673O6510O1611M045n3872P5081K7359o4420
$$ 1098382 1029426 977863 1007868 962721 866048 932558 994169 998214 944342 1019423 1046782 982362
4545I82362O8061o8318j39748R4431M4554Q312K2310K2738n8285k2757j7362k749
$$ 982362 1050423 982105 842357 936788 981342 989654 1011964 1034702 976417 953660 936298 933549
4533I33549J22767M5236p7569k9671K3548M5935j14823j888P3451o4258j2911
$$ 933549 1056316 1101552 1023983 994312 1017860 1063795 948972 947084 1020535 956277 943366
4522I43366O9844M8267l4508k1248p485M4659o1178j6683K7565J6533K0504m3143
$$ 943366 1013210 1061477 1026969 1005721 998236 1042895 981717 965034 992599 1009132 1029636 986493
4510I86493M0035L9227L0285q4714l0666J07815k060J5517k811j2666n5189L562
$$ 986493 1026528 1065755 1096040 1011326 980660 1088475 1086415 1101932 1099121 1086455 1031266 1034828
4498A034828Q0551J213k4636J575P9398k8205M6201L0560L8987j20137J5283o9210
$$ 1034828 1115379 1116592 1091956 1093531 1172929 1144724 1190925 1221485 1260472 1140335 1155618 1086408
4486A086408J8807P9401R7004k5945j06975J62253N711m0158m625J12469r9125
$$ 1086408 1105215 1184616 1281620 1255675 1148700 1310953 1316664 1276506 1271881 1384350 1285225
4475A285225M7430M4730J4996P8587j4660j765Q4948m1225P7581N7309n6969Q6906
$$ 1285225 1332655 1377385 1392381 1470968 1456308 1454543 1539491 1498266 1575847 1633156 1576187 1663093
4463A663093M4940n6233o0734j4993J35049J32081M2602o392M1010L2685P8975
$$ 1663093 1708033 1651800 1591066 1576073 1711122 1843203 1885805 1879413 1920423 1953108 2032083
4452B032083J34232n20k5816P4196J09370J9697R1576P5254k954Q7081J28769
$$ 2032083 2166315 2165795 2139979 2214175 2323545 2343242 2434818 2510072 2507118 2594199 2722968
4441B722968P4807K8390L4245R563J5915R0037J32909Q8893J22445Q0811j1340
$$ 2722968 2797775 2826165 2860410 2869973 2885888 2975925 3108834 3197727 3320172 3400983 3389643
4430C389643J06904m481L806Q0302P7768J32513Q6605J53287Q8982J06537J80918
$$ 3389643 3496547 3492066 3495872 3576174 3653942 3786455 3873060 4026347 4115329 4221866 4402784
4419D402784J19304J32926J35352J62192K01865J73402K01218K80106L88975L31076
$$ 4402784 4522088 4655014 4790366 4952558 5154423 5327825 5529043 5809149 6198124 6529200
4409F529200L34650K67280L69404M57940N67828N08235N94543O20393P11148P39536
$$ 6529200 6863850 7131130 7500534 7958474 8526302 9034537 9629080 10249473 10960621 11700157
4399A1700157P07078P32611O07009O95932P94189P03550P20938N99855O36293
$$ 11700157 12407235 13139846 13746855 14442787 15236976 15940526 16661464 17261319 17897612
4390A7897612O86743M63882M94525M64414L36590L31394L47087J53637O3585n7302
$$ 17897612 18584355 19048237 19542762 20007176 20343766 20675160 21022247 21175884 21239469 21182167
4380B1182167j95423l25468m75554m72357m81033n13653n91184n79211n73980
$$ 21182167 20986744 20661276 20185722 19713365 19232332 18718679 18127495 17548284 16974304
4371A6974304q17170p87159p70328o79498p49796q35214o58026p03098p41621
$$ 16974304 16157134 15369975 14599647 13920149 13170353 12335139 11677113 10974015 10232394
4362A0232394n36183o59470o06462n07599p03872m99793m29343l57745k93675
$$ 10232394 9696211 9036741 8430279 7922680 7218808 6719015 6289672 5931927 5638252
4353E638252l19171j94477k51569k79145l48192p1228k03059k63469K6557q3657
$$ 5638252 5319081 5124604 4873035 4593890 4245698 4174470 3971411 3707942 3734499 3650842
4343C650842j46491j09920j76538j51801j76055n8922j20359k4579j15883j62587
$$ 3650842 3504351 3394431 3217893 3066092 2890037 2831115 2710756 2686177 2570294 2407707
4333B407707p4718n4004p2819m0526J6002j43277K0734j02108o0083K7819k9086
$$ 2407707 2332989 2278985 2206166 2165640 2181642 2038365 2059099 1956991 1896908 1924727 1895641
4322A895641o2536n8155o236p3919K4845q4840j00136j8830m179O548m7056q7625
$$ 1895641 1833105 1774950 1768714 1694795 1719640 1634800 1534664 1515834 1511655 1518203 1471147 1383522
4310A383522r5513j04933k6613L1749k6522K385O4892j12420j19233J26052L8196
$$ 1383522 1288009 1183076 1156463 1188212 1161690 1164075 1228967 1116547 997314 1123366 1161562
4299A161562r3043k7540K7033k7914n5203P9363k0363j36694R9431j6787R627
$$ 1161562 1068519 1040979 1068012 1040098 984895 1064258 1043895 907201 1006632 989845 999472
4288I99472n5369m2422k5377k0020o6265P3776m6836n779K5803o1415m6192q0662
$$ 999472 944103 901681 876304 856284 790019 863795 816959 811180 836983 775568 729376 648714
4276F48714O3314n1581J2900K0172M6145L4840n8474j26141J9367k1640Q1953
$$ 648714 712028 660447 673347 693519 739664 774504 716030 589889 609256 587616 669569
4265F69569O1413j15050n0199k033l2078j2939k9627q88J25322N6200j7625j02251
$$ 669569 730982 615932 565733 563700 531622 518683 489056 488168 613490 669690 652065 549814
4253E49814l1176m8240p3369N4252J9339k3974o0405p601N0907p0072O4556J14842
$$ 549814 518638 470398 397029 451281 470620 446646 386241 378640 429547 359475 424031 538873
4241E38873l9883j35607k1427K9434P900k6868j3212J9688R6792L4771m6760M2883
$$ 538873 498990 363383 341956 371390 379290 352422 339210 358898 455690 490461 443701 486584
4229D86584M0481r5623n6424o8270K9892M1359J4546m8741q9311k825L842R2134
$$ 486584 527065 431442 375018 306748 336640 377999 392545 343804 254493 251668 255510 347644
4217C47644P6595J6550J8677j8332j6231p3937O83J25585r0040o1940J5821m8307
$$ 347644 424239 440789 459466 441134 424903 350966 351649 477234 387194 325254 341075 292768
4205B92768n4737n0130j7206J4971N8923M9352L0073L312m6891K3081j9512K1416
$$ 292768 238031 187901 170695 185666 244589 293941 324014 327326 280435 303516 284004 305420
4193C05420L732j2912N1461q6726n9786J75767k7592J0956O901P602j37212J8586
$$ 305420 309152 296240 347701 260975 201189 376956 349364 360320 367221 374823 237611 256197
4181B56197P4147j07431J01572m682K9030J617n0587j3744q321k3888m2338J17716
$$ 256197 330344 222913 324485 319803 348833 350450 299863 286119 277798 253910 211572 329288
4169C29288J9457q2530O474Q2859p076R738j60427m4431O5918k1044K3841j7551
$$ 329288 348745 266215 272689 355548 348472 358210 197783 153352 219270 198226 222067 204516
4157B04516R4908K9919l2526j09689Q6438M6201q9692P726P2105L9903R1770o5164
$$ 204516 299424 329343 296817 187128 273566 319767 230075 237801 309906 349809 441579 376415
4145C76415m2662r457n655L5698o993J7957M9966o9817l8200N9324o5990M8960
$$ 376415 333753 324296 318641 354339 347346 365303 415269 345452 307252 366576 300586 349546
4133C49546m0204l7365j15277R5061Q5877q9427P8416O2375m6120p2672M7098
$$ 349546 309342 271977 156700 251761 337638 248211 326627 389002 342882 270210 317308
4122C17308Q0319Q9292j33075P811l4840R331L0022N8994K6416p1460J2145R057
$$ 317308 397627 486919 353844 361655 326815 336146 366168 425162 451578 380118 392263 401320
4110D01320p5836L1336M9245m6322R967o6288J52419M8189l8491K4928N5690r3566
$$ 401320 325484 356820 406065 359743 369710 303422 455841 504030 465539 490467 546157 452591
4098D52591K425p7580j3457J41404m055J6005n185m7218j6271M411K654Q4013
$$ 452591 455016 377436 363979 505383 501328 517333 512148 464930 448659 453070 455724 539737
4086E39737K9505k1329j0547r1990J6320J75840n3315r0361J12351M9230o8690
$$ 539737 569242 547913 537366 445376 461696 637536 584221 493860 606211 655441 586751
4075E86751k5100J33082o1412n6698J27194k3854q4970M1776l562m5853M3720
$$ 586751 561651 694733 633321 576623 703817 679963 594993 636769 633207 587354 631074
4064F31074M3366p6541j14513R9133J14091R0980l6840j33369k1604K9170N1390
$$ 631074 674440 597899 483386 582519 696610 787590 750750 617381 595777 624947 676337
4053F76337L0706o34M898j2637R4805J07034k8242p265J737Q813R6265l373O3371
$$ 676337 707043 706409 711307 698670 793475 900509 872267 865002 866739 875552 971817 968444 1031815
4040A031815j3073o9162p907o7501J22149K1535j05196J2544J68379R9404o7847
$$ 1031815 1018742 949580 941673 874172 996321 1017856 912660 925204 1093583 1192987 1125140
4029A125140J7104R8388K8479J355J49210k0876J2902R2231J4733K5788J37943
$$ 1125140 1142244 1240632 1269111 1270466 1419676 1398800 1411702 1503933 1518666 1544454 1682397
4018A682397P9353P1217J31303J40245J21832J37406J97860K58782K12921K60630
$$ 1682397 1761750 1832967 1964270 2104515 2226347 2363753 2561613 2820395 3033316 3293946
4008C293946K94443M46489M58914N11834O03253L82044N12240L61591J32955j87773
$$ 3293946 3588389 4034878 4493792 5005626 5608879 5990923 6503163 6864754 6997709 6809936
3998F809936m25890n33568o49267o34723n43370m17419l42060k43470l01069l12560
$$ 6809936 6384046 5850478 5201211 4566488 4023118 3605699 3263639 3020169 2719100 2406540
3988B406540j31072j20764m3319k07067j78912j36481j36883m8376l7487j25840
$$ 2406540 2275468 2154704 2111385 1904318 1725406 1588925 1452042 1403666 1366179 1240339
3978A240339o1724n4526o1903j2315J3610j05645j09608m2781l6135N2o6276P3606
$$ 1240339 1178615 1124089 1062186 1049871 1063481 957836 848228 805447 769312 769364 703088 776694
3966G76694k7488n3757k6560k8689r3319N9760P7238k4696j9308l0554q6106r5069
$$ 776694 749206 695449 668889 640200 546881 606641 683879 659183 639875 609321 523215 428146
3954D28146L990P2350m0443J7618J5900m5804j7283j9377K9335l9431J1441j12418
$$ 428146 432136 504486 464043 481661 497561 451757 434474 415097 444432 405001 416442 304024
3942C04024l8499Q5879L7267p7254o9688J5221J7242n342R1282q8448n663J02333
$$ 304024 265525 351404 388671 311417 241729 256950 274192 268850 360132 271684 266021 368354
3930C68354k7577L0615o509p9813M6055M8066o2695p7857p5758r763J66247O0181
$$ 368354 340777 371392 364883 285070 331125 379191 316496 238639 162881 153118 319365 379546
3918C79546o5070l1473K9809L928j31246K2889K2669N6730n8156q010L8936p4845
$$ 379546 314476 283003 312812 316740 185494 208383 231052 287782 229626 221616 260552 185707
3906A85707n2600J17887j9764o6754k1938O794L5754k5699N9513k1503k7527J06137
$$ 185707 133107 250994 231230 164476 142538 149332 185086 159387 218900 197397 169870 276007
3894B76007q3869n8985l9792J38765M1411j46305j08366N9031Q2215m5772P0234
$$ 276007 192138 133153 93361 232126 273537 127232 18866 77897 160112 114340 184574
3883A84574Q2715r1919l6245R8600q0192K96j01951j1990Q0286K2585J01757j21558
$$ 184574 267289 175370 139125 237725 157533 157829 55878 43888 124174 146759 248516 126958
3871A26958o4804J6849k0497L7740M4230K5059o1851q0999J1734J11601N7122
$$ 126958 62154 79003 58506 96246 140476 165535 103684 22685 34419 146020 203142
3860B03142J15006m1246n6754j7862K147L0329o3086l28M6168l2444m7804J00884
$$ 203142 318148 276902 220148 202286 204433 234762 171676 171348 217516 185072 137268 238152
3848B38152L0713n9918l775j2046P206o9145j259J8593k9685j5461j8160L1426
$$ 238152 268865 208947 205172 193126 200332 131187 129928 148521 118836 103375 85215 116641
3836A16641Q9821k8253j01241J06199J09390j47458n4739j2961P7374k4270j49998
$$ 116641 206462 178209 76968 183167 292557 145099 90360 77399 154773 130503 -19495
3825a9495J02481M2595l998j1664L9496R8523l6061j3955n2110M1365n6809j9345
$$ -19495 82986 125581 121583 109919 149415 247938 211877 197922 145812 187177 130368 111023
3813A11023l376m7538l615m6543q12L7769P5682o0317K1413O2090k1132K3675
$$ 111023 107647 60109 56494 9951 9139 46908 122590 62273 83686 145776 124644 148319
3801A48319k9156O0838K8667p1130O113J214K5429j5450J5590p527K0652l2901
$$ 148319 119163 180001 208668 137538 143651 144865 170294 154844 170434 162907 183559 150658
3789A50658p4939R607Q6738k0996m2182J8760O3045j4087j9295Q5909k3679o7476
$$ 150658 75719 85326 172064 151068 108886 127646 190691 176604 157309 243218 219539 152063
3777A52063L2368M3214M6685N8383n7859m020L085r987L3980q2025l7670N9100
$$ 152063 184431 227645 274330 332713 274854 270834 273919 263932 297912 215887 178217 237317
3765B37317J6298n0622K1461k2117o3830l1169N5714j2978K3425P9867o3859l0701
$$ 237317 253615 202993 224454 202337 138507 107338 163052 150074 173499 253366 189507 158806
3753A58806K2565O8927j3551j5589N5746L3922j75929j7425M4510p4254k7612
$$ 158806 181371 250298 236747 221158 276904 310826 134897 117472 161982 87728 60116
3742F0116K07773n0687J4387R8214j00075J7965m665J4702L7014o100r735O8708
$$ 60116 267889 217202 231589 329803 229728 247693 243028 257730 294744 288644 278909 347617
3730C47617J3880P3869j0071r0856q3619O6004l4547Q3700K2677k4219p7437K6364
$$ 347617 361497 435366 425295 334439 250820 316824 282277 365977 388654 364435 286998 313362
3718C13362r8720l589m3755P5918L6759m3736Q2343m0991J00313M1842J2884j87007
$$ 313362 214642 211053 167298 243216 279975 236239 318582 277591 377904 419746 432630 245623
3706B45623k1081K8140l2820K1836p541p8663L4346Q2033m6724k0414k2557J0477
$$ 245623 224542 252682 219862 241698 234157 155494 189840 271873 225149 204735 182178 192655
3694A92655J9195q0544Q6712M0736N7515m8448q0911l8110j817M6398Q755J00632
$$ 192655 211850 131306 218018 258754 316269 267821 186910 148800 146983 193381 202136 302768
3682C02768J9903l8448q4959K8844n2700L9799J5488o9119j00647O8260N7440
$$ 302768 322671 284223 199264 228108 175408 215207 230695 161576 60929 129189 186629
3671A86629O5703Q1192j47077j6720J9093o396K6003j0107L7592M4881j6602j1324
$$ 186629 252332 333524 186447 169727 188820 182424 208427 198320 235912 280793 264191 252867
3659B52867Q2408m8246j33468r932o1608J41206L032J4082n2219L6371k563p3972
$$ 252867 335275 287029 153561 143629 82021 223227 226259 240341 188122 224493 221930 147958
3647A47958k5234R3924n7867k532o965K5017L4636J5872o0552o2601O5455O7099
$$ 147958 122724 216648 158781 156249 149284 174301 208937 224809 164257 101656 167111 234210
3635B34210r8056n2132P5927O9133L8303P6673n993K2548l8582j01413J15961
$$ 234210 136154 84022 159949 229082 267385 344058 338065 360613 322031 220618 336579
3624C36579J05026j31726m4012L7187m5196q0846q9429J87o787K13810o3883o4369
$$ 336579 441605 309879 265867 303054 257858 177012 87583 87770 80983 294793 230910 166541
3612A66541M891k8942L0888L2363K8140q00j00940j6250L0679P9861L0150m8128
$$ 166541 171432 142490 173378 205741 233881 233081 132141 115891 146570 226431 256581 208453
3600B08453k6929Q6377o4813m7733L9575K9127L0369q6865P861J21457J880P315
$$ 208453 181524 267901 203088 155355 194930 224057 254426 167561 175422 296879 298759 306074
3588C06074J6027L1760M2543n3476j16997J54791J20289j03662J9540j0388J60157
$$ 306074 322101 353861 396404 342928 225931 380722 501011 397349 416889 406501 566658
3577E66658J1178n1077k6781j03889k6121q5912N5186j9970M8692m814L7526o6937
$$ 566658 577836 526759 499978 396089 369968 284056 339242 319272 367964 363150 400676 333739
3565C33739J8625q2399J56769N0303P302j00966k9496P4242n9928K8547m3056
$$ 333739 352364 269965 426734 477037 484339 383373 353877 428119 368191 396738 353682
3554C53682K5560L1103m457j42995J5216Q3362N6367J7928o6120o5256k787J41337
$$ 353682 379242 410345 405888 262893 278109 361471 417838 435766 369646 304390 301603 442940
3542D42940N9935j05085k3630p2376K4786J5907N2790Q770M3908j13582N236M7843
$$ 442940 502875 397790 374160 301784 326570 342477 395267 404037 447945 334363 339599 387442
3530C87442l6610P7982L9316l4204N0605N258q8765k3691Q82o6204L2606L694
$$ 387442 350832 428814 468130 433926 484531 489789 401024 377333 378215 312011 344617 348311
3518C48311P1001l9201l8941j01458l6887p3922O3303L7133J8678R4417o7971
$$ 348311 419312 380111 341170 239712 202825 128903 192206 229339 248017 342434 274463
3507B74463j3516l2067l4995K0785R37o4500J737M5401M0596q373J662m5731O1941
$$ 274463 260947 228880 193885 214670 215607 151107 152844 198245 238841 230468 232130 186399 248340
3494B48340k163K492N8171p0520l6923j5865l8240O4667K2085j4545j09233L8178
$$ 248340 246177 248669 306840 236320 199397 183532 145292 209959 232044 217499 108266 146444
3482A46444P2227J4240j6067j1743J67434m2931j30691l4970p6010O3295J28295
$$ 146444 218671 232911 216844 205101 372535 329604 198913 163943 87933 151228 279523
3471B79523r2617K2931K2099k3716o581r767J0693p6257l2639J3682O7470O2877
$$ 279523 186906 209837 231936 208220 201639 191872 202565 126308 93669 107351 174821 237698
3459B37698o0874m8034p491K2848N2047P3389j2474j34725J04071l0004J7051
$$ 237698 176824 128790 121299 144147 196194 269583 257109 122384 226455 196451 213502
3448B13502O0729m0824M318o8274k8650P8226J1582o8190J38619M4695k27749
$$ 213502 274231 233407 237725 169451 140801 219027 230609 162419 301038 345733 117984
3437A17984R9J364M0297P7683k7413p2794J8517N2941j05317Q5910K2436n6476
$$ 117984 118083 119447 159744 237427 210014 137220 155737 208678 103361 189271 211707 155231
3425A55231m0913K0628M923M3637O4480j6900N7168q440K4112j9573J8747q399
$$ 155231 114318 134946 139869 183506 247986 231086 288254 279814 303926 284353 303100 294701
3413B94701j04793L7191j010J18611K3537J9341m246J1151L6759P154m506k40390
$$ 294701 189908 227099 226089 344700 368237 387578 383332 394483 431242 438396 433890 193500
3401A93500L1717O2459R7851k8108l4065P181L6065J6449j21181O8150o4057l741
$$ 193500 225217 287676 385527 357419 323354 330535 366600 383049 261868 330018 265961 262220
3389B62220N016O6377n2969K6621J3204m5834N8717n2499m2287J0598O7687k9283
$$ 262220 267236 333613 280644 307265 320469 274635 333352 280853 238566 249164 316851 287568
3377B87568R161M7175l4292m5526n1660M6104P1813j7690L538j7904r4619K0904
$$ 287568 296729 343904 309612 264086 212426 258530 330343 312653 316191 298287 203668 224572
3365B24572L8757o4649r5178M7369O5000K2983j7473m3994R689j4172J8058R3370
$$ 224572 263329 198680 103502 150871 215871 238854 221381 177387 187076 172904 190962 284332
3353B84332K6991j19185P319M4008K1569m6119R576m4498K1048N7585j9767m0888
$$ 284332 311323 192138 199457 243465 265034 218915 228491 183993 205041 262626 242859 201971
3341B01971K6773J6828k6893l1337N3995K4464L7269m4152L3415N0265N1295O8116
$$ 201971 228744 245572 218679 187342 241337 265801 303070 258918 292333 342598 393893 462009
3329D62009j20315r6355K9638M2297J8535J01752r0282m8484J23644M2250j14157
$$ 462009 341694 245339 274977 317274 335809 437561 347279 298795 422439 464689 350532
3318C50532O3622N7062p2816R6074o7733L1522k0335k6851P623N2898n831k2929
$$ 350532 414154 471216 398400 494474 426741 458263 437928 411077 418700 471598 465767 442838
3306D42838N3941J3706K0667l3984J23008o087p8536K5371J09844q136k6383M8619
$$ 442838 496779 510485 531152 497168 620176 614089 535553 560924 670768 662632 636249 684868
3294F84868j7199l1647J1016K4876k438O5552P1424K7157J5628j08946k2058j911
$$ 684868 667669 636022 647038 671914 669476 735028 806452 833609 849237 740291 718233 716322
3282G16322N6009K8126N5706k4888m3361j9667n0242k2036O637J7095K2360O3672
$$ 716322 772331 800457 856163 831275 787914 768247 718005 695969 702606 719701 742061 805733
3270H05733m8724j22557j7348N032P0109K0984o7323M9410k2803J0007j0470L3255
$$ 805733 757009 634452 617104 622136 692245 713229 645906 695316 672513 682520 672050 705305
3258G05305j00898j9204M1791q7859L3964q2961K5992P7274n1064m075O6418p0933
$$ 705305 604407 585203 626994 539135 573099 490138 516130 593404 542340 538265 604683 533750
3246E33750R241o335N709m9916j1087m2047o8070P5804k3474M9259j3815O2569
$$ 533750 542991 536656 542365 492449 481362 439315 371245 447049 423575 472834 459019 521588
3234E21588O7038k6492K8138o4535k0168m4546o0948N4581N2369j2329n2722J435
$$ 521588 588626 562134 590272 525737 505569 461023 400075 454656 507025 494696 441974 443409
3222D43409o4946k9088k4687N4881L8870M637m3187j4733M4924n4057j4891K1572
$$ 443409 378463 349375 324688 379569 418439 423076 379889 365156 410080 356023 341132 362704
3210C62704k4737j41017Q4612R1383K4149m3206l0299n9369O3519q943k1118J6660
$$ 362704 337967 196950 281562 372945 397094 353888 323589 264220 327739 318796 297678 314338
3198C14338l7224q071j5280L987P7144N1695k4040l9627n2972J1131P2044o1703
$$ 314338 277114 269043 253763 257750 334894 386589 362549 322922 269950 281081 353125 291422
3186B91422p7474M4847J38012j0014j66708r11L7911m2854M3631J45905m2517
$$ 291422 213948 258795 396807 386793 220085 219174 257085 214231 257862 403767 361250
3175C61250o5909r9095Q1586J9630K3705M931J952l3586j8939M5403Q8146m6388
$$ 361250 295341 196246 277832 297462 321167 326098 328050 294464 275525 320928 409074 362686
3163C62686r688M7942l4398N0549N0190o9301J3267J05267L9032r077j3722M1990
$$ 362686 352998 400940 366542 417091 467281 397980 411247 516514 555546 546469 532747 574737
3151E74737K5021r0020N8738l783J7631l114K8485Q428n9410R9504k0667J3441
$$ 574737 599758 509738 568476 564693 582324 579210 607695 616123 556713 656217 635550 648991
3139F48991P2454q4616o2975k5577O0947j09907p7296J07170M4478p0119n5839
$$ 648991 721445 636829 573854 548277 609224 499317 422021 529191 573669 503550 447711
3128D47711M9060K549K2401l9295n1749o4374N4053k9914p3850P7990N8140J6190
$$ 447711 496771 499320 521721 482426 430677 366303 420356 390442 316592 394582 452722 468912
3116D68912j18625j9929N4723j06550O0929n5043n8454O3712q6020r5902k1580
$$ 468912 350287 330358 385081 278531 339460 284417 225963 289675 203655 107753 86173
3105H6173J08564P8366k3628N3387o3207l7924K6876N4644j687m7684J1352j8469
$$ 86173 194737 273103 249475 302862 239655 201731 228607 283251 281564 233880 245232 226763
3093B26763P8099K1318p921p2809k9709Q9258j8275q6679n2419m014R0998K5073
$$ 226763 304862 326180 318259 245450 215741 304999 286724 200045 147626 143612 234610 259683
3081B59683l3715m5721j224N6904j9353j4629K7203r833p8112R4947l1436n4646
$$ 259683 225968 180247 179023 235927 216574 201945 229148 219315 141203 236150 204714 150068
3069A50068O6052j00626q7611O1725J46904j3977m2181m5289J33424k1908q4634
$$ 150068 216120 115494 27883 89608 236512 222535 180354 135065 268489 246581 161947
3058A61947J03257l7569M3148K0931P2531o3114K7283n5154r9876p452M4944J4620
$$ 161947 265204 227635 270783 291714 364245 301131 328414 273260 173384 165932 210876 225496
3046B25496N8669n8709P555M049o372L7964N708j2759j20253Q71N5922j09208
$$ 225496 284165 225456 233011 237060 230688 268652 274360 261601 141348 142219 198141 88933
3034H8933L7500P1545M4434o844n9231m1375N5396M1060l9340n668k2516L7854
$$ 88933 126433 197978 242412 235568 176337 134962 190358 231418 192078 186410 163894 201748
3022B01748J3811q0329r9553P9148J06380M7912q1786j8966o2504J5499J38184
$$ 201748 215559 135230 35677 114825 221205 269117 187331 168365 105861 121360 259544
3011B59544o4516j0427r3154k0865R9448m9635m1903k0844J1345J04841J4840
$$ 259544 195028 184601 91447 70582 170030 120395 78492 57648 68993 173834 188674
3000A88674L0572J9857o3020j3438p551j45270k6420J47684p8249L3968R8311
$$ 188674 219246 239103 176083 162645 155094 9824 -16596 131088 52839 86807 185118
2989A85118N0490l7134q5456P3124j7111n5059N6137n8826N1477O3763q8336j3946
$$ 185118 235608 198474 113018 186142 169031 113972 170109 111283 162760 226523 138187 124241
2977A24241R8310m683l4700j2597M9400l5807o1613l8678L8621N6431j6479j4040
$$ 124241 222551 217868 183168 170571 219971 184164 122551 83873 122494 178925 162446 148406
2965A48406N3482L766n1232J273K38j5466m4158N7416P2277k1195J9756P8993
$$ 148406 201888 205654 154422 155695 155933 140467 96309 153725 226002 204807 224563 303556
2953C03556j3070k7625k9230p7561J70986J4827p4577n9782k2543p49K26434r3143
$$ 303556 290486 262861 233631 156070 327056 341883 267306 207524 184981 184232 410666 317523
2941C17523J2262L0665n3925k6107L7680R3964O4470J3755l4094p8674q477K0981
$$ 317523 329785 360450 306525 280418 318098 412062 476532 490287 456193 377519 369042 390023
2929C90023R6562O4295l3528J5259p3621O4982p3251o4825O3393L8435Q395o0280
$$ 390023 486585 550880 517352 532611 458990 523972 450721 385896 449289 487724 496119 435839
2917D35839P7234J46590j14165M6059J5060J20337k0718o1646P1337J8747J3540
$$ 435839 513073 659663 545498 591557 606617 726954 706236 644590 715927 734674 748214
2906G48214n380J46912N3870J24092J22271j44467R434J40301P3477j63782L9064
$$ 748214 742834 889746 943616 1067708 1189979 1045512 1054946 1195247 1268724 1104942 1144006
2895A144006J60169k1422Q0414N1982m3719p509R9176j15751r3079K3582n1923
$$ 1144006 1304175 1282753 1363167 1415149 1371430 1363921 1463097 1347346 1254267 1277849 1225926
2884A225926j9633k5868k0127p8631l662K130N5000p6832O7805m5995j6407q8336
$$ 1225926 1206293 1180425 1160298 1081667 1078005 1080135 1135135 1058303 1126108 1080113 1063706 975370
2872I75370k138J03443L7081j43353p4039j00655M2283Q496L1918q4873p4808
$$ 975370 973232 1076675 1113756 970403 896364 795709 837992 846488 878406 793533 718725
2861G18725O4610r106m9921q5784m61m1528m1156J7074K141Q1458j3488m9683
$$ 718725 783335 774229 724308 638524 638063 596535 555379 572453 574594 656052 642564 592881
2849E92881p0242J8100r0507j4277n9682q0545N8874M4614N9773o2943m6729L4619
$$ 592881 522639 540739 450232 435955 376273 295728 354602 399216 458989 396046 349317 383936
2837C83936j6552K9250K5129n067r8456J708L9275q9192M8015j7592O6111P644
$$ 383936 367384 396634 421763 416696 318240 319948 359223 270031 318046 300454 366565 374209
2825C74209r3153o0474Q478r4038J82796j42372M6536m9436P039L4813K9224j2535
$$ 374209 281056 220582 229060 135022 317818 175446 221982 172546 179585 214398 243622 231087
2813B31087l5788J35251K6405j61600j0262P2495J391o3441L9822q2911l4532
$$ 231087 195299 330550 356955 195355 185093 257588 258979 195538 235360 152449 117917
2802A17917J1647k664o5363M4858N0574L1021k2506m1376o3420M894R3272j7512
$$ 117917 129564 126900 61537 106395 156969 187990 165484 124108 60688 65582 158854 141342
2790A41342j6670n7106q8513n0741J66828P3060j06469K1070J2429N6168K1964
$$ 141342 124672 67566 -20947 -71688 95140 168200 61731 82801 95230 151398 173362
2779A73362N1449k0650r4645p0129K354L4995O602k1931j358k9895P7457q4585
$$ 173362 224811 204161 109516 39387 41741 76736 83338 61407 60049 30154 107611 23026
2767B3026m7168R0682l8478J07094l0637r471p0955J7787M1540L4580j33023P2200
$$ 23026 -24142 66540 28062 135156 104519 95048 24093 41880 83420 118000 -15023 57177
2755E7177j8246J01506m5135Q8710q3948k7784N1853r8882k1642K801k289n737
$$ 57177 38931 140437 95302 184012 100064 72280 124133 25251 3609 6410 4121 -1616
2743a616o357K1851O8650j449K3605o0590o6807p2687J01658Q0919k6981P2045
$$ -1616 -7973 13878 82528 81079 104684 44094 -22713 -95400 6258 87177 60196 132241
2731A32241k4179k3071j8997j13461L8206p139k9J4302M0749K7469J8057j3194
$$ 132241 108062 84991 65994 -47467 -9261 -16400 -16429 -2127 38622 66091 84148 70954
2719G0954q9766J34296j44304m44O6800n5553o4234l9777P0630j830L8619l2198
$$ 70954 -18812 115484 -28820 -29264 37536 -18017 -82251 -122028 -51398 -53228 -14609 -46807
2707d6807o772j3605O5825P5295q6708J2129K0019k3276J3731K4964J8284m942
$$ -46807 -53579 -67184 -1359 73936 -12772 -643 19376 -3900 9831 34795 53079 48137
2695D8137k3749q7037K0730M536J7261j7502J08572L3610l08n0424n0434n3486
$$ 48137 24388 -62649 -41919 -37383 -20122 -37624 70948 104558 104250 53826 3392 -50094
2683e0094L6930J427l7025L1867P2443K5618p7495K515n0374m4878l3723p3188
$$ -50094 -13164 -11737 -48762 -16895 55548 81166 3671 6186 -44188 -89066 -122789 -195977
2671a95977N0345L3456N4059K0822J7557N896j18534L7191P0704J3931k8430R6914
$$ -195977 -145632 -112176 -58117 -37295 -19738 -13842 -132376 -95185 -24481 -10550 -38980 57934
2659E7934k8264P2485l232j15807m6377N6757m6768o7941N9532P4544L8684p5134
$$ 57934 29670 102155 98923 -16884 -63261 -6504 -53272 -121213 -61681 12863 51547 -23587
2647b3587M8616N0153q1857p3764L4657L3439p4372j2475J04100N5825m5805p2343
$$ -23587 25029 75182 -6675 -80439 -45782 -12343 -86715 -99190 4910 60735 14930 -57413
2635e7413M5P0463k68j20942p7699n9663P3726Q8189k636O3077J01266l4555j41951
$$ -57413 -57368 13095 12827 -108115 -185814 -245477 -171751 -83562 -86198 -23121 78145 43590 -98361
2622i8361k0214K3996j2028Q4999r800j5921M1946j3042m9454P7424j1756q692
$$ -98361 -118575 -94579 -106607 -21608 -31408 -47329 -5383 -18425 -67879 9545 -2211 -10903
2610a0903L9220l9694n7557P4982m6449j4963J3874j2063O6195K7320o0433O708
$$ -10903 28317 -11377 -68934 6048 -40401 -55364 -41490 -53553 12642 39962 -20471 -13763
2598a3763N5464j28362L4537q409J8721M8210M8534J7450j01003j4804p373O3366
$$ -13763 41701 -86661 -52124 -60533 -41812 6398 54932 72382 -28621 -43425 -50798 12568
2586A2568P491O976o4866j2095M1314N2348j54668j7602J64689N1810q5461j6426
$$ 12568 20059 27035 -37831 -49926 -8612 43736 -110932 -128534 36155 87965 2504 -13922
2574a3922j8825p721P1059M9886P7967p2840r5085n5691J12014N2279o1866n3862
$$ -13922 -32747 -40468 30591 80477 158444 85604 -9481 -65172 46842 99121 37255 -16607
2562a6607K7313m249n5049p163O2378P661j19199N7668K6899r614J03820j74136
$$ -16607 10706 6457 -48592 -55755 6623 14284 -104915 -47247 -20348 -29962 73858 -100278
2550a00278Q601Q1939j40632K8857J10026l5029l9597P4965P0177n5521Q0644
$$ -100278 -91677 -9738 -150370 -121513 -11487 -46516 -86113 -11148 59029 3508 84152
2539H4152Q544J2689r2944p0964K6808R8912m3897n6704P3913K2213n5403K6816
$$ 84152 92696 105385 12441 -58523 -31715 67197 23300 -33404 40509 62722 7319 34135
2527C4135l9679L769p156K2359M8529o2885j4349K2473p1290L07N2099j1230M4024
$$ 34135 -5544 -1775 -8931 13428 61957 -928 -15277 7196 -64094 -63787 -11688 -22918 21106
2514B1106p5380o5941O3054P3471q0764j3804K9675l4571j473P0371m5536J2236
$$ 21106 -54274 -120215 -57161 16310 -64454 -78258 -48583 -83154 -84627 -14256 -59792 -47556
2502d7556N7995m6533J16835q1719n2774M2831J1734J849M6370m804j26151k0302
$$ -47556 10439 -36094 80741 -978 -53752 -10921 813 2662 49032 44228 -81923 -102225
2490a02225O2087J36273n3896J717p5217J288K8886N920n8798k8034l7269L6940
$$ -102225 -40138 96135 42239 43956 -31261 -29973 -1087 4833 -53965 -81999 -119268 -82328
2478h2328p282j9292O6157j5100K913n9456m8122N9333P1745K322R9647j51755
$$ -82328 -89610 -108902 -42745 -57845 -54932 -114388 -162510 -103177 -31432 -29110 70537 -81218
2466h1218J5352J58768q951K9440k726p148q8737N4151k7190j53131M8767J20052
$$ -81218 -65866 92902 83951 113391 110665 103517 14780 68931 41741 -111390 -62623 57429
2454E7429j01162K7242j15951J9243J13958n5577o7841O3159Q4704k5346K5652
$$ 57429 -43733 -16491 -132442 -113199 759 -54818 -122659 -59500 25204 -142 25510
2443B5510m7389J1064K1787K0483m0097j9646K9628O460q7053K1274Q3107r1465
$$ 25510 -21879 -10815 10972 31455 -8642 -28288 1340 7800 -79253 -57979 25128 -66337
2431f6337K4909J04605n773q161J5820j01408M5457m00l6805K8830J5002J7690
$$ -66337 -41428 63177 57404 49243 65063 -36345 9112 8712 -28093 737 15739 33429
2419C3429n7234m5313K4376P578k4994O5619n0560k8552O0058m1013q628R2693
$$ 33429 -23805 -69118 -44742 -37164 -62158 3461 -47099 -75651 -15593 -56606 -65234 27459
2407B7459j8766m5963j7622Q3442j41677M1571P7917q1449K2144R440K3539K3918
$$ 27459 8693 -37270 -54892 28550 -113127 -71556 6361 -75088 -52944 -43504 -19965 3953
2395C953n132J2670k0095L706M2706m769p458o2257P5020k9739K6092L3459n4648
$$ 3953 -1179 11491 -8604 -4898 37808 33039 25581 -36676 38344 8605 34697 68156 13508
2382A3508n4583l1612n444J349L0924O0628r0348l7887M9962o2994J08501L1820
$$ 13508 -41075 -72687 -78131 -76782 -45858 14770 -75578 -113465 -63503 -126497 -17996 13824
2370A3824L5743k0253n3117M9277K0763J6424j04583j22638L0004N3713J27886
$$ 13824 49567 29314 -23803 25474 46237 62661 -41922 -164560 -134556 -80843 47043
2359D7043O4036n5865K1289l3974j2182r4648n7954J25503J12153j34162p8098
$$ 47043 111079 55214 76503 42529 30347 -64301 -122255 3248 115401 -18761 -96859
2348i6859N0317M0097o5763L1416J02184m7824o079r2236J22071l084j1459K3712
$$ -96859 -46542 -6445 -72208 -40792 61392 13568 7489 -84747 37324 34240 22781 46493
2336D6493k9358q8830N5042k5804M0847M7935P30k7160j09217J4928J5355M0280
$$ 46493 17135 -71695 -16653 -42457 -1610 46325 47055 19895 -89322 -74394 -59039 -18759
2324a8759j28364K3544N7401J3229J068p6188k252N4999L6317L2032j3093J4177
$$ -18759 -147123 -123579 -66178 -52949 -51881 -128069 -130321 -75322 -39005 -6973 -20066 -5889
2312e889O8115P4798n6162j11384L7377K6781l0400j30421j1051O7733L0792m2538
$$ -5889 62226 137024 80862 -30522 6855 33636 3236 -127185 -138236 -70503 -39711 -82249
2300h2249N3069Q924p3116k3752N3058J42433l5583j14917j38590J19704J5405
$$ -82249 -29180 -20256 -93372 -117124 -64066 78367 42784 -72133 -210723 -91019 -75614
2289g5614j2656Q777K0721j5362M026J21467k4993m4505q6796k2581M1457J14967
$$ -75614 -88270 -79493 -58772 -74134 -70108 51359 26366 -18139 -104935 -127516 -86059 28908
2277B8908j02683k6550L1681N2620k9547N0716J02419q1472m8704j4296K4639
$$ 28908 -73775 -100325 -68644 -16024 -45571 5145 107564 26092 -22612 -36908 -12269
2266a2269m6660o4065j21329J58530R2769j6265l3468M483M1834n9239j5712J80856
$$ -12269 -58929 -122994 -244323 -85793 6976 -9289 -42757 -38274 3560 -55679 -71391 109465
2254A09465l7146k5781P460p4273p8977M530L3655n4887l1643l0229K2946J48884
$$ 109465 72319 46538 53998 -20275 -99252 -94722 -61067 -115954 -147597 -177826 -154880 -5996
2242e996Q3786p5070J0504k8043n9724O3858k5583j17109K5346k4420J05079J22030
$$ -5996 77790 2720 13224 -14819 -74543 -10685 -36268 -153377 -128031 -152451 -47372 74658
2230G4658j31945j5476M9186j7329R7677L7988m8332q4875o6657J4792P0827n2279
$$ 74658 -57287 -72763 -23577 -40906 56771 94759 46427 -38448 -105105 -90313 -19486 -71765
2218g1765n9749J2885n2942J19595J6361k0120r2771O2616J7455M0042J4191n5302
$$ -71765 -131514 -118629 -171571 -51976 -35615 -55735 -148506 -85890 -68435 -28393 -14202 -69504
2206f9504P9208k433L2840l09L012o6356L1015J7555N1379J6227M2569k9198L7014
$$ -69504 9704 7271 40111 39802 42814 -23542 7473 25028 76407 92634 135203 106005 143019
2193A43019M251K4094n167j30652Q2399k4388p0128l5418p4391J8134N5023n384
$$ 143019 147270 171364 166197 35545 117944 93556 23428 -11990 -86381 -68247 -13224 -18608
2181a8608m865n0502J15245j7906m1132P3034K4990j4135J365l9392r6755k1018
$$ -18608 -23473 -73975 41270 23364 -17768 55266 80256 66121 67486 28094 -68661 -89679
2169h9679L0866L5389K6364m7455K0011Q0835j8355J00822r8324l0140K7677J8733
$$ -89679 -58813 -23424 2940 -44515 -24504 56331 37976 138798 40474 10334 38011 56744
2157E6744l6259k7689M3820P583l0363k1988m7551J38928L5565p4742J3332l45
$$ 56744 20485 -7204 36616 44199 13836 -8152 -55703 83225 118790 44048 57380 57035
2145E7035n4943l177M2349J23936o8352N8074K0825o5358n5129k0760j2568N6027
$$ 57035 2092 -1085 41264 165200 96848 154922 175747 110389 55260 34500 21932 77959
2133G7959M6915J4546M6544P6599p9118j45829P2478N1331o431o339P1972L6965
$$ 77959 124874 139420 185964 262563 183445 37616 110094 161425 154994 148655 220627 257592
2121B57592N7348p2501J14943L439k125m6656J17578J16656l6326j762R5164M7913
$$ 257592 314940 242439 357382 360821 358696 312040 429618 546274 509948 508186 603350 651263
2109F51263J17132J16508J15478L9473K1554L5787j69956j00643j55230p7423
$$ 651263 768395 884903 1000381 1039854 1061408 1097195 927239 826596 671366 593943
2099E93943j17161k8302j13764r3308P0369j04633M4930L6431n3425r7033J112
$$ 593943 476782 448480 334716 241408 311777 207144 252074 288505 235080 138047 139159
2088A39159j2125k4216L3478P5572k1454k3651k6942k0729n499o9213L4512j0599
$$ 139159 127034 102818 136296 211868 190414 166763 139821 119092 113593 44380 78892 68293
2076F8293J3294Q4097q8598l0053M1750j1961J5260o4944m2404L7538M7617J0767
$$ 68293 81587 165684 77086 47033 88783 76822 92082 27138 -15266 22272 69889 80656
2064H0656p5163j2257j7528j42314M0341M5374J38071R8290l5145q9136M7940
$$ 80656 5493 -6764 -24292 -166606 -126265 -80891 57180 155470 120325 31189 79129
2053G9129n2786N777K105q2823J01685K2577L8354j23594N988O5359O3496K1560
$$ 79129 26343 32120 34225 -48598 53087 75664 114018 -9576 -3588 61771 125267 146827
2041A46827m2621m9804k5352J0944K7323j22982m4853J06011J38781K5397r7308
$$ 146827 104206 54402 29050 39994 67317 -55665 -100518 5493 144274 169671 72363
2030G2363j27946j7420q8837k939Q8405Q0742J90p3394Q1916q1717N971O6100
$$ 72363 -55583 -73003 -161840 -164779 -76374 4368 4558 -68836 13080 -68637 -62666 3434
2018C434m5746O5439r30m6243L6470l3986J8355K4577n6373n4933N2296K4528
$$ 3434 -42312 23127 22197 -24046 12424 -21562 -3207 21370 -35003 -89936 -37640 -13112
2006a3112k9411k9000J11904n3230J7739l8908j9173N0039l3013P1178l2940q1917
$$ -13112 -42523 -71523 40381 -12849 4890 -34018 -53191 -3152 -36165 35013 2073 -79844
1994g9844M0234K8720j298R317M3732L2690n6969q3251k463M2929J2292m7905
$$ -79844 -39610 -10890 -12188 -2871 40861 73551 16582 -66669 -69132 -26203 -13911 -61816
1982f1816K5530p288p110K4524K1731o4716l8757O6918Q32Q9366J7624o7069l3411
$$ -61816 -36286 -43574 -50684 -26160 -4429 -69145 -107902 -40984 -40152 49214 66838 -231 -33642
1969c3642N5078M9313j10711j22240J20636J01810o8331L049o1729K0446Q036
$$ -33642 21436 70749 -39962 -162202 -41566 60244 -8087 -5038 -66767 -46321 -38285
$$ [...]
##END NTUPLES=NMR SPECTRUM
##END=
