##TITLE=1H_CA-8982
 CDCl3
 8 sc, 
 17.03.2022
##JCAMPDX= 6.0         $$ Bruker NMR JCAMP-DX V2.0
##DATA TYPE= NMR SPECTRUM
##DATA CLASS= NTUPLES
##ORIGIN= UXNMR, Bruker Analytische Messtechnik GmbH
##OWNER= root
$$ XWIN-NMR		Version 3.5
$$ Thu Mar 17 12:56:06 2022 Russian Standard Time (UT+4h)  she@DPX200
##.OBSERVE FREQUENCY= 200.131346
##.OBSERVE NUCLEUS= ^1H
##.ACQUISITION MODE= SIMULTANEOUS
##.ACQUISITION SCHEME= undefined
##.AVERAGES= 8
##.DIGITISER RES= 18
##SPECTROMETER/DATA SYSTEM= spect
##.PULSE SEQUENCE= zg30
##.SOLVENT NAME= CDCl3
##.SHIFT REFERENCE= (INTERNAL, CDCl3, 0, 15.7469)
##AUDIT TRAIL= $$ (NUMBER, WHEN, WHO, WHERE, WHAT)
$$ ##TITLE= Audit trail, XWIN-NMR		Version 3.5
$$ ##JCAMPDX= 5.01
$$ ##ORIGIN= Bruker BioSpin GmbH
$$ ##OWNER= she
$$ F:/spectra/data/she/nmr/H-F/1/pdata/1/auditp.txt
$$ ##AUDIT TRAIL=  $$ (NUMBER, WHEN, WHO, WHERE, WHAT)
(   1,<2022-03-17 12:54:10.28 +0400>,<she>,<DPX200>,
      <created by zg, POWCHK disabled, PULCHK disabled
       configuration hash MD5:
       00 E9 B6 7A A2 85 ED C7 34 08 36 98 17 FE 4E 26
       data hash MD5: 16K
       A1 57 00 64 22 2A 27 3A 91 44 58 42 36 74 BF 49>)
(   2,<2022-03-17 12:54:30.53 +0400>,<she>,<DPX200>,
      <Start of raw data processing
       efp BC_mod = 2 LB = 0.24 FT_mod = 6 PKNL = 1 PHC0 = -16949.74 PHC1 = 12.00078 SI = 16K 
       data hash MD5: 16K
       25 F9 1C 91 D2 D0 AE 89 31 3F 67 BA 09 F0 30 E8>)
(   3,<2022-03-17 12:54:33.48 +0400>,<she>,<DPX200>,
      <abs ABSG = 5 
       data hash MD5: 16K
       46 F7 F2 BE 6D 2F 4E 49 4D 18 A0 F6 12 3C BD 6B>)
(   4,<2022-03-17 12:55:03.96 +0400>,<she>,<DPX200>,
      <pk PHC0 = 2.449509 PHC1 = -2.4 
       data hash MD5: 16K
       34 9E 2C 1F 56 53 9A 8A CF 89 12 3D 7F 60 C0 57>)
(   5,<2022-03-17 12:55:07.57 +0400>,<she>,<DPX200>,
      <abs ABSG = 5 
       data hash MD5: 16K
       A7 08 73 69 E9 8A C2 38 98 DD 96 BA 70 24 5A CC>)
$$ ##END=
$$ 
$$ hash MD5
$$ 20 04 70 67 7C 9C 24 00 E7 3E 29 CC 07 CF F9 5A
##$RELAX= 
##$RELAX= 
##$RELAX= 
##$RELAX= 
##$RELAX= 
##$RELAX= 
$$ Bruker specific parameters
$$ --------------------------
##$DU= <F:/spectra>
##$EXPNO= 1
##$NAME= <H-F>
##$PROCNO= 1
##$TYPE= <nmr>
##$USER= <she>
##$AMP= (0..31)
100 100 100 100 100 100 100 100 100 100 100 100 100 100 100 100 100 100 
100 100 100 100 100 100 100 100 100 100 100 100 100 100 
##$AQSEQ= 0
##$AQ_mod= 1
##$AUNM= <au_zg>
##$AUTOPOS= <>
##$BF1= 200.13
##$BF2= 200.13
##$BF3= 200.13
##$BF4= 200.13
##$BF5= 200.13
##$BF6= 200.13
##$BF7= 200.13
##$BF8= 200.13
##$BYTORDA= 1
##$CFDGTYP= 0
##$CFRGTYP= 5
##$CHEMSTR= <none>
##$CNST= (0..31)
1 1 145 1 1 1 1 1 1 1 1 1 1 1 1 1 1 1 1 1 1 1 1 1 1 1 1 1 1 1 1 1 
##$CPDPRG= <>
##$CPDPRG1= <>
##$CPDPRG2= <>
##$CPDPRG3= <>
##$CPDPRG4= <mlev>
##$CPDPRG5= <mlev>
##$CPDPRG6= <mlev>
##$CPDPRG7= <mlev>
##$CPDPRG8= <mlev>
##$CPDPRGB= <>
##$CPDPRGT= <>
##$D= (0..31)
0 1.2 0 0 0 0 0 0 0 0.06 0 0.03 0 0 0 0 0.0002 0 0 0 0 0 0 0 0 0 0 0 0 
0 0 0 
##$DATE= 1647507249
##$DBL= (0..7)
$$ [...]
##$SUBNAM2= <"">
##$SUBNAM3= <"">
##$SUBNAM4= <"">
##$SUBNAM5= <"">
##$SUBNAM6= <"">
##$SUBNAM7= <"">
##$SUBNAM8= <"">
##$SUBNAM9= <"">
##$SW= 18.0517287032376
##$SWIBOX= (0..15)
0 0 2 0 0 0 0 0 0 0 0 0 0 0 0 0 
##$SW_h= 3612.71676300578
##$TD= 16384
##$TD0= 1
##$TE= 0
##$TE2= 300
##$TE3= 300
##$TEG= 300
##$TL= (0..7)
0 120 120 120 120 120 120 120 
##$TP= (0..7)
150 150 150 150 150 150 150 150 
##$TP07= 0
##$TPNAME0= <>
##$TPNAME1= <>
##$TPNAME2= <>
##$TPNAME3= <>
##$TPNAME4= <>
##$TPNAME5= <>
##$TPNAME6= <>
##$TPNAME7= <>
##$TPOAL= (0..7)
0.5 0.5 0.5 0.5 0.5 0.5 0.5 0.5 
##$TPOFFS= (0..7)
0 0 0 0 0 0 0 0 
##$TUNHIN= 0
##$TUNHOUT= 0
##$TUNXOUT= 0
##$USERA1= <user>
##$USERA2= <user>
##$USERA3= <user>
##$USERA4= <user>
##$USERA5= <user>
##$V9= 5
##$VALIST= <valist>
##$VCLIST= <CCCCCCCCCCCCCCC>
##$VD= 0
##$VDLIST= <DDDDDDDDDDDDDDD>
##$VPLIST= <PPPPPPPPPPPPPPP>
##$VTLIST= <TTTTTTTTTTTTTTT>
##$WBST= 1024
##$WBSW= 4
##$XGAIN= (0..3)
0 0 0 0 
##$XL= 0
##$YL= 0
##$YMAX_a= 727797
##$YMIN_a= -1048559
##$ZGOPTNS= <>
##$ZL1= 120
##$ZL2= 120
##$ZL3= 120
##$ZL4= 120
##$ABSF1= 15.73257
##$ABSF2= -2.31928
##$ABSG= 5
##$ABSL= 3
##$ALPHA= 0
##$AQORDER= 0
##$ASSFAC= 0
##$ASSFACI= 0
##$ASSFACX= 0
##$ASSWID= 0
##$AUNMP= <proc_1d>
##$AZFE= 0.1
##$AZFW= 0.1
##$BCFW= 0
##$BC_mod= 2
##$BYTORDP= 0
##$COROFFS= 0
##$CY= -3
##$DATMOD= 1
##$DC= 0
##$DFILT= <>
##$DTYPP= 0
##$F1P= 0
##$F2P= 0
##$FCOR= 1
##$FTSIZE= 16384
##$FT_mod= 6
##$GAMMA= 0
##$GB= 0
##$INTBC= 1
##$INTSCL= 0
##$ISEN= 128
##$LB= 0.24
##$LEV0= 0
##$LPBIN= 0
##$MAXI= 10000
##$MC2= 0
##$MEAN= 0
##$ME_mod= 0
##$MI= 1.114404
##$NCOEF= 0
##$NC_proc= -4
##$NLEV= 6
##$NOISF1= 3.799351
##$NOISF2= 2.8
##$NSP= 0
##$NTH_PI= 0
##$NZP= 0
##$OFFSET= 15.74689
##$PC= 1
##$PHC0= -16947.29
##$PHC1= 9.60078
##$PH_mod= 1
##$PKNL= yes
##$PPARMOD= 0
##$PSCAL= 0
##$PSIGN= 0
##$REVERSE= no
##$SF= 200.130000933221
##$SI= 16384
##$SIGF1= 3
##$SIGF2= 2
##$SINO= 5.538805
##$SIOLD= 16384
##$SREGLST= <1H.CDCl3>
##$SSB= 0
##$STSI= 16384
##$STSR= 0
##$SW_p= 3612.71676300578
##$SYMM= 0
##$S_DEV= 0
##$TDeff= 16384
##$TDoff= 0
##$TI= <>
##$TILT= no
##$TM1= 0
##$TM2= 0
##$TOPLEV= 0
##$USERP1= <user>
##$USERP2= <user>
##$USERP3= <user>
##$USERP4= <user>
##$USERP5= <user>
##$WDW= 1
##$XDIM= 16384
##$YMAX_p= 323096200
##$YMIN_p= -78336
$$ End of Bruker specific parameters
$$ ---------------------------------
##NTUPLES= NMR SPECTRUM
##VAR_NAME=  FREQUENCY,     SPECTRUM/REAL,   SPECTRUM/IMAG
##SYMBOL=    X,             R,               I
##VAR_TYPE=  INDEPENDENT,   DEPENDENT,       DEPENDENT
##VAR_FORM=  AFFN,          ASDF,            ASDF
##VAR_DIM=   16384,         16384,           16384
##UNITS=     HZ,            ARBITRARY UNITS, ARBITRARY UNITS
##FACTOR=    0.220516191357247, 1,           1
##FIRST=     3151.42512401502, 0,            0
##LAST=      -461.291638990765, 0,           0
##MIN=       -461.291638990765, -78336,      0
##MAX=       3151.42512401502, 323096200,    0
$$ Real data points
##PAGE= N=1
##DATA TABLE= (X++(R..R)), XYDATA
$$ [...]
5836D09894R852J372J357K801P660K0921J244m233J9091J7563j2818O739k424
5823D79019J3265K868j4760m438r644q757K3649q946K2499J6839j9847J5984J4236
5810E21967Q982m999M068L0300M2133L2307P067L0145L0976K6871K5706q258m0535
5797G06730M425j6508j6094L994Q993n5182l9876R986J3653K4382j324P868J2246
5784F63293L5151K6243J4444L3291K9199N1579L7219N1721M0214j2229l4000m0458
5772H95667k4540k5304l118k3737K8800O9742K0287l651m8157n9087j4477l3382
5760G79043J1075k0694q108O140J7265M4899L5005J9754J3590K5402m2788l5566
5748H45017l9543k7596q031J1685J9380o912K5694L7373O5710R0873P391m6459
$$ plain form
5836 409894 419746 421118 422475 425276 432936 453857 455101 450868 469959 487522 474704 481443 479019
5823 479019 492284 495152 480392 475954 466310 457553 481202 472256 494755 511594 491747 507731 521967
5810 521967 530949 525950 530018 560318 602451 634758 641825 671970 702946 729817 755523 747265 706730
5797 706730 711155 694647 678553 682547 691540 636358 596482 606468 620121 644503 643179 651047 663293
5784 663293 698444 724687 739131 772422 801621 853200 890419 942140 982354 970125 936125 895667
5772 895667 871127 845823 842705 818968 847768 917510 937797 934146 885989 826902 812425 779043
5760 779043 790118 769424 761316 767456 784721 829620 864625 884379 897969 923371 880583 845017
5748 845017 805474 777878 769847 781532 800912 794000 819694 857067 922777 1013650 1021041 974582
5736I74582o3110n7973n1785k3204q707K496k1786r49R372k047j7529k3265j1272
5723G04823k1142J5315M336l330J1730K5932m491J2303L4666K7808K6432M1153
5711H75535N0384q879l2367k8150o7944j7577q035J307r125l4377l2587O469Q818
5698G03472J6226r827l066K0399K6149N221M970J4628Q763K079K1127J5894J9810
5685H45845L458o061L9517j0421R317m322l2208m385o019J7360m32M938J960P425
5671H65972R357J0521K3458k856J1278K6356M980R328l650J1242K9176J4759J1312
5658A021233Q724J3291J6132P081K2780K7959K2409L1498J7708J1714K9321L5309
5646A265159j5900p255L6677M0586J2154J7373J7292J1072j5163K1754J346K2430
$$ plain form
5736 974582 911472 853499 801714 778510 769803 772299 750513 749564 758936 756889 739360 716095 704823
5723 704823 683681 698996 703332 700002 711732 737664 733173 745476 780142 807950 834382 875535
5711 875535 925919 917040 884673 856523 788579 771002 762967 764274 755149 720772 688185 694654 703472
5698 703472 719698 709871 706805 727204 753353 758574 763544 778172 786935 789014 810141 826035 845845
5685 845845 849303 843242 882759 872338 881655 877333 845125 840740 834721 852081 851649 856587 858547 865972
5671 865972 875329 885850 909308 906452 917730 944086 949066 958394 954744 965986 995162 1009921 1021233
5658 1021233 1029957 1043248 1059380 1066461 1089241 1117200 1139609 1171107 1188815 1200529 1229850 1265159
5646 1265159 1249259 1242004 1278681 1319267 1331421 1348794 1366086 1377158 1361995 1383749 1385095 1407525
5634A407525J3663L4995L8495M2946J7812L3072M3711N7488O1766N109K6023K6058
5622A808663L3690L6272L0701K8910K8684L4759L365J0907O7425M6341K0910M8245
5610B198872L7522O6648R0736O4954P7961Q5351Q2505O1597Q6739N1301N2288
5599B956474R2126O9619Q4071J08330J01073J36516J41497J35691J43323J69859
5589D138579J80255J79426J84180J91183K17766K28161K57598K85701L01330L24188
5579F488367L03357K24268P9519J6464m1499l4164K9347M3273J39391J60934J94198
5568G603455K68054L14563L55276L89338L74323M04997M17574L79710L25071K62741
5558A1095102K29853K54618K97380L25252L44674L35393K28336O6029m2471j27488
$$ plain form
5634 1407525 1421188 1456183 1494678 1537624 1555436 1588508 1632219 1689707 1751473 1756582 1782605 1808663
5622 1808663 1842353 1878625 1909326 1938236 1966920 2001679 2005044 2015951 2083376 2129717 2150627 2198872
5610 2198872 2236394 2303042 2393778 2458732 2536693 2622044 2704549 2766146 2852885 2904186 2956474
5599 2956474 3048600 3118219 3202290 3310620 3411693 3548209 3689706 3825397 3968720 4138579
5589 4138579 4318834 4498260 4682440 4873623 5091389 5319550 5577148 5862849 6164179 6488367
5579 6488367 6791724 7015992 7095511 7111975 7070476 7036312 7065659 7108932 7248323 7409257 7603455
5568 7603455 7871509 8186072 8541348 8930686 9305009 9710006 10127580 10507290 10832361 11095102
5558 11095102 11324955 11579573 11876953 12202205 12546879 12882272 13110608 13176637 13134166 13006678
5548A3006678j53666m7145O7787J48101K16770L35140L67332L54276K42243K17398
5538A4754914K31953K34170K24106J42256O5850l6732j19836j98235r8155K0773
5528A5221064J51596J50542J28265P2481J911l3748q3198p7292l4600O1491J27483
5517A5685995P9964K8434o1965j98391l65781m13750l24740k78283k69301l10876
5507A3571306l63827k53852j63079p6901M2135J25944J85920J49470P6772n7348
5497A3236540j49783k93190m66530m17016l65049l09997l38522m27274n51295
5488I917884o12444n65878m73172l64353k33224j52994j38536q1407j6874J2915
5478G291917N8214J06955P9374J32399Q3600p7286k55341l89665m60584m64020
$$ plain form
5548 13006678 12853012 12805867 12873654 13021755 13238525 13573665 13940997 14295273 14537516 14754914
5538 14754914 14986867 15221037 15445143 15587399 15653249 15616517 15496681 15298446 15200291 15221064
5528 15221064 15372660 15523202 15651467 15723948 15725859 15692111 15608913 15531621 15497021 15558512 15685995
5517 15685995 15765959 15794393 15732428 15534037 15168256 14754506 14429766 14151483 13882182 13571306
5507 13571306 13207479 12953627 12790548 12713647 12755782 12881726 13067646 13217116 13293888 13236540
5497 13236540 13086757 12793567 12327037 11910021 11544972 11234975 10896453 10469179 9917884
5488 9917884 9305440 8739562 8266390 7902037 7668813 7515819 7377283 7295876 7279002 7291917
5478 7291917 7350131 7457086 7536460 7668859 7752459 7675173 7419832 7030167 6569583 6105563
5468F105563l76944l19846k66967k09775j80312j31108q5911j11884q9888n4046
5458D278882l1041k7849l2152L823N0050L5019L2418R6133Q2488J72545J87840
5447D848156K36023K86935L06031K38986M9533k14082m22518m26701k93343k03559
5437D405461j74088j22492r1849n7768l4534j5449K5207M6540M0192N9839R0413
5426D171472P7756J20950J53011K08858K59647K21375J44097M002j38241k28210
5416D994717k78734k86406k36111j65300j09127n9737l5350m0586l5349j6822
5406C731195l856L131J6400n863J4327K0306J3607J7090L2168M1233M0846N4441
5394C975025N6460L8306M6870N6028P5134N9620L0138M8147O0044O9058O9915
$$ plain form
5468 6105563 5728619 5408773 5141806 4932031 4751719 4620611 4534700 4422816 4332928 4278882
5458 4278882 4247841 4219992 4187840 4191663 4241713 4276732 4309150 4405283 4487771 4660316 4848156
5447 4848156 5084179 5371114 5677145 5916131 5965664 5751582 5329064 4902363 4609020 4405461
5437 4405461 4231373 4108881 4017032 3959264 3924730 3909281 3934488 3981028 4021220 4081059 4171472
5426 4171472 4249228 4370178 4523189 4732047 4991694 5213069 5357166 5361168 5222927 4994717
5416 4994717 4715983 4429577 4193466 4028166 3919039 3859302 3823952 3783366 3748017 3731195
5406 3731195 3727339 3730470 3746870 3741007 3755334 3775640 3789247 3806337 3838505 3879738 3920584 3975025
5394 3975025 4031485 4069791 4116661 4172689 4247823 4307443 4337581 4385728 4445772 4514830 4584745
5383D584745M5432N1621P1175P5225N9451J10692R9479J07989J06599J29989J53074
5372E595471J75490J78227K28884K28851K00848K24285K19573K10298K72058K89775
5362G823760L17870L43561K38506Q1979o6814j20456p3061L7688J12008J50928
5352H845969J66295J37432L9673K3385N5334J15321J58471K12476K21193K58030
5342A0233579K66024L29769L28296L80345M27200M23272L97841K39491J64201
5333A3190018K06483K57625L53975M73050N67115O07151O75335O11607O06330
5324A7548689P13621Q97514J127129J302948J536603J775193J945399K130176
5316B8977272K294483K535083K854298L267952L825716M049539L380990J658343
$$ plain form
5383 4584745 4630177 4681798 4752973 4828198 4887649 4998341 5097820 5205809 5312408 5442397 5595471
5372 5595471 5770961 5949188 6178072 6406923 6607771 6832056 7051629 7261927 7533985 7823760
5362 7823760 8141630 8485191 8723697 8805676 8738862 8618406 8545345 8583033 8695041 8845969
5352 8845969 9012264 9149696 9189369 9212754 9268088 9383409 9541880 9754356 9975549 10233579
5342 10233579 10499603 10829372 11157668 11538013 11965213 12388485 12786326 13025817 13190018
5333 13190018 13396501 13654126 14008101 14481151 15048266 15655417 16330752 16942359 17548689
5324 17548689 18262310 19159824 20286953 21589901 23126504 24901697 26847096 28977272
5316 28977272 31271755 33806838 36661136 39929088 43754804 47804343 51185333 52843676
5308E2843676k06958r74503p08969k13711k07142j327029k903887l678629l445202
5299C9177646k619118j721274r78032l85253J3593K85565N17790Q02136J150958
5290C6244011J625212K128500K560028K514711J773277L50995q30313j203342
5282D5163079j110352r62747p15957l69257r3505l78911j530439k937609l586156
5273C3478146l258502k584303j943731j431127r96197o75560m19162k54774n0136
5264B1864654N9029J06107J06176J23949J42668J41234O5380j83685m45138o82251
5254B1298123p78658r10578j030023r95831q40087o58925n08152l81004k85063
5245A4909802j83389q1805j7787M0405J28778J63173K43547L32400L71440M00017
$$ plain form
5308 52843676 52636718 51662215 50953246 50739535 50532393 49205364 46301477 42622848 39177646
5299 39177646 36558528 34837254 33859222 33473969 33487562 33773127 34290917 35093053 36244011
5290 36244011 37869223 39997723 42557751 45072462 46845739 47196734 46366421 45163079
5282 45163079 44052727 43089980 42374023 42004766 41911261 41532350 40001911 37064302 33478146
5273 33478146 30219644 27635341 25691610 24260483 23264286 22588726 22169564 21914790 21864654
5264 21864654 21923683 22029790 22135966 22259915 22402583 22543817 22609197 22425512 21980374 21298123
5254 21298123 20519465 19608887 18578864 17583033 16742946 16084021 15575869 15194865 14909802
5245 14909802 14726413 14644608 14626821 14667226 14796004 14959177 15202724 15535124 15906564 16306581
5235A6306581L71545K92201J60032L2599m9131l010N3799J10775R8023q2561l51799
5224A6939054n83081p21089p12841o59968n53154m36311l52920k54228k16222
5215A2449240j72467j02213j3526n6624j1181M1993P7293J04837J18034J46839
5205A2582225J28205R7414L6938M3982M9704O2661J01628N7920n830j31077k15397
5194A2808373l22188l75105k94058k99608k78663j57818j50531j46624j01516
5185A0682262r1485m6762p9880n2565m1980o0500o3936j0332L955P323k3990k5000
5173A0197110k4517k4070l0721J046m552K02L4457P757k2914k1032J2267J3154
5161A0138187o671j7491K2916J3205k9061k1684J6835m021r187K361j0925m844
$$ plain form
5235 16306581 16678126 16970327 17130359 17162958 17113827 17110817 17164616 17275391 17373414 17290853 16939054
5224 16939054 16355973 15634884 14922043 14262075 13708921 13272610 12919690 12665462 12449240
5215 12449240 12276773 12174560 12161034 12104410 12093229 12135222 12212515 12317352 12435386 12582225
5205 12582225 12710430 12807844 12844782 12888764 12938468 13001129 13102757 13160677 13154847 13023770 12808373
5194 12808373 12486185 12111080 11817022 11517414 11238751 11080933 10930402 10783778 10682262
5185 10682262 10590777 10544015 10464135 10411570 10369590 10309090 10245154 10234822 10238777 10246100 10222110 10197110
5173 10197110 10172593 10148523 10117802 10118848 10114296 10114498 10148955 10156712 10133798 10112766 10125033 10138187
5161 10138187 10131516 10114025 10136941 10150146 10121085 10099401 10116236 10112215 10103028 10105389 10094464 10089620
5149A0089620J6800j7106j027L5998L708n3338Q308q169l3264K7826j8609k6279
5137A0024468p933j9840k8193K744k3296m8700R930k0155M423j5952m0391j4041
5125I823064p156l6725k3089n7447m4290k2380m2450l1870k2516n5566l8480n2805
5113I388290k3457j7541k4793l7924l8928l7676m5147l4536o3046n5458l6798
5102H972986j8205m3195k0748o0956o2942o5089m6408m3581n3776n4837n8592
5091H444657o8805m9434p2541o1193k7396o6561j9803n5198n4514k8601n6982
5080G883629n6854l7761l9951n4778l3861o1651p1852m2834m2731o9979m6282
5069G325095k6187m8269k3363m7902n9923n1683m6530l5038l2651k7645n8788
$$ plain form
5149 10089620 10106420 10089314 10088287 10124285 10127993 10074655 10082963 10074794 10041530 10069356 10050747 10024468
5137 10024468 10016535 9996695 9968502 9971246 9947950 9899250 9909180 9889025 9893448 9877496 9837105 9823064
5125 9823064 9815908 9779183 9756094 9698647 9654357 9631977 9589527 9557657 9535141 9479575 9441095 9388290
5113 9388290 9364833 9347292 9322499 9284575 9245647 9207971 9162824 9128288 9065242 9009784 8972986
5102 8972986 8954781 8911586 8890838 8829882 8766940 8701851 8655443 8611862 8558086 8503249 8444657
5091 8444657 8375852 8326418 8253877 8192684 8165288 8098727 8078924 8023726 7969212 7940611 7883629
5080 7883629 7826775 7789014 7749063 7694285 7660424 7598773 7526921 7484087 7441356 7371377 7325095
5069 7325095 7298908 7250639 7227276 7179374 7119451 7067768 7021238 6986200 6953549 6925904 6867116
5058F867116o6099n0149k1107l7810j7404k6408m7327m6604l7984p6118n1067
5047F389039n5387n4059k6106j1628r442m0799p7333n8476l9892n2208j283j2464
5035E949962n0098n8122m0520l4263l3789j6617l8010l2457m760j2608k9449n6456
5023E542813n1049l1960j2688k6698j9933l985k0940l2145m1971k1153j7712N69
5011E263148p596r314l4722l3056m198K3423K1079M351k117J1285L4773o204p818
4998E253034j2703L4357L9923K1016M4639M2887M8810P0951Q1291P8962J23923
4987E827090J18488J53276J75327J91214K27410K32266K98310L25447L36969L35956
4977H221753L46271L25142K87412K10558J41275Q310r6751j53744j50230j21604
$$ plain form
5058 6867116 6801017 6750868 6729761 6691951 6674547 6648139 6600812 6554208 6516224 6440106 6389039
5047 6389039 6333652 6279593 6253487 6241859 6232417 6191618 6114285 6055809 6015917 5963709 5962426 5949962
5035 5949962 5899864 5841742 5801222 5766959 5733170 5716553 5678543 5646086 5641326 5628718 5599269 5542813
5023 5542813 5491764 5459804 5447116 5420418 5400485 5396500 5375560 5343415 5301444 5280291 5262579 5263148
5011 5263148 5255552 5246238 5211516 5178460 5174262 5197685 5218764 5223115 5220998 5232283 5267056 5260852 5253034
4998 5253034 5240331 5274688 5314611 5335627 5380266 5423153 5471963 5542914 5624205 5703167 5827090
4987 5827090 5945578 6098854 6274181 6465395 6692805 6925071 7223381 7548828 7885797 8221753
4977 8221753 8568024 8893166 9180578 9391136 9532411 9540721 9443970 9290226 9139996 9018392
4967I018392j19797n8347n4909n8561m8077m5862q2677j09493j16464r4157p3490
4956H156558n9702K9979R0858J25820J77369K51037L31439L15213K73405J71390
4946I863366P1162r402r0138q3102p0539j04988j15590j10988j23756j24554j19867
4935H981604k00601k70250l30384l82840l43876l31033k57174k28100j54348o1297
4925F421701m6352j0591K1614R5200J06905J13030J66037J50227J45564J50539
4915G313874J37276J48644J44179J36526Q9072k6832j47826k97923m16164m23640
4905F657186l93035l27501k68797k06579j47624j28227o9963n3024n4635l7151
4895D970650l3296p7757j25355j39253j76800j88477j76871j80511j75748j59313
$$ plain form
4967 9018392 8898595 8840248 8785339 8726778 8678701 8632839 8550162 8440669 8324205 8230048 8156558
4956 8156558 8096856 8126835 8217693 8343513 8520882 8771919 9103358 9418571 9691976 9863366
4946 9863366 9934528 9925126 9834988 9751886 9681347 9576359 9460769 9349781 9226025 9101471 8981604
4935 8981604 8781003 8510753 8180369 7797529 7453653 7122620 6865446 6637346 6482998 6421701
4925 6421701 6375349 6364758 6386372 6481572 6588477 6701507 6867544 7017771 7163335 7313874
4915 7313874 7451150 7599794 7743973 7880499 7969571 7942739 7794913 7496990 7080826 6657186
4905 6657186 6264151 5936650 5667853 5461274 5313650 5185423 5115460 5062436 5007801 4970650
4895 4970650 4937354 4859597 4734242 4594989 4418189 4229712 4052841 3872330 3696582 3537269
4885C537269j59782p9491j17985r2997o0023q6215o3379m7428k5216o3354o8440
4874B672959m7065m8786n6071m7119m9837l2917o1085l9004j5439k262l5496k2457
4862B215421k1081l0053l3559J154l2709m1205j4563j3676m2997l1652j4442j681
4850A938957k3436l9370N790q629k9749k4127j5500k3880l1043R342K5961p989
4838A776327l0131m644N069J817j7707q123k7537j7421J3987q855k1666j4139
4826A646977J3714k1019j1477j3265l41j053l1215j1647L559R348k3616k9282
4814A530683L786j6352K3362J2161k0041j2336K787N212N1674j3488j9600k5569
4802A522279n670j0601j044n64J38J0115p763l93l639L97J5045j9089k1216o584
$$ plain form
4885 3537269 3377487 3297996 3180011 3087014 3026991 2940776 2877397 2829969 2804753 2741399 2672959
4874 2672959 2625894 2577108 2521037 2473918 2424081 2391164 2330079 2291075 2275636 2273374 2237878 2215421
4862 2215421 2194340 2164287 2130728 2131882 2099173 2057968 2043405 2029729 1986732 1955080 1940638 1938957
4850 1938957 1915521 1876151 1881941 1873312 1843563 1819436 1803936 1780056 1749013 1758355 1784316 1776327
4838 1776327 1746196 1741552 1746621 1748438 1730731 1722608 1695071 1677650 1691637 1682782 1661116 1646977
4826 1646977 1660691 1639672 1628195 1614930 1614589 1613536 1582321 1570674 1574233 1583581 1559965 1530683
4814 1530683 1534469 1518117 1541479 1553640 1533599 1521263 1524050 1529262 1580936 1567448 1547848 1522279
4802 1522279 1516609 1506008 1504964 1504400 1504538 1514653 1506890 1506497 1502858 1503255 1518300 1499211 1477995 1471411
4788A471411o429K357P438o477K1403j9260j0490J0997J8460R706K7767o342j4280
4775A506261l88J9467J2555l100K5729R327L398J6876K2228q909J042J1780j793
4762A614473L946J6185L616K1646N054K7238J3299K3221M4889j1940J7755L8398
4750A817780L6190L8912J5489M7744L8871P7597N2387P104K804P007j0587K5512
4738B156810k848k774K2085N4146N2380N6593N2814P3198J00722R8719J29243
4727B791088J13295J12829J37656J07546J09850J06018Q2077M3099P1824N8677
4717C733959K2354K6133Q874l7121j0282K4113J0839L7176P8318R9727J20693
4706D114783J58888J50687O3894N5268K5950l8631p2570j07974k1296j685N028
$$ plain form
4788 1471411 1464982 1467339 1474777 1468300 1489703 1470443 1459953 1470950 1489410 1499116 1526883 1520541 1506261
4775 1506261 1505873 1525340 1537895 1534795 1560524 1569851 1573249 1590125 1612353 1603444 1604486 1616266 1614473
4762 1614473 1618419 1634604 1638220 1659866 1664920 1692158 1705457 1728678 1773567 1761627 1779382 1817780
4750 1817780 1853970 1892882 1908371 1956115 1994986 2072583 2124970 2132074 2134878 2141885 2131298 2156810
4738 2156810 2153962 2151188 2173273 2227419 2279799 2336392 2389206 2462404 2563126 2661845 2791088
4727 2791088 2904383 3017212 3154868 3262414 3372264 3478282 3560359 3603458 3675282 3733959
4717 3733959 3756313 3782446 3791320 3754199 3743917 3768030 3778869 3816045 3894363 3994090 4114783
4706 4114783 4273671 4424358 4488252 4543520 4569470 4530839 4458269 4350295 4328999 4327314 4332342
4695D332342J1616O9616J05018R3041J54521J84132K35886K98419L46225L72180
4685F202996L91789M88919N84328O46744P49254Q33745Q85284P68603L99685j44632
4675A1806715o52703p98712p29819n31562l26850j30984m517R7561K13687L50256
4665I293072M73718N59980O89749P85196Q20483O67936J95545m30057q18784q94266
4655A1342572p52676n49973m49810m01971l40924l10787k70339k09690j28194
4646G928208r5336k9273K7971J02963J20543J58416J73088K09644K10149J94371
4636I000744J76718J98729K56943L39608M48363N90826P57323Q89665J052558
4627A3711477J234466J426034J490896J338764P54995k03338j143834j603529
$$ plain form
4695 4332342 4343958 4413574 4518592 4611633 4766154 4950286 5186172 5484591 5830816 6202996
4685 6202996 6594785 7083704 7668032 8314776 9064030 9897775 10783059 11551662 11951347 11806715
4675 11806715 11154012 10355300 9625481 9093919 8767069 8636085 8631568 8729129 8942816 9293072
4665 9293072 9766790 10326770 11016519 11801715 12622198 13290134 13485679 13055622 12236838 11342572
4655 11342572 10589896 10039923 9590113 9188142 8847218 8536431 8266092 8056402 7928208
4646 7928208 7832872 7803599 7831570 7934533 8055076 8213492 8386580 8596224 8806373 9000744
4636 9000744 9177462 9376191 9633134 9972742 10421105 11011931 11769254 12658919 13711477
4627 13711477 14945943 16371977 17862873 19201637 19956632 19753294 18609460 17005931
4619A7005931j537047j225132q85723n69458k93369o1439Q2119L36319N06787
4610A3358988P07410Q14438R55263R68550P22552P8628p79440j498650j782354
4601A3545385j680211j413053j155468r00682p45905o36681n14829m28103l55587
4592E714866l31563k75970k23771j95692k05237j69040j61566j49462j13283r7312
4582C791970r3445p0100j27460r2869l7361p0219o0910l7854l2578j9802m2363
4571C107009l4710m4064L34j5512l4576l5316k4691j8447j2346j1660n073M753
4559B875701J3421J9210L4625L1034P8346N0738J6732J133k3408j1663l5380K0765
4547C071254P499K2472N6869M7339O0711L3149J9895J02q383K2234P5989L1348
$$ plain form
4619 17005931 15468884 14243752 13358029 12788571 12495202 12433763 12515882 12852201 13358988
4610 13358988 14066398 14880836 15836099 16804649 17527201 17605829 16826389 15327739 13545385
4601 13545385 11865174 10452121 9296653 8395971 7650066 7013385 6498556 6070453 5714866
4592 5714866 5383303 5107333 4883562 4687870 4482633 4313593 4152027 4002565 3889282 3791970
4582 3791970 3698525 3628425 3500965 3408096 3370735 3300516 3239606 3201752 3169174 3149372 3107009
4571 3107009 3072299 3028235 3028569 3013057 2978481 2943165 2918474 2900027 2887681 2876021 2870948 2875701
4559 2875701 2889122 2908332 2942957 2973991 3052337 3103075 3119807 3120940 3097532 3085869 3050489 3071254
4547 3071254 3078753 3101225 3158094 3205433 3266144 3299293 3319188 3319290 3310907 3333141 3409130 3440478
4535C440478N3068R5471P2833P2842Q0538K9520L2205J6327N4866P9343P6325
4524D103816J30911J37732J88515J93352J63636J55479J94004K54173K79654L71121
4514F172393M48282M69821N99069O65920P85855R06408J023513J202838J340994
4505A3615093J430700J376346R62852K02867p76515j435614j620019j514102j271472
4496A0970136j010583p40211o07960n12758l46235k89567k35233j65816j20999
4487F940774n8577n6632m280O9276R4680J43578J90046K48534K98768L79875M68968
4476H715010N02684O18643P11454Q53830J000329J150846J270015J363687J373901
4467A7560399J084310M58543m77079j348174j635212j562742j288722r48509p00045
$$ plain form
4535 3440478 3493546 3589017 3661850 3734692 3815230 3844750 3876955 3893282 3948148 4027491 4103816
4524 4103816 4234727 4372459 4560974 4754326 4917962 5073441 5267445 5521618 5801272 6172393
4514 6172393 6620675 7090496 7689565 8355485 9141340 10047748 11071261 12274099 13615093
4505 13615093 15045793 16422139 17384991 17587858 16811343 15375729 13755710 12241608 10970136
4496 10970136 9959553 9219342 8611382 8098624 7752389 7462822 7227589 7061773 6940774
4487 6940774 6882197 6825565 6821285 6890561 6985241 7128819 7318865 7567399 7866167 8246042 8715010
4476 8715010 9217694 9836337 10547791 11401621 12401950 13552796 14822811 16186498 17560399
4467 17560399 18644709 19103252 18626173 17277999 15642787 14080045 12791323 11842814 11142769
4458A1142769m45582k52820j32331L2711K03191L19887M48056N21222N50650M56033
4448A2843786J9194n20022r56240j101490r52195q24818o54210n28303m27342
4439F898360l37915k57028j70678j42649j14174p2232j677R909M3125P1285Q6932
4428F013258R1151J40779J50666J42407J68443J34960J35129R8597J63512K43161
4418G482063L42924M15283N27460O12138O65308O03775L08890k22605p77400j028360
4408H929476r92387q02176o10442m49566l34800k62734k37223k40632k49774k44350
4398D505392k11724k10735k21595k18093j81169j38094j41635r6102q1985r4763
4388B909497r7918q3398p8712o8566o9387m3556l843k0537l0309j0449l5091J6045
$$ plain form
4458 11142769 10697187 10444367 10312036 10344747 10547938 10867825 11315881 11837103 12387753 12843786
4448 12843786 12862980 12342958 11386718 10285228 9333033 8508215 7854005 7325702 6898360
4439 6898360 6560445 6303417 6132739 5990090 5875916 5803684 5802007 5811916 5855041 5926326 6013258
4428 6013258 6104409 6245188 6395854 6538261 6706704 6841664 6976793 7075390 7238902 7482063
4418 7482063 7824987 8240270 8767730 9379868 10045176 10648951 10957841 10735236 9957836 8929476
4408 8929476 7937089 7134913 6524471 6074905 5740105 5477371 5240148 4999516 4749742 4505392
4398 4505392 4293668 4082933 3861338 3643245 3462076 3323982 3182347 3086245 3004260 2909497
4388 2909497 2811579 2728181 2649469 2580903 2511516 2467960 2464117 2443580 2413271 2402822 2367731 2383776
4376B383776j897o956j084r418J8090j574L7444K8087N0849N6589M7211R3051
4364B694168P6809R9404J00237R3792P9230N1730K6629M435q460Q020O533J1515
4352C244042N2176M1633O257n5236j04686j57879j35038j44828j37931j28888
4342B479622j10909o1361o9130q5539r0435n3310o4269l8682l9680m6803p456
4331A812048k8607j1020O965Q522j327N074J6649r963R181N0226M5584M2558O6239
4318B012129O8742L3145N5008P3336Q5811P3710J11072P6510O3677J9536l3972
4307B638704p4766j13941j21017r8790j10584r9352l0382m3297p2095l6078j4073
4296A824329k1989J7326J8387n665L41L8731N0373M0407L7148R1106P0367Q2971
$$ plain form
4376 2383776 2381879 2374923 2373839 2364421 2382511 2380937 2418381 2446468 2497317 2553906 2601117 2694168
4364 2694168 2770977 2870381 2970618 3064410 3143640 3195370 3221999 3226434 3217974 3225994 3232527 3244042
4352 3244042 3296218 3337851 3344108 3288872 3184186 3026307 2891269 2746441 2608510 2479622
4342 2479622 2368713 2307352 2238222 2152683 2062248 2008938 1944669 1905987 1866307 1819504 1812048
4331 1812048 1783441 1772421 1779386 1787908 1786581 1791655 1808304 1798341 1807522 1857748 1903332 1945890 2012129
4318 2012129 2080871 2114016 2169024 2242360 2328171 2401881 2512953 2589463 2653140 2672676 2638704
4307 2638704 2563938 2449997 2328980 2230190 2119606 2020254 1989872 1946575 1874480 1838402 1824329
4296 1824329 1802340 1819666 1838053 1832388 1832729 1871460 1921833 1962240 1999388 2090494 2160861 2243832
4284B243832M2050j8297m5484r1178j05658j17343j11048j15606r8949m4769o8730
4273A468820n2953n359l7360n585l8982l2140j1742j1873j9431j8278N846m159
4261A236804O86N739n141J8585K626N519M295J7581N6671O5001M1796M562P9155
4248A533879P3232O7981Q6668R6723M0687L6826p388p1082j06939j00884j02711
4237A546992r3102q6235n3840o5235m7408l1296n8976n3425j8535k260l5716l8724
4225I62240k8700j7229m3361k3275j2264l3357j9862j8230l5257k9981K9642J7907
4213G48273r711P575k686J3217l061K1300j107j8239m885q724j2166L669R799
4200G43254J5816J8538O726k5320K5750J9480r869O740j7519K9425k1193r329
$$ plain form
4284 2243832 2285882 2267585 2222101 2130923 2025265 1907922 1796874 1681268 1582319 1537550 1468820
4273 1468820 1415867 1410508 1373148 1367563 1328581 1296441 1284699 1272826 1253395 1235117 1240963 1236804
4261 1236804 1237490 1243229 1238088 1256673 1259299 1264818 1269113 1286694 1343365 1408366 1450162 1454724 1533879
4248 1533879 1607111 1675092 1761760 1858483 1899170 1935996 1928608 1857526 1750587 1649703 1546992
4237 1546992 1453890 1367655 1313815 1248580 1201172 1169876 1110900 1057475 1038940 1036680 1000964 962240
4225 962240 933540 916311 872950 849675 837411 804054 784192 765962 730705 700724 730366 748273
4213 748273 738562 746137 743451 756668 753607 774907 773800 755561 750676 741952 729786 733455 743254
4200 743254 759070 777608 784334 759014 784764 804244 794375 801115 783596 813021 791828 782499
4188G82499K7950k821m0286R832P472K310j424k0751N282O061o974M601J9637
4175G93388l030R376J7995J5264K2639K5403J8560M742l712N291K988j4788Q427
4162I02543L6146O27J6551J1166j2347N009L8743J11P944J4211l621L0797M3664
4149A091544j4141K1159M9957N9384K7355J2645j2155k6195k7387k2435j0287
4138A149444k471J0452J8696J7521J9258M550O760K8018J9195L3694K3399J4330
4126A342846L4445L2621L7117K4221K3112L2185K1692O9215N4153K8071M2132
4115A741810L7681L9346O3370O3419O1165N8978M0164O7731N3383N0380O1794
4104B339221P1930R9353N9961Q8228R0865P4622Q0455J16921R8596Q0518J08620
$$ plain form
4188 782499 810449 807628 767342 777174 784646 786956 785532 764781 770063 776124 769150 773751 793388
4175 793388 790358 799734 817729 832993 855632 881035 899595 904337 900625 905916 908904 894116 902543
4162 902543 938689 939316 955867 967033 954686 959695 998438 998549 1006493 1020704 1017083 1047880 1091544
4149 1091544 1077403 1098562 1148519 1207903 1235258 1247903 1235748 1209553 1182166 1159731 1149444
4138 1149444 1146973 1157425 1176121 1193642 1212900 1217450 1224210 1252228 1271423 1305117 1328516 1342846
4126 1342846 1377291 1409912 1447029 1471250 1494362 1526547 1548239 1617454 1671607 1699678 1741810
4115 1741810 1779491 1818837 1882207 1945626 2006791 2065769 2105933 2173664 2227047 2277427 2339221
4104 2339221 2411151 2510504 2570465 2658693 2749558 2824180 2904635 3021556 3120152 3200670 3309290
4093C309290J16154J50971J41534J30649J52282J85094J62917K07055K17733K01689
4083D975368K42973K37893K47462K74971L01921K94483K98930L09664L40579L40698
4073G864942M01033M06297M24426M90527M78955M92481N32943N09146N28384M97481
4063A2626615M65281M27878M36665M40894M73241M96299N35438N82421O06235
4054A7090967O25254O38893O78453O26783N46928L90357K55496J32298P5467N6690
4044B1117586J02862J44847K13421K71867L07345L99740M17118L62947K44416
4035B3582149M8213j89946m31561n90123o69299o05458m86563m41666l64323k40304
4025A9611119j60757j12051j11413j11222k86614m57704o41555p98880q87170
$$ plain form
4093 3309290 3425444 3576415 3717949 3848598 4000880 4185974 4348891 4555946 4773679 4975368
4083 4975368 5218341 5456234 5703696 5978667 6280588 6575071 6874001 7183665 7524244 7864942
4073 7864942 8265975 8672272 9096698 9587225 10066180 10558661 11091604 11600750 12129134 12626615
4063 12626615 13091896 13519774 13956439 14397333 14870574 15366873 15902311 16484732 17090967
4054 17090967 17716221 18355114 19033567 19660350 20207278 20597635 20853131 20985429 21060896 21117586
4044 21117586 21220448 21365295 21578716 21850583 22157928 22557668 22974786 23337733 23582149
4035 23582149 23630362 23440416 23008855 22418732 21749433 21143975 20657412 20215746 19851423 19611119
4025 19611119 19450362 19338311 19226898 19115676 18829062 18371358 17729803 16930923 16043753
4016A6043753q83930p77851p15416o13757n41944m05513l75803l36170l01053
4007A1092316l54090l88533m52119n17459n41358n46537n20423m74124m50042
3998F847631l83523l29680l07446k67948k13419k04867k10267j92978k22336k34895
3988D280272j96499j81895k01058j58129j58055j39303j21098j29908j16915j07615
3978B769797j03628q5174q1171r1950p6349o6465p5711p0918p2003o7021l7779
3967A941628n7474o0467n7493m4139m3174n1507n2528k7914k7875l4984k1432
3956A462641n6476j6228k4646k1353n1896j4893J6169k9526j4242m7139n2914
3945A149497l2750l7877J4199l1949l0902j0476k1493j5395k2137j4087m7824
$$ plain form
4016 16043753 15159823 14381972 13666556 13052799 12510855 12105342 11729539 11393369 11092316
4007 11092316 10738226 10349693 9897574 9380115 8838757 8292220 7771797 7297673 6847631
3998 6847631 6464108 6134428 5826982 5559034 5345615 5140748 4930481 4737503 4515167 4280272
3988 4280272 4083773 3901878 3700820 3542691 3384636 3245333 3124235 2994327 2877412 2769797
3978 2769797 2666169 2580995 2499824 2407874 2331525 2265060 2189349 2118431 2046428 1979407 1941628
3967 1941628 1884154 1823687 1766194 1722055 1678881 1627374 1574846 1546932 1519057 1484073 1462641
3956 1462641 1406165 1389937 1365291 1343938 1292042 1277149 1293318 1263792 1249550 1202411 1149497
3945 1149497 1116747 1078870 1093069 1061120 1030218 1019742 998249 982854 960717 946630 898806
3934H98806n842j9707j4533N97j5006n582k3585l648k3592k7449R48l7804M865
3921G28468k2313m165L053j3922j4598p699p883r852j7933k5849o77l964K684
3908F05350K0426m5809j3990J2132j4907k0486n319M179j2640o84l0472j0916
3896D86864j0416n872J7686N527j356l4260m23l619j3746k2471p084K002j420
3883D11412K1521kj0849Q199N110l4316L70J0861J0541r241L608r324k09k4343
3869C83338n593j6926K8275L3218J481o660k4763k6379L697J8595o497j6250N940
3856C71476R742l3304K0470J4707r579j7317k0631J6180L34j5885J5343j8617
3844C32919q777K8008J4146j6796J5841l8617K168j0277L777K6286k2350l758
$$ plain form
3934 898806 892964 873257 858724 859321 844315 838733 815148 811500 787908 760459 761407 723603 728468
3921 728468 706155 701990 705043 691121 676523 668824 660941 651089 633156 607307 606630 602666 605350
3908 605350 625776 579967 565977 578109 563202 542716 537397 541576 528936 528252 497780 486864
3896 486864 476448 470576 488262 493789 492433 458173 457750 454131 440385 417914 410830 412832 411412
3883 411412 432933 432931 422082 430281 435391 401075 401445 412306 422847 413606 417214 407890 407681 383338
3869 383338 377745 360819 389094 422312 423793 417133 392370 365991 369688 388283 381786 365536 371476
3856 371476 381218 347914 368384 383091 373512 356195 335564 351744 352078 336193 351536 332919
3844 332919 324142 352150 366296 349500 365341 326724 328892 318615 322392 348678 326328 322570
3832C22570q170Q417J7870k160Q801j4056l244J96o904n424J1516o923p012M041
3818C19518J0460P924k755k8839j594J5168R86l234j2283j138k107M2744Q651
3805C53501j7884K0623J0273l0006j4325n434J5285J9107J588l1233J0324J3146
3793C44965n735N74L761j6709K6952j7839K4876R170N38k856O872j829o637j3792
3779C52311R306K4084K190Q323r213r407J5959P257j1479J0696J530j966j8183
3766C81408J1640m912P889j713J0458K7937J070p237K6213K3252l732j2719P074
3753D66628J3451j3248P784p544n219P902r382J2742K7026j0903P741j3020l6
3740D83922o46J9887K1131j6393p797j133K1137K3665j8686j3194j3806r22K4581
$$ plain form
3832 322570 314400 322817 340687 338527 347328 333272 330028 330224 323320 317896 329412 322489 315477 319518
3818 319518 329978 337902 335147 306308 304714 319882 320868 317634 305351 304213 302106 344850 353501
3805 353501 335617 356240 366513 336507 322182 316748 332033 351140 352728 321495 331819 344965
3793 344965 339230 339804 343565 326856 353808 335969 360845 370015 370553 367697 374569 372740 366103 352311
3779 352311 361617 385701 387891 396214 387001 377594 393553 400810 389331 400027 401557 399591 381408
3766 381408 393048 388136 396025 394312 404770 432707 433777 426540 452753 476005 472273 459554 466628
3753 466628 480079 466831 474615 467071 461852 469754 460372 473114 500140 489237 496978 483958 483922
3740 483922 483276 503163 524294 507901 500104 498971 520108 543773 525087 511893 498087 497165 521746
3727E21746q648J3370l772p57K2999K4265O475j2111O220K4456N516K3351j7057
3714F06053P440K6008N988j3501K8792O616O93J4894m803k5766j2724M1245J9062
3701F99997J4545J9335k2978l1010j6332L627J7243j0572N486m861j8582J7598
3689F73496J1183o771p809r009j351k508l7010l996J9992M391k4140K1122n823
3676F31767k4904j9208l916M82j0233N064K7820p914M573J9261m815K701o664
3663F14014J1664j4468L194J6998J3626J6252J5887j7323j6106K0689O993K9438
3651G00858J0118n200K0474P651Q033q678n83j6515L1247O533q069J3926j954
3638G57841K9342J383J2768P637o538l052k4836K5469J8803J1838l060K8330J0716
$$ plain form
3727 521746 513098 526468 522696 521939 544938 569203 575678 563567 569787 594243 599759 623110 606053
3714 606053 613493 639501 645489 631988 660780 667396 668089 682983 678180 652414 639690 680935 699997
3701 699997 714542 733877 710899 679889 663557 667184 684427 673855 679341 674480 655898 673496
3689 673496 684679 677908 670099 661090 659739 657231 620221 616225 636217 640608 616468 637590 631767
3676 631767 606863 587655 583739 584221 573988 579052 606872 598958 603531 622792 617977 620678 614014
3663 614014 625678 611210 614404 631402 645028 661280 677167 659844 643738 664427 671420 700858
3651 700858 710976 705776 726250 733901 741934 733256 732673 716158 747405 753938 745869 759795 757841
3638 757841 787183 788566 801334 808971 802433 799381 774545 800014 818817 830655 827595 855925 866641
3625H66641j0367K7691J8835K9320j515P496J8376O164j8130J2081L8852L4014
3613A029458R826J1861J0739K0445K5493J799J6033K005J0136P382M7677M1425
3601A234279j9351M672L3037L9131L9463K0769K9196K2679K6375O7635M1913K4366
3589A564164M5279K4349K2880L3672L8948M8477K2298N074M3129K7825P3391K6891
3577A976377M3625K4655L7959L0520K1584L2967R097K3109M9072K3224M8777K2040
3565B343006L8741O0306J2625L5051N3010N0581K1090L0101L9590M7459L3519
3554B765079R344K7964K9252K9331N4948L9722L5455M1543P6830N7723O5966N3611
3542C286768K2362J7541P4648O4874L1033P3971P1167N9991M0164K5045R0702
$$ plain form
3625 866641 856274 883965 902800 932120 930605 938101 956477 962641 944511 956592 995444 1029458
3613 1029458 1039284 1051145 1061884 1082329 1107822 1109621 1125654 1127659 1137795 1145177 1192854 1234279
3601 1234279 1214928 1219600 1252637 1291768 1331231 1352000 1381196 1403875 1430250 1497885 1539798 1564164
3589 1564164 1609443 1633792 1656672 1690344 1729292 1777769 1800067 1805141 1848270 1876095 1949486 1976377
3577 1976377 2020002 2044657 2082616 2113136 2134720 2167687 2176784 2199893 2248965 2272189 2320966 2343006
3565 2343006 2381747 2442053 2454678 2489729 2542739 2593320 2614410 2644511 2684101 2731560 2765079
3554 2765079 2774423 2802387 2831639 2860970 2915918 2955640 2991095 3032638 3109468 3167191 3233157 3286768
3542 3286768 3309130 3326671 3401319 3466193 3497226 3571197 3642364 3702355 3742519 3767564 3858266
3531C858266P3962K3921L0025N2617M5758P2159O5052P6965N3974O6049M5202
3520D463950M1037L8235M8393J9932J9245K8676L1120M8264N0671O6695N4087
3509D910305J9490N4057O0903k0319L8986N8533P0547M9494N1522R7432J08147
3498E499097J55001R2826J06983J57214J84432K06266K16643K28562K81965K74802
3488G403791K76471K81598K74787L15115K67087J97913J92836J89437J55687J10833
3478I665555M4097O1690R7185J07774R9526J11494J26185J54516J53738J20686
3468A0742446Q2939Q0055O3334J1249J6454K9524j678P363K0433N5047P4114Q2294
3456A1263574R1412J61740J50890J96922K51336K51054K90869L45167L75780M18562
$$ plain form
3531 3858266 3932228 3956149 3986174 4038791 4084549 4156708 4221760 4298725 4352699 4418748 4463950
3520 4463950 4504987 4543222 4591615 4611547 4630792 4659468 4690588 4738852 4789523 4856218 4910305
3509 4910305 4929795 4983852 5044755 5024436 5063422 5121955 5192502 5241996 5293518 5390950 5499097
3498 5499097 5654098 5746924 5853907 6011121 6195553 6401819 6618462 6847024 7128989 7403791
3488 7403791 7680262 7961860 8236647 8551762 8818849 9016762 9209598 9399035 9554722 9665555
3478 9665555 9709652 9771342 9868527 9976301 10075827 10187321 10313506 10468022 10621760 10742446
3468 10742446 10825385 10905440 10968774 10980023 10996477 11026001 11024323 11031686 11052119 11107166 11181280 11263574
3456 11263574 11354986 11516726 11667616 11864538 12115874 12366928 12657797 13002964 13378744 13797306
3446A3797306M99575N40384O29010O79674P21100Q24283R06479J034521J199844
3437B0832176J345254J480377J653563J815477J879227J937463J933440J886361
3429C4763338J795342J702570J634270J574455J478839J312865J123762R11717
3421D6297158O49915M11334J87230l9576k15983l77225m93417n49156n87606n76023
3411D4706651n61340o05854o76904q57345j058975j275790j529986j682399j796864
3402C4661194j869310j859692j828597j705131j551404j400035j245614j090914
3394B2110497r30523q01994p24599o26107n32354n07874m16317l77710l33638
3385A6859381k68449k20537j83440j70012j00851q3735q8959p3550o7805j06659
$$ plain form
3446 13797306 14296881 14837265 15466275 16145949 16867049 17691332 18597811 19632332 20832176
3437 20832176 22177430 23657807 25311370 27126847 29006074 30943537 32876977 34763338
3429 34763338 36558680 38261250 39895520 41469975 42948814 44261679 45385441 46297158
3421 46297158 46947073 47358407 47545637 47506061 47290078 46912853 46419436 45870280 45282674 44706651
3411 44706651 44145311 43539457 42862553 42005208 40946233 39670443 38140457 36458058 34661194
3402 34661194 32791884 30932192 29103595 27398464 25847060 24447025 23201411 22110497
3394 22110497 21179974 20377980 19653381 19027274 18494920 17987046 17570729 17193019 16859381
3385 16859381 16590932 16370395 16186955 16016943 15916092 15832357 15743398 15669848 15602043 15495384
3375A5495384j08803p8379m8634k6802O047J00560J30545J63303K07806K58946
3365A6099973K74024L19481L51178L63254M08610M30527M91110M91050M63867
3356A9693074M73870M12104L31883K31485J46389P1334q187k4271l7852o656M5327
3345B1328500R2212J23553J46194J39450J48154Q1793L6502m2193j20976j70220
3335B1762969k20794k23663k55185k15879j79616j72307j24344p5376j3055L2763
3325B0315513N3287Q6253J45175J40847K01318K36437K76976L18165L83123L99778
3315B2556872M34082N04719N65950N85648N89718O54406P35319P57023P91658
3306B8175395Q86235R01476R68966J012673J073552J090215J111045J164531J194653
$$ plain form
3375 15495384 15386581 15308202 15259568 15232766 15238813 15339373 15469918 15633221 15841027 16099973
3365 16099973 16373997 16693478 17044656 17407910 17816520 18247047 18738157 19229207 19693074
3356 19693074 20166944 20579048 20910931 21142416 21288805 21360139 21351952 21327681 21289829 21283173 21328500
3345 21328500 21420712 21544265 21690459 21829909 21978063 22059856 22096358 22054165 21933189 21762969
3335 21762969 21542175 21318512 21063327 20847448 20667832 20495525 20371181 20295805 20282750 20315513
3325 20315513 20368800 20455053 20600228 20741075 20942393 21178830 21455806 21773971 22157094 22556872
3315 22556872 22990954 23495673 24061623 24647271 25236989 25891395 26626714 27383737 28175395
3306 28175395 29061630 29963106 30932072 31944745 33018297 34108512 35219557 36384088 37578741
3297C7578741J223408J242523J291645J308941J377168J482770J552444J722429
3289D8780069J906556K156442K484549K799055L154171L588267M105318M581940
3281G3556367N077108N590615N980328O245041O309301O111315N642508N034028
3273A19546611M173473L280993K385910J684471J150294J014894J199214J600664
3265A36036524K101381K566870K823800K769571K323900J545398N04117o89911
3257A49981650j975296l141249m038374m626233m689664m461344l923774l235686
3249A19890030k558916j930374j409999j025475q52899q10892q23803q98001q74736
3240A08704935q30059p42090n90611l16206j2648K95739O65731R38033J086568
$$ plain form
3297 37578741 38802149 40044672 41336317 42645258 44022426 45505196 47057640 48780069
3289 48780069 50686625 52843067 55327616 58126671 61280842 64869109 68974427 73556367
3281 73556367 78633475 84224090 90204418 96449459 102758760 108870075 114512583 119546611
3273 119546611 123720084 127001077 129386987 131071458 132221752 133236646 134435860 136036524
3265 136036524 138137905 140704775 143528575 146298146 148622046 150167444 150671561 149981650
3257 149981650 148006354 144865105 140826731 136200498 131510834 127049490 123125716 119890030
3249 119890030 117331114 115400740 113990741 112965266 112112367 111301475 110477672 109579671 108704935
3240 108704935 107874876 107132786 106542175 106225969 106213321 106509060 107174791 108112824 109199392
3231A09199392J105317Q71477N00747L5290n69193j208541j760058k323124k814097
3222A03037210l207556l440828l535307l480963l324226l056761k799945k566149
3214G7625475k347242k175619k046530k017231k017012k043918k090504k133177
3206F0754242k196689k195282k147784k099287j966036j775113j511333j263260
3198D5599458j308119j821788k243381k078358j760612j436925j168985j054238
3190C2727052r10317p77198p12366o36289n77134m85401m15328l11263k31943
3181B7669813j43413n1777M0709J87671K85026M20201N42015O57774Q40996J044028
3171C1493043J129659R04257K42411j78183o709K21097M39496O22249P35192Q07758
$$ plain form
3231 109199392 110304709 111176186 111676933 111712223 111143030 109934489 108174431 105851307 103037210
3222 103037210 99829654 96388826 92853519 89372556 86048330 82991569 80191624 77625475
3214 77625475 75278233 73102614 71056084 69038853 67021841 64977923 62887419 60754242
3206 60754242 58557553 56362271 54214487 52115200 50149164 48374051 46862718 45599458
3198 45599458 44291339 42469551 40226170 38147812 36387200 34950275 33781290 32727052
3190 32727052 31816735 31039537 30327171 29690882 29113748 28628347 28213019 27901756 27669813
3181 27669813 27526400 27474623 27515332 27703003 27988029 28408230 28950245 29608019 30449015 31493043
3171 31493043 32622702 33526959 33769370 33591187 33584478 33805575 34245071 34867320 35602512 36410270
3161C6410270Q20638P88151P67473P36475O09658M74930K90740O6835j35963l45621
3151D0483586m97740o65497p38716p84893p92322p70140p46925o88629o81557
3142C4117167o78748o56469o84707p65832q24351q15116p84576p52691o42802
3133B7511875n45673m23059k74382j78863m9740R7666K04821L56040N23846O70053
3123B7892584Q37125J064359J293343J495859J736547K000932K204431K369261
3115D0894441K490554K502176K417282K308480K191151K014231J850494J650375
3107E8319184J377639J101209Q25653O11496L99793K84701J68501L6342j41205
3098F2983313l33013o14899r54671j364334j732104k054301k339623k491180k521772
$$ plain form
3161 36410270 37230908 38019059 38786532 39523007 40132665 40607595 40898335 40965170 40829207 40483586
3151 40483586 39985846 39320349 38581633 37796740 37004418 36234278 35487353 34798724 34117167
3142 34117167 33438419 32781950 32097243 31331411 30507060 29691944 28907368 28154677 27511875
3133 27511875 26966202 26543143 26268761 26089898 26040158 26137824 26342645 26698685 27222531 27892584
3123 27892584 28729709 29794068 31087411 32583270 34319817 36320749 38525180 40894441
3115 40894441 43384995 45887171 48304453 50612933 52804084 54818315 56668809 58319184
3107 58319184 59696823 60798032 61623685 62235181 62634974 62919675 63088176 63124518 62983313
3098 62983313 62650300 62035401 61080730 59716396 57984292 55929991 53590368 51099188 48577416
3089D8577416k511130k353389k220235k028894j869047j725387j565529j416549
3081C2887256j332748j285955j248291j238493j225468j177784j195068j159441
3073B3024008j116007j080099j005433r82261r19454q44433p83435p15447o22527
3064A4954912n97401m98911m75768m31718l84824l19282k79890k68628k48862
3055A1449628j96973j74674j44767j08777j08112q0836l3406J765p572m115J7975
3044A0610136P120m599k7450l3610j03429j57908j30057j86422j99516j85518
3034I588747k28330j93824j71045j58004j71734j37282j22160j17055j36836j12178
3024H040299r3338j22049j27780j06307q7632j24299j34270j30611j47565j32430
$$ plain form
3089 48577416 46066286 43712897 41492662 39463768 37594721 35869334 34303805 32887256
3081 32887256 31554508 30268553 29020262 27781769 26556301 25378517 24183449 23024008
3073 23024008 21908001 20827902 19822469 18840208 17920754 17076321 16292886 15577439 14954912
3064 14954912 14357511 13858600 13382832 12951114 12566290 12247008 11967118 11698490 11449628
3055 11449628 11252655 11077981 10933214 10824437 10716325 10635489 10602083 10603848 10596276 10592161 10610136
3044 10610136 10617256 10612657 10585207 10551597 10448168 10290260 10160203 9973781 9774265 9588747
3034 9588747 9360417 9166593 8995548 8837544 8665810 8528528 8406368 8289313 8152477 8040299
3024 8040299 7946961 7824912 7697132 7590825 7503193 7378894 7244624 7114013 6966448 6834018
3014F834018j31449j03998j15079j13722q1271q1497o6057p8272o8699o5393m2534
3003E886047k7617l7882l0748k0633P652O748K4859M141L0061L0135K3051L4108
2991E929922L9168L1114K1537K4607L5228L8098M4659m754j6155q772o218N483
2979F133917m338L7566j797k769O095K3539K692M890L3842M4609L5460L1146J9139
2966F363991L5926L5814P104O6595P9908N1377L9121R4294J00937J04509J23818
2955G103394J41755J41545J47536J86611J95789J90656J73222J91806J78415J79345
2945H830074K30489K23371K09840K03084J96212J86222J45222J67469J74100J51782
2935A0717865J62918J87627J67085J83657J82900K35009K64786K60948K71697
$$ plain form
3014 6834018 6702569 6598571 6483492 6369770 6288499 6207002 6140945 6062673 5993974 5928581 5886047
3003 5886047 5858430 5820548 5789800 5769167 5776819 5783567 5808426 5812567 5842628 5872763 5895814 5929922
2991 5929922 5969090 6000204 6021741 6046348 6081576 6119674 6164333 6159579 6143424 6134652 6128434 6133917
2979 6133917 6129579 6167145 6165348 6162579 6168674 6192213 6194905 6199795 6233637 6278246 6313706 6344852 6363991
2966 6363991 6399917 6435731 6442835 6509430 6589338 6640715 6679836 6774130 6875067 6979576 7103394
2955 7103394 7245149 7386694 7534230 7720841 7916630 8107286 8280508 8472314 8650729 8830074
2945 8830074 9060563 9283934 9493774 9696858 9893070 10079292 10224514 10391983 10566083 10717865
2935 10717865 10880783 11068410 11235495 11419152 11602052 11837061 12101847 12362795 12634492
2926A2634492K83721K75393L06086L27862L19852L44772L42876L86037M36913
2917A5658004M50660M59581M58025M79971M86897N33209M95302N54518N77204
2908B0153371N99107O57705O91762P11708P17391P70385P85782Q51912R44386
2899B6883509J037204J087779J129192J201754J272936J380879J431663J518949
2891C6943865J567268J618309J692142J760799J874012K013903K196590K426577
2883E2093465K713771L049331L489402L903447M446100N041880N696159O478595
2875H6912150P427988Q582786R983349J1623243J3323201J4960916J6392846J7623149
2867A86829628J8470826J8786917J8481214J7715348J7188512J7380468J6698874
$$ plain form
2926 12634492 12918213 13193606 13499692 13827554 14147406 14492178 14835054 15221091 15658004
2917 15658004 16108664 16568245 17026270 17506241 17993138 18526347 19021649 19576167 20153371
2908 20153371 20752478 21410183 22101945 22813653 23531044 24301429 25087211 25939123 26883509
2899 26883509 27920713 29008492 30137684 31339438 32612374 33993253 35424916 36943865
2891 36943865 38511133 40129442 41821584 43582383 45456395 47470298 49666888 52093465
2883 52093465 54807236 57856567 61345969 65249416 69695516 74737396 80433555 86912150
2875 86912150 94340138 102922924 112906273 124529516 137852717 152813633 169206479 186829628
2867 186829628 205300454 224087371 242568585 260283933 277472445 294852913 311551787
2860C11551787J1544413q77558j7530651l0093651l4040168l1221275k5800427
2853A83532470k0914743j7729119j5600578j3614822j1588579r790988q419616
2846H5874025p315283o410115n635913m955440m362076l794788l342935k970132
2838D7087343k647231k359639k120670j929857j799161j670796j545031j417348
2830C1597610j294795j136258r97447r31362q46433q46310p66870p07179p11323
2821B3359633o86900o77367o65482o36752n93559o11660n59384n50043n12088
2812A7866398m89777m71234m33692m59792n00753m55962m54833m45664m17579
2803A3737112l68422l74376l80547l43064l39029l17063k80302k75586k72199
$$ plain form
2860 311551787 323096200 322218642 304687991 274594340 240554172 209332897 183532470
2853 183532470 162617727 144888608 129288030 115673208 104084629 94293641 85874025
2846 85874025 78558742 72148627 66512714 61557274 57195198 53400410 50057475 47087343
2838 47087343 44440112 42080473 39959803 38029946 36230785 34559989 33014958 31597610
2830 31597610 30302815 29166557 28169110 27237748 26391315 25545005 24778135 24070956 23359633
2821 23359633 22672733 21995366 21329884 20693132 20099573 19487913 18928529 18378486 17866398
2812 17866398 17376621 16905387 16471695 16011903 15511150 15055188 14600355 14154691 13737112
2803 13737112 13368690 12994314 12613767 12270703 11931674 11614611 11334309 11058723 10786524
2794A0786524k62892k27522j93383k11446k10475j96786k08519k24671k32215
2785H818615k36317k49162k43770j99291k05294j90048j84143j61640j72449j06219
2775F870282j28905j53494j07241j18954j05266j17953j26310j54672j31103r7966
2765E628418r8810j09499j14921r7576j02536j29927j26514q2442j10047j02222
2755D553924q1964o9895q4473q5903r9728m3547n8598o7946n0868n7974o8160
2744C784868p1560p4192r5470q3829o5101m6056p3382o8230p4613m4058n3460
2733C034917m2542n7653o2121k9921p7514n6567m4853l2214j6200k5591n6524
2722B533217l9547l7085l5257l0579n3285j8516m9609m4594m1059l8370m1637
$$ plain form
2794 10786524 10523632 10296110 10102727 9891281 9680806 9484020 9275501 9050830 8818615
2785 8818615 8582298 8333136 8089366 7890075 7684781 7494733 7310590 7148950 6976501 6870282
2775 6870282 6741377 6587883 6480642 6361688 6256422 6138469 6012159 5857487 5726384 5628418
2765 5628418 5529608 5420109 5305188 5207612 5105076 4975149 4848635 4766193 4656146 4553924
2755 4553924 4471960 4402065 4317592 4231689 4131961 4088414 4029816 3961870 3911002 3853028 3784868
2744 3784868 3713308 3639116 3543646 3459817 3394716 3348660 3275278 3207048 3132435 3088377 3034917
2733 3034917 2992375 2934722 2872601 2842680 2765166 2708599 2663746 2631532 2615332 2589741 2533217
2722 2533217 2493670 2456585 2421328 2390749 2337464 2318948 2269339 2224745 2183686 2145316 2103679
2711B103679m6506O74m7l8428l9899j2178k3290n027Q17j3820j8057q946j9729
2698A879243r314j764l5356l9118N846q314j6740l0773j4905J229j9347k2442
2686A688245J539L6179K391M398K6778k5843n2789l9035J4330p305k5109k6980
2674A596799o3382o3088l9950j4281k3960j4037k616l4921j9050r070q716l5150
2662A268578k0390J2640k4431K0081k0664m8888J0368N920k4101j9032Q722n248
2650A163555j8299O11j6835o983N877J402m756k2846r894l1227k2828J0175k3760
2637A024192p500j7811j3860j7868J296j4552q044L784K3172k6071j6218r753
2625I20767l1141P640K4777J1812K4786m786O793L903l914J3226j797k7550K3237
$$ plain form
2711 2103679 2057173 2057847 2057800 2019372 1979473 1967295 1944005 1938978 1939795 1925975 1907918 1898972 1879243
2698 1879243 1869929 1868165 1832809 1793691 1799537 1791223 1774483 1743710 1728805 1730034 1710687 1688245
2686 1688245 1689784 1725963 1728354 1732752 1759530 1733687 1680898 1641863 1656193 1648888 1623779 1596799
2674 1596799 1533417 1470329 1430379 1416098 1392138 1378101 1375485 1340564 1321514 1312444 1303728 1268578
2662 1268578 1248188 1260828 1236397 1256478 1235814 1186926 1197294 1203214 1179113 1160081 1168803 1163555
2650 1163555 1145256 1145867 1129032 1122049 1127926 1129328 1124572 1101726 1091832 1060605 1037777 1047952 1024192
2637 1024192 1016692 998881 985021 967153 968449 953897 945853 949637 972809 946738 930520 920767
2625 920767 889626 897266 922043 933855 958641 953855 960648 964551 960637 973863 972066 944516 967753
2612I67753P970l689M2272j0251J6257J6551j6620r125K436J6991K4434J7104
2600A072083l4m454K4470R686J6002K6140J4523J2141N0952L6960M7996N2718
2588A359183Q4284M4960N4537J23913P4461Q4993J14348N6301Q4063R8909N0799
2577B230751L0191L4761l3675j03891j53396j65473j41273j25442r4815j22934
2567A354804q6915m5630q3373o6687n1934n1432k9997m7884l5293m273m16j9700
2555H31270k8620j8208l7471j5568n429r769m258K696j3662k9549k1395p997L8578
2542F80618p56j4570m006l759q618j7102q439n658q134r932j9440j9545k2616
2529E38043j2867n681j0327r48R434M552m9098l1719J3376q708j0763K3896n684
$$ plain form
2612 967753 975723 972034 1014306 1004055 1020312 1036863 1020243 1011118 1013554 1030545 1054979 1072083
2600 1072083 1072049 1067595 1092065 1101751 1117753 1143893 1158416 1170557 1221509 1258469 1306465 1359183
2588 1359183 1443467 1488427 1542964 1666877 1741338 1826331 1940679 1996980 2081043 2179952 2230751
2577 2230751 2260942 2295703 2262028 2158137 2004741 1839268 1697995 1572553 1477738 1354804
2567 1354804 1267889 1222259 1138886 1072199 1020265 968833 938836 890952 855659 851386 850970 831270
2555 831270 802650 784442 746971 731403 725974 716205 711947 714643 700981 671432 650037 642040 680618
2542 680618 679862 665292 661286 657527 648909 631807 623368 617710 609576 599644 580204 560659 538043
2529 538043 525176 519495 509168 508220 517654 522206 473108 441389 454765 446057 435294 459190 453506
2516D53506l208j1431l5647N277O762k9764l371K869k0542j1116m116n271j361
2503C42587R648j774k2501q147k823J4283L0163j0598j1145n997l088O341j0012
2490C26937k9091K7046j4879J59o612k7787K1281j1613K045n062Q834j4966m0638
2477B35654k75r926k1986p858r575K4501J1742j1231J4021K459n789O872j5815
2464B12794K2044L0838m012R301J3416j2803P02J874k2533j141j3169J9691l7955
2451B19047K726k5764j963K8546J958m879l2679n340J8795J4390j6432n994P934
2438B00345k6502j2199J5919J2058r353j2283J763K036L1061k5385n359l7187
2426A34914L2863J2685j2468N323J3796m805j4008L1884R345k3911l1303K6657
$$ plain form
2516 453506 450298 438867 403220 408497 415259 385495 382124 384993 364451 353335 349219 343948 342587
2503 342587 352235 350461 327960 319813 316990 331273 361436 350838 339693 333696 330608 336949 326937
2490 326937 297846 324892 310013 310172 303560 275773 297054 285441 287486 282424 291258 276292 235654
2477 235654 235379 225453 203467 195609 186034 210535 222277 211046 225067 227526 221737 228609 212794
2464 212794 234838 265676 261664 270965 284381 271578 272280 274154 251621 250480 237311 257002 219047
2451 219047 221773 196009 194046 222592 224550 219671 186992 181652 200447 214837 198405 192411 200345
2438 200345 173843 161644 177563 189621 180268 167985 169748 171784 202845 177460 172101 134914
2426 134914 167777 180462 167994 173317 187113 182308 168300 200184 209529 185618 154315 180972
2414A80972Q157k6721J6135j2392j1413j4990L4860n394l009j5086Q839K0011
2402A79969j5350M230k3353p708J275N27j4439K1782M465N920K295j3591r437
2389A36585k1241L1793j8227n555l214k243J29j074J8507k8805K5718j5623N662
2376A22412n8j616m871M176M775K359j7003J1770J200n324J3367q293k3082J6435
2362A16247L2607J4813M912J2993k2452l7608J9279J0317j1151j5070j4529o929
2350A03429o484J713k5722O711J9737q496K860J8190Q163r567l0538J0357k4274
2337F6079l767K3296L521M177l448l3177J347J5962J4141j415j8593k0861K757
2324E0019K6195J0479j6030O847N318m1541J1326Q967K2784l67j0336J4360p075
$$ plain form
2414 180972 189129 162408 178543 166151 154738 139748 174608 169214 166205 151119 159958 179969
2402 179969 164619 168849 145496 137788 139063 139590 125151 146933 151398 157318 159613 146022 136585
2389 136585 115344 147137 128910 123355 120141 117898 118027 116953 135460 106655 132373 116750 122412
2376 122412 122354 120738 115867 120043 124818 127177 110174 121944 123144 117820 131187 122894 99812 116247
2362 116247 148854 163667 168579 181572 159120 121512 140791 151108 139957 124887 110358 103429
2350 103429 96945 98658 72936 79647 99384 90888 93748 111938 120101 110534 79996 90353 66079
2337 66079 62312 85608 89129 93306 89858 56681 58028 73990 88131 86716 68123 47262 50019
2324 50019 76214 86693 70663 77510 82828 41287 52613 61580 84364 83997 73661 88021 80946
2311H0946k2258p641q040n27J488L2714j1955k0295q310R674J1440j897n803j720
2297D7816P92J1448m847K505l3328l879R379Q032K269m8l6Q188j9672P017O653
2282D2289k031l9j3260j1645Q707J6845K0381k0488p197p479l20N499j0950J1827
2268C2139K8045q215j5546L2980M748k397k1926O74j3601J2764J9380j0447j2762
2255D5836Q308N949J1099n855K999M731k488r977J9190j935k3442l072M375O351
2241F2069k855o188R717L9654k9246j6773J8989j54K520P018p701r282M427m400
2227F7795J0608O005r482j1828J1148L19J2467q730N159j7253K0910K7363K4289
2214A38770l4567m1970M0333r711J1729n081k5583J588Q606n214N327R352j6064
$$ plain form
2311 80946 58688 51047 43007 42480 43968 76682 64727 44432 36122 45796 57236 55339 49536 47816
2297 47816 48608 60056 55209 57714 24386 20507 29886 37918 40187 40139 40103 48291 28619 35636 42289
2282 42289 40258 40219 26959 15314 24021 40866 61247 40759 33562 26083 25763 31262 20312 32139
2268 32139 60184 51969 36423 69403 74151 71754 49828 50502 36901 49665 69045 58598 45836
2255 45836 54144 60093 71192 65337 68336 73067 70579 60602 79792 77857 54415 51343 55718 62069
2241 62069 59214 53026 62743 102397 73151 56378 75367 75213 77733 84751 77050 67768 72195 67795
2227 67795 78403 84408 74926 63098 74246 74565 87032 78302 83461 66208 87118 114481 138770
2214 138770 104203 62233 102566 92855 104584 99503 73920 75508 84114 78900 84227 93579 77515
2201G7515J799K268r10l257P293k459o203j147j126K7454Q775J4748l667k5383
2187I5700K1516K2082j4237R134N449n96J6645R557j4971K4497n815J5914l882
2174A80993J1209J2712j6439n317L9870J2287j6794n08k5943J7567R258R640J7936
2161B46471O277J0070J8887n816j2738J5446K3152n547j5553N437J8869K832J5661
2148C23448K8389K8612k8723M556M0918K6979J4388L9386K4256j6674K2398M6616
2136E54549J0988j0828J3098M5011R388O807K9119J9890K0070L7734J1131L9455
2124G86412M2662M3258L6092L8377N0454J8580L8041M5528K1420P5458R8714P7592
2112A372588R8744R9165J05292J53274J47252J69509J34742J48274K00388L00955
$$ plain form
2201 77515 79314 81582 80672 77415 84708 82249 76046 74899 73773 101227 110002 124750 121083 95700
2187 95700 117216 139298 125061 134195 139644 139048 155693 165250 150279 174776 168961 184875 180993
2174 180993 192202 204914 188475 183158 223028 235315 218521 218013 192070 209637 218895 228535 246471
2161 246471 252748 262818 281705 275889 263151 278597 301749 296202 280649 286086 304955 307787 323448
2148 323448 351837 380449 351726 356282 397200 424179 438567 477953 502209 485535 507933 554549
2136 554549 565537 554709 567807 612818 622206 629013 658132 678022 698092 735826 746957 786412
2124 786412 829074 872332 908424 946801 997255 1015835 1053876 1099404 1120824 1196282 1294996 1372588
2112 1372588 1471332 1570497 1675789 1829063 1976315 2145824 2280566 2428840 2629228 2930183
2102B930183L38383L85244N07815O38520Q29701R75100J114228J441265J876736
2093A1037175K090852O94466k057479k880736k171291j458312r66834o42233n09275
2084C136333l76995k68592k14971j58939j22047j02994o2943j07653j44874j70612
2074A405713j36630p4154j03023p8016o0127l2467m1734o2744l6216m2954l5101
2063G02547k4429m3636q716K126o9660k1092k306k2588K229k4594q707o539l4202
2050D40433j704P523l7832l906m118L665k2376n1414k7042L6454j5243j0363j9710
2037B94367R397j7485k9236o955l157j6418k5017n670J6366J155n443l39m576
2024B06989n014o74K4523K888l0356k7917K083O092N762j8471k924q360r659l640
$$ plain form
2102 2930183 3268566 3653810 4161625 4800145 5629846 6604946 7719174 9160439 11037175
2093 11037175 13128027 13822493 11765014 8884278 6712987 5254675 4287841 3645608 3136333
2084 3136333 2759338 2490746 2275775 2116836 1994789 1891795 1828852 1721199 1576325 1405713
2074 1405713 1269083 1194929 1091906 1013890 953763 921296 879562 816818 780602 737648 702547
2063 702547 678118 634482 625766 627892 558232 537140 534834 512246 514475 489881 481174 474635 440433
2050 440433 438729 446252 408420 404514 400396 404061 381685 330271 303229 339683 324440 314077 294367
2037 294367 303764 286279 257043 250088 246931 230513 205496 199826 216192 217347 211904 211565 206989
2024 206989 201975 201301 225824 228712 198356 170439 172522 178614 184376 165905 162981 154621 144962 141322
2010A41322J0308M755r962j1408j5256J5892R21j9668j1789j862L0061O733l7167
1997A02880j8005j0395Q226n018n543n8O14N988N211q151k1863L1259J2704j6032
1983H1817p054j9346J1028j5405J0792J2261M328j0577j4420J4132j1488J3579
1971F9647j7275k2857m177K1464m628q571l0515P564J823L1766J6353k0302k5412
1958A4880N438J266n893J4335M229j429j6811J1074J11j3629J162J1341m463L497
1944B5108L281l460K589m130k641J0342k5160l571J1514R033K493J4609jk3401
1930A6605j8604K9792M2096j4000k3379j0954K686p170k540j3515j4275l844m551
1917b1653M1809J7070k1560J8009j7253j790l631k0466K9341j4942l160J1496
$$ plain form
2010 141322 151630 156385 146423 135015 119759 135651 136572 116904 105115 103253 133314 140047 102880
1997 102880 84875 74480 82706 77688 72145 72087 72701 78689 83900 75749 53886 85145 97849 81817
1983 81817 74763 55417 66445 51040 61832 74093 78421 67844 53424 67556 56068 69647
1971 69647 52372 29515 25338 46802 42174 33603 3088 10652 12475 44241 60594 40292 14880
1958 14880 20318 21584 15691 30026 34255 32826 16015 27089 27200 13571 14733 26074 21611 25108
1944 25108 28389 24929 27518 23388 20747 31089 5929 2358 13872 22905 25398 40007 40006 16605
1930 16605 -1999 27793 69889 55889 32510 21556 24242 17072 14532 1017 -13258 -17102 -21653
1917 -21653 20156 37226 15666 33675 16422 14632 11001 -9465 19876 4934 1774 13270
1905A3270j6403L613J2711j1827j110r211j757L2287K4898k7196k9648L438J6783
1892I848J542k117j1738J613J1953j5043q563J2018k3102o497L8726k93r185j4820
1878a5658M760k680M147J7980j6258L006k9478J0751J2932m266j0537J3888L827
1865g586L847K3267j4856j1234o901k081J0951o865J2897J9758l3596O623J2503
1852F727L2141k3505j3022m376j0835K1567k2066j656J0606r856P662j588K714
1839e487l670R850L974L485O079k589j5730M188L1985j588j1248K186L3898r249
1825D6084j2418R95J8547N793l0037j2001l429o514R077j968j3023j4917k5859
1812c9670K110J6967K7475p618m3989K9037K4717p940j4648j128j2458p141J0633
$$ plain form
1905 13270 -3133 480 13191 1364 254 -8957 -10714 21573 46471 19275 -10373 -6935 9848
1892 9848 11390 9273 -2465 -852 11101 -3942 -12505 -487 -23589 -30086 8640 8347 -838 -15658
1878 -15658 -10898 -13578 -9431 8549 -7709 -4703 -34181 -23430 -10498 -14764 -25301 -11413 -7586
1865 -7586 -3739 19528 4672 -6562 -13463 -15544 -4593 -11458 1439 21197 -12399 -5776 6727
1852 6727 38868 15363 2341 -2035 -12870 8697 -13369 -15025 -4419 -14275 -6613 -8201 -5487
1839 -5487 -9157 693 4667 8152 14231 11642 -4088 100 32085 30497 19249 21435 55333 46084
1825 46084 33666 34661 53208 59001 28964 16963 13534 7020 16097 14129 1106 -13811 -39670
1812 -39670 -37560 -20593 6882 -736 -44725 -15688 9029 1089 -13559 -14687 -27145 -34286 -23653
1799b3653J2953r831k5268J0153J1462M765K098j4008P509L777j9839M862N246
1786b9774P142l989p512q691J3750j4559J1142J0839J2681j0959J5398Q716l191
1773I93k769j4040j6483Q749L2189Q135q991l784j9526k580o983P54j0002J6915
1759a7423J2061j958p30K2263m4778j5506J9567m578J0502j0155K5040J358J8143
1746A3806k9785o517o840O790k3611j2647J6164M631L4000J2736N664j6563j5329
1733a7501j2673J4505l0167l079K3776j822J5153j6626j527j1706J0093k0389
1721e1963J5707K829O482j844J8798p880j4772k3772n105m530J4209J9724K0518
1708a1599k2126k4167P058k936K280j837J5954Q390J4104l334j828o348n000J2270
$$ plain form
1799 -23653 -10700 -20531 -45799 -35646 -24184 -19419 -17321 -31329 -23820 -20043 -39882 -35020 -29774
1786 -29774 -22632 -26621 -34133 -42824 -29074 -43633 -32491 -21652 -8971 -19930 -4532 4184 993
1773 993 -1776 -15816 -32299 -23550 8639 16774 7783 3999 -15527 -18107 -25090 -24336 -34338 -17423
1759 -17423 -5362 -7320 -8050 14213 -30565 -46071 -26504 -31082 -20580 -30735 -5695 -4337 13806
1746 13806 -15979 -22496 -29336 -22546 -46157 -58804 -42640 -38009 -4009 8727 14391 -2172 -17501
1733 -17501 -30174 -15669 -45836 -48915 -25139 -26961 -11808 -28434 -29961 -41667 -31574 -51963
1721 -51963 -36256 -33427 -26945 -28789 -9991 -17871 -32643 -56415 -61520 -66050 -51841 -32117 -11599
1708 -11599 -33725 -57892 -50834 -53770 -51490 -53327 -37373 -28983 -14879 -18213 -20041 -26389 -31389 -19119
1694a9119L769l74J9392p515O408n747k262J5899j1038j7434q144J0127j9889
1681c5927k355m103Q105L0183l3637J5330m906P149J0112k8742L752J598J4421
1668a9020M892o150O901j2958r683r266J1009p012O836N016J607m74j1793J0883
1654b9212n724K1586M048j5991K3383j1353j5096L2715L437j3133l996k0513j7862
1641d7711p738J8274K1759o610q88N922j4224J4729P759j0626K573j0763l485
1628c1029J1190j2697P573M654k611j0633q610R342M410K426Q91J4142N747M349
1614h56j7923M622j8356j563J693N523n555K2760j3324l0279J8335k46M047p235
1600c8357J3654O31k229K3420R903k3805O336j0542m266J8879n948n632J0351
$$ plain form
1694 -19119 -15350 -15724 3668 -3847 2561 -3186 -5448 10451 -587 -18021 -26165 -16038 -35927
1681 -35927 -38282 -42385 -34280 -4097 -37734 -22404 -27310 -20161 -10049 -38791 -35039 -33441 -19020
1668 -19020 -14128 -20278 -13377 -26335 -36018 -45284 -34275 -41287 -34451 -29435 -27828 -28302 -40095 -29212
1654 -29212 -34936 -13350 -9302 -25293 -1910 -13263 -28359 4356 7793 -5340 -9336 -29849 -47711
1641 -47711 -55449 -37175 -15416 -22026 -22914 -16992 -31216 -16487 -8728 -19354 -16781 -27544 -31029
1628 -31029 -19839 -32536 -24963 -20309 -22920 -33553 -42163 -32821 -28411 -25985 -25094 -10952 -5205 -856
1614 -856 -18779 -14157 -32513 -34076 -32383 -26860 -32415 -9655 -22979 -53258 -34923 -35169 -31122 -38357
1600 -38357 -24703 -24072 -26301 -2881 7022 -16783 -10447 -20989 -25255 -6376 -12324 -17956 -7605
1587g605p055m061j7033Q543J947L451J0158k140j8307r331J4728j9679Q784N758
1573c1842m966j336L091K2910j638K100j7811r315j1069K1911M536j5103k3509
1560f2041J9145J831L076J781k338K2837k4746k95Q708M171k1777P844L235j2517
1546e1086P732K3949m086k2625P249L3345j7056k1189r908L634Q337K0476r14
1533b2142r689P802j1514J5911j0377k9116J5445J7841K713k1454m735R260j1761
1520e1816J2080R424m259q319j5640M4546j0037o186M887L998J5095r255j3040
1507b8522K613O182l575j6016j4441M775L718M541j5288J9139K2117q094j0993
1494c3844K94K09k0700K5098L6993j0995J08q727L24j3263k924Q000P270k2440
$$ plain form
1587 -7605 -14660 -18721 -35754 -27211 -25264 -21813 -11655 -13795 -32102 -41433 -26705 -46384 -37600 -31842
1573 -31842 -36808 -38144 -35053 -12143 -13781 -11681 -29492 -38807 -49876 -27965 -23429 -38532 -62041
1560 -62041 -42896 -41065 -37989 -36208 -38546 -15709 -40455 -40750 -32042 -27871 -49648 -41804 -38569 -51086
1546 -51086 -43354 -19405 -23491 -46116 -38867 -5522 -22578 -43767 -53675 -50041 -41704 -21228 -22142
1533 -22142 -31831 -24029 -35543 -19632 -30009 -59125 -43680 -25839 -23126 -44580 -49315 -40055 -51816
1520 -51816 -39736 -30312 -34571 -42890 -58530 -13984 -24021 -30207 -25320 -21322 -6227 -15482 -28522
1507 -28522 -25909 -19727 -23302 -39318 -53759 -48984 -45266 -40725 -56013 -36874 -14757 -22851 -33844
1494 -33844 -33550 -33341 -54041 -28943 8050 -2945 -2837 -11564 -11240 -24503 -27427 -19427 -12157 -34597
1480c4597j476K107r150l843l381J1330j4770J436J6879J9678j199m503J5200
1467f289m758k6608r136J0018L0778j802k4913L406j3505M6350j1013r751J0304
1454f919j2253k393Q19K2616l0640k271j9468J83n048O592l402o145J9061j7848
1440e7116J0624K0188l0732l905K2356j572L33J9487j6587j548J5726j445k549
1427b6740j011j1793J6704J568k8245R43k668J5648K1538k5565Q453K3578k4602
1414c2192o796r616P699K7343j0741K508k7105L80J3813k1988K3549k362j1723
1401d7231j8738J9270J56K0109j3429j3102R631K5504M623j3698J295L2431J4664
1388B1485o782j8490k0116r731K6393j7118j7887L8479n141q243k186M917k2832
$$ plain form
1480 -34597 -36073 -33966 -43116 -46959 -50340 -39010 -53780 -52344 -35465 -15787 -16986 -21489 -6289
1467 -6289 -11047 -37655 -46791 -36773 -5995 -7797 -32710 -29304 -42809 3541 -7472 -17223 -6919
1454 -6919 -19172 -21565 -20746 1870 -28770 -31041 -50509 -50326 -55374 -48782 -52184 -58329 -39268 -57116
1440 -57116 -46492 -26304 -57036 -60941 -38585 -40157 -39824 -20337 -36924 -38472 -22746 -24191 -26740
1427 -26740 -27751 -39544 -22840 -21272 -49517 -48574 -51242 -35594 -14056 -39621 -31168 -7590 -32192
1414 -32192 -38988 -48604 -40905 -13562 -24303 -21795 -48900 -48520 -34707 -56695 -33146 -35508 -47231
1401 -47231 -65969 -46699 -46543 -26434 -39863 -52965 -43334 -17830 -13207 -26905 -25610 6821 21485
1388 21485 14703 -3787 -23903 -33634 -7241 -24359 -42246 -3767 -8908 -17151 -19337 -14420 -37252
1375c7252J52q711O192Q441J6171o401k350j0479P151j4736j2916K4667Q349m720
1361b6442J5237K933J235l859j6086m233p095K0858N300R045K2477j7863j4416
1348a2909j2099J0603J0364o146o48L954Q302j1471R322J3684k9374K861J1476
1335b081j3906K4196J0924j6599k1424l807j3431L5468k730k909j6116n541k29
1322b8185j749J1185q18J1801O42r944J1746m871n652J269N045p906l120j889
1308b2446J8608r401j3046J459l0613k266K4904J7873k7856o494K0092J8505J1047
1295C66K26j2772k5608o724J0878J080J1570m345j440L745l669k5029J6603q944
1281d4063Q342J0541p264q617j1881O022K7482K1261o643j6151J0154K397k0036
$$ plain form
1375 -37252 -37100 -45811 -39619 -31178 -15007 -21408 -23758 -34237 -27086 -41822 -54738 -30071 -21722 -26442
1361 -26442 -11205 -8272 -7037 -10896 -26982 -31215 -38310 -17452 -12152 -3107 19370 1507 -12909
1348 -12909 -25008 -14405 -4041 -10187 -10835 -6881 1421 -10050 -728 12956 -16418 -13557 -2081
1335 -2081 -15987 8209 19133 2534 -18890 -22697 -36128 -660 -3390 -6299 -22415 -27956 -28185
1322 -28185 -29934 -18749 -19567 -7766 -7124 -17068 -5322 -10193 -15845 -14576 -9531 -17437 -20557 -22446
1308 -22446 -3838 -13239 -26285 -24826 -55439 -57705 -32801 -14928 -42784 -49278 -29186 -10681 366
1295 366 592 -12180 -37788 -44512 -33634 -32554 -20984 -25329 -26769 -23024 -26693 -51722 -35119 -44063
1281 -44063 -35721 -25180 -32444 -41061 -52942 -46920 -19438 1823 -4820 -20971 -10817 -8420 -28456
1268b8456R337l996k041J7862l2344K655N986J7313j6169k4861K4610J2903j8074
1255c5275k2337K7171P570k848n056J9581k4339O71J2016p44J2469k20L956J7401
1241A0016l0644j2394J1038O377J6412j9573j0174o823J5294p066o403N092r728
1228c8576q202J7042M4630j4509j2155j2944k4497K825K2651j471j3988J9207
1216a9987J5768Q59j892j1455J429J3038j509j5054j925N797l1100m321J3923
1203c6429K497K2006J5450k7499K2648J6524r805j3227n341j2234j956N635K4978
1190C247k2526k9547K3109J5471k962j8631j111J6059L403J0615j7711r890o366
1177c6840M888J0164J3744j0915K571J2028P012o506j1219K0325j011j491J502
$$ plain form
1268 -28456 -19119 -23115 -25156 -7294 -39638 -36983 -30997 -13684 -29853 -54714 -30104 -17201 -35275
1255 -35275 -57612 -30441 -22871 -25719 -30775 -11194 -35533 -34862 -22846 -23590 -11121 -11341 -7385 10016
1241 10016 -20628 -33022 -21984 -15607 805 -18768 -28942 -35765 -20471 -27537 -33940 -28848 -38576
1228 -38576 -46778 -29736 14894 385 -11770 -24714 -49211 -46386 -23735 -25206 -39194 -19987
1216 -19987 -4219 -3360 -5252 -16707 -15278 -2240 -3749 -18803 -20728 -14931 -46031 -50352 -36429
1203 -36429 -33932 -11926 3524 -23975 -1327 15197 5392 -7835 -13176 -25410 -27366 -21731 3247
1190 3247 -19279 -48826 -25717 -10246 -13208 -31839 -32950 -16891 -13488 -2873 -20584 -30474 -36840
1177 -36840 -31952 -21788 -8044 -18959 -16388 -4360 2652 -3854 -15073 5252 4241 2750 4252
1164D252j4146J2045K6371k0277p094l8598K4504K588j5670K26n476P57J5681
1151a4837K440k486o09K632M396o194M703l574l8797J7970R313K5357o906k2762
1137b9354J2880M239J7326q677j3795R194l142l613m063Q711P763j6796k085K691
1123a8721R290n739J5395l384K483J3808k6774m468K017k577k2330K4012N032
1110a1956N776o066Q395K2670k8087j1724n256P466j0025l515K9732Q715j0026
1097c901j5322P055L05L474O048j6870j5954J773J2270j2781l562M6670R321k0620
1083b094p536J8514R40k1618o22O216K2306m268j8749j7479R083P990j4578M7
1069b1848J3744q179j8341p407L2298j233Q730m236k896k068N212J250j0022P540
$$ plain form
1164 4252 -9894 2151 28522 8245 1151 -37447 -12943 -10355 -26025 -25799 -31275 -30518 -14837
1151 -14837 -12397 -14883 -15492 -12860 -8464 -14658 -9955 -13529 -52326 -34356 -25043 314 -6592 -29354
1137 -29354 -16474 -12235 5091 -3586 -17381 -8187 -11329 -14942 -19005 -10294 -2531 -19327 -21412 -18721
1123 -18721 -9431 -15170 225 -3159 -676 13132 -13642 -18110 -16093 -18670 -41000 -16988 -11956
1110 -11956 -6180 -12246 -3851 18819 -9268 -20992 -26248 -18782 -28807 -32322 -2590 6125 -3901
1097 -3901 -19223 -12168 -11863 -8389 -2341 -19211 -35165 -33392 -21122 -33903 -37465 9205 18526 -2094
1083 -2094 -9630 8884 9824 -11794 -12416 -6200 16106 11838 -6911 -24390 -15307 -7317 -21895 -21848
1069 -21848 -8104 -16283 -34624 -42031 -9733 -10966 -2236 -6472 -9368 -11436 -6224 -4974 -14996 -7456
1055g456M12m861k379j1485j2889K37K1072J2015L783R772Q496j6176j219l394
1041d072P473k1545K2174j0493K1021l591k7328l719P186p379O606k190o129L0851
1027H865l0083j4209J6365O701q811K2928J8332L130k7894n693J7110j9666q515
1014b1440P852q910m914l017m710Q113k874K047R716J4212j2232q926k179Q129
1000a9133J4115j296p464k6626n588J1148q378J5538L1745k7884p611K102J4612
987a4720J2472n145l570J0953M748K329o475k1034j0360N714K646J7311q765K0409
973F513p597o216p868k708L555N217o928J4771j7042J7682N411R4j5980m95j2429
958b4020M36K2300m621K195J35M286j487q068k2977j831R197P959J57L501Q180
$$ plain form
1055 -7456 -7044 -11905 -14284 -25769 -38658 -38421 -17349 -5334 -1551 8221 16717 541 -678 -4072
1041 -4072 3401 -18144 4030 -6463 14558 10967 -16361 -20080 -12894 -20273 -13667 -15857 -21986 8865
1027 8865 -21218 -35427 -19062 -12361 -21172 1756 20088 23218 -4676 -10369 6741 -12925 -21440
1014 -21440 -13588 -22498 -27412 -30429 -35139 -27026 -29900 -27853 -18137 -3925 -16157 -25083 -27262 -19133
1000 -19133 -5018 -6314 -13778 -40404 -45992 -34844 -43222 -27684 4061 -23823 -31434 -29332 -14720
987 -14720 -2248 -7393 -10963 -10 4738 7067 592 -20442 -30802 -25088 -22442 -5131 -13896 6513
973 6513 -1084 -7300 -15168 -17876 -14321 -9104 -16032 -1261 -18303 -621 4790 4884 -11096 -11591 -24020
958 -24020 -23584 -1284 -5905 -3710 -3575 711 -776 -8844 -31821 -33652 -24455 -16496 -16339 -12838 -4658
943d658K7906r402l617J783L301k4431j0983J7488P48K000M959j3528K495N74
929e365k1574N608J2074j266m71j041J2044k2426J5605J9374J385J1117j4648
916A0416q186o898q878J3140J605j8624P273N252j4729O165l830j967j552J7505
902c308j3064Q078j2565j3465P253k815J8174l432N267k338O101O574K6178k934
888B3704p118J5356n920j7753m827k6662n408L7616k508j1416k0796r118O807
875b8043r699L9165K417K222K2809j6200J7083k3637m128m31J5588j0119n199
862A828p046J2486k5559O801P453j3276J8930o565J6820R786j9095j9533o617
849b3587j5824m130K8064K605L016K3963q933J4086K785n580l047K668j1894j7109
$$ plain form
943 -4658 23248 13846 10229 12012 15313 -9118 -20101 -2613 -1865 135 5094 -8434 -5939 -5365
929 -5365 -26939 -21331 -9257 -10523 -10994 -12035 9 -22417 -6812 12562 13947 25064 10416
916 10416 2230 -4668 -13546 -406 1199 -17425 -10152 -4900 -19629 -13464 -17294 -19261 -20813 -3308
902 -3308 -16372 -8294 -20859 -34324 -27071 -29886 -11712 -15144 -9877 -12215 -6114 460 26638 23704
888 23704 16586 31942 26022 8269 3442 -23220 -28628 8988 6480 -4936 -25732 -34850 -28043
875 -28043 -37742 1423 3840 6062 28871 12671 29754 6117 1989 1558 17146 7027 1828
862 1828 -5218 7268 -18291 -11490 -4037 -17313 1617 -4948 11872 21658 2563 -16970 -23587
849 -23587 -39411 -43541 -15477 -12872 -9856 14107 5174 19260 22045 16465 13418 16086 4192 -12917
835a2917l01o332N016J703q219J3733K0551L604r418L7181o361j5643j8519o4
821D014l339j0796R271k419l543P011J439k631l502l458j0498N557J5496J6670
807A9272j098P771j8531Q502M178j0765j7077j0091J1977j1753J3184j0371N401
794i401j0095j9559P864L5886R820r92q451p656o687k5872K864J5470j589M517
780a3881K3894j581J719P247k465R037J476k6221k474J5090J4580l7215P058l09
766d045M352p984n679J2833J1095J5325n67j633o451j1993j757J2979q727k746
752E002j6068j3166R035J4117j7918J6237n44J9060j3890j0258k4019J0098m544
739b6858j0874K9898O698m280J9722q78l196N34k7162K6087J8153m131p769l0452
$$ plain form
835 -12917 -13218 -19550 -14534 -12831 -21050 -7317 13234 16838 7420 44601 38240 22597 4078 4014
821 4014 675 -10121 -850 -3269 -6812 199 1638 -993 -4495 -7953 -18451 -12894 2602 19272
807 19272 18174 25945 7414 15916 20094 9329 -7748 -17839 -5862 -17615 -4431 -14802 -9401
794 -9401 -19496 -39055 -31191 4695 14515 13523 5072 -2584 -9271 -35143 -32279 -16809 -18398 -13881
780 -13881 10013 8432 10151 17398 14933 23970 25446 -775 -3249 11841 26421 -10794 -3736 -4045
766 -4045 307 -7677 -13356 -523 10572 25897 25330 23697 17246 5253 3496 16475 7748 5002
752 5002 -11066 -24232 -15197 -1080 -18998 -2761 -3305 15755 1865 -8393 -32412 -22314 -26858
739 -26858 -37732 -7834 -1136 -5416 14306 13428 10232 10766 -16396 9691 27844 23713 15944 -14508
725a4508O653K0313P519k2887j3037k690J2565q536J2184m766J0728J3596k7466
712a0332J3544J4672j5916k120J2293j8850j8878L261J4721J5958J4684P496P553
699C8086r922k5832N495K180O627J4470l0982J8037l013N651j8940k8131j71K2614
685c831J8959j5051j1227J2072m918J2985J355j1531L52L617J2920j1008j3311
672h617n701J1431J7087o233j5263N409J3687q90J2431l1471L885K7191J5646
659C8592l890k1639q071l63k0159j0377K959j037m589J8633P571k3642o04j428
645b8044K4268J6640R088q512j037j4676J2120J9340j1280j2625j6243j8488k331
632c1780K1644J3946O671n649N586K241j1779j4655J0688k884k761L084J8606
$$ plain form
725 -14508 -7855 12458 19977 -2910 -15947 -18637 -6072 -14608 -2424 -7190 3538 17134 -10332
712 -10332 3212 17884 1968 -152 12141 -6709 -25587 -22326 -7605 8353 23037 30533 38086
699 38086 28164 2332 7827 10007 16634 31104 122 18159 15146 20797 1857 -26274 -26445 -3831
685 -3831 15128 77 -11150 922 -3996 8989 10344 -1187 -835 2782 15702 4694 -8617
672 -8617 -14318 -2887 14200 7967 -7296 -1887 11800 10910 23341 -8130 -4245 22946 38592
659 38592 34702 13063 4992 4629 -15530 -25907 -22948 -23985 -28574 -9941 -2370 -26012 -26616 -28044
645 -28044 -3776 12864 21952 13440 12403 -2273 9847 29187 17907 5282 -10961 -29449 -31780
632 -31780 -10136 3810 10481 4832 10418 12659 880 -13775 -3087 -5971 -8732 -5648 12958
619A2958J9707j1913j7287j3502R420N494j0991J3321P518m301q127N379J8465
606B6141o987r740q299J4715k391j0587l921l413J4112O657J0559K087j181r567
592A8185j6590j120K3093k726k2670k6240L5900L2703L359j7766N9l910k5886
579c609M2889l209k064k1042J386j6180j4560J0239K4597R8k5578j2908J8094
566a847J2848o205j0259J4763J3348M655j4021Q920K3362P773l4490o584j1393
553H70J0112J4366j6110r454m614P966J627O91O511J942P640k390Q842R54j9330
538I623j606r230Q525M485K2113j1201O048n36j8077n7J8722l631j2021J0433
524B3590j1339k459L584K095K0240k7949j7938J5994J7000m00k2371K467K5785
$$ plain form
619 12958 32665 20752 3465 -10037 -617 4877 -6114 7207 14725 10424 2297 7676 26141
606 26141 19154 9414 1115 15830 13439 2852 -1069 -4482 9630 16287 26846 28933 27752 18185
592 18185 1595 475 23568 20842 -1828 -28068 7832 40535 43894 26128 26187 22277 -3609
579 -3609 39280 36071 34007 12965 14351 -1829 -16389 -6150 18447 18545 -7033 -19941 -1847
566 -1847 11001 4796 -5463 9300 22648 27303 13282 22202 45564 53337 18847 12263 870
553 870 10982 25348 9238 -216 -4830 3136 4763 5454 11965 13907 21547 19157 27999 28953 9623
538 9623 8017 -1213 7312 11797 33910 22709 28757 28221 10144 10087 28809 25178 13157 23590
524 23590 12251 9792 13376 15471 35711 7762 -10176 5818 22818 22418 47 2514 28299
511B8299l7016q641Q562K5468n856k1688P502L46K1539Q117j8395m511R790K37
497A3753o292Q563j0471j8598J3989J3827j845K0130q034j3902R717p145O280
484A9972J0653k879k7270j7626J3826j5566o105K9426j120j371m222K3273P020
471B8011l9499O793j0030J4604N490j8262P997R985N691J3693P37j7793m857O696
457I256J7071m207n773j9856M692j988K2442j2414j2474k546p26M6560P685j1986
443C5736k7819j0968J5304P977j5763J2093N701j4504J6894L098j5613p929j2566
430h359J1633J6951j0358J0645j7613o328O829l521L328K3427j0450j1818k814
417A552J5845k835J3859p660k6602J6495N246J1126J1316Q319l4582j3662K2211
$$ plain form
511 28299 -8717 -17358 -8796 16672 10816 -10872 -3370 -3024 18515 26632 8237 3726 13516 13753
497 13753 7461 16024 5553 -13045 944 14771 12926 33056 25022 11120 20837 13692 19972
484 19972 30625 27746 476 -17150 -3324 -18890 -24995 4431 3311 1940 -2282 20991 28011
471 28011 -11488 -4695 -14725 -121 5369 -12893 -4896 5089 10780 24473 25210 7417 2560 9256
457 9256 26327 22120 16347 -3509 1183 -805 21637 9223 -3251 -5797 -6523 40037 47722 35736
443 35736 7917 -3051 12253 20230 4467 16560 22261 7757 24651 27749 12136 4207 -8359
430 -8359 3274 20225 9867 20512 2899 -3429 3400 -121 3207 26634 16184 4366 1552
417 1552 17397 14562 28421 20761 -5841 10654 15900 27026 38342 46661 12079 -1583 20628
404B0628J9614j5872k120l1441q435N82J0222L3531J0437j5369Q035j0098l5023
391a5309r757L5535L7162l3036J4024R560k4121l8378O232r644K2629K0306m997
378A0206L810q196k7K1062k1341n587K782J1825o827J6043J1087R877j622m2368
364G24L8477l587l2871j937K1806p044J1566k3801J0151j6124j3245K0639K4823
351B9577J1445j631R053N771k3695K4490J1282l0169m26Q445j5529l405J1382
338C6590L936J4526k5973j5095Q010q035P355j315l2916m815L6013J6897q216
325B6962j8918Q136K187m255J5922j9498J8951L5294j6500j2822o299N717J4966
312D9843k8928j4555K961p770K5979O659j7396j5719K180J8840J6764r615k0152
$$ plain form
404 20628 40242 24370 22250 -9191 -17626 -17044 -6822 26709 37146 21777 29812 19714 -15309
391 -15309 -25066 10469 47631 14595 28619 38179 14058 -24320 -18088 -27732 -5103 15203 10206
378 10206 14016 5820 5793 26855 5514 -73 2709 14534 7707 23750 34837 44714 43092 724
364 724 39201 35614 2743 806 22612 15568 27134 3333 13484 -2640 -15885 4754 29577
351 29577 41022 39391 48444 54215 30520 55010 66292 36123 35697 44142 28613 25208 36590
338 36590 40526 55052 29079 13984 21994 13959 21314 19999 -12917 -17732 18281 35178 26962
325 26962 8044 16180 18367 14112 30034 10536 29487 64781 48281 35459 29160 34877 49843
312 49843 20915 6360 9321 1551 27530 34189 16793 1074 3254 22094 38858 29243 9091
299I091J807j7923J2664O882J7518q851L899K2458M638j8526K971j1106q512J2034
285B9044K115O562j6056l3297M6954Q754j1146j7056M239J2645J4848k4465J690
272B4831L368j1214J9926k361P614r100k1995K451L6645j8398l382j7569j1966
259a150o143J2011J2492K7645J520j6141P200j4782M236k859o172J2555p915Q446
245C0943k413j1788J2099j1580J1489j2887l724J5438l275o430O8O917o768J2286
231C0375j7785K0739m20J8162K231n98j602j1389r002J2730j1716k0473K5889
218C7141J6001j0344k5428J0624L049O381o743J931j2084l8O786l700L6660K655
204F2891k8374k256K0979O941k3672m136K203J455K6691k2098l564M770j1126
$$ plain form
299 9091 10898 -7025 5639 12521 30039 21188 25087 47545 52183 33657 36628 25522 17010 29044
285 29044 31159 37721 21665 -11632 35322 44076 32930 15874 20113 32758 47606 23141 24831
272 24831 28199 16985 36911 34550 42164 33064 11069 13520 50165 31767 28385 10816 -1150
259 -1150 -7293 4718 17210 44855 46375 30234 37434 22652 26888 24029 17857 30412 22497 30943
245 30943 28530 16742 28841 17261 28750 15863 12139 27577 24302 17872 17940 24857 18089 30375
231 30375 12590 33329 32909 51071 53302 52704 51102 39713 30711 43441 31725 11252 37141
218 37141 53142 42798 17370 27994 31043 37424 30681 32612 20528 20490 27276 23576 60236 62891
204 62891 34517 32261 53240 60181 36509 32373 34576 36031 62722 40624 37060 41830 30704
191C0704L567L14O455J576p977K549J003k0017j0413J7415J4189J33K054J0568
177E2120p708R90R073J3246K020j4055L442J928J6103k4736k3230J582J2696R784
163E3255m219J230l0n038j297K6478k786j4613m674Q699K1648l845o687j5015
149E3106P305P226j4874K1189J84j0633P683o213J4437J1108r884m322k6515N577
135E5374M976K01Q754l657J3943J2578P523j6571l313j8904o16q597R883K136
121F3710J1804l20n197J1340J0502K606L56n65J1035q123Q636M277k4925J5168
107A00304o803P93n229Q609k4795R085L684p059K856Q192Q401M236m021l205L1553
92A26601l244j2314n136k2522J9887K4035j1078j2772K0683r827q115J8352m038
$$ plain form
191 30704 34271 34585 41040 42616 34639 37188 38191 18174 7761 25176 39365 39498 41552 52120
177 52120 44412 45402 54475 67721 69741 55686 59128 61056 77159 52423 29193 30775 43471 53255
163 53255 49036 50266 50236 45198 43901 70379 67593 52980 48306 57005 78653 74808 68121 53106
149 53106 60411 67637 52763 73952 74136 63503 71186 64973 79410 90518 80634 76312 49797 55374
135 55374 60350 60551 69305 65648 79591 92169 99692 83121 79808 60904 60288 51691 61574 63710
121 63710 75514 75194 69997 81337 91839 94445 94801 94236 105271 97148 105784 110061 85136 100304
107 100304 93501 94294 89065 97674 72879 81964 85648 78589 81445 89637 98038 102274 98253 95048 126601
92 126601 123357 111043 105907 83385 103272 127307 116229 103457 124140 114313 106198 124550 120512
79A20512M218j7997K3139j7556R891K554q29l694K4207j1505j4805n700J7889
66A30324J2212j6179j17O017R474J406j9603j7792J1026Q170R643J5813n744j6381
52A28269K120L414l414l6j6027M787J3592j0578J9022k932P343J901J596M83j0324
37A39216J1838j3873j466K2273k269N783j3169L45p977J1486R66o225l437M401
23A47892J73K1284J0749q727j6790J9828l412j8977m438J889R217O818O34p38
9A65402M934J4733l833m521M419J259o016n726P53
0A71404
$$ plain form
79 120512 124730 106733 129872 112316 122207 124761 123932 120238 144445 132940 118135 112435 130324
66 130324 142536 126357 126240 132257 141731 143137 123534 105742 116768 124938 134581 150394 144650 128269
52 128269 130389 133803 130389 130353 114326 119113 132705 122127 141149 138217 145560 147461 149057 149540 139216
37 139216 151054 137181 135715 157988 155719 161502 148333 148678 140701 152187 153153 146928 143491 147892
23 147892 148065 169349 180098 171371 154581 174409 170997 152020 147582 149471 158688 165506 166140 165402
9 165402 170336 185069 181236 176715 181134 182393 176377 170651 171404
0 171404
$$ Imaginary data points
##PAGE= N=2
##DATA TABLE= (X++(I..I)), XYDATA
16383a049501J4746K2234R689O815Q239K1311K1133R987K2899Q955K0408J8653
16371h64432O617J9508k860J8226J3014J5940L6751P501m019K7384K3447L0452
16359f72471j0012R657K8535l154R345J2405J0637P637J8813K9157J2736N076
16347e41639J7616J7165P39K6036K3719L5668K878n049J3399R20L6932n426R599
16334c67443L7146N494J1586N515K1011k062J10J8263K4591J1248L6687K0277
16322a77577N430P013N019L082J5051j7488K3399K1766K4349J5633K3001N464
16310d5858K940J1405k816J2858J9027J2254R283K5343L350M675Q044L2260j4271
16297G8494J3488K3154Q665j486L858K5272J2052Q670K4116N723J3613J5521l939
$$ plain form
16383 -1049501 -1034755 -1012521 -1002832 -996017 -987778 -966467 -945334 -935347 -912448 -903493 -883085 -864432
16371 -864432 -857815 -838307 -841167 -822941 -809927 -793987 -757236 -749735 -753754 -726370 -702923 -672471
16359 -672471 -682483 -672826 -644291 -647445 -638100 -625695 -615058 -607421 -588608 -559451 -546715 -541639
16347 -541639 -524023 -506858 -506119 -480083 -456364 -420696 -417818 -422867 -409468 -408548 -371616 -377042 -367443
16334 -367443 -330297 -324803 -313217 -307702 -286691 -288753 -288643 -270380 -245789 -234541 -197854 -177577
16322 -177577 -172147 -165134 -160115 -157033 -141982 -159470 -136071 -114305 -89956 -74323 -51322 -45858
16310 -45858 -42918 -31513 -34329 -21471 -2444 9810 19093 44436 47786 52461 60505 92765 78494
16297 78494 91982 115136 123801 122315 126173 151445 163497 172167 196283 202006 215619 231140 227201
16284B27201L1781j3253J3806J6442P240K7918k1843J6242Q447M530K1732K8447
16272C68690P837J561J0063J1901J844K1263r302J5270K2108M572n074O108o735
16259D50106J7412K8031K3746l423R384R837K5538J558j4858J4645J1067O37r433
16246E64247J5037K3559P778K0934J2400j2348j4700O522L1708r86p862K9253
16234F75542J9519J28J950J8122K9801j8470j1043J6629Q840J5086p301Q27L7327
16221G86957k0212R587M737l617J9289J9663J754k740J3086j495r501J1950J427
16208H30885q092J7229P998J6336J6120o997J0265J1542k4138k1973L1080Q001
16196H88256J9419R112o96J17R581R90j7605R607J0375J6772J4244j6679O070
$$ plain form
16284 227201 258982 245729 259535 275977 283217 311135 289292 305534 313981 318511 340243 368690
16272 368690 376527 378088 388151 400052 401896 423159 413857 429127 451235 455807 450733 456841 450106
16259 450106 467518 495549 519295 515872 525256 535093 560631 562189 547331 561976 573043 573680 564247
16246 564247 579284 602843 610621 631555 643955 631607 616907 623429 655137 654151 646289 675542
16234 675542 695061 695189 697139 715261 745062 726592 715549 732178 741018 756104 748803 749630 786957
16221 786957 766745 776332 781069 777452 796741 816404 818158 815418 828504 827009 817508 829458 830885
16208 830885 822793 840022 848020 864356 880476 873479 883744 895286 871148 849175 880255 888256
16196 888256 907675 916787 916091 916208 925789 926779 909174 918781 929156 945928 960172 943493 949563
16183I49563j80R76L373k580L3040K9833j7750j9221r415J7938n606o058P698
16170I81611J5339J8177l228K786j519o041K032K4723j6705P236q928L5250k176
16157A048557L924n410r545j2522L1065J7897m353R895Q045Q213m760j5635k086
16144A073285K0564M272L094L28O835n787K991j7427J4990K418K1253R691k4491
16131A112016K4397J4289L392Q736k3704J764L7862Q027q014l2247k3174J0616
16119A133960o265j5949K6745O875j4929L657m853Q818j6048K5243P621l1686
16107A123189k3347L4952j1060r189J3868J9817N514J4674r792o11j5519J1339
16095A153835J1561j0562K663J3081L475K100q923J0960M283r569M246J9173j2578
$$ plain form
16183 949563 949383 950359 953732 951152 984192 1014025 996275 977054 967639 985577 979971 973913 981611
16170 981611 996950 1015127 1011899 1014685 1013166 1007125 1009157 1033880 1017175 1024411 1015483 1050733 1048557
16157 1048557 1052481 1047071 1037526 1025004 1056069 1073966 1069613 1079508 1087553 1095766 1091006 1075371 1073285
16144 1073285 1093849 1098121 1101215 1101543 1108378 1102591 1105582 1088155 1103145 1105563 1126816 1136507 1112016
16131 1112016 1136413 1150702 1154094 1162830 1139126 1140890 1178752 1186779 1178765 1146518 1123344 1133960
16119 1133960 1127695 1111746 1138491 1145366 1130437 1134094 1129241 1138059 1122011 1147254 1154875 1123189
16107 1123189 1099842 1134794 1123734 1114545 1128413 1148230 1153744 1168418 1158626 1158015 1142496 1153835
16095 1153835 1165396 1154834 1157497 1170578 1174053 1176153 1167230 1178190 1182473 1172904 1177150 1196323 1183745
16082A183745J1587k0355j9441L0465l1265j7893J3801L3328j6797R152k138j258
16070A172931L857r561J5394Q307l3543j4823J1704J6431J6805L1908j9114L680
16058A203976j4298m271j1641l822l065P455j0633K368p551K3702K6525l677k601
16045A202467q320K655K4264j1801k4350r414j6035N38K3603J4482k260j2198
16033A183631J3710J4172k1262r468n123J3129J4274j4394j5232q59j554j4556
16021A156468M296K5493j4420m787o583R840K3900n86j6697j1388k736R558O675
16008A179033K4549Q724j0249j8825L292k834j006K381K371K4982l1023j842j269
15995A178284j023J4849L727k1136j2145Q779J4234L1731l189q489j0699J3301
$$ plain form
16082 1183745 1195332 1174977 1155536 1186001 1154736 1136843 1150644 1183972 1167175 1176327 1174189 1172931
16070 1172931 1176788 1167227 1182621 1190928 1157385 1142562 1154266 1170697 1187502 1219410 1200296 1203976
16058 1203976 1189678 1185407 1173766 1169944 1166879 1174334 1163701 1166069 1158518 1182220 1208745 1205068 1202467
16045 1202467 1194147 1196802 1221066 1209265 1184915 1175501 1159466 1160004 1183607 1198089 1195829 1183631
16033 1183631 1197341 1211513 1190251 1180783 1175660 1188789 1203063 1188669 1173437 1172578 1171024 1156468
16021 1156468 1160764 1186257 1171837 1167050 1160467 1170307 1194207 1193621 1176924 1165536 1162800 1172358 1179033
16008 1179033 1203582 1212306 1202057 1183232 1186524 1183690 1182684 1185065 1187436 1212418 1181395 1179553 1178284
15995 1178284 1177261 1192110 1195837 1174701 1162556 1171335 1185569 1217300 1214111 1205622 1194923 1208224
15983A208224l553m976k243o780R50k591k317m810j3431K831J2234O652L882k978
15969A191094j080K3691J4494o16j4387j738l1102J55K3485l370j5953J421J4249
15956A200343j3368Q48j2869J5297o703j9502K474k3996J245J1389k165J9699
15944A172692J3839j4537K4571j4175p861K0565j669O317j6818J0555J0349l9690
15932A164138K2842J5117j623m008K072j7264o644M381R004j412R485r691Q111
15919A194508j0744j8976L3544r089j85N0J0187o827k481j1647j0977O90L8054
15906A206107m744j9082M504k997o164J5416K9793J2149J0055k6509k0594j3241
15894A184693j160M111P024K5069j4176J906L131m093k0911K2603N061j5018m189
$$ plain form
15983 1208224 1204671 1199695 1197452 1190672 1191622 1189031 1186714 1181904 1168473 1171304 1183538 1190190 1194072 1191094
15969 1191094 1190014 1213705 1228199 1227583 1213196 1211458 1180356 1180511 1203996 1200626 1184673 1186094 1200343
15956 1200343 1186975 1187823 1174954 1190251 1183548 1164046 1166520 1142524 1143769 1155158 1152993 1172692
15944 1172692 1186531 1171994 1196565 1182390 1174529 1195094 1193425 1199742 1182924 1193479 1203828 1164138
15932 1164138 1186980 1202097 1200474 1196466 1198538 1181274 1174630 1179011 1188015 1186603 1196088 1186397 1194508
15919 1194508 1183764 1164788 1198332 1189243 1189058 1189108 1199295 1192468 1189987 1178340 1167363 1168053 1206107
15906 1206107 1201363 1182281 1186785 1183788 1177624 1193040 1222833 1234982 1245037 1218528 1197934 1184693
15894 1184693 1183533 1187644 1194668 1219737 1205561 1207467 1210598 1206505 1185594 1208197 1213258 1198240 1194051
15881A194051l4901J0935J6675J5681J01l9447K2203P035J663o877j4869K363
15869A174613O695j8769K4707n665j1495J0414M05j0021j0515R832K3455r969
15857A183687P199N754l093K9810j5325j5372j2639j3062l412J4894J4786j5991
15845A177236J6672L985P26p084O925J235k9918J4288Q001O927J3979M766m084
15832A213654L512j018N518k646J4085l1955k7793j4025L0663K1534k777k2598
15820A186154j7543K2712o841j5988J0023k753Q536k0125O966K7243j6636l534
15808A178214J1557k4836K7482J5196j2767r55K853J737j2980j3499p458R868
15796A174412K2065j9722k573j5077r373K9788K4543K906j1922J2966j546k5000
$$ plain form
15881 1194051 1159150 1170085 1186760 1202441 1202542 1163095 1185298 1192333 1193996 1187119 1172250 1174613
15869 1174613 1181308 1162539 1187246 1181581 1170086 1180500 1180905 1170884 1160369 1170201 1193656 1183687
15857 1183687 1190886 1196640 1193547 1223357 1208032 1192660 1180021 1166959 1163547 1178441 1193227 1177236
15845 1177236 1193908 1197893 1198619 1191535 1198460 1199695 1169777 1184065 1192066 1198993 1212972 1217738 1213654
15832 1213654 1217166 1216148 1221666 1219020 1233105 1201150 1173357 1159332 1189995 1211529 1208752 1186154
15820 1186154 1168611 1191323 1184482 1168494 1178517 1175764 1184300 1164175 1171141 1198384 1181748 1178214
15808 1178214 1189771 1164935 1192417 1207613 1194846 1193891 1196744 1198481 1185501 1172002 1164544 1174412
15796 1174412 1196477 1176755 1174182 1159105 1149732 1179520 1204063 1206969 1195047 1208013 1206467 1181467
15784A181467Q472q654j8802K6663K6866L329J3595l5312J826P964k9649K7953
15772A205718j0376j7493L0227j2774p778J3749r887K0335j0501m422Q434P519
15760A212751n77l0090j4783p58R075M1770r535j7328J723R755j7010p24j1024
15747A173245R956P31K0820R701j3781m0502J2286j3534n41M3821o509o248o591
15734A182854J4139q161M55J1729K084j7949M31J9575j9164J5621l1508N551L7991
15721A213648n521L325n25o325j8731J3357k9754O48O902O518P895N139N074j6720
15707A184930J1935l151k4900J6957R903j7489k095P984M160l547R014P196N909
15694A206806j1864N164r025J807J0278n541J020l155j313K2585j1885l1665J7754
$$ plain form
15784 1181467 1189939 1181285 1162483 1189146 1216012 1219341 1232936 1197624 1199450 1207414 1177765 1205718
15772 1205718 1195342 1177849 1208076 1195302 1187524 1201273 1191386 1211721 1201220 1196798 1205232 1212751
15760 1212751 1212174 1182084 1167301 1166543 1175618 1217388 1207853 1190525 1192248 1202003 1184993 1184269 1173245
15747 1173245 1183201 1183932 1204752 1214453 1200672 1160170 1172456 1158922 1158381 1202202 1195693 1189445 1182854
15734 1182854 1196993 1188832 1189287 1201016 1203100 1185151 1185582 1205157 1185993 1201614 1170106 1175657 1213648
15721 1213648 1208127 1211452 1210927 1204602 1185871 1199228 1169474 1170122 1177024 1183542 1191437 1196576 1201650 1184930
15707 1184930 1196865 1193714 1168814 1185771 1195674 1178185 1176090 1184074 1188234 1184687 1193701 1200897 1206806
15694 1206806 1194942 1200106 1191081 1192888 1203166 1197625 1198645 1195490 1194177 1216762 1204877 1173212 1190966
$$ [...]
##END NTUPLES=NMR SPECTRUM
##END=
