##TITLE=1H_CA-8981x-1
 DMSO
 8 sc, 
 17.03.2022
##JCAMPDX= 6.0         $$ Bruker NMR JCAMP-DX V2.0
##DATA TYPE= NMR SPECTRUM
##DATA CLASS= NTUPLES
##ORIGIN= UXNMR, Bruker Analytische Messtechnik GmbH
##OWNER= root
$$ XWIN-NMR		Version 3.5
$$ Thu Mar 17 10:19:18 2022 Russian Standard Time (UT+4h)  she@DPX200
##.OBSERVE FREQUENCY= 200.131346
##.OBSERVE NUCLEUS= ^1H
##.ACQUISITION MODE= SIMULTANEOUS
##.ACQUISITION SCHEME= undefined
##.AVERAGES= 8
##.DIGITISER RES= 18
##SPECTROMETER/DATA SYSTEM= spect
##.PULSE SEQUENCE= zg30
##.SOLVENT NAME= DMSO
##.SHIFT REFERENCE= (INTERNAL, DMSO, 0, 15.7436)
##AUDIT TRAIL= $$ (NUMBER, WHEN, WHO, WHERE, WHAT)
$$ ##TITLE= Audit trail, XWIN-NMR		Version 3.5
$$ ##JCAMPDX= 5.01
$$ ##ORIGIN= Bruker BioSpin GmbH
$$ ##OWNER= she
$$ F:/spectra/data/she/nmr/H-F/1/pdata/1/auditp.txt
$$ ##AUDIT TRAIL=  $$ (NUMBER, WHEN, WHO, WHERE, WHAT)
(   1,<2022-03-17 10:18:04.25 +0400>,<she>,<DPX200>,
      <created by zg, POWCHK disabled, PULCHK disabled
       configuration hash MD5:
       00 E9 B6 7A A2 85 ED C7 34 08 36 98 17 FE 4E 26
       data hash MD5: 16K
       FD 80 9D 3D 18 2C E9 65 8F 1B 11 B4 BF C5 B8 B2>)
(   2,<2022-03-17 10:18:06.78 +0400>,<she>,<DPX200>,
      <Start of raw data processing
       efp BC_mod = 2 LB = 0.24 FT_mod = 6 PKNL = 1 PHC0 = -16947.34 PHC1 = 9.20078 SI = 16K 
       data hash MD5: 16K
       56 C8 EA 4E 26 2F 72 B2 DA 7E 28 81 66 B5 AB 26>)
(   3,<2022-03-17 10:18:31.53 +0400>,<she>,<DPX200>,
      <pk PHC0 = -4.592312 PHC1 = 2.8 
       data hash MD5: 16K
       B0 62 A3 C3 53 8B 15 4A 53 EE 63 B1 9E 79 54 D7>)
(   4,<2022-03-17 10:18:34.48 +0400>,<she>,<DPX200>,
      <abs ABSG = 5 
       data hash MD5: 16K
       68 32 79 DC 25 60 F8 4B 27 02 5F 16 01 62 D9 CD>)
$$ ##END=
$$ 
$$ hash MD5
$$ 2C A1 C6 AA 62 03 D0 AC B0 04 BE 29 71 86 19 69
##$RELAX= 
##$RELAX= 
##$RELAX= 
##$RELAX= 
##$RELAX= 
##$RELAX= 
$$ Bruker specific parameters
$$ --------------------------
##$DU= <F:/spectra>
##$EXPNO= 1
##$NAME= <H-F>
##$PROCNO= 1
##$TYPE= <nmr>
##$USER= <she>
##$AMP= (0..31)
100 100 100 100 100 100 100 100 100 100 100 100 100 100 100 100 100 100 
100 100 100 100 100 100 100 100 100 100 100 100 100 100 
##$AQSEQ= 0
##$AQ_mod= 1
##$AUNM= <au_zg>
##$AUTOPOS= <>
##$BF1= 200.13
##$BF2= 200.13
##$BF3= 200.13
##$BF4= 200.13
##$BF5= 200.13
##$BF6= 200.13
##$BF7= 200.13
##$BF8= 200.13
##$BYTORDA= 1
##$CFDGTYP= 0
##$CFRGTYP= 5
##$CHEMSTR= <none>
##$CNST= (0..31)
1 1 145 1 1 1 1 1 1 1 1 1 1 1 1 1 1 1 1 1 1 1 1 1 1 1 1 1 1 1 1 1 
##$CPDPRG= <>
##$CPDPRG1= <>
##$CPDPRG2= <>
##$CPDPRG3= <>
##$CPDPRG4= <mlev>
##$CPDPRG5= <mlev>
##$CPDPRG6= <mlev>
##$CPDPRG7= <mlev>
##$CPDPRG8= <mlev>
##$CPDPRGB= <>
##$CPDPRGT= <>
##$D= (0..31)
0 1.2 0 0 0 0 0 0 0 0.06 0 0.03 0 0 0 0 0.0002 0 0 0 0 0 0 0 0 0 0 0 0 
0 0 0 
##$DATE= 1647497883
##$DBL= (0..7)
120 120 120 120 120 120 120 120 
##$DBP= (0..7)
150 150 150 150 150 150 150 150 
##$DBP07= 0
##$DBPNAM0= <>
##$DBPNAM1= <>
##$DBPNAM2= <>
##$DBPNAM3= <>
##$DBPNAM4= <>
$$ [...]
##$SUBNAM2= <"">
##$SUBNAM3= <"">
##$SUBNAM4= <"">
##$SUBNAM5= <"">
##$SUBNAM6= <"">
##$SUBNAM7= <"">
##$SUBNAM8= <"">
##$SUBNAM9= <"">
##$SW= 18.0517287032376
##$SWIBOX= (0..15)
0 0 2 0 0 0 0 0 0 0 0 0 0 0 0 0 
##$SW_h= 3612.71676300578
##$TD= 16384
##$TD0= 1
##$TE= 0
##$TE2= 300
##$TE3= 300
##$TEG= 300
##$TL= (0..7)
0 120 120 120 120 120 120 120 
##$TP= (0..7)
150 150 150 150 150 150 150 150 
##$TP07= 0
##$TPNAME0= <>
##$TPNAME1= <>
##$TPNAME2= <>
##$TPNAME3= <>
##$TPNAME4= <>
##$TPNAME5= <>
##$TPNAME6= <>
##$TPNAME7= <>
##$TPOAL= (0..7)
0.5 0.5 0.5 0.5 0.5 0.5 0.5 0.5 
##$TPOFFS= (0..7)
0 0 0 0 0 0 0 0 
##$TUNHIN= 0
##$TUNHOUT= 0
##$TUNXOUT= 0
##$USERA1= <user>
##$USERA2= <user>
##$USERA3= <user>
##$USERA4= <user>
##$USERA5= <user>
##$V9= 5
##$VALIST= <valist>
##$VCLIST= <CCCCCCCCCCCCCCC>
##$VD= 0
##$VDLIST= <DDDDDDDDDDDDDDD>
##$VPLIST= <PPPPPPPPPPPPPPP>
##$VTLIST= <TTTTTTTTTTTTTTT>
##$WBST= 1024
##$WBSW= 4
##$XGAIN= (0..3)
0 0 0 0 
##$XL= 0
##$YL= 0
##$YMAX_a= 129031
##$YMIN_a= -163338
##$ZGOPTNS= <>
##$ZL1= 120
##$ZL2= 120
##$ZL3= 120
##$ZL4= 120
##$ABSF1= 15.71714
##$ABSF2= -2.334709
##$ABSG= 5
##$ABSL= 3
##$ALPHA= 0
##$AQORDER= 0
##$ASSFAC= 0
##$ASSFACI= 0
##$ASSFACX= 0
##$ASSWID= 0
##$AUNMP= <proc_1d>
##$AZFE= 0.1
##$AZFW= 0.1
##$BCFW= 0
##$BC_mod= 2
##$BYTORDP= 0
##$COROFFS= 0
##$CY= -3
##$DATMOD= 1
##$DC= 0
##$DFILT= <>
##$DTYPP= 0
##$F1P= 0
##$F2P= 0
##$FCOR= 1
##$FTSIZE= 16384
##$FT_mod= 6
##$GAMMA= 0
##$GB= 0
##$INTBC= 1
##$INTSCL= 0
##$ISEN= 128
##$LB= 0.24
##$LEV0= 0
##$LPBIN= 0
##$MAXI= 10000
##$MC2= 0
##$MEAN= 0
##$ME_mod= 0
##$MI= 1.114404
##$NCOEF= 0
##$NC_proc= -8
##$NLEV= 6
##$NOISF1= 3.799351
##$NOISF2= 2.8
##$NSP= 0
##$NTH_PI= 0
##$NZP= 0
##$OFFSET= 15.74358
##$PC= 1
##$PHC0= -16951.93
##$PHC1= 12.00078
##$PH_mod= 1
##$PKNL= yes
##$PPARMOD= 0
##$PSCAL= 0
##$PSIGN= 0
##$REVERSE= no
##$SF= 200.130001594885
##$SI= 16384
##$SIGF1= 3
##$SIGF2= 2
##$SINO= 5.538805
##$SIOLD= 16384
##$SREGLST= <1H.CDCl3>
##$SSB= 0
##$STSI= 16384
##$STSR= 0
##$SW_p= 3612.71676300578
##$SYMM= 0
##$S_DEV= 0
##$TDeff= 16384
##$TDoff= 0
##$TI= <>
##$TILT= no
##$TM1= 0
##$TM2= 0
##$TOPLEV= 0
##$USERP1= <user>
##$USERP2= <user>
##$USERP3= <user>
##$USERP4= <user>
##$USERP5= <user>
##$WDW= 1
##$XDIM= 16384
##$YMAX_p= 344066325
##$YMIN_p= -2077682
$$ End of Bruker specific parameters
$$ ---------------------------------
##NTUPLES= NMR SPECTRUM
##VAR_NAME=  FREQUENCY,     SPECTRUM/REAL,   SPECTRUM/IMAG
##SYMBOL=    X,             R,               I
##VAR_TYPE=  INDEPENDENT,   DEPENDENT,       DEPENDENT
##VAR_FORM=  AFFN,          ASDF,            ASDF
##VAR_DIM=   16384,         16384,           16384
##UNITS=     HZ,            ARBITRARY UNITS, ARBITRARY UNITS
##FACTOR=    0.220516191357247, 1,           1
##FIRST=     3150.76266339197, 0,            0
##LAST=      -461.954099613805, 0,           0
##MIN=       -461.954099613805, -2077682,    0
##MAX=       3150.76266339197, 344066325,    0
$$ Real data points
##PAGE= N=1
##DATA TABLE= (X++(R..R)), XYDATA
$$ [...]
9928 -359811 -794492 -603940 -373167 -246290 -186425 -165826 -378732 -340771 -139995 -111740
9918 -111740 -241941 -94024 -48320 -326333 -125841 92220 -11191 -59463 -204189 -173277
9908 -173277 15680 -102583 -427275 -967806 -833362 -346542 -390931 -556209 -653070 -147177
9898 -147177 208623 -384333 -616672 -370188 -392515 -304439 -382053 -584429 -609031 -427321
9888 -427321 -338711 -528701 -355416 -30685 -417118 -511751 -267872 9030 -125838 -403888
9878 -403888 -402456 -961819 -373150 -137663 160405 -1943 -64254 -271357 -690146 -599810
9868 -599810 -669762 -370785 -590654 -481252 -342431 -124182 -54359 -344390 -602439 -551445
9858 -551445 -608787 -516138 -336645 -420255 -475104 -784591 -485965 -14058 -216391 -414187
9848 -414187 -793743 -613104 -269128 -345037 -236716 272140 80015 -103765 -92559 -293462
9838 -293462 -164750 -262293 -112108 -194080 -283181 -127825 -27428 -376427 -138473 -223032
9828 -223032 -157545 -378683 -795593 -557926 -371651 -117579 -95925 -310806 -294816 -268043
9818 -268043 -465725 -296062 -260224 -336510 -372986 -97050 134586 134314 -22093 -289642 -79176
9807 -79176 -187878 -259381 -519222 -480917 -568144 -774801 -820696 -719492 -329658 -177121 -311073
9796 -311073 -215752 -379195 -138624 -650598 -739140 -317758 -425277 -559678 -213023 -193338
9786 -193338 -126913 -574384 -154100 -310843 -353761 325083 168324 -156954 -550832 -12144
9776 -12144 203673 -196334 -244395 35647 -435441 -559960 -600691 -110708 -74957 -514045
9766 -514045 -253934 -267609 -268706 10572 136247 65924 53267 -16279 -225066 -247025 -118656
9755 -118656 -409354 -776548 -716532 -716497 -749497 -676427 -149090 -350226 -361603 -475391 -600521
9744 -600521 -821415 -811146 -546938 -148352 -432414 -104751 88413 -327244 -822748 -208169
9734 -208169 203277 10229 -482219 -118498 97644 -229395 -188064 -20533 -88623 -259575
9724 -259575 -100436 -198569 -440581 -470985 -356613 -192077 -219143 -180372 -152347 -97504 -127023
9713 -127023 -90289 -308326 -448669 -37462 26558 183533 -120167 -237607 -60978 175266
9703 175266 78569 145188 -45446 66976 33211 38475 -28524 16348 -242608 -59408 -407877
9692 -407877 -278856 -44713 88452 -17862 -487310 -298386 -190012 248045 153272 201965
9682 201965 -322942 -338117 -129407 -98284 -188748 -110422 299666 106153 183319 316359 148619
9671 148619 -16896 -256946 -390951 -110753 -88318 157656 201479 -75890 -66777 -122587 277078
9660 277078 463968 214668 549121 623496 285647 -22651 -195507 -94100 40678 66404
9650 66404 93457 196601 287307 80816 92102 123367 128022 143538 230352 395154 -91802
9639 -91802 -349024 141995 143901 576137 638377 535842 440568 338304 708017 1203654 919873
9628 919873 1085920 1399525 851240 964799 917101 1067856 1436433 1342526 1279235 1850565
9618 1850565 1849412 2195610 2575065 2881159 3107039 4168732 4883196 5430869 6880658 8323732
9608 8323732 9500577 9096196 7453636 6222145 5465109 4265587 3571088 2782758 1884759
9599 1884759 1386285 987843 1176454 1380280 1331940 1257509 1439554 1007565 1072220 712272
9589 712272 331848 468151 620664 740251 819516 1026042 825072 568415 401094 368363
9579 368363 320530 398164 475073 625337 474243 171226 207276 189934 -217823 -396758 -547952
9568 -547952 159284 582209 529172 718671 678462 498370 116704 39897 -27880 -377677
9558 -377677 -106400 21799 59690 -389352 -378357 -176330 -275342 30064 138867 -357104
9548 -357104 -457970 -394716 -37308 158825 37626 -13527 64744 87081 395183 150335
9538 150335 -578850 -714478 -241948 151026 -157701 -265580 -237382 9789 -7237 100849
9528 100849 321123 3402 -114645 -267020 -543423 -260445 -50465 -246115 -299280 -310437
9518 -310437 -230254 -194 18398 9539 -120725 -284625 -232866 -557132 -437718 -648019 -517949
9507 -517949 -409514 -575728 -170228 -393557 -520401 -190632 -214710 -212952 -22363 -283730
9497 -283730 -249731 -390093 -432603 -508281 -456723 -535989 -692679 -470894 -302980 -428022 -117748
9486 -117748 -583003 -681023 -430116 -159536 59850 -126964 -281067 -230322 -431730 -438133
9476 -438133 -599936 -580415 -297561 -342901 -530969 -558023 -569690 -209723 -102802 -507840
9466 -507840 -754881 -610744 10417 -307730 -434760 -341112 -755088 -395488 -400685 107699
9456 107699 -34587 -256127 215323 114925 126690 -284043 -525285 -345085 -373298 -596218
9446 -596218 -614552 -439526 -194831 -484724 -617363 -800798 -609764 -546011 -546377 -142259 -331242
9435 -331242 -700932 -452161 -499150 -94724 305947 -398015 -637173 -578673 -732693 -431906
9425 -431906 -238623 6784 312231 258432 -99378 -131879 -159061 -350595 -432094 -276944
9415 -276944 -12944 -219904 -130184 -316463 -365894 17775 -145993 -378445 -146828 98997
9405 98997 -152885 -360646 -236802 -409920 -302200 -15878 -106816 -449290 -438812 -39395
9395 -39395 -362704 -500207 -624788 -449219 -518873 -268420 -206392 -686599 -657045 -654670 -533861
9384 -533861 -691911 -722574 -475614 96422 202492 -83422 -332824 -530359 -203181 -441851
9374 -441851 -181933 351 -255330 -493587 -241267 -254891 -395990 -326396 -390213 -398751 -675138
9363 -675138 -281407 250669 -67166 -433757 -774182 -422008 -248403 -42945 198640 -23958
9353 -23958 -349732 -362042 -309810 -78260 -273354 -655392 -328177 -535969 -343161 -470711
9343 -470711 -354815 -354304 -105529 -153186 -407757 -320658 186006 -177867 -185385 -266666 -334163
9332 -334163 -401425 -316791 -90069 -273033 -183393 -12254 108943 -161255 -188482 -389792
9322 -389792 -266331 -496852 -636008 -78541 -178457 -157499 -63597 -114761 -19405 -277322 256603
9311 256603 380805 210742 -215123 -568042 -377678 136577 -27623 -185033 22127 -136303
9301 -136303 -181509 -325102 -278167 -331854 -355764 -13329 -34968 -32759 -217427 -385855 -432597
9290 -432597 -355269 2739 3108 -76864 22521 -506575 -428640 94182 142916 259813 334759
9279 334759 -64644 -161428 -107034 20303 -169966 -342813 -274013 -512119 -604171 -268594
9269 -268594 36283 -75859 -330482 -210310 -122747 -84509 176899 -218046 -157183 -110870
9259 -110870 -85132 27952 138250 371817 124527 -426519 -352732 -196573 98954 -361754
9249 -361754 54527 158510 -140295 108793 -27666 -562155 -107241 -62533 -32740 -369241
9239 -369241 -420171 -49570 -311052 -308345 -305351 4972 12528 147327 141573 371421 138302
9228 138302 192616 -95963 -508016 -260036 -176964 40147 217554 247821 56118 -134250
9218 -134250 -139685 -375196 -125768 192128 447447 -58040 -52368 -45914 -123593 -85357 -49810
9207 -49810 160921 -205740 -30730 -88229 86860 71544 -177222 -243118 -29517 368819
9197 368819 5887 83069 233128 105322 -94402 -236084 -42975 -226910 6847 204717
9187 204717 48588 -243696 283166 328205 -227671 -520799 -617046 -428698 -225072 45233
9177 45233 -59041 197180 84522 -194704 -480811 -555042 -273090 91231 281499 61897
9167 61897 -58507 -97779 -94653 -93712 -196380 -135377 -178205 -109850 -246162 -203151 -144217 -370923
9155 -370923 -114668 91001 -11541 316236 470957 432623 481515 188839 -13778 -141856
9145 -141856 234469 239066 338536 434172 346442 43850 143577 -28995 -174091 -196250 -211472
9134 -211472 37743 -71627 -45523 -94458 -127214 -432412 -245313 71398 373713 337163
9124 337163 83839 2490 305994 451315 310247 214056 238301 217452 -6277 90929 329698
9113 329698 484205 492165 491559 563345 654539 414405 609627 439531 256197 83042 -161838
9102 -161838 213403 -2775 156212 180191 405207 266110 232456 41234 276489 186683
9092 186683 -11345 571889 390038 47515 214076 420426 93149 -25645 333509 69562
9082 69562 130279 45176 -146244 87568 286971 541243 366027 357466 484898 464875 358738
9071 358738 321130 212488 95639 538046 575967 557598 559203 397808 458655 175766 158807
9060 158807 590516 757717 536335 446471 410209 70456 20100 354141 16619 288720
9050 288720 514399 443007 267194 264005 584173 582438 468522 618336 724871 706971 650634
9039 650634 456503 431948 53048 368135 312493 316463 378964 123340 401385 289573 487047
9028 487047 586435 417037 482676 482139 506365 835280 344826 432577 288329 -275579 -76926
9017 -76926 362297 432227 491325 320630 221157 -191803 11799 473933 619625 476907
9007 476907 532239 362770 869928 708828 242595 633875 598048 494047 717859 1093296
8997 1093296 1065770 1114436 828353 996821 893849 641088 864412 1102325 745896 739547
8987 739547 893876 883292 844971 651312 774691 470995 579331 960657 911236 735656
8977 735656 754000 1048875 1122380 717005 681980 516714 492397 729026 1017961 1089708 556879
8966 556879 489003 923663 1131172 831720 586042 876332 1003918 487999 860298 909273
8956 909273 570214 499037 578705 721184 832514 890676 1079176 1416429 1350507 1186270
8946 1186270 1196164 1144566 1266564 957477 1078476 869343 847500 945659 787011 779616 693524
8935 693524 1028864 1302775 1170375 687437 796495 632353 714879 596436 416848 578426
8925 578426 546967 749537 524761 756185 700103 679074 834904 912415 696954 795700 1049692
8914 1049692 1160335 957568 717998 1168214 1138585 964820 965019 1070046 1569003 1554009
8904 1554009 1308270 1373524 1238165 1341086 1690998 1707067 1691916 1336573 1220772 1290074
8894 1290074 1835394 1658574 1323228 1380692 1071124 1359349 1266464 1606379 2160123 2103745
8884 2103745 1941238 1716321 1523925 1468347 1656630 1789719 1655189 1724667 1599988 1911158
8874 1911158 2311313 2186955 1986426 2107272 2833250 2858254 2728713 2785248 2618993 2528434
8864 2528434 2533701 2556182 2596028 2655132 2154275 1860955 2266434 2673405 3087021 3145339 2892229
8853 2892229 2974870 3412529 3174580 3001449 3261359 3355978 3223662 3122766 2813663 3371572
8843 3371572 3381447 3747106 3907843 3853147 4131069 4198428 4180807 4272615 4550779 4075847 3966091
8832 3966091 3693061 4579389 4620812 4661173 4802983 4910493 4753792 5563246 5932852 5605056
8822 5605056 5493096 5897351 6318064 6209495 6183008 6593901 6926900 6555062 6721099 6785798
8812 6785798 7399166 7536700 7800204 7924195 7932114 8354967 8336608 8737670 9422704 9663503
8802 9663503 9983078 10438045 10708347 11123295 11676084 12248398 12448013 13532786 14343271
8793 14343271 14937326 15373783 16321904 17409773 19040932 20701782 22368212 24020388 26749579
8784 26749579 30132263 33477549 36818217 39307925 40043216 38866551 36641612 33823727
8776 33823727 31118117 28768325 27264087 26309003 25650525 25346197 25340121 25674731 26298437
8767 26298437 27156544 28886887 30975974 33428071 36787585 40616953 43504163 45104605
8759 45104605 44666864 43058155 40184798 37600832 34782729 32645645 30782957 29661699
8751 29661699 29404893 28991343 29919649 30952785 32013459 34519968 36605569 39653364 43818828
8742 43818828 47609372 50446580 50619231 48963218 45629001 41206387 37571205 34480530
8734 34480530 31965860 29911498 29136538 28615215 27917407 28108142 28801539 29754793 31013588
8725 31013588 33164345 35831693 38905279 42241692 45067907 46027246 45033642 42075966
8717 42075966 37941646 33870682 30291953 26562342 23465857 20976553 19225084 17821873
8709 17821873 16767407 15670209 14876513 14337351 13648379 13186958 13025604 12489099 11987117
8700 11987117 11593298 11322747 11461497 11094171 10889878 10651631 10183033 9869026 9752430
8691 9752430 9819152 9812227 9739610 9605868 9296624 9331956 9007575 9107183 9082689 9212418 8849664
8680 8849664 9121837 9378539 9870578 9550519 9304070 9433048 9317203 9309978 9547572 9801374
8670 9801374 9951432 10136049 10325931 10546193 10239975 10323662 10864344 10955526 11300700 11278243
8660 11278243 11733539 11978517 12193129 12386273 12830693 13186252 13249242 14032013 14613097 15052718
8650 15052718 15170791 16123810 17136615 18266348 19531379 20739397 22169760 24160835
8642 24160835 25857651 28244693 30876145 33976849 37211618 40424514 43194411 45539958
8634 45539958 46047587 45490157 44471030 43108405 42070167 42196830 42300747 43655197 45576592
8625 45576592 46883158 47517105 46908021 45330774 42738225 38993510 35513572 31955306
8617 31955306 29112332 26951852 25081998 23744169 22788325 21836755 21060303 20540986 20431758
8608 20431758 20149254 20315820 20592315 20651996 21094930 21346735 21870358 22797619 23905100
8599 23905100 25356544 26812906 28564684 30883710 33685350 37049971 40351196 43132521
8591 43132521 44869674 45842360 45397324 44206957 42654927 41278809 40438851 40511986 41204276
8582 41204276 41631394 43265306 43905766 43550485 41908689 38402506 35362202 31707090 28381946
8573 28381946 25089691 22437069 20150040 18130134 16457276 15313779 13878197 12799664
8565 12799664 12435675 11966953 11025618 10850348 10249488 9567996 9309685 8832845 8240897
8556 8240897 8125442 8067532 7533808 7673553 6985605 6662746 6538989 5979759 6106172 5758650
8546 5758650 5922448 5823357 5717299 5894002 5603165 5115314 4926542 4728160 4991433 4904413
8536 4904413 4976026 4645182 4474667 4356430 4350271 4109682 3776648 3838798 3750655 4169794
8526 4169794 4486266 4500869 3866572 3797229 3740960 3353084 3545934 3597987 3456542 3182235
8516 3182235 3288488 3474911 3755722 3327214 3044762 3406130 3287536 3148517 3011369 2884715
8506 2884715 2993367 3108174 2808085 3017169 2959006 2995452 3161629 3259482 3311053 3242143
8496 3242143 3096790 3357829 2949835 2743777 3089118 3179959 3171595 3040194 3244670 3090110
8486 3090110 3167386 3484389 3197680 3114577 3430392 3565570 3828486 3638683 3232374 3303136
8476 3303136 2954914 2968259 3146030 3414078 3247254 3152081 3181723 3631142 3866865 3469919
8466 3469919 3307651 3629309 3393616 3682948 4119765 4038889 4015329 4136464 4053696 4181145
8456 4181145 3920338 4198173 4037400 4082248 4067882 4140325 4382993 4551667 4853021 5218237
8446 5218237 4894775 4737378 4779812 4882799 5141271 5411691 5815779 5715637 5507207 5560638
8436 5560638 5581559 5483114 6370122 7012265 6945739 6594945 6941372 6807207 7046137 7399335
8426 7399335 8133449 8473848 8762340 8801564 9078473 9473977 9249517 9729896 10325020 10474243
8416 10474243 11594877 12135692 12457767 13129077 14360141 15244372 16370846 17332699 18950721
8407 18950721 21261129 23672426 26560525 28975016 30592173 30162053 28794191 27572823
8399 27572823 26401135 25895229 25522364 25336575 26297029 27672253 29193171 30369704 30225183
8390 30225183 29203259 27021278 24875022 23670326 21736908 20337649 19674991 18890485
8382 18890485 18404461 18197783 17979577 17873947 18076359 18068342 18399762 19104993 19922314 20883754
8372 20883754 21413940 22848219 23880156 25283290 27333537 29797197 33082249 35998050
8364 35998050 39860433 43459000 45558620 46928604 47421816 46595955 44700959 42455114
8356 42455114 41006605 40150797 40174086 41184501 42163601 42928021 42737484 41769508 39766965
8347 39766965 36606551 33547334 30418069 27077027 25098856 22974292 20863214 19630247
8339 19630247 18626881 17703046 17199653 16402428 15584217 15382132 15223127 15239721 15248848 15563233
8329 15563233 15752600 15928269 16269606 17082685 17923469 19285885 20687606 22365257 24123701
8320 24123701 25488491 25893228 24801328 22771571 21202307 19718982 18914183 18993741 19673071
8311 19673071 20548090 21275127 21949829 21675754 20884623 18396715 16664341 15149607 13784509
8302 13784509 12395073 10942467 10021920 9011911 8663012 8373184 7303830 6382623 6161626
8293 6161626 6052410 5958435 5978854 5833586 5499767 5077669 4930555 4797973 4375388 4879696
8283 4879696 4597220 4399343 4193346 3522218 4038136 3862514 3574139 3503589 3513321 3323870
8273 3323870 3319640 3241129 3095133 3209966 3256340 3176091 2810033 2414666 2515327 2407083
8263 2407083 2038133 2197933 2260531 2004342 2141527 2457115 2383442 2395503 2477650 2336783
8253 2336783 2146928 2387572 2078810 1984944 2238535 1626677 1384744 1372194 1466603 1620093
8243 1620093 1513949 1618078 1441749 1108466 1199820 1335422 1256481 1333329 1327151 917805
8233 917805 1314201 1584038 1548570 1475355 1296333 1320031 1002515 1004049 1095515 830486 1238182
8222 1238182 1184462 973859 779643 890694 979401 962386 802842 645142 534455 364948
8212 364948 652826 999994 1485137 1238305 896498 842849 875298 532124 757530 471999
8202 471999 156622 -71035 -217424 -258161 335618 -168786 285047 -159630 -428785 -2077682
8192 -2077682 108508 3062523 1682230 1431892 727680 1174701 973402 875458 855666
8183 855666 864922 1032336 1134138 1021496 953962 693229 847724 697135 624782 32535
8173 32535 330865 853148 548751 257027 90084 155708 168568 229890 121159 165736 163852
8162 163852 636905 767449 677690 666665 325921 311452 406488 642580 632136 247979 380678
8151 380678 566840 207111 -139420 -9765 -121503 -6783 65896 293008 117000 -45914
8141 -45914 97978 -155999 76409 103989 521879 187145 -186761 91513 90722 23640 265648
8130 265648 361451 741166 622912 377453 281175 129284 -267913 -481989 -515529 -573311
8120 -573311 -350784 -282686 -257965 -350987 88321 264135 286277 198990 214512 257104 187471
8109 187471 308583 214846 -62143 381902 -66429 -334180 -26924 -254393 -311660 -315640
8099 -315640 -135192 -215811 -625093 -428003 -426764 42840 92739 282061 -14678 115325
8089 115325 398192 358717 513948 -15588 -348807 -630264 -339400 502797 671266 199793
8079 199793 -202238 -175900 -99082 -90170 98239 229310 79903 -14957 228294 214073 45327
8068 45327 -364317 -285407 -45020 56367 291129 89528 36590 -216289 -575050 -702119
8058 -702119 -377758 -274146 -505510 -52924 242102 135799 -98722 -212604 -330280 -133441
8048 -133441 -329707 -66311 -55432 224707 76377 -100305 -182374 232831 71327 150408
8038 150408 -179081 -12216 299920 445151 -4270 116939 579320 668269 526052 84733
8028 84733 -401954 -799844 -896239 -721983 -310984 89833 -238177 -354039 -355680 -36076
8018 -36076 281071 169965 39062 -155335 -285483 -284213 273655 476266 529611 171400
8008 171400 186181 -94313 -125509 -275225 230482 293279 454774 440009 366049 82720 -136611
7997 -136611 -799442 -224208 -64013 201916 257637 338246 631348 495060 523493 727990
7987 727990 799610 361901 221731 81446 -119755 362770 530022 244209 -82962 -99681
7977 -99681 590112 695994 204465 -352610 -151935 -9559 -314681 -244073 77568 196828
7967 196828 26053 -192799 60487 -30374 84419 152450 131671 7449 86688 -26894
7957 -26894 -309641 -505923 -457000 -286294 -501823 -418026 -174741 131939 326150 99667
7947 99667 -87170 299892 111035 125897 421873 302109 -141492 -152467 -394955 -353078
7937 -353078 -157646 -327412 -135636 -225235 -348894 -155539 -308775 -109301 -42152 72950
7927 72950 81276 -100669 -121390 327832 702077 214834 -257847 -205814 -418596 -457471 -312828
7916 -312828 -177918 -133549 -190384 -274621 -358152 -333762 -354092 -50918 -68900 140134 166950
7905 166950 -205903 -256282 236668 71558 -244307 -34156 142847 -77652 68488 -17448
7895 -17448 214021 214497 -300371 -658909 -280021 -332047 107919 385996 111330 14762 -564838
7884 -564838 -550124 -323745 -367883 -305324 -267177 -492416 -519252 -270195 -218926 -154152 124895
7873 124895 205154 45520 116896 90948 144708 -178541 -88231 -226776 -374811 -390818 -291484
7862 -291484 -179435 -206285 34057 2758 -152524 242215 393515 -300549 -547943 -84258
7852 -84258 -223618 4373 142649 34061 397749 155181 -168908 -355714 -377842 -325470
7842 -325470 433183 413493 307096 215388 109618 347370 350649 157172 -184410 -235864 -268158
7831 -268158 435885 356544 141354 -86713 22295 -134666 -363099 64747 -315772 -156823
7821 -156823 -129767 -505786 -653992 -597307 -7468 139093 -276359 -269236 -97916 -339367
7811 -339367 -240542 -42604 -135968 -785002 -974320 180176 377932 -28117 -2583 305493
7801 305493 425897 285636 530148 641284 401052 629585 105294 191905 265826 -52950
7791 -52950 -138266 -168293 20192 -130696 -166998 7463 61966 41484 91639 399567 465074
7780 465074 597560 191878 -136489 18599 232377 299083 156016 85513 157732 -2298
7770 -2298 258328 449478 319281 325154 556078 507210 58938 -66891 -2779 634756 454521
7759 454521 462711 115255 414305 951152 596686 669924 727354 1086856 1191033 950438
7749 950438 780760 1299494 1153180 672844 104282 76434 179192 579538 404148 32828
7739 32828 111034 29299 142922 77413 119571 142132 299989 460782 765047 766143 695525
7728 695525 452507 626941 838108 765284 525957 374431 633066 420499 550379 455537
7718 455537 497971 362870 512921 631285 202161 273244 578846 375517 235529 255165
7708 255165 379300 569634 302138 144053 158862 -169172 -417081 -111555 130379 185909
7698 185909 154722 63002 -105619 -217457 121841 59370 -39429 266414 28159 -154468
7688 -154468 -344791 -109054 -11964 73220 -179139 -395354 -263153 50510 6497 162506
7678 162506 424107 295005 -220583 -188060 -450144 -158628 77431 377487 319016 -22620
7668 -22620 25826 42340 -150589 247115 473351 286782 393306 -33000 24248 364044
7658 364044 263713 -57023 -74373 70946 451508 345577 455418 -67655 120689 126731
7648 126731 52228 43569 -469206 -64985 -63510 186588 111226 38720 -26189 67404 392652
7637 392652 161506 22962 -107512 27653 248199 197860 45861 343396 168152 20083
7627 20083 -183002 -354578 152481 152144 499282 632387 297612 183742 -121134 -104278 -198132
7616 -198132 -422556 36039 -186478 -147739 -174475 24950 172157 -160962 -182964 -275722
7606 -275722 -127405 -18877 -118914 78093 -186981 -219159 -293012 -96929 194735 -436838
7596 -436838 20603 73077 -215589 18845 129366 9808 110881 217746 -213723 -310389
7586 -310389 21835 188696 -255271 -573542 -171503 19467 -205995 -242487 -408180 -160202
7576 -160202 -3724 3586 -159829 36975 -85010 -335373 -96629 174709 394211 103704
7566 103704 34482 -193951 -587511 -69820 342331 134654 257582 -245354 -196340 -12776
7556 -12776 -300621 -838562 -318161 54990 59580 -209976 -174890 -228415 6218 134783 127577
7545 127577 -280368 -217984 -85550 -211284 -99950 244544 258264 175285 145557 -144080
7535 -144080 46732 -192642 261320 184225 -389959 -497644 -179968 -179314 -59420 317578
7525 317578 288500 246345 -160122 -295396 -162710 82303 -27662 -105948 78017 120138
7515 120138 -194812 -332894 -427824 -512787 -426978 -393892 -320303 -77976 298746 314475 533098
7504 533098 408958 198064 -51788 -471601 -98449 66207 521656 471083 153366 172420
7494 172420 -61845 -295497 -403741 -594735 -359805 -397655 -211700 616775 745162 396792
7484 396792 267843 383342 288392 118340 -155404 -219805 -89829 32736 195250 105008
7474 105008 -129135 -214521 -267707 -36867 -114995 -24909 -415797 -325173 -22771 181184 267937
7463 267937 278445 168712 214496 -340828 -389167 240789 275193 166560 10545 37509 48469
7452 48469 151318 -136502 -181350 260897 40380 -23146 -81231 -255916 -298315 -233415 252296
7441 252296 638168 346234 46557 -339738 132962 209316 -7253 -135103 218492 295765
7431 295765 108466 -295804 -270979 -139094 -155589 -97253 323774 125148 -222415 119070
7421 119070 -173255 -256099 195442 -154648 -269951 -137202 -57143 29820 -7957 -261584
7411 -261584 -175922 -170742 -349373 -113691 -53890 -78594 -353412 -342720 72328 133335 -26707
7400 -26707 107786 8373 -46597 -426108 -208446 -324206 -114488 23214 28032 -231008 -122607
7389 -122607 -50553 39235 -205109 -255962 365550 210510 134352 -105444 -233397 -76595
7379 -76595 -40878 49168 -169683 -90711 -167213 -507121 -529469 114661 121407 145176 106968
7368 106968 171216 397011 111274 -84809 130604 291487 -69803 -243499 -243676 180962
7358 180962 418780 161141 101197 -39331 215142 -8360 -28806 -248142 121105 -157711
7348 -157711 -197251 107749 -149351 115541 247303 488865 575398 315995 164547 582343
7338 582343 679080 327758 418374 238168 174616 454776 445106 367175 279347 430678 145975
7327 145975 170950 -172824 -214738 -188262 -106183 274405 -65935 -41355 334072 171258 -123837
7316 -123837 85353 -52311 -417107 -245646 -293828 -103285 150610 188420 237659 331547
7306 331547 282207 68687 246023 166063 -19757 2546 23145 73728 120811 32153 -131937
7295 -131937 -157766 -52921 290078 630734 195416 13879 -277685 -537696 -236537 -489248
7285 -489248 -189234 75476 -92964 167202 161674 265633 31527 41108 160278 268017
7275 268017 355234 211529 252014 21486 -184130 28893 114405 -120921 -75639 150708
7265 150708 -289907 -506892 -38414 -62016 384648 151617 171917 -162410 -301586 -236490
7255 -236490 -256249 -340283 -9623 72573 -136491 4814 -5871 -350460 -648301 -340915
7245 -340915 163539 218638 -344008 -443350 -186884 -326412 -62422 -33609 241205 34984
7235 34984 1671 118071 -300819 50584 86392 -109762 276693 294100 53971 17493 42253
7224 42253 138478 205364 26272 123219 -195063 60800 555320 509920 470082 -138096 -161125
7213 -161125 301874 264148 244649 148864 99283 17191 55038 -190348 -96022 350978 317870
7202 317870 421653 193801 317991 -2861 78390 124585 -95288 -654242 -501238 131437
7192 131437 863 -98097 -333050 -344366 -250824 -240778 -37943 12033 324037 103524 102657
7181 102657 138113 32607 442576 815154 277541 235040 32843 -67394 376867 696395
7171 696395 344168 47063 -58333 -7124 207000 128028 23308 199251 267446 415714
7161 415714 176685 276401 20823 166439 665878 366557 303271 179118 184349 -184077
7151 -184077 -414366 -185107 141796 158280 348708 223556 40807 233140 239513 171665
7141 171665 243204 39753 298118 573510 770189 573965 368537 102917 -145197 255633
7131 255633 450399 834664 773692 161741 3214 -165537 78101 339550 604001 637841
7121 637841 623720 -30690 95779 97416 89786 257645 363286 584627 320634 442956 196758
7110 196758 185343 -51852 305724 134604 114797 398611 198251 225409 320138 79804
7100 79804 -87402 115730 151289 -81395 242732 294506 94736 221774 -172441 -173544 -40935
7089 -40935 97528 125609 -7945 353111 585876 307073 78691 16645 329751 557968
7079 557968 453807 215953 -87846 -191816 -537723 -31067 -244148 -130700 362349 293215
7069 293215 94481 327287 676613 348695 371760 441620 273138 67367 618298 67353
7059 67353 174857 133466 307057 425623 50179 151203 47480 177312 44192 117201
7049 117201 56266 -10190 191045 368165 127434 -7553 -366558 -5833 369549 315394
7039 315394 472552 571247 454567 370277 433108 687651 716626 430259 516751 141605 -88494
7028 -88494 -256233 -190310 -321520 108180 119014 135621 105572 14495 4458 -9043 -218226
7017 -218226 172528 593139 281738 75733 38136 -281321 -163147 -393393 -273712 150042
7007 150042 282022 372878 202864 537161 708823 626395 375699 278167 318734 -53001
6997 -53001 -238238 32845 18136 -136135 224221 272835 -131215 -33783 31306 453865 496186
6986 496186 766731 330371 -31347 180394 222333 482806 498674 388499 593536 796469
6976 796469 512839 68185 238031 337973 460331 532632 704927 518107 52743 251453
6966 251453 560239 545138 159071 136123 371011 87833 226454 342251 87626 123159
6956 123159 -116938 55772 377211 523490 384256 35587 -57199 -187088 449763 453955
6946 453955 392177 393552 574787 397586 512255 587352 689977 414058 476868 608004 758011
6935 758011 567264 604786 714872 662773 593425 93954 83525 415653 436594 491455 839452
6924 839452 586089 178567 510009 237024 -16497 525812 536436 407928 -22872 452729
6914 452729 399121 741727 326150 192775 244318 210077 148958 164551 340175 59751 138737
6903 138737 288455 427419 302784 273119 796610 673945 562700 244959 44641 43031
6893 43031 425968 184576 -181282 349132 557520 529503 329348 328656 298602 580345 478596
6882 478596 368354 383261 785105 948462 801207 685466 337525 742751 531188 443771
6872 443771 622900 892882 709857 522831 556258 362636 501275 321782 101088 6676
6862 6676 138874 147699 86111 165084 196529 336941 452836 303715 299557 239119 222769 289270
6850 289270 643730 547224 749609 570203 257618 297280 297810 246682 -203476 279888 629274
6839 629274 438130 576274 581713 485578 371539 261571 377516 371664 598902 190614 274037
6828 274037 305563 453055 368476 376812 529166 157415 59117 123084 264377 242132 164304
6817 164304 -296301 192482 602800 381346 716918 631868 725262 902442 784421 708070
6807 708070 466859 294160 122141 450773 431003 125606 232259 12374 556643 601205
6797 601205 665854 683840 -35248 603733 1155403 1270372 990468 671548 674480 498300
6787 498300 132778 258973 481142 961639 665515 815448 931587 634760 955181 1168533
6777 1168533 1017460 742557 725718 78637 -137147 323889 316198 183162 133228 259766
6767 259766 111857 77204 233042 439725 460142 751919 865182 589453 769549 964334
6757 964334 1060608 619111 229328 585913 304314 174811 426946 687319 388113 490053
6747 490053 797072 823165 969129 1121949 1154536 1214551 990610 1099732 996201 596185
6737 596185 334238 354667 207501 367377 1121367 858575 770452 605592 441094 549636
6727 549636 460438 420689 436352 627266 617644 415639 254645 471743 334064 133285 326786
6716 326786 245405 564234 189805 -24471 300286 482061 254382 341260 419056 277038
6706 277038 306753 82522 295848 455168 619406 456847 -48817 612828 686858 583399
6696 583399 492794 861910 694781 629794 1244880 860818 1024789 877669 857272 1146628
6686 1146628 1046613 1060008 685669 1081092 964178 820122 813540 868539 663691 932088
6676 932088 907381 689882 686068 501625 609868 555191 342700 728294 650818 218592 335580
6665 335580 596656 827099 753543 991744 668931 389019 746344 937554 1098701 940198
6655 940198 906329 784735 836384 754525 754138 850392 1152287 1164668 1024504 1318371 1142350
6644 1142350 1289134 1205931 860155 814578 511487 300442 733171 997462 1055567 855868
6634 855868 872174 1104390 879845 760246 812890 1128978 1160930 792681 430044 410521
6624 410521 638678 407450 521133 660115 838514 1001191 1276876 1256344 1204989 1105206
6614 1105206 938104 1049740 973506 752000 729642 1173112 897848 544036 664635 658251
6604 658251 1268779 757507 821017 786281 1106879 1134167 1046619 1162354 844731 818385 887986
6593 887986 972793 836553 789451 1188323 1196869 620521 683078 1114782 1493607 1511060 1063641
6582 1063641 1199685 1262566 851082 881430 1071656 1135108 979366 930433 712848 1047693
6572 1047693 1290314 1135727 940962 880879 819982 719598 787804 630428 581730 703995
6562 703995 1004610 932342 1014024 1178541 1419300 839407 804410 852041 1313471 1924566
6552 1924566 1098784 988839 1170805 820864 882390 1015935 908643 944469 1167707 1286591
6542 1286591 1399278 1343351 898365 738561 846873 943075 967590 630656 896068 899938
6532 899938 518321 1084120 1459758 1272428 1154237 1459247 1235947 1077376 1553717 1238189
6522 1238189 1035700 981529 930206 1000897 740065 926700 1301098 1752858 1584655 1294705
6512 1294705 983614 819646 1105721 1052512 1216744 1494598 1619334 1574462 1416755 1279822
6502 1279822 899693 1219123 1286823 1317552 1273536 1591794 1569584 1062326 863391 1129156
6492 1129156 1356069 1519271 1129775 1270126 1758413 1521508 898310 1184880 1093886 1276063
6482 1276063 1888767 1492203 1588243 1654854 1611957 1932686 1876590 2029917 1952527 2041907 1683648
6471 1683648 1491924 1499378 1668092 1659626 1539929 1858118 1800594 1192407 1152595 1749162 1965131
6460 1965131 1493307 1712060 1643739 1882256 1844008 1838246 2078848 2149366 1690439 1566131
6450 1566131 1373082 1416258 1744208 1445557 1680611 1629362 1680370 1871230 1841292 1532005
6440 1532005 1734766 1629902 1656965 1731284 1982363 1734831 2111509 2102397 1883083 1535891
6430 1535891 1832635 2011766 1623349 1535754 1483706 1731890 2218183 2242200 2040154 1918460
6420 1918460 2174789 1931385 1769738 1732289 1755671 1809956 1922759 2124350 2386825 2309298
6410 2309298 1828284 2287602 2524175 2426004 2080584 1586422 2362112 2473968 1748904 1929539
6400 1929539 2120053 2173615 2527266 2447191 2209798 2317098 2722014 2481506 2917906 2958088
6390 2958088 2809384 2685227 2719170 2374100 2723612 2947118 2613186 2487530 2316969 2349257
6380 2349257 2437747 2366661 2280229 2378576 2406939 2478918 2166717 2319636 2339377 2256784 2346664
6369 2346664 2446491 2480856 2039446 2249594 2321031 2617190 2539635 2649056 2552557 2603408 3094278
6358 3094278 3044692 3149680 3079947 2463713 2098431 1914553 2121347 2268837 2488902 2777640
6348 2777640 2517446 2329703 2175803 2420405 2320070 2212869 1826052 2059929 2188293 2376804
6338 2376804 2277007 2350157 2077129 2479502 2740385 2536576 2308495 2528361 2414481 2727188
6328 2727188 2690348 2890794 3085309 2753417 2413523 2457082 2473512 2884817 3015435 2844805
6318 2844805 2818502 2363643 2845580 2903396 2925770 2964704 2680261 2875148 3071959 2951350
6308 2951350 3064795 2914717 2747867 2695258 3045192 3240110 2998049 2851685 3091364 3093576
6298 3093576 2982739 3678810 3407381 2999109 3118114 3083801 3141113 3024667 3111822 3190845
6288 3190845 2879021 2868339 2775538 3057589 3138344 2974190 3104251 3059957 3174877 3203192
6278 3203192 3316275 3014480 3121129 3259046 3475210 3708797 3199909 3282819 3308279 3647400
6268 3647400 3463426 3637439 3595838 3588206 3465162 3045232 3289132 3766810 3735236 3557871
6258 3557871 3535882 3506808 3530514 3611080 3471217 3157753 3273451 3489838 3666201 4076959
6248 4076959 4312255 3980200 4220212 4352862 3894462 4025129 4244889 4011576 4258789 3933663
6238 3933663 4191318 4345776 4429332 4136239 4315272 4702516 4605187 4695097 4561537 4627839
6228 4627839 4804787 4873576 4746124 4935317 4753258 4822338 4802245 4551595 4535579 4439558
6218 4439558 4546597 4574216 4973366 4947638 5159789 4928851 4857161 5077940 5324526 5506467
6208 5506467 5342738 5476559 5805163 5790333 5822497 5561506 5719687 5515044 5747190 5866730
6198 5866730 5733828 5528194 5806460 6264538 6176585 6091813 6023496 6025390 5982477 6387649 6533731
6187 6533731 6622913 6745138 6866752 7241656 7440990 7139035 6620858 6655583 7092676 7455024
6177 7455024 7479552 7370624 7749528 7665246 7819692 8160335 8288028 8766291 8640716 8687018
6167 8687018 8757371 9068941 9386314 9323001 9189986 8961589 9198215 9204297 9355717 9766332
6157 9766332 10208630 10131352 10512251 10993464 10807675 10955930 11847341 11912767 11642533 11925965
6147 11925965 11845916 12246722 12335285 12461635 13164380 13575773 13459350 13270209 13411338 13578693
6137 13578693 13959336 14187007 14429880 14404824 14478213 14907321 15264332 15521230 15847509 16271715
6127 16271715 16887811 17265418 17387854 17821478 17970415 18514587 19045379 18888353 19493050
6118 19493050 20224093 20951343 21240058 21675318 22172313 22832955 23490370 24068479 24572940
6109 24572940 25631125 26029195 26392583 27699768 28404114 29128699 29832140 30455368 31610996
6100 31610996 32698436 34065543 35294138 36124928 37170328 38736422 40037283 41801324
6092 41801324 43712270 45500177 47295130 49004590 51018691 53388465 56037143 58619072
6084 58619072 61634690 64478115 67340680 70857242 74499897 78885643 82711045 86748977
6076 86748977 90897757 95021704 99241213 103702091 107820869 111633461 115043155 117777045
6068 117777045 120026933 121210084 122135506 122052066 120881669 119267116 116865921 113480355
6060 113480355 109989557 105751451 101127664 96153981 92102709 87569501 82679193 78151535
6052 78151535 73891428 69742978 66401631 62715949 59331852 56465346 53469438 50861779
6044 50861779 48406257 45842916 43601531 41648888 40035228 38510980 37150490 35441859
6036 35441859 34121988 32965859 31754981 30807874 29441638 28528500 27681409 26325748 25520324
6027 25520324 24684541 24098685 23643218 22557689 22197472 21812762 21002911 20417473 19826772
6018 19826772 19477181 19082071 18886983 18436549 17889697 17718597 16967362 16953492 16317593 16102242
6008 16102242 15881231 15690010 15486890 14698506 14415664 14211583 13868844 13614197 13310687
5999 13310687 13266008 13081190 12552873 12419986 12387322 12583797 12560358 12185697 11852384 11564454
5989 11564454 11452027 11273798 11469789 11234142 10821172 10712343 10606019 10382798 10562610
5980 10562610 10366071 10094367 10077839 9813410 9760531 9546630 9822474 9263945 9092039 9244566
5970 9244566 9448615 9189681 8697922 8716153 8495844 8472647 8383966 8453533 8283499 7909131
5960 7909131 7757899 7808255 8534965 8360002 8105687 8473087 8548143 8522564 8340377 8119230
5950 8119230 7723199 7547916 7579494 7420328 7563278 7588807 7350857 7325939 8124274 7958175
5940 7958175 7707953 7440044 7227934 7329215 7611114 7996745 8078371 7899148 7521324 7354931
5930 7354931 7257562 7225361 7208152 7271827 7243920 7277327 6935750 6850295 6914665 6953645 6982805
5919 6982805 7344780 7131278 6766242 6876187 7303795 7064238 6969699 6927365 6834425 6924738
5909 6924738 6676057 6716927 6636813 6680117 6788689 6810601 6847742 6265741 6144098 6617998
5899 6617998 6591027 6357527 6774228 6673193 6557373 6542143 6616142 6417094 6969434 7189529
5889 7189529 6498122 6368568 6330188 6363112 6305151 6169872 6562163 6606697 6117424 5905728
5879 5905728 6458333 6321045 6838082 6921546 6422006 6449458 6233488 6184286 6078888 6458856
5869 6458856 6945734 6794303 6621913 6507120 6676385 6820698 6569208 6989069 6415161 6452309
5859 6452309 6519652 6421718 6479055 6522826 6334733 6069075 6146097 5950563 6142166 6506940
5849 6506940 6500389 6595187 6352605 6104091 6419563 6734750 6640722 6630445 6423677 6078663
5839 6078663 6187033 6403187 6449774 6630065 6412890 6433337 6531839 6606999 6370623 6788047
5829 6788047 6768266 6740636 6561085 6720614 7181052 7194068 7540045 7279217 6625268 6574691
5819 6574691 6861982 6869628 7193864 7379170 7212965 7277159 7002828 6549978 6627983 7057029
5809 7057029 7030478 6961077 7511012 7381631 7169496 7184923 7090986 7197588 7275664 7649664
5799 7649664 7330706 7048692 7219291 6870818 6791348 7378601 7516799 7324272 7604800 7549914
5789 7549914 7808621 7897998 7692071 7738217 7885110 7783485 8055201 7762185 7481747 7735861
5779 7735861 8306395 8291849 7773939 7958815 8002044 7899745 8080301 7806866 8048129 7701208
5769 7701208 7876549 8490692 8436151 8723920 8691159 8686375 8900544 8489529 8322322 8421832
5759 8421832 8588091 8543247 8260382 8445734 8625516 8866232 8851292 8696664 8987121 8861202
5749 8861202 8782617 9239433 9027348 9294708 9741897 9401800 9245695 9340534 9374478 9116314
5739 9116314 9351314 9238437 9312847 9469903 9549321 9296927 9036023 9484057 9494329 9417816
5729 9417816 9411083 8933460 9070973 9596935 9057346 9615053 10112747 9883120 10046411 10020851
5719 10020851 9829821 9722727 9913942 9716686 9619424 9666686 9531080 9831970 9753032 9794362
5709 9794362 10280424 10220580 10534086 10462827 10276785 10237733 10033854 10363490 9986475 10068159
5699 10068159 10360372 10636616 10194500 10269942 10253619 10341528 10624132 10334868 10462941 10783083
5689 10783083 11072941 10861428 10826251 10671419 10901434 10929973 10775282 11205063 10992671 11391102
5679 11391102 11210503 11271837 11849349 11507450 11388660 11627539 11616569 11493587 11379048 11424122
5669 11424122 11389574 11508118 11544613 11691093 11819505 11941012 12030857 11949707 11856091 12026739
5659 12026739 12132697 12086925 11845258 11926345 11837056 11512450 12091482 11981689 11374686 11161487
5649 11161487 11728980 12012267 12670136 12660356 12367418 12373782 12193257 12296600 12668461 13195467
5639 13195467 12665727 12728746 12957322 12981265 12885758 12857517 13275394 13070689 13021998 13274257
5629 13274257 13516389 13251946 13123363 13088764 13025603 13094742 13689194 14066571 13932450 13794964
5619 13794964 14035641 14439020 13866924 13507644 13777580 14007998 13969865 14401117 14514582 14700608
5609 14700608 14226339 14172426 14421403 14080013 14442765 14548242 14887381 14680871 14878963 14997620
5599 14997620 15148795 15568155 15948106 15689018 15876334 15874395 15883246 16043830 15875506 16124678
5589 16124678 16158160 16316341 16448760 16419466 16522433 16475917 16662950 16381062 16609899 16862835
5579 16862835 16905308 16719965 16828280 17180832 17101964 17382180 17695692 17518009 17466163 17074863
5569 17074863 17193592 17466040 17675147 18027251 18145322 18323956 18349907 18724913 18945691 19044674
5559 19044674 18616017 18837579 18986874 19308023 19074003 18539529 18827676 19529608 19726356
5550 19726356 19600818 19358273 19664445 20075464 19738526 19965614 20536958 20698565 20428317
5541 20428317 20476433 20913930 20864330 20905181 21138100 21022620 20779021 20987840 21277693 21293967
5531 21293967 21688765 22051395 22013299 22001891 22081003 21899698 21840556 21964156 21981910 22032653
5521 22032653 22339938 22573120 22523367 22684663 23064070 22983362 23123075 23156820 23341630 23565615
5511 23565615 23772965 24027954 23907281 24100880 24365757 24751553 24885412 24334496 24215565
5502 24215565 24725713 24678356 25156196 25438494 25630736 25733868 26138600 26159454 26266514 26368817
5492 26368817 26604101 27189740 26964170 27110143 27683001 27447263 27791243 28016525 27858326
5483 27858326 27827568 28200786 28291387 28719285 28799556 29197521 29789006 30088399 29912040 29947070
5473 29947070 30032457 29920279 30752967 31101541 31291735 31071223 31207263 31496088 31631982 31509976
5463 31509976 31763869 32305321 32676746 33057746 33181940 33249794 33708205 33775151 34028869 34384329
5453 34384329 34601145 34955823 35256210 35346501 35982019 36271379 36853218 36777138 36596390 37161313
5443 37161313 37846253 38287777 38414101 38538960 38704162 39198550 39538956 39556552 40118130 40585822
5433 40585822 40786588 41364271 41645456 42262733 42711016 42672348 42983777 43404158 43899866 44282281
5423 44282281 44979334 45157612 45414426 46267798 46887604 47232741 47724703 47776295 48047493 48919486
5413 48919486 49482255 49781195 50305258 51353304 51928545 52236393 52771063 53159898 53645444
5404 53645444 54667223 54972342 55512747 56330704 57099915 57209545 58139555 59249112 60032440
5395 60032440 60965701 61431210 62378255 63359205 64237428 65071684 66118572 67156039 68526840
5386 68526840 70026920 70611141 71668693 73239950 75002562 76504542 77948221 80083319
5378 80083319 81727045 83275465 85188040 87265653 89107412 91049423 93301727 95885994
5370 95885994 98574037 100829194 102649069 104102549 105560869 106911023 107575764 108330247
5362 108330247 109393923 109946017 110274064 111119247 111601244 112498352 113409799 114457768 115673328
5353 115673328 117045760 118782836 120708608 122297002 124446636 127188555 130162109 133615006
5345 133615006 136638103 139686058 142750297 145894670 148568787 151403877 153258554 154464877
5337 154464877 154428727 153383583 152246219 150683261 148560786 145781267 142969764 140434660
5329 140434660 138568353 136970413 135676375 134021509 132740027 131737539 131040968 130380769
5321 130380769 130088247 130550856 131443090 131918236 132382839 133023481 133730457 133911358 134286341
5312 134286341 134621831 134113620 134020910 133756107 132486375 131198269 129652814 128026009 126315277
5303 126315277 124739843 123039001 121586107 120154669 118249530 117330282 116505146 115424725
5295 115424725 114405822 113627342 113095009 112454102 111432053 110885861 110171911 110238163 110010115
5286 110010115 109772469 110123654 110043591 109526190 109646269 109528446 109094133 109156325 109120496 109421300
5276 109421300 109625209 109688577 109549807 109483022 109826383 109895125 109707426 109465771 109760744 110223698
5266 110223698 110609541 110397104 110681340 111163899 111494905 111734437 111849587 111602227 111804728
5257 111804728 111846950 112361194 112736576 112842007 113027951 113242741 113239594 113272129 113508317 113715812
5247 113715812 113952049 113773875 114250295 114063950 113983084 114107832 114237730 114403036 114369404 114744414
5237 114744414 114809375 114912459 114858620 114754754 114513786 114614166 114782123 115238850 114902361 114727123
5227 114727123 114767610 114572914 114323794 114422645 114704962 114583271 114732612 114504889 114458793 113906283
5217 113906283 113860142 113767442 113803672 113831483 113474124 113364504 113203729 112487664 112451834 112147839
5207 112147839 112062605 111852143 111123808 111262401 111334760 110555208 110316062 109670518 109686102 109042252
5197 109042252 108639843 108417046 107839360 107997704 107680383 107701507 107240973 106456094 106068782
5188 106068782 105930990 105817230 105173246 104995138 104512608 103807948 103388729 102583991 102124423
5179 102124423 101704004 101396652 101210785 100406490 99908343 99415437 98758292 98462315 98079242
5170 98079242 97315104 96856007 96290178 96047326 95398014 94360634 93380439 93511237 93150390
5161 93150390 92790518 92221625 91844130 91293134 90396982 89704204 89028850 88459400 87740651
5152 87740651 87621652 87099040 86661253 85968065 85475394 85155346 84551100 84295068 84170560
5143 84170560 83467039 82740749 82016965 81503017 80850050 80814661 80131223 79865997 79415321 78849668
5133 78849668 78134929 77515986 76798331 76386934 75788177 75077463 74740780 74526054 73850020
5124 73850020 73222501 73155401 72628302 72036464 71877623 71247970 70943825 70807850 70428042 69940628
5114 69940628 69624995 68906795 68454127 68251538 67795273 67362952 66864809 66568945 66157476
5105 66157476 65295383 64687306 65018244 64992539 64361259 63969018 63433765 62925757 62312404 61659255
5095 61659255 61357708 61051749 60945861 60684358 60192244 59344295 58918467 58464462 58087507
5086 58087507 57304031 57105179 57116009 56696788 56085686 55630403 55469654 55142090 54630222 54203146
5076 54203146 53974331 54087522 53288891 53212601 52996082 52652181 52622926 52231953 52126036 51817961
5066 51817961 51430839 51134775 50880611 50508039 50067497 49930195 49670924 49549511 49694326
5057 49694326 49272205 49124796 48897376 48929742 48741868 48225309 48279240 48169536 48082253 48048670
5047 48048670 47720735 47807968 47477568 47496337 47387573 47122662 46821710 46992054 46820146 46953631
5037 46953631 46905180 47008386 46797506 46616382 46562226 46516379 46434202 46559461 46713050 46739026
5027 46739026 46871276 46575635 46887067 46847023 46894770 46853627 47239888 47375640 47424990 47658736
5017 47658736 48392649 48478955 48492150 49072614 49261834 49438573 49575581 50077752 50295763 50645457
5007 50645457 51366516 51604651 52051344 52447405 53114493 54064130 54929047 56123409 56990793
4998 56990793 57362830 58526496 59376293 60512342 62133525 63741786 65170831 66380773
4990 66380773 67582018 68872747 70316221 72456033 74516477 75856991 77402622 79255162
4982 79255162 80561514 81943496 83072065 84344738 85189696 85440348 86091201 86727003 86830636
4973 86830636 87053712 87192574 87129287 87458071 87757441 88310260 88642977 89410654 90223186 91771594
4963 91771594 93188194 94713870 96094059 97875620 99228554 101173682 102894131 104509853
4955 104509853 105897359 106814623 107691108 108328332 108605400 107658630 106647688 105141772 103476184
4946 103476184 101314012 98918351 96048447 93650665 90671826 88506365 86571027 84571043
4938 84571043 82696313 81040090 79409493 77625791 76571524 75758824 75125829 74042012
4930 74042012 73723964 72962331 72115445 71665489 71092894 70313298 69347744 68104205 66807932
4921 66807932 65321934 63798175 62190585 60342774 58744252 57000091 55506096 53819920
4913 53819920 52377592 50688396 48737862 47348218 46065140 44801203 43442715 42222040
4905 42222040 41263780 40557843 39900131 38964541 38386950 38037563 37137549 36361916 35731652
4896 35731652 35528769 34964944 34329166 33939368 33239517 32968320 32926078 32556012 32158019 32010647
4886 32010647 31849852 31764982 31289356 31054459 30852616 30473113 30529591 30743017 30489035 30186412
4876 30186412 29799246 29656124 29968768 30236021 30017727 29644999 29888891 29701195 29303734
4867 29303734 29542279 29797358 29962439 30016979 30207100 30244796 30357591 30189947 29909726 30425441
4857 30425441 30824070 30839450 31084332 31065544 31259838 31308037 31255977 31421625 31348042 31393335
4847 31393335 31397220 31579364 31705503 32020037 32330407 32651298 32476342 32472683 32749142 33444234
4837 33444234 33813075 33761960 33647800 34523376 35385418 35388728 35903238 36810593 37045515 37335866
4827 37335866 37886316 38950268 39559895 40158851 40716320 41390209 42130562 42886924 44354956
4818 44354956 45696932 46767123 47274959 48583077 50065739 51337911 52461283 54246287
4810 54246287 55387791 57018816 58324708 59561381 61212893 63275039 65376306 67764825
4802 67764825 70281642 73281031 76662753 80045500 84061196 88060196 93121554 99128634
4794 99128634 105674897 113060911 121521227 130355478 141212065 152679137 165675201 181133986
4786 181133986 199112826 218913319 241546362 267599307 295033006 320254330 338529063
4779 338529063 344066325 334168789 311815794 283039351 253498109 225759508 200760783
4772 200760783 178777134 160404756 145021320 131522479 119984083 110932724 102168872
4765 102168872 94742551 88560570 83070717 78286478 74127355 70161553 66891432 63602284
4757 63602284 60831159 58050693 55260968 53121668 51414135 49455870 47346635 45818326
4749 45818326 44016581 42685682 41313428 39784796 38368315 37255749 36135624 34997963
4741 34997963 34056208 33147125 32439459 31749176 31051575 30491865 29692632 28689276 28074705
4732 28074705 27711430 27039720 26830828 26017429 25317600 24840156 24808270 24345813 23635464 23176093
4722 23176093 23008369 22854122 22322808 21706162 21273769 21224815 21110898 20715242 20179100 19615996
4712 19615996 19151493 18979269 18584207 18227957 18735008 18714796 18395650 18134788 17608146 17675687
4702 17675687 17242220 16692135 16668739 16624560 16140103 16155308 16067496 15703105 15530378 15411512
4692 15411512 15230121 15014758 14804163 14624488 14667617 14519629 14356086 14366999 13836643 13477870
4682 13477870 13125884 13183705 13148540 12979127 13013247 12786246 12491638 12218749 12184083 12051685
4672 12051685 12043976 12403962 12196948 11635377 11503320 11333423 11580916 11564931 11284243 11339975
4662 11339975 11090728 11265211 11331101 11538503 11265364 10946554 10596344 10493982 10092011 10060994
4652 10060994 10320440 10660620 10102396 9998277 10155754 10010696 9919120 10088333 10303125 10101239
4642 10101239 9715019 9306880 9299574 8998817 9384740 9537457 9155069 9132964 9182085 9290476
4632 9290476 9394855 8989518 9147177 9066468 8809611 8078218 8339537 8627501 8679468 8634460
4622 8634460 8348578 8555123 8854368 8462942 7812211 7680336 7665468 7840503 8072998 8080644
4612 8080644 7740752 7451699 7383647 7403860 7327665 7582815 8199545 7848881 7564197 7390311
4602 7390311 7480628 7084751 7041923 7627966 7458958 7672678 7709784 7828014 7700937 7209252
4592 7209252 7116530 6635497 6434247 6787138 7124674 6850371 6697510 6567178 6797372 6951384
4582 6951384 6656607 6413265 6795934 6765261 6476156 6477179 6667567 6801441 6224315 6481309
4572 6481309 6533018 6493902 6692279 6824489 6667984 6565402 6630195 6497218 6597707 6199410
4562 6199410 6207614 6082054 6259409 6052081 5467614 5496045 5847536 6085410 5980117 5743709
4552 5743709 5538977 5557507 6214190 6354416 6546991 6394087 6114524 6118033 6216192 6151061
4542 6151061 5808632 5849853 5995459 5823862 5723175 5873416 5508430 5510593 5437397 5636821
4532 5636821 5951522 6347095 6387429 6327607 5967058 6177656 6190356 6063027 5705118 5183892
4522 5183892 5110351 5720811 5624856 5913515 5828001 5634616 5810956 5895945 5468321 5456604
4512 5456604 5750091 5594753 5765025 5470299 5332177 5745565 6097024 5790002 5784582 5812319
4502 5812319 6137441 6296874 6075639 5943270 6098478 6254896 6154344 6430129 6744845 6803066
4492 6803066 6931436 6583074 6357730 6120795 6179748 6580311 6756985 6886546 6966404 6563314
4482 6563314 6480852 6807936 6608145 6893872 7050990 6618002 7005634 7653415 7539284 7564251
4472 7564251 7269877 7338161 7534034 7773688 7878389 8218783 8169535 8426046 8603535 8553638
4462 8553638 8498361 8747506 9055119 8998095 8804339 9269232 9573371 9574123 9815881 9940408
4452 9940408 9783434 9880406 9933484 9504581 9838038 10063179 9914675 9792088 9907275 9653558
4442 9653558 9866867 10395139 10537776 10616464 10605871 10417110 10526539 10899217 11069102 11043019
4432 11043019 11367521 11784613 11886912 11638494 11785602 12165096 12393858 12393819 12875184 13273921
4422 13273921 13851019 14618732 15074544 15474004 15919197 16402018 16680338 17410175 18149262
4413 18149262 18307445 19108175 20348214 21475739 22379825 23452457 24762501 26315657 28178401
4404 28178401 29899664 32355456 35025758 38160112 41237997 43743201 46070950 48062881
4396 48062881 49865660 51603933 55080112 58821453 63061499 66195262 68086360 68754109
4388 68754109 68840163 69732898 70994544 73201721 76115562 78857609 79827077 77895556 74889383
4379 74889383 71885390 69194400 67415356 66176602 65685299 64799409 62294438 59041887
4371 59041887 54243817 50226160 47091755 44619676 42759292 40909888 38623829 35979730
4363 35979730 32946710 30233123 27593756 25051738 23088145 21307772 20096976 18849560
4355 18849560 17791018 16577009 15597376 15041573 14652642 13996953 13191617 12718090 12190553
4346 12190553 12071392 11551463 10822085 10992959 10735200 10410350 10014194 9765298 9336432
4337 9336432 9317183 9090630 9035258 8892571 8906752 8584593 8348273 8315617 8160763 7952230
4327 7952230 7906354 8004609 7652200 6974803 7212511 7271681 6863345 6966077 6489830 6159289
4317 6159289 6591567 6370397 6280158 6267795 6042312 6134503 6329087 6053561 5683794 5258771
4307 5258771 5458816 5179386 5130343 5186701 4979298 4615151 4755705 4811166 4890233 5464007
4297 5464007 5407901 5233187 4743658 4695734 4814105 4641397 4580340 4530855 4443752 4216457
4287 4216457 4268102 4492798 4318971 4579457 4387438 3981609 3961351 4286827 3990041 3685891
4277 3685891 3729048 3604333 3444058 3550510 3467259 3533099 3692444 3687400 3835118 3517189
4267 3517189 3419349 3364578 3327053 3251462 3570108 3606083 3775994 3703025 3041523 3151497 3351293
4256 3351293 3060372 3012776 3051513 3219620 3254727 2854019 3115384 3319193 3427367 2936393
4246 2936393 3288522 3021171 2629918 3013321 3030261 3325063 3034471 3149852 3267348 2880097
4236 2880097 2862077 2843925 2713286 2579612 2347292 2406965 2837152 2594603 2454403 2571133
4226 2571133 2866977 2856754 2257021 2303903 2879269 2729119 2858188 2837388 2577783 2453949
4216 2453949 2221088 2519852 2672450 2677217 2651187 2658773 2317010 2471651 2098031 2227664
4206 2227664 2521117 2540639 2712466 2781176 2296117 2154266 2730478 2437215 1988580 1835943
4196 1835943 2172337 2293448 2204558 2501685 2561120 2328041 2405558 2410087 2257917 1967896
4186 1967896 2007405 2198051 2176884 2358932 2186591 2038387 2096574 2009697 2268405 2469005
4176 2469005 2205313 2181533 2314403 2205572 2198109 2119119 2472556 2111399 1751450 1865819
4166 1865819 2088506 2070697 2264561 2052518 2335311 2398743 2477253 2438413 2157602 2276767
4156 2276767 2106839 2036740 2277420 2443372 2574413 1971634 1964817 2273739 2025726 2373621
4146 2373621 2268867 2135226 2035067 2197307 2406114 2241519 2071636 1910714 2082191 2227681
4136 2227681 2358186 2350158 2263488 2272871 2470388 2623077 2575228 2395949 2157823 2042467 2302929
4125 2302929 2813882 2906297 2678519 2428212 2418491 2233176 2455971 2591986 2866499 2914245
4115 2914245 3028706 2558461 2492911 2676488 2679198 2548206 2866391 3151262 3099981 2855581
4105 2855581 2888315 2738257 2550963 2611571 2379703 2515372 2800199 2834772 2668364 2934162
4095 2934162 2595751 2531543 2732021 2783014 2418873 2649666 2780225 2629728 2337247 2430247
4085 2430247 2594157 2650709 2730108 2640546 2720723 2447585 2316598 2676564 3093451 3144504
4075 3144504 3084560 3317777 3365665 3341074 3073812 2807683 2979801 2715066 2837642 2682374
4065 2682374 2972283 2809252 2913014 3339638 3314395 3120171 3170107 2780439 2939235 3372613
4055 3372613 2956091 2768129 2907879 2649859 3125136 3091546 2905324 3028699 3125995 3284534
4045 3284534 3743641 3562306 3522266 3731283 3471200 3238866 3497182 3521443 3151097 2998894
4035 2998894 3255028 3363367 3579268 3767225 3722031 3569653 3762901 3736463 3993661 4275033
4025 4275033 4358185 4546350 4438307 4777144 4691135 4774163 4753204 5136448 5526711 6142354
4015 6142354 6374152 6273870 6607763 7051344 7447970 8348064 9573821 9779590 10361780
4006 10361780 11889078 12877165 14068190 15627147 18384481 21669254 26470994 31211693
3998 31211693 34889678 33986011 29302078 23473475 19411251 16688841 14590314 12605317
3990 12605317 10887799 9296946 8404471 7845513 7165016 6223947 5805325 5612629 5422152
3981 5422152 5275933 4998164 4760078 4556481 4689111 4375030 4074142 3983408 3793651 3219474
3971 3219474 3095507 2919480 2454841 2409866 2384327 2351856 2301239 2317279 2791110 2534152
3961 2534152 2337143 2532557 2689589 2513612 2324899 2212742 1896392 1901554 2065615 2073753
3951 2073753 2148940 1922342 2064904 2155613 1888381 1915458 2297131 2342796 2048874 1792527
3941 1792527 1882814 1821807 1352643 1353796 1634052 1275249 1656470 1787559 1571347 1404511
3931 1404511 1287330 1436831 1703138 1669473 1899474 2002026 2105938 1853574 1806503 1335177
3921 1335177 1125136 1591743 1521367 1249975 1439908 1640489 1506524 1727271 1615671 1370334
3911 1370334 1213943 1310254 1831516 1882877 1979511 1700017 1793238 1593858 1483674 1433744
3901 1433744 926877 998543 1111152 1219874 1266413 1409393 1191456 903163 861162 937024
3891 937024 1002846 1175685 1102372 1135514 1368389 1059296 942015 982637 1026765 877183 856097
3880 856097 893649 1278759 1145511 775540 948037 884434 1085710 1252660 1401885 1417166
3870 1417166 1107036 989682 1014047 1230694 1010521 979475 1303930 1104137 1259707 1294329
3860 1294329 1092827 982509 844723 1239906 1178325 1095229 1342779 981044 1354752 1392572
3850 1392572 1300700 1099807 640950 578120 597886 592962 822738 640033 769926 907566
3840 907566 712506 364102 608464 1126165 1241250 1157481 1123180 975671 917188 862330
3830 862330 774279 586165 833761 995788 837972 983556 893121 430733 329524 661162
3820 661162 903192 913499 1038900 1073515 737368 466860 397034 657388 1056138 1061066 641880
3809 641880 518974 494649 860114 1068318 985954 854635 782816 1290935 1220730 886780
3799 886780 853209 987221 1214878 1107420 1047046 797223 710001 909172 1102406 1240864
3789 1240864 974516 1174599 1307094 971440 914889 810390 812328 888813 692295 569599
3779 569599 619615 619874 616640 741746 427266 554147 1133855 917103 989448 903038 763355
3768 763355 816137 1001013 845251 763866 612574 410344 510906 559362 635897 602326 735869
3757 735869 623662 659258 905973 400236 490161 849343 704404 500097 875010 970670
3747 970670 770094 555022 496298 707828 618112 1088357 873736 875798 902460 402576 458917
3736 458917 812450 906027 387784 715144 610710 543765 922327 815687 780141 876648
3726 876648 979731 772679 944006 796586 1055913 964557 446039 252193 435147 561336
3716 561336 1098424 1160639 871530 888921 895613 919114 961056 837677 1120899 1493727 1009759
3705 1009759 859431 930171 1105854 965387 1055159 1128296 1110829 1070063 1191813 942448
3695 942448 1363444 1295600 1117868 1025333 1124033 1096418 1071145 1329077 865288 1092197 1369286
3684 1369286 1379798 1066537 865391 649188 928340 1050764 722108 938865 971540 1005568
3674 1005568 819251 937616 629251 898732 770367 723869 920805 1146344 1389801 1076619
3664 1076619 1376204 1239405 1223113 517687 865162 1002078 1221378 1193590 1344339 1520480
3654 1520480 1311981 1200022 1008807 1078897 1293766 1105993 1036373 1266257 1255152 950518
3644 950518 699275 828436 918509 1367404 1029265 1197392 1345551 1375128 1382159 1134045
3634 1134045 1602275 1520705 1104301 1161888 1132898 1004027 798087 1002968 1307450 1398268
3624 1398268 1274951 1124599 1364245 1307967 1247204 1402205 1324304 1360361 1285483 1453331
3614 1453331 1489496 1345480 1183310 1038244 1069648 1438696 1499042 1465148 1805006 1847366
3604 1847366 1555589 1305842 1931758 2401253 2301853 1964027 2023123 2284981 2384521 2667853
3594 2667853 2535191 2124690 2115819 2474096 2393136 2377615 2687211 2670814 2622101 3014145 3180642
3583 3180642 2823703 2843837 2830193 2661129 2860968 3118847 3143268 3058896 2713113 2792509
3573 2792509 2834978 2667662 2324783 2316679 2495288 2417445 2069639 2028369 2165997 1916804
3563 1916804 2020420 2003309 2070580 2071048 1786567 1465973 1439212 1635025 1433042 1760846 1629487
3552 1629487 1143597 1187716 1464856 1975491 1896283 1553560 1385970 1623537 1332457 1678513
3542 1678513 1759038 1831323 1701011 1181349 1586743 1341191 1418001 1727509 1512459 1082393
3532 1082393 1072936 1316394 1305135 1495095 1545210 1444255 1259590 1210339 1360372 1582072
3522 1582072 1567561 1509492 1672596 1547057 1457236 1942794 1957749 1790811 1459702 1691945
3512 1691945 1862996 1533974 1342789 1573927 1655423 1865817 1704331 1691918 1908341 1235468
3502 1235468 1483621 1643801 1367606 1345083 1442333 1175002 1207391 1446716 1195067 1317665
3492 1317665 1713807 1688185 1650439 1322895 1353926 1335362 1494536 1485084 1807982 1735283 1358626
3481 1358626 1411968 1542144 1639318 1410829 1524931 1304550 1540307 1721580 1666598 1667605
3471 1667605 2094070 2104458 2107636 1944841 2018995 2093662 1712041 1748575 1472959 1316846 1418585
3460 1418585 1536709 1477870 1451648 1545759 1826265 1632572 1824853 1849370 1758017 1599220
3450 1599220 1703438 1688868 1747002 1932319 2033185 2049167 1671637 1432653 1478722 1529640
3440 1529640 1497324 2028148 1684366 1809728 2131089 2265066 2076456 1899322 2051581 1803533
3430 1803533 1507887 1721216 1837015 1940090 2068143 1948605 2033047 1993586 2290252 2092702
3420 2092702 2134189 2353342 2802304 2804030 2903898 2943700 3274246 3957333 3680220 3501128
3410 3501128 3864899 3819591 3791558 4133858 3950076 3863401 4311710 4206377 4215299 4298425 3987015
3399 3987015 4388552 4192626 4312624 4400052 4032537 4305263 3978883 3653531 4047690 4125997
3389 4125997 3813747 3404718 3254656 3214325 3305435 3201218 2801543 2948385 2620038 2490836
3379 2490836 2521074 2157312 2352926 2151570 2152834 2055464 2044543 2133684 1979324 2019284 2072359
3368 2072359 2016098 1671964 1817194 2099960 1975994 2048809 1904164 2160837 2307873 2163446
3358 2163446 1996532 1737953 1982464 1897359 1954047 1740906 1973707 2107787 2060116 2156439
3348 2156439 1948236 1668375 2019854 2065118 2149595 2233797 2073257 2193590 1982709 1882885
3338 1882885 2128738 2197900 2452995 2513333 2336142 2316225 2252757 2362250 2257377 2560617
3328 2560617 2340572 2418156 2601066 2469076 2349910 2761075 2337990 2243158 2558630 2715054
3318 2715054 2945917 2905668 2757792 2866134 2804779 2781464 2735472 2953599 3316012 3299220
3308 3299220 3744306 3935134 3919048 4471927 4368422 4500004 4526965 4741447 5143211 5107461
3298 5107461 5149067 5033264 4976512 5347772 5484631 5405263 5757591 5786436 5668401 5899005
3288 5899005 5649716 5437388 5213522 5229445 5505939 5545228 5167059 5104416 5159922 5126894
3278 5126894 5269332 5132142 4868363 4364471 4311709 3941938 4158005 4034602 3799860 3495839
3268 3495839 3533653 3346912 3629246 3153601 3216069 3187216 2860676 2942342 2883144 2917971 2998189
3257 2998189 3010192 3251850 3173459 2662652 2322036 2300728 2212528 2018339 2392051 2639983
3247 2639983 2721569 2677827 2858015 2704681 2523237 2457909 2574825 2664294 2262091 2409860
3237 2409860 2693432 2300525 2597415 2429508 2487059 2582891 2420083 2565045 2830065 2809336
3227 2809336 2728380 2851311 2666379 2758597 2966112 3016522 2819959 2496247 2359511 2620646
3217 2620646 2485003 2474859 2303628 2752571 2588765 2854257 2890069 2570563 2499098 2196973
3207 2196973 2203322 1809527 1562881 1888443 2168537 2116562 1788889 2145031 2333157 1971410
3197 1971410 2012159 1704942 1493538 1323154 1463337 1239784 1414307 1695253 1902186 1925230
3187 1925230 1812063 1718154 1695033 1853886 1624543 1357844 1542181 1456201 1619588 2016806
3177 2016806 2345655 2544521 1991967 2063492 2383546 2870625 2862663 2436208 2405938 2636912
3167 2636912 2605025 2333046 2585064 2613683 2914280 2872798 2419044 2321912 2410852 2195716
3157 2195716 2781604 3059915 2722260 2091725 2414281 2216978 2234792 2746067 3034006 2846852
3147 2846852 3028168 3484357 3613865 3722865 3627368 3765066 3786283 4084280 4230275 4085372
3137 4085372 3775438 3674316 3751371 3891481 3555229 3318719 3155100 2689869 3098448 2691052
3127 2691052 2329572 2588086 2696554 2548384 2412937 2405501 1893365 2069383 2128214 2155133
3117 2155133 1792109 1456604 1586290 1404044 1415772 1520005 1426850 1354516 1307914 1375364
3107 1375364 1258182 1423524 1364698 1258103 1302846 1789209 1740236 1640586 1205926 934248
3097 934248 1235624 1607377 1830457 1391143 748090 1045387 1383831 889840 1007661 982571
3087 982571 1259899 961754 811104 919704 1154915 1508585 1604270 1091079 1114019 1149663
3077 1149663 871005 795517 686486 751833 567370 286308 153438 802620 750511 825685
3067 825685 856120 357859 619835 924736 584916 421657 1029928 857972 747546 849043
3057 849043 661423 854367 644771 324261 286182 505795 320157 383252 236515 392843
3047 392843 644606 1065489 981697 889546 624040 336604 530207 853394 793839 282371
3037 282371 523538 493234 465620 805828 763317 772987 311975 493199 861504 686475 515924
3026 515924 749912 500744 571933 556708 332637 633999 869146 638673 644133 910135
3016 910135 947935 1122168 750930 578032 495608 650277 749897 485449 390958 1019089
3006 1019089 1311393 1295459 1315692 1198004 1185621 1145877 849579 885182 824318 656658 352927
2995 352927 745226 743206 795181 1025438 777659 795189 1125173 1066586 425942 492718 454262
2984 454262 686031 518550 522820 1091698 972873 803918 862532 834642 918461 1024854 892334
2973 892334 1235149 1180451 1072099 1114305 1260680 967533 747363 1119196 1013853 1020628
2963 1020628 1346496 1240125 977567 918723 1034280 1074831 1017546 1464292 1952182 1411065
2953 1411065 1145972 1174303 1304295 1776457 1737154 1169577 1264078 1702359 1588607 1738384
2943 1738384 1790091 2046235 1839892 1727997 1786081 1922204 2307404 1849820 1887902 2166144
2933 2166144 2256785 2488447 2638980 2965322 2723432 2472181 2799746 2295348 2402064 2595494
2923 2595494 2716513 3414119 3397682 3356965 3471463 3530888 3523693 3574945 4286880 4611813 4344709
2912 4344709 4597867 4907513 4744992 5501150 6190689 6389704 7173718 7671437 8138371 9456508
2902 9456508 10022894 10305590 11016045 11294095 11187885 10404769 9796977 9404252 8858934 8657202
2892 8657202 7918996 7252847 6369101 6123947 5810469 5589495 5657361 5192339 4939037 5539342
2882 5539342 5557508 5042831 4614019 3950818 4324942 4141610 4277168 4296717 4467320 4524616
2872 4524616 4395030 4068445 4104170 4362477 3794902 3592618 3719611 3669619 3446912 3367236
2862 3367236 3838404 3272636 3397896 3247019 3403066 3627578 3076576 3161737 3221109 3087398
2852 3087398 2750204 2724463 2747473 2474550 2435718 2530003 2152225 1902272 1984058 1653967
2842 1653967 1797551 1969105 2076645 1974231 1571465 1493972 1780108 1853529 1758557 1995149
2832 1995149 1909431 1506300 1421115 1719130 1488865 1564259 1770745 1441487 1435528 1507961 1442839
2821 1442839 1136194 1077990 1407905 1601839 1534580 1476675 1296558 1171271 1437176 1065134
2811 1065134 1231564 1450390 1144453 1097772 706183 471808 850429 868671 788892 736402
2801 736402 786493 773110 915051 955876 602015 543021 570077 656147 713903 1060265 876015
2790 876015 770489 545511 592618 674709 845169 504083 265794 918535 862971 792020
2780 792020 466249 520389 346901 561141 500290 226430 358077 596661 286214 542106
2770 542106 302343 160677 315620 575214 520591 323867 291886 653916 740717 472260
2760 472260 639473 -74901 102638 368935 451355 79864 -18873 307806 -61620 182738
2750 182738 531465 569378 704198 149197 -69407 289382 8743 317184 560188 314234
2740 314234 450131 314147 173310 6960 316688 481689 858246 687933 483430 479406
2730 479406 379851 421757 62585 41463 561407 258384 90419 414342 571146 754072
2720 754072 554377 480216 228259 -11647 297039 213932 -178481 310877 393997 348246
2710 348246 -264355 129547 870304 272530 172252 25191 6810 419566 484559 621701
2700 621701 40565 -219393 -262075 -362579 -192155 -3988 67722 -124737 -357427 -190045
2690 -190045 -321533 -279960 -43577 -250008 -73139 -334948 -62454 318965 226439 94092
2680 94092 77188 -39034 137706 176747 379689 570630 472678 140733 222793 302409 -46757
2669 -46757 55750 149860 -174909 -68973 211283 217436 197441 340698 -243563 -650353 -566017
2658 -566017 -358842 36634 281817 106841 -191410 -109833 -26323 18580 -282223 -234172
2648 -234172 63768 -84807 -304209 -225886 -26152 203406 1540 131664 -6255 72580
2638 72580 -164338 -250927 -172374 -283515 91659 183118 366095 253988 183403 40935 168201
2627 168201 64065 -37014 215247 -41560 -249310 -176466 246732 306863 204909 -125633
2617 -125633 -149153 -199613 -178873 -116654 -364919 -48039 98902 205789 107558 -127759 275573
2606 275573 -76695 -521113 -369896 -231178 140369 -145886 48396 -24560 -89177 71154
2596 71154 -174694 -189354 -25629 72244 -151869 -304765 -10156 172855 180398 -11171 241797
2585 241797 354991 -40857 -132105 -442578 -266839 -211561 -95937 32408 326890 466794
2575 466794 -61478 108806 83249 -138909 -222182 -12746 15812 -160715 -144472 -4119
2565 -4119 -126399 -442939 -114698 -237222 -251708 -308993 -385718 -103589 -255790 -62938 -112230
2554 -112230 -212094 -264995 -39377 415001 163542 -331119 -223893 -58117 133104 258000
2544 258000 272113 407319 200645 155597 -11350 -166184 82807 -52667 -641917 -721829
2534 -721829 -670913 -672432 -357555 67074 -103998 -308383 -567710 -148400 37452 62659
2524 62659 236032 29303 98092 -94732 -101700 91844 -46337 -49359 -106815 -493283 -604477
2513 -604477 -376034 -199788 -501718 -108487 -127153 -404100 -485112 -162355 -170470 -338223
2503 -338223 -62429 -16030 -356191 -809537 -614525 101296 142320 -133094 -139894 -476274
2493 -476274 -252846 -122891 -104783 -5065 87118 -324362 -12588 90596 -229714 -377960
2483 -377960 -595340 -580258 -546199 126102 322066 170349 -18640 -187147 59480 -81785
2473 -81785 167928 106478 209055 26160 5017 -287280 -581620 -329614 -281689 163186
2463 163186 163638 -188366 252545 427167 -9502 -194684 -199927 -258818 -50473 60714 89962
2452 89962 -110628 -273230 -163712 -379287 -295455 -56784 -337712 -289297 242749 114055
2442 114055 -283405 -408515 -151281 -321444 -371950 -316391 -33241 -88858 -9926 250556
2432 250556 383979 334040 69318 2364 -144741 -137618 -110212 97695 13342 -72865 -91194
2421 -91194 -22259 112022 103679 -137030 12325 220190 312185 443016 111852 110357 -298623
2410 -298623 -323575 -109490 -13681 -372387 -474034 -450072 -343769 -328796 -141739 184809
2400 184809 -145807 -345864 -30120 -157888 -296452 -295620 25644 -178533 -196638 -493996
2390 -493996 -121984 119406 163215 154792 -23189 -4443 -105867 122153 19001 -39336 85669
2379 85669 -121884 -305291 -302956 -356132 -64360 97919 136362 293384 9547 -146247 -63624
2368 -63624 -158561 -133899 -140819 420401 689790 913194 596937 66256 67240 -118193 -299488
2357 -299488 -66321 -390552 -178731 -35538 -127027 -146385 -196789 -510017 -318039 -444126
2347 -444126 -273372 -33891 -84735 -564602 -346648 -134492 -86071 -78146 72491 447542
2337 447542 473441 -53120 -106939 86393 -260362 32769 83713 -913 -304260 31081
2327 31081 320080 -310397 -104528 -49422 127762 387236 228878 -293707 -809261 -432672
2317 -432672 -170977 -407091 -862481 -226319 -40496 -316745 34644 137001 132960 525698
2307 525698 220116 121896 85624 171780 -46252 -311514 -574204 -156700 193431 -206124
2297 -206124 329364 345356 190006 328076 91523 -134190 -216974 -460158 -418227 -213039
2287 -213039 -318130 -253193 -210422 12735 287071 139720 78214 144416 198427 1141 37425
2276 37425 -11548 -136730 24280 187366 547808 316471 -100175 123635 75411 -123257
2266 -123257 166535 171214 29645 118326 157189 11453 -170159 -228098 260228 -66843 40335
2255 40335 -59267 -668724 -103886 131032 403046 369429 162487 259262 283117 31509 38973
2244 38973 55841 -103781 -48416 -188228 -37326 -227441 -47170 -97820 -79351 87801 278906
2233 278906 217542 -85828 508056 535776 146627 227497 111930 144074 -80930 -237978
2223 -237978 -107980 -345739 -49520 -321447 -144350 134149 191425 151254 28159 178756
2213 178756 148828 517355 850005 549982 104231 -91779 144185 12637 62258 72916
2203 72916 185301 315100 403550 449608 523940 563390 370312 -200751 -228601 -265906 -296972
2192 -296972 -147734 -301426 161693 324942 534046 579955 534600 290985 -5161 -17296
2182 -17296 186504 219893 389513 606405 507988 -91426 -118174 98558 51215 71192 598569
2171 598569 282188 180708 557350 388766 492459 769588 634199 91762 884920 1258586
2161 1258586 880491 905474 545642 601965 870961 667382 264433 411348 601009 578738
2151 578738 787800 853736 802367 756560 578767 524733 599708 193316 240042 279463 476181
2140 476181 567304 950886 1325469 922587 911998 952920 900793 883457 860413 832277 647126
2129 647126 1176128 1657261 1376324 1038643 1018714 1353856 2005615 1910623 1406914 1612591
2119 1612591 1917050 2051040 2382055 2436648 2665966 2434562 2552636 2740476 3018201 3398102
2109 3398102 3537790 3882700 4113655 4736524 4883252 5178217 5924239 6730594 7763293
2100 7763293 9166933 10913621 12703086 15253486 17645371 17180764 14530687 11657015
2092 11657015 9814049 8161385 6902283 5955758 5549803 4636690 3719424 3406252 3087838
2083 3087838 3290109 3296184 2909193 2500552 2440435 2581950 2485321 1617084 1564937 1728252
2073 1728252 1627703 1574205 1014247 1295771 1420441 1005732 1189970 1526353 1574569 1249534
2063 1249534 959488 816522 774429 593277 653473 755724 409320 438161 527744 292407
2053 292407 290727 257421 139867 460528 355604 396039 300619 513454 498770 259763 520880
2042 520880 318434 477872 -37707 -187907 98329 320856 394838 685282 740814 224040
2032 224040 -55748 30634 230630 278222 76139 147566 202239 -191354 -144735 183406 -5733
2021 -5733 231221 644066 187966 22299 -241871 -159048 -75358 375210 449959 293351 481349
2010 481349 500126 -115854 -184931 27510 16204 281518 89230 21391 220300 20614
2000 20614 187073 68158 131834 278059 35799 188077 110640 -124341 -220869 -206118 -47335
1989 -47335 -255030 -86841 -106093 -406973 -413928 -366797 -170781 25355 387838 387492 384188
1978 384188 -33682 -619195 -503410 -24649 139816 189514 94914 118859 225487 16656
1968 16656 -133968 -228317 -126423 335736 470108 272090 34014 238173 116446 -14469
1958 -14469 36808 45644 -153519 68177 -138605 -138202 96687 193182 -99386 -41631 -52229
1947 -52229 -410002 -314312 -297655 -614118 -395670 -292060 104690 113877 234955 126988 -107455
1936 -107455 -12772 156007 221167 51996 -45801 -69083 -264928 -62899 32186 140649 193753
1925 193753 -219781 -212856 -186543 -49105 -73144 287188 498990 348627 1409 212031
1915 212031 165329 23114 -207297 -352829 -618942 -328664 -242519 -109364 -258745 -37356
1905 -37356 -15770 188446 253271 205346 175329 -206655 17456 184311 -345269 -76309 63833
1894 63833 -39249 -13643 -112197 -134014 -30414 -251229 -477465 -457458 -501110 -487773 -388708
1883 -388708 -154545 -45081 -113727 -18139 -65847 -380600 -174582 -223166 -398026 -469944 -137721
1872 -137721 133019 -93574 -448804 -545243 -353863 84172 -116167 -412990 -493431 -653517
1862 -653517 -385459 -115910 -6443 -60240 -4978 -213611 -293740 -190526 -349997 -263062
1852 -263062 -56365 417629 262211 263148 344652 322214 161983 204086 329367 -32504 -118990
1841 -118990 -167266 -18911 226682 460112 250674 443945 513062 110390 347950 456776
1831 456776 322335 460324 270894 -51422 122952 294865 314626 562213 631919 10935
1821 10935 241150 223476 -9040 53087 115732 -16985 -25184 44038 145352 70761 257387
1810 257387 151572 -30076 -545310 -809419 -347823 -225518 -142071 208670 141998 -230255
1800 -230255 -337959 -167213 -85913 -248938 -120177 314100 150534 -73769 167748 -92294
1790 -92294 -185423 -181059 -235721 -379769 -152640 -418679 -145561 -6928 179505 384920 446575
1779 446575 144943 -239392 181150 -135870 -419528 15009 43331 84481 -152518 69935
1769 69935 -9194 -274275 -158117 -424615 -279457 -357228 -315931 47127 -47113 -33553 -27065
1758 -27065 86359 -50700 -503464 -60192 140177 -5647 68365 86266 -185445 -285519
1748 -285519 -495158 -136928 -403352 -228377 -22111 -287297 -124071 -109173 -278271 -355317
1738 -355317 -189190 -27623 294723 23609 -296915 49580 -353923 -500826 -298603 -183215
1728 -183215 303329 189417 159720 226773 52450 -215855 -4932 -276025 -658133 -110966
1718 -110966 -139955 -309269 32735 339227 286724 294939 266253 289042 223201 253834 -78478
1707 -78478 58351 303790 -523113 -445952 -560171 -503972 -106275 -29525 -50701 146135 -20566
1696 -20566 -210419 -220240 -143098 -37677 -27619 -261837 -273117 -124548 83246 225148 294099
1685 294099 80562 63090 16119 -308976 -30727 338034 -181996 93954 504748 136928
1675 136928 147896 -61926 -287231 -536668 -385772 -382027 -190784 171959 54651 5258
1665 5258 -130621 -1921 206320 66003 51620 -89154 -136794 -253938 -301424 -266611 -83048
1654 -83048 -6345 135907 -311721 -512458 -270725 -141704 193042 511786 546271 42558
1644 42558 -184862 -92311 79592 -89378 -502923 -272874 84882 -3900 270961 334140
1634 334140 97052 312522 614392 354445 189251 204550 98463 -128458 85089 199114
1624 199114 -57512 62491 -302980 -367405 -38401 -427750 -358347 -482499 -311785 -302359
1614 -302359 -327912 29151 53385 -154165 -368960 -450413 -593847 -264593 -196376 26508
1604 26508 -341762 -333824 -709484 -1015018 -551032 -556864 -308891 -202166 204766 -140074 -371690
1593 -371690 -313224 23906 459342 23018 -170990 -398176 -34173 -218039 -419189 -221589
1583 -221589 -223936 -187447 -285706 -348854 -348916 -158698 -277043 -695765 -514021 -446158 -300590
1572 -300590 154009 -199202 -223802 148968 201095 436774 -41891 -298966 -152840 -360848
1562 -360848 -327506 -333670 -309441 -133071 -31035 263199 350148 -69736 -326274 -22833 159180
1551 159180 212243 404813 311851 51338 336299 220893 -124863 -430998 -330226 -485609
1541 -485609 -558044 252403 959285 478871 -78226 264207 -161221 6269 -33912 68693
1531 68693 23704 -22604 -102703 -45048 317194 284567 217624 246626 73440 105780 316376
1520 316376 136171 -10271 -323853 -267712 -203536 -102473 -76342 -508975 -563103 -781552
1510 -781552 -308983 -421069 -504370 -280294 -216598 2622 134030 91266 -116674 -616530
1500 -616530 -434474 -54981 -300781 71832 167611 53967 28129 420294 207259 -133956
1490 -133956 201577 451991 -31952 -16832 116028 -36371 -78621 -142163 -704361 -494558
1480 -494558 -102077 128118 368191 224688 -271382 -231482 -213008 2531 -107922 -279011
1470 -279011 -149404 -148583 -103846 -452528 -73955 -49912 147700 -219674 -201750 -400737 -313808
1459 -313808 -147254 -126228 -330753 -407093 -26368 189541 -50494 -288229 371513 89373
1449 89373 46428 -91959 188124 232254 370718 28913 -85737 265575 122674 126585 -8773
1438 -8773 41996 122922 105755 -323309 -266707 96171 140378 312948 287628 -24457 135985
1427 135985 185949 336702 -56395 -138217 -71366 -389377 -412941 -318892 43710 176883 -237995
1416 -237995 158793 555694 492913 204964 91054 72925 -161037 -45992 89681 -137085
1406 -137085 -576989 -498499 -183969 -419591 -450618 -125300 -140189 -280403 -1367 115455
1396 115455 -66642 -1265 169384 102652 126220 97001 327385 276912 301857 -179537 -443478
1385 -443478 -154859 -292498 -33265 238336 -77454 -243185 1415 13175 115748 177925
1375 177925 293626 -89075 315120 386992 248137 198257 178053 -201399 -85640 -39863
1365 -39863 -158325 -150773 63998 17448 66803 -7752 -428335 -460250 -486215 -216360 -447459
1354 -447459 -302712 -290038 -432694 -26443 20166 -67841 33059 214720 263675 208282 336105
1343 336105 19191 271693 310921 431239 357708 -72577 30150 -51095 -221370 -210714
1333 -210714 15597 223589 -87157 -71020 488870 -102506 -178145 -305662 -653522 -46131
1323 -46131 224892 391467 595822 7249 -189529 192423 -172752 -387571 -85551 526282
1313 526282 469166 220141 142898 139002 130525 -15363 -267165 -469503 -732113 -510490 208743
1302 208743 72745 -101211 -239069 -210858 30902 273119 -91339 -200275 165266 236424
1292 236424 198361 4966 -279666 -510914 -552258 -517093 -432330 -156631 330320 528789
1282 528789 226936 225327 140216 -117740 -218596 -116677 -112574 55897 -42982 -114259 -212605
1271 -212605 -333314 -160109 -271348 -62488 -90043 -10258 47412 -81522 -183141 -384026
1261 -384026 -326422 -232670 -1241 -40353 -82435 65221 327741 258598 -78272 213302 394606
1250 394606 325161 -307541 -256834 -100208 54403 93915 -171158 -365004 -170893 30898
1240 30898 -697735 -824937 -216148 -168210 -177859 -163665 -187030 -451804 -257774 22102 27120
1229 27120 30927 99603 236277 168751 58866 191609 584948 360714 80045 274501 165145
1218 165145 -127436 -329202 -92823 -187959 -42926 -93039 142242 186781 187474 -206215 -453652
1207 -453652 57110 158999 357765 -319187 -314461 -446267 -541890 -87542 161890 -92860
1197 -92860 -288202 -39005 -79110 -334048 -234961 -219157 -129486 -35979 -12112 -80654 59598
1186 59598 -126323 -191717 -175039 -404682 -305428 268043 301707 -102482 287224 -203157 8867
1175 8867 433817 242418 -58766 -436929 -407713 -110409 182606 -213971 -585814 -162298
1165 -162298 -242349 -379578 -148684 -299845 84720 14204 -134462 93014 323015 189834
1155 189834 77286 -451178 -220608 -261145 -389523 16100 -146386 -102240 -100998 -19817 79292
1144 79292 -140620 -238136 -365732 112428 3626 -458419 -307631 155997 -9293 8415
1134 8415 -20669 52194 447342 163613 498178 275005 101389 247961 194970 9471 245866
1123 245866 321221 -28284 -107203 -37094 45952 217714 394643 193278 255869 280346 -6434
1112 -6434 79881 266179 410775 66650 557 204819 -194612 -1905 230313 67650
1102 67650 307899 622081 353830 -30416 -316815 -734732 -741091 -462125 -74723 218930
1092 218930 -317615 -465748 166130 42334 75191 102251 -70542 8022 195078 341085
1082 341085 179243 -204786 -97091 -353345 -132643 -248770 -135469 228838 368257 294026
1072 294026 167814 152765 217204 92692 -152240 106749 300739 4274 -120059 -149307
1062 -149307 -205032 -287981 -316598 -102176 99454 261048 399024 356133 144162 261390
1052 261390 -79147 -23121 -163246 -402386 -379824 -4408 -77369 -214141 -107037 -429011
1042 -429011 -519742 -324447 -491868 -470597 -321812 40609 205509 382664 347690 951
1032 951 -339836 -720427 -425837 -59672 117654 367152 164886 -554798 -151906 243134
1022 243134 -45040 -608423 -462794 -33763 384941 300304 117967 -128045 -378759 -58803
1012 -58803 -84989 35593 -40098 -510595 207814 271758 32025 -38796 -242358 -342325 -566806
1001 -566806 -338041 -157752 -20398 80217 405881 148245 -184251 -478054 -562753 -434274
991 -434274 139180 303980 43853 66916 208383 -223943 -225145 -147258 -53804 -70096 93246
980 93246 185931 364407 387558 -49988 -85306 -32284 -289220 -27172 -16335 -238022 -53503
969 -53503 -194669 -142217 -385214 -447659 -109996 20466 -13399 -264895 141441 270448 62273
958 62273 83249 297268 -111835 -47628 -162961 -251100 -149477 -352441 -180363 224964 237702
947 237702 402496 286731 80043 587388 49649 -294813 -136193 -41373 -101713 -57152
937 -57152 -269791 -246152 187392 539350 594147 421984 -896 155768 -89758 31708
927 31708 78299 -240676 156634 591092 77846 -16212 -397748 31067 -129140 -246536
917 -246536 -50582 5503 53606 -25926 -125175 -477611 -402863 -31040 1423 -8425 173206
906 173206 178966 35188 -92433 123568 95936 357337 543745 358552 405747 353801 -64745
895 -64745 -67355 -178297 -229652 17710 169856 -84853 215604 365872 280560 214967 189439
884 189439 43072 79008 -109782 -38153 -176927 -127975 -100109 -259784 -220481 -140945 -453200
873 -453200 -48228 -134147 -388449 -140805 -228493 399060 39753 97480 208942 21229
863 21229 -9614 -20096 49205 -225033 -634052 -494988 -272736 -131340 -354649 -342499 -290535
852 -290535 117979 219766 -105464 -216047 -226212 -225501 -265981 82712 61976 177572 260645
841 260645 371396 377087 -41584 -13622 75727 -172917 -140531 -192258 -113801 -62177 237348
830 237348 213821 230640 272316 192806 400501 89029 -84370 332177 509371 536808 298642
819 298642 91801 420512 267052 271946 190778 312223 244158 151451 72563 119237 34613
808 34613 21166 -77080 -157863 420 95444 4994 -40097 -88629 -509054 -461291 -52334
797 -52334 124329 314390 415473 -5509 362768 69589 -12462 -6114 -89887 -182736 273783
786 273783 318502 388121 316273 494011 278380 66522 -86287 147022 -145620 -325708
776 -325708 -333059 -93227 -76135 -407617 -209272 -211094 -269249 -514309 -322826 -408488 -26976
765 -26976 -313529 -149591 42607 150289 64096 -114143 -213424 -282640 -349842 -320758 -227417
754 -227417 144478 120429 19417 294149 127977 270881 134295 310748 556964 45894
744 45894 -191885 -277331 -153812 -159839 90821 -141672 -118891 432368 -115926 15969 206286
733 206286 -296939 -96383 -88992 -192331 68835 23183 -127420 -95130 18837 322193 -207600
722 -207600 -184001 86020 94610 147667 -173480 -91030 408786 107383 81497 -57535 323164
711 323164 387274 414339 -204396 -143687 184282 -154746 -270125 -94310 -49919 -409242 -520843
700 -520843 -508503 -267518 -277347 -46256 210958 165778 -86081 162122 396038 338049 -8428
689 -8428 135082 -168776 -56796 268086 477599 237880 -180585 -107207 154975 -368854
679 -368854 -351856 -274107 -122005 41357 397322 679606 479428 240658 75264 441024
669 441024 364656 -123537 -2344 -1398 -550355 -224166 9798 83662 -88488 -431391 -5704
658 -5704 67054 263423 439601 388039 351580 42911 -67939 50992 -234665 -381741 -336129
647 -336129 -151021 475153 345908 169425 128250 -67710 -138686 189772 -115186 -38601
637 -38601 -319051 -286225 -409928 34429 426649 -59291 -343785 -256127 -53848 96285
627 96285 -29541 -156386 127744 -88933 -162223 -234144 -178536 -182621 -43441 -34203 416089
616 416089 555206 151451 59833 404483 229688 13466 -58686 46724 96111 447949
606 447949 67304 106055 302197 311593 338896 290573 208596 97022 180652 242438 57222
595 57222 248499 102799 -249924 -557623 -404369 -281874 -366464 -218814 -422080 -425717 -435756
584 -435756 -210087 -53668 188802 343132 268913 431532 339973 -147285 -99013 -230332
574 -230332 -19497 -86723 -234328 94474 91923 72268 -6979 406411 678615 204402 -29587
563 -29587 -490350 -616521 -247299 -164399 -133472 120201 -161386 -181299 -135096 120976 223935
552 223935 274764 289229 289680 302832 365996 241492 -12397 238469 572710 593623 165716
541 165716 -201693 -54026 -279484 -205655 46114 161329 -58481 -443627 -280453 -28946
531 -28946 183837 -230880 -118522 -77833 -146678 199917 -173972 -305099 58072 -166095
521 -166095 217250 132033 95343 256233 277530 185346 -9477 -50043 13174 -20881 -29835
510 -29835 295755 101183 20221 -64474 -98784 -125775 116412 -208349 -101457 -14573 114508
499 114508 410801 689036 403850 402679 508395 2870 -17229 -145542 -81936 234636 244885
488 244885 288649 121258 -79170 -388514 -240912 82854 -197335 273919 110830 -50399
478 -50399 -50567 -17348 260203 397131 426287 -101153 -57605 126478 -299738 -457866 -100889
467 -100889 -60298 -674 376763 256413 33462 50132 99426 262372 218521 585254 544418
456 544418 189175 86889 -50968 449109 520417 740439 142417 -220406 37597 53911
446 53911 293324 309653 227129 280113 425356 313374 343143 145124 244158 446815 360275
435 360275 704570 193727 -404949 -207307 14219 345556 565480 528788 462192 358372
425 358372 613100 424306 167347 -448158 -436006 -117774 -274969 -574036 -250911 276536
415 276536 557057 652879 797542 1103939 822298 386668 128728 -25464 87449 384891
405 384891 442164 -78143 49633 399617 337407 41568 178559 198402 362538 635684
395 635684 375640 -35675 177013 516490 109366 96685 261136 470229 253478 104220
385 104220 -238982 -9833 430293 300046 229435 711012 436170 76498 228053 298676
375 298676 37741 42458 42680 131035 43968 646022 575451 173593 553695 501418 494085 528838
363 528838 520882 479033 288037 583293 481025 387928 345631 277362 229586 395131 184141
352 184141 173534 117231 356643 465044 450093 430065 358490 337615 155421 108071 189600
341 189600 357857 279703 246483 185840 580089 68067 -80751 106096 241701 6387
331 6387 -18631 110020 223660 301811 242680 50858 461446 668553 620806 504431 365320
320 365320 -221174 -162333 496362 730367 359545 -81966 -176372 -176668 218527 444144 199821
309 199821 -43801 -35805 540367 466927 488894 -66006 -297670 -32263 442048 431922 369307
298 369307 312542 250058 313205 104147 438637 250627 -49770 40235 424549 396077 232294
287 232294 34493 184145 12431 276799 453823 156470 -34685 -7176 95413 626616
277 626616 381814 296447 524072 883791 839292 558651 213957 -56527 -102429 232157
267 232157 427175 346233 522840 150717 235631 500251 192342 46896 198474 392582
257 392582 252291 426654 312423 253759 55089 -33801 274778 -66902 65172 291980
247 291980 322769 423155 253433 564228 497308 342097 417638 335899 250474 346082 546197
236 546197 358496 603759 606935 384058 214966 -66880 78106 287283 388851 659118
226 659118 721238 285883 211238 300218 173903 293645 189117 378991 632076 740742
216 740742 559399 444896 409072 204072 15754 247464 412622 38244 261102 253124
206 253124 -82525 50129 134782 114689 102440 474982 662473 535174 208578 299121 -102692
195 -102692 -5021 508693 433633 331558 307843 157913 260248 265129 27270 428673 808380
184 808380 513288 102610 -79279 -163242 211355 665336 706126 394291 375179 853006
174 853006 515917 11376 158981 26805 134656 272378 -174777 36869 128379 -77593
164 -77593 191193 106747 447427 847136 210565 -178519 -15759 443642 317311 472337
154 472337 757319 404298 413823 95182 316095 308588 338492 119799 147533 359092 388230
143 388230 279660 -171806 41399 313117 435559 906445 861561 733943 471381 281381
133 281381 596618 363245 230492 283341 245846 362595 -58263 161279 467942 183025
123 183025 209696 388499 420148 354261 205816 229015 183272 317672 396873 163734 629093
112 629093 307166 146821 251471 250589 388514 305028 176703 485781 715992 815141 601722
101 601722 114047 95767 124122 226372 171840 89924 339378 405816 187449 255344 297876
90 297876 403930 771613 599742 482415 459351 207571 340964 414910 688960 824206
80 824206 799441 799512 561302 161891 39209 122823 184130 461206 252534 272734 164411
69 164411 285854 167117 116257 441769 722049 694751 633033 568157 303198 104329 -5398
58 -5398 236942 268754 266263 305690 169610 268694 435000 193848 211637 154895 283139 254164
46 254164 34302 341978 263190 411241 279855 410523 386696 342623 589486 379439 356007
35 356007 204950 199585 6616 -301759 -334560 296365 140537 8398 58900 150037 384469
24 384469 267785 402222 303527 148824 485560 329324 236581 417311 321246 394054 392246
13 392246 262809 306998 496414 370305 450977 529952 352592 582047 631376 535855 508501
2 508501 435248 337497
0 337497
$$ Imaginary data points
##PAGE= N=2
##DATA TABLE= (X++(I..I)), XYDATA
16383 -1588756 -1556424 -1611114 -1579644 -1243362 -1191837 -1296022 -962526 -993437 -1029910 -1090532 -1052020
16372 -1052020 -795655 -913595 -652269 -709596 -633207 -537849 -657791 -711266 -515155 -860228
16362 -860228 -554883 -710061 -734015 -554963 -389481 -627779 -841802 -648868 -155804 -36345
16352 -36345 -194795 -112869 -175518 -238369 -83597 182332 -65641 -340394 -250899 -252694 140408
16341 140408 263170 103516 68605 181589 294443 142645 122893 206388 92547 303714
16331 303714 373402 221451 242824 415304 445377 626861 837309 642659 590904 489290
16321 489290 476614 362953 629858 721544 582609 415706 140258 333043 767172 711666
16311 711666 650379 467761 770403 1139616 1179040 1078715 990610 800372 1021904 1118202
16301 1118202 1171068 1388326 1592806 1716672 1457056 1429668 1391626 1074124 1076722 1116274
16291 1116274 1170073 1619678 1316119 1194024 1674455 1793163 1691198 1723378 1777240 1525463
16281 1525463 1454330 1458987 1586942 1740720 1563185 1477005 1669107 1730887 1517907 1479859
16271 1479859 1693652 1741059 1765690 1998023 1886365 1488099 1465733 2027689 2012464 1932714
16261 1932714 1950544 2017606 2019491 2078372 1935223 1913762 2079568 2208748 2369365 2491606
16251 2491606 2195714 2286168 2543476 2443870 2772679 2518607 2532832 2558765 2659493 2683237
16241 2683237 2442951 2338770 2414797 2552382 2638548 2437957 2581648 2412472 2598845 2292743
16231 2292743 2292510 2700509 2908504 2989765 2852061 2573210 2739777 3114425 3161487 2622445
16221 2622445 2692213 2652131 2839151 2847384 2849551 2806554 2884262 2626773 2490785 2556157 2692242
16210 2692242 3038089 2854545 2869714 2895999 2859707 2767846 3005737 2633641 2744131 2845163
16200 2845163 3435618 3058359 3125603 3328399 3134337 3248478 3106187 2750848 2466918 2948552
16190 2948552 3272583 3215964 3438524 3502508 3369152 3298929 3434104 3213632 3366965 3493067
16180 3493067 3393681 3420879 3393794 3566350 3680674 3398376 3455536 3377663 3221855 2991244
16170 2991244 3360034 3318743 3177957 3009314 2830851 3152547 3372062 3426782 3567534 3483757
16160 3483757 3358036 3243995 3247194 3147988 3152344 3401076 3618990 3295330 3503831 3414946
16150 3414946 3527598 3559842 3261307 3388703 3232278 3332767 3093818 3320923 3301730 3473746
16140 3473746 3347496 3501339 3896131 4011580 3982754 3916802 3499598 3687172 3643593 3735278
16130 3735278 3235050 2958937 3718943 3770632 3579298 3583463 3715644 3612756 3558847 3777196
16120 3777196 3611504 3395143 3332799 3680512 3953240 3975527 3451112 3340292 3425012 3487613
16110 3487613 3523017 3469328 3740386 4083383 3869590 4013826 3954744 3671813 3532087 3433722
16100 3433722 3560029 3589010 3269984 3171595 3625804 3955104 3645094 3798017 4041449 3658027
16090 3658027 3418152 3362999 3843575 3089051 2808558 3047537 3732041 3654915 3600749 3782805
16080 3782805 3802593 4128680 4162759 4092649 4241984 3769732 3519576 3194750 3389453 3599933
16070 3599933 3483399 3744002 4156829 4074319 3861467 3579980 3665419 3817752 3698125 3871058
16060 3871058 3637367 3977615 4203855 3850190 3968853 4063682 3868923 3563930 3442281 3305001
16050 3305001 3242010 3439553 3562567 4014208 4320164 4145650 3858406 3573214 3626776 3837856
16040 3837856 3853942 3662065 3510363 3324819 3414217 3733551 3602139 3866578 3993162 4015813
16030 4015813 3621076 3601872 3559108 3801328 4065430 3827259 3826234 3787418 3794621 3803654 4022076
16019 4022076 4247533 3943332 4031446 3384723 3290602 3586523 3524109 3700984 3802314 3869026
16009 3869026 3698124 3826200 3619191 3544250 3806293 3369934 3323248 3542135 3584074 3604985
15999 3604985 3667832 3398922 3345445 3664540 3752982 3502223 3622384 3690010 3503123 3468932
15989 3468932 3357933 3389827 3738865 4242640 4079852 3822235 3726194 3968359 4228881 4045446
15979 4045446 3984371 3806449 3972669 4018100 4128103 4081189 3836654 3846485 4033303 3836650
15969 3836650 3585976 3493821 3732395 4130647 4081145 4027561 4085346 3974023 4058880 3832975
15959 3832975 3723368 3904554 3764412 4002543 4045317 3792648 3807487 3673815 3388920 3346068
15949 3346068 3326017 3724836 3852672 3947041 3848042 3567137 3391183 3741010 3869554 3486087
15939 3486087 3282934 3577295 3553981 3476230 3580950 3816846 3586777 3172144 3840381 4187864
15929 4187864 4071919 3901172 3405655 3307662 3957792 3741289 3592858 3573618 3787211 3940746
15919 3940746 3640433 3524142 3351978 3613811 3763567 4134400 3994273 3903804 3828546 3877645
15909 3877645 3761206 4074469 3914123 4086857 3852465 3451229 3764821 3872510 3541587
15900 3541587 3738167 3878442 4153070 3968645 3592196 3525051 3791189 3949281 4141057 3865853
15890 3865853 3644270 3743742 3801074 3842411 3838475 3635584 3848713 4159138 3879891 3965252
$$ [...]
##END NTUPLES=NMR SPECTRUM
##END=
