##TITLE=1H_CA-8981-3
 CDCl3
 8 sc, 
 16.03.2022
##JCAMPDX= 6.0         $$ Bruker NMR JCAMP-DX V2.0
##DATA TYPE= NMR SPECTRUM
##DATA CLASS= NTUPLES
##ORIGIN= UXNMR, Bruker Analytische Messtechnik GmbH
##OWNER= root
$$ XWIN-NMR		Version 3.5
$$ Wed Mar 16 13:03:07 2022 Russian Standard Time (UT+4h)  she@DPX200
##.OBSERVE FREQUENCY= 200.131346
##.OBSERVE NUCLEUS= ^1H
##.ACQUISITION MODE= SIMULTANEOUS
##.ACQUISITION SCHEME= undefined
##.AVERAGES= 8
##.DIGITISER RES= 18
##SPECTROMETER/DATA SYSTEM= spect
##.PULSE SEQUENCE= zg30
##.SOLVENT NAME= Acetone
##.SHIFT REFERENCE= (INTERNAL, Acetone, 0, 15.7248)
##AUDIT TRAIL= $$ (NUMBER, WHEN, WHO, WHERE, WHAT)
$$ ##TITLE= Audit trail, XWIN-NMR		Version 3.5
$$ ##JCAMPDX= 5.01
$$ ##ORIGIN= Bruker BioSpin GmbH
$$ ##OWNER= she
$$ F:/spectra/data/she/nmr/H-F/1/pdata/1/auditp.txt
$$ ##AUDIT TRAIL=  $$ (NUMBER, WHEN, WHO, WHERE, WHAT)
(   1,<2022-03-16 13:01:51.29 +0400>,<she>,<DPX200>,
      <created by zg, POWCHK disabled, PULCHK disabled
       configuration hash MD5:
       00 E9 B6 7A A2 85 ED C7 34 08 36 98 17 FE 4E 26
       data hash MD5: 16K
       9C 99 F3 18 69 5C D4 15 53 F6 6D EB A6 95 25 C8>)
(   2,<2022-03-16 13:01:54.00 +0400>,<she>,<DPX200>,
      <Start of raw data processing
       efp BC_mod = 2 LB = 0.24 FT_mod = 6 PKNL = 1 PHC0 = -16951.09 PHC1 = 13.40078 SI = 16K 
       data hash MD5: 16K
       FB B5 24 F3 ED 26 C6 D2 54 DD F5 7D 75 34 96 18>)
(   3,<2022-03-16 13:02:13.35 +0400>,<she>,<DPX200>,
      <pk PHC0 = 2.049647 PHC1 = -2.4 
       data hash MD5: 16K
       53 09 9B E6 C9 65 33 4B F9 66 2F A9 E8 A5 E6 08>)
(   4,<2022-03-16 13:02:16.82 +0400>,<she>,<DPX200>,
      <abs ABSG = 5 
       data hash MD5: 16K
       19 00 4F B9 72 43 3B CC 2A C5 79 ED 67 FD 28 43>)
$$ ##END=
$$ 
$$ hash MD5
$$ D9 41 05 07 07 4E D6 02 24 3A D7 1B BC 0D 24 6C
##$RELAX= 
##$RELAX= 
##$RELAX= 
##$RELAX= 
##$RELAX= 
##$RELAX= 
$$ Bruker specific parameters
$$ --------------------------
##$DU= <F:/spectra>
##$EXPNO= 1
##$NAME= <H-F>
##$PROCNO= 1
##$TYPE= <nmr>
##$USER= <she>
##$AMP= (0..31)
100 100 100 100 100 100 100 100 100 100 100 100 100 100 100 100 100 100 
100 100 100 100 100 100 100 100 100 100 100 100 100 100 
##$AQSEQ= 0
##$AQ_mod= 1
##$AUNM= <au_zg>
##$AUTOPOS= <>
##$BF1= 200.13
##$BF2= 200.13
##$BF3= 200.13
##$BF4= 200.13
##$BF5= 200.13
##$BF6= 200.13
##$BF7= 200.13
##$BF8= 200.13
##$BYTORDA= 1
##$CFDGTYP= 0
##$CFRGTYP= 5
##$CHEMSTR= <none>
##$CNST= (0..31)
1 1 145 1 1 1 1 1 1 1 1 1 1 1 1 1 1 1 1 1 1 1 1 1 1 1 1 1 1 1 1 1 
##$CPDPRG= <>
##$CPDPRG1= <>
##$CPDPRG2= <>
##$CPDPRG3= <>
##$CPDPRG4= <mlev>
##$CPDPRG5= <mlev>
##$CPDPRG6= <mlev>
##$CPDPRG7= <mlev>
##$CPDPRG8= <mlev>
##$CPDPRGB= <>
##$CPDPRGT= <>
##$D= (0..31)
0 1.2 0 0 0 0 0 0 0 0.06 0 0.03 0 0 0 0 0.0002 0 0 0 0 0 0 0 0 0 0 0 0 
0 0 0 
##$DATE= 1647421310
##$DBL= (0..7)
120 120 120 120 120 120 120 120 
##$DBP= (0..7)
150 150 150 150 150 150 150 150 
##$DBP07= 0
##$DBPNAM0= <>
##$DBPNAM1= <>
##$DBPNAM2= <>
##$DBPNAM3= <>
##$DBPNAM4= <>
$$ [...]
##$SUBNAM2= <"">
##$SUBNAM3= <"">
##$SUBNAM4= <"">
##$SUBNAM5= <"">
##$SUBNAM6= <"">
##$SUBNAM7= <"">
##$SUBNAM8= <"">
##$SUBNAM9= <"">
##$SW= 18.0517287032376
##$SWIBOX= (0..15)
0 0 2 0 0 0 0 0 0 0 0 0 0 0 0 0 
##$SW_h= 3612.71676300578
##$TD= 16384
##$TD0= 1
##$TE= 0
##$TE2= 300
##$TE3= 300
##$TEG= 300
##$TL= (0..7)
0 120 120 120 120 120 120 120 
##$TP= (0..7)
150 150 150 150 150 150 150 150 
##$TP07= 0
##$TPNAME0= <>
##$TPNAME1= <>
##$TPNAME2= <>
##$TPNAME3= <>
##$TPNAME4= <>
##$TPNAME5= <>
##$TPNAME6= <>
##$TPNAME7= <>
##$TPOAL= (0..7)
0.5 0.5 0.5 0.5 0.5 0.5 0.5 0.5 
##$TPOFFS= (0..7)
0 0 0 0 0 0 0 0 
##$TUNHIN= 0
##$TUNHOUT= 0
##$TUNXOUT= 0
##$USERA1= <user>
##$USERA2= <user>
##$USERA3= <user>
##$USERA4= <user>
##$USERA5= <user>
##$V9= 5
##$VALIST= <valist>
##$VCLIST= <CCCCCCCCCCCCCCC>
##$VD= 0
##$VDLIST= <DDDDDDDDDDDDDDD>
##$VPLIST= <PPPPPPPPPPPPPPP>
##$VTLIST= <TTTTTTTTTTTTTTT>
##$WBST= 1024
##$WBSW= 4
##$XGAIN= (0..3)
0 0 0 0 
##$XL= 0
##$YL= 0
##$YMAX_a= 480381
##$YMIN_a= -1005393
##$ZGOPTNS= <>
##$ZL1= 120
##$ZL2= 120
##$ZL3= 120
##$ZL4= 120
##$ABSF1= 15.76011
##$ABSF2= -2.291739
##$ABSG= 5
##$ABSL= 3
##$ALPHA= 0
##$AQORDER= 0
##$ASSFAC= 0
##$ASSFACI= 0
##$ASSFACX= 0
##$ASSWID= 0
##$AUNMP= <proc_1d>
##$AZFE= 0.1
##$AZFW= 0.1
##$BCFW= 0
##$BC_mod= 2
##$BYTORDP= 0
##$COROFFS= 0
##$CY= -3
##$DATMOD= 1
##$DC= 0
##$DFILT= <>
##$DTYPP= 0
##$F1P= 0
##$F2P= 0
##$FCOR= 1
##$FTSIZE= 16384
##$FT_mod= 6
##$GAMMA= 0
##$GB= 0
##$INTBC= 1
##$INTSCL= 0
##$ISEN= 128
##$LB= 0.24
##$LEV0= 0
##$LPBIN= 0
##$MAXI= 10000
##$MC2= 0
##$MEAN= 0
##$ME_mod= 0
##$MI= 1.114404
##$NCOEF= 0
##$NC_proc= -5
##$NLEV= 6
##$NOISF1= 3.799351
##$NOISF2= 2.8
##$NSP= 0
##$NTH_PI= 0
##$NZP= 0
##$OFFSET= 15.72485
##$PC= 1
##$PHC0= -16949.04
##$PHC1= 11.00078
##$PH_mod= 1
##$PKNL= yes
##$PPARMOD= 0
##$PSCAL= 0
##$PSIGN= 0
##$REVERSE= no
##$SF= 200.130005342674
##$SI= 16384
##$SIGF1= 3
##$SIGF2= 2
##$SINO= 5.538805
##$SIOLD= 16384
##$SREGLST= <1H.CDCl3>
##$SSB= 0
##$STSI= 16384
##$STSR= 0
##$SW_p= 3612.71676300578
##$SYMM= 0
##$S_DEV= 0
##$TDeff= 16384
##$TDoff= 0
##$TI= <>
##$TILT= no
##$TM1= 0
##$TM2= 0
##$TOPLEV= 0
##$USERP1= <user>
##$USERP2= <user>
##$USERP3= <user>
##$USERP4= <user>
##$USERP5= <user>
##$WDW= 1
##$XDIM= 16384
##$YMAX_p= 358096115
##$YMIN_p= -220332
$$ End of Bruker specific parameters
$$ ---------------------------------
##NTUPLES= NMR SPECTRUM
##VAR_NAME=  FREQUENCY,     SPECTRUM/REAL,   SPECTRUM/IMAG
##SYMBOL=    X,             R,               I
##VAR_TYPE=  INDEPENDENT,   DEPENDENT,       DEPENDENT
##VAR_FORM=  AFFN,          ASDF,            ASDF
##VAR_DIM=   16384,         16384,           16384
##UNITS=     HZ,            ARBITRARY UNITS, ARBITRARY UNITS
##FACTOR=    0.220516191357247, 1,           1
##FIRST=     3147.01425465941, 0,            0
##LAST=      -465.702508346367, 0,           0
##MIN=       -465.702508346367, -220332,     0
##MAX=       3147.01425465941, 358096115,    0
$$ Real data points
##PAGE= N=1
##DATA TABLE= (X++(R..R)), XYDATA
$$ [...]
5686A230544R651M5572J6687l7741n5012j2786j9873k722m1167j1602r3378J6802
$$ 1230544 1240195 1285767 1302454 1264713 1209701 1196915 1177042 1174320 1133153 1121551 1028173 1044975
5674A044975j1489j9733j5443m1509L1917k8045l9941L4869k0773j1980m0452
$$ 1044975 1033486 1013753 998310 956801 988718 960673 920732 955601 934828 922848 882396
5663H82396L0397P5062l6386j0955O92n4299L9053M5487k2317q763q2406o8141
$$ 882396 912793 987855 951469 940514 941206 886907 925960 971447 949130 940367 857961 789820
5651G89820N1973M866J6729L4685k661M3666J2851k7047n905J6453J7050m7831
$$ 789820 841793 846659 863388 898073 895412 939078 951929 924882 918977 935430 952480 904649
5639I04649K703J9574l7245J4464L1532R680k5517N657k2849K059Q214M5347K523
$$ 904649 907352 926926 889681 904145 935677 945357 919840 925497 902648 904707 912921 958268 960791
5626I60791J5245N7076J7924P731n5771L3383P421k1605K7456m834r811K1573
$$ 960791 976036 1033112 1051036 1058767 1002996 1036379 1043800 1022195 1049651 1044817 1035006 1056579
5614A056579O835K9407j9888j0451J2311K0431K9071M3875o7636J564r212j7806
$$ 1056579 1063414 1092821 1072933 1062482 1074793 1095224 1124295 1168170 1100534 1102098 1092886 1075080
5602A075080O2831L5086k2544j7205N0369k5836J3822J3879O7046q369j6833K577
$$ 1075080 1137911 1172997 1150453 1133248 1183617 1157781 1171603 1185482 1252528 1244159 1227326 1229903
5590A229903R335M8430K6834O3964N5696k9066m0956j2452L7149K3587M4629K5074
$$ 1229903 1239238 1287668 1314502 1378466 1434162 1405096 1364140 1351688 1388837 1412424 1457053 1482127
5578A482127K2817R218M4626P3885L7348L118N150R411M7798J3990K2495R75j8945
$$ 1482127 1504944 1514162 1558788 1632673 1670021 1673139 1678289 1687700 1735498 1749488 1771983 1772958 1754013
5565A754013K4904J6197n6891j3643K0752j4643L7464J6797J7281R428k9228K0028
$$ 1754013 1778917 1795114 1738223 1724580 1745332 1730689 1768153 1784950 1802231 1811659 1782431 1802459
5553A802459M8385O0297J1200M4922n758P3464N2775L3941J4532l018j785L8055
$$ 1802459 1850844 1911141 1922341 1967263 1961505 2034969 2087744 2121685 2136217 2133199 2131414 2169469
5541B169469L6486P3341J3835l5063P9512M7842M4816l7935l0738P7557J03606
$$ 2169469 2205955 2279296 2293131 2258068 2337580 2385422 2430238 2392303 2361565 2439122 2542728
5530B542728K4960M6295M4721O8201J4274K0242l6844m2957P61J4865k198j2799
$$ 2542728 2567688 2613983 2658704 2726905 2741179 2761421 2724577 2681620 2682381 2697246 2695048 2682249
5518B682249L3145R997L9927J8122L601l5717k4607O1962P1047k9568O3634O3990
$$ 2682249 2715394 2725391 2765318 2783440 2787041 2751324 2726717 2788679 2859726 2830158 2893792 2957782
5506B957782P4834O5111M3142M5283O3488J8469R1478J03990J10342P2097Q9541
$$ 2957782 3032616 3097727 3140869 3186152 3249640 3268109 3359587 3463577 3573919 3646016 3735557
5495C735557J43032Q7197J50488J30258J54451K0090q3846j16792k8197K501O9432
$$ 3735557 3878589 3965786 4116274 4246532 4400983 4421073 4337227 4220435 4192238 4194739 4264171
5484D264171L8406l664O487Q7140N8701R7428J18109J13877J06896J17108J17601
$$ 4264171 4302577 4298913 4305400 4392540 4451241 4548669 4666778 4780655 4887551 5004659 5122260
5473E122260J90646J16052K03659K59880L17565K79000M05635M21185M10423N27823
$$ 5122260 5312906 5428958 5632617 5892497 6210062 6489062 6894697 7315882 7726305 8254128
5463H254128M50474K14281k21380l86138l34245k02932j31087o2499J4934N9278
$$ 8254128 8704602 8918883 8697503 8311365 7977120 7774188 7643101 7580602 7595536 7654814
5453G654814L7365J39964J90014N5072N6417K01254K11251K54468K46483K69413
$$ 7654814 7692179 7832143 8022157 8077229 8133646 8334900 8546151 8800619 9047102 9316515
5443I316515K65205L38995M40146M68390N41613O37790P53405Q12802R78550J145581
$$ 9316515 9581720 9920715 10360861 10829251 11370864 12008654 12762059 13574861 14553411 15698992
5433A5698992J323366J443495J309518N17730q99117j440608j046892o94354m40385
$$ 15698992 17022358 18465853 19775371 20293101 19393984 17953376 16906484 16212130 15771745
5424A5771745j42116N7445J20464K04158L76180K98538L28196L80788M76257N36581
$$ 15771745 15629629 15687074 15807538 16011696 16387876 16686414 17014610 17395398 17871655 18408236
5414A8408236N81205P44355P71525P76990Q13826J015164J155049J294423J495521
$$ 18408236 18989441 19733796 20505321 21282311 22096137 23111301 24266350 25560773 27056294
5405B7056294J677248J893642K179048K424723K786427L004365L132417K480566
$$ 27056294 28733542 30627184 32806232 35230955 38017382 41021747 44154164 46634730
5397D6634730J428339J435128K158078L020626L795403M468619M938540N323559
$$ 46634730 48063069 49498197 51656275 54676901 58472304 62940923 67879463 73203022
5389G3203022N526250N534003N351072N170131M836753M470293L709532K450584
$$ 73203022 78729272 84263275 89614347 94784478 99621231 104091524 107801056 110251640
5381A10251640N94239j537960l560374m971652n598560n874768n959316n984012
$$ 110251640 110845879 109307919 105747545 100775893 95177333 89302565 83343249 77359237
5373G7359237n939967n896809n552222n090936m491741l924443l478876l373997
$$ 77359237 71419270 65522461 59970239 54879303 50387562 46463119 42984243 39610246
5365C9610246l329639l029764k609383k236870j920679j690635j470149j325068
$$ 39610246 36280607 33250843 30641460 28404590 26483911 24793276 23323127 21998059
5357B1998059j204596j027774r30627q77881p88232p27393o08578n95333n05694
$$ 21998059 20793463 19765689 18835062 17957181 17168949 16441556 15832978 15237645 14731951
5348A4731951n65426m90677l92019l87076l59056m06482l69929l22483k99039
$$ 14731951 14166525 13675848 13283829 12896753 12537697 12131215 11761286 11438803 11139764
5339A1139764l33744k94494l35644l50458k68237k77050j75722k04203k64350
$$ 11139764 10806020 10511526 10175882 9825424 9557187 9280137 9104415 8900212 8635862
5330H635862k22848j86432j51976j84358j94667j72795j75584j90507j07159j16106
$$ 8635862 8413014 8226582 8074606 7890248 7695581 7522786 7347202 7156695 7049536 6933430
5320F933430j90202r2319r8180j35708j04369j37755m3149j06140j26950p4567
$$ 6933430 6743228 6650909 6552729 6417021 6312652 6174897 6131748 6025608 5898658 5824091
5310E824091q7514r2598p1524p1984m2519n4068j24265p1738q6515n1855o8016
$$ 5824091 5736577 5643979 5572455 5500471 5457952 5403884 5279619 5207881 5121366 5069511 5001495
5299E001495m1892j3690k125M6636N42j5499p7513p064n6025j8297q164l0344
$$ 5001495 4959603 4945913 4943788 4990424 4990966 4975467 4897954 4890890 4834865 4816568 4808404 4778060
5287D778060q54j8725o9918m510L7697j1961n1005n3414k8111j2987k455J5370
$$ 4778060 4777206 4758481 4688563 4684053 4721750 4709789 4658784 4605370 4577259 4564272 4561817 4577187
5275D577187l8671l1726l9573K8387m176M3341o9340O716j4654J36175P4178M0024
$$ 4577187 4538516 4506790 4467217 4495604 4491428 4534769 4465429 4472145 4457491 4593666 4667844 4707868
5263D707868R5741J00733K2369O9234P2268N6430L5812O2137K4579P341M9065
$$ 4707868 4803609 4904342 4926711 4995945 5068213 5124643 5160455 5222592 5247171 5254512 5303577
5252E303577K8963M2531m706M8011K8770N9491q71K3506J14659J46347R0861J03021
$$ 5303577 5332540 5375071 5370365 5418376 5447146 5506637 5505766 5529272 5643931 5790278 5881139 5984160
5240E984160P7030O2614J6275R6537J29247J04982J27528J30611J00253J38534
$$ 5984160 6061190 6123804 6140079 6236616 6365863 6470845 6598373 6728984 6829237 6967771
5230F967771R3858J27784J99925K03099J56161J83166J90484J35947J33759J73481
$$ 6967771 7061629 7189413 7389338 7592437 7748598 7931764 8122248 8258195 8391954 8565435
5220H565435J67652J94831J93962J50224J84974K55293K76100L15965L39964L78096
$$ 8565435 8733087 8927918 9121880 9272104 9457078 9712371 9988471 10304436 10644400 11022496
5210A1022496L58581M38831L62673N06305L86659L84702L94320M91169N68993
$$ 11022496 11381077 11819908 12182581 12688886 13075545 13460247 13854567 14345736 14914729
5201A4914729N18720M99915O15784N50556O54887O76957O94143P56478R83874
$$ 14914729 15433449 15933364 16549148 17099704 17754591 18431548 19125691 19882169 20866043
5192B0866043J105933J336084J462788J694382J923892K521103K875147L654746
$$ 20866043 21971976 23308060 24770848 26465230 28389122 30910225 33785372 37440118
5184C7440118M536700N688815O943825Q569604J0089863J2552018J4816877J7780380
$$ 37440118 41976818 47665633 54609458 63179062 73268925 85820943 100637820 118418200
5176A18418200J9950542K0098984J274078k5599077k9468642k2966354j5899033
$$ 118418200 138368742 158467726 159741804 134142727 104674085 81707731 65808698
5169F5808698j0949312p590321n561236m143039l337494k752495k381572j979796
$$ 65808698 54859386 47269065 41707829 37564790 34227296 31474801 29093229 27113433
5161B7113433j719627j425902j251140r09814p02812p30664o98217o30760o36668
$$ 27113433 25393806 23967904 22716764 21806950 21104138 20373474 19675257 19044497 18407829
5152A8407829m39780l12087k62705j87084j06340q5197m9569j4499k3837L8213
$$ 18407829 17968049 17655962 17393257 17206173 17099833 17014636 16965067 16950568 16926731 16964944
5142A6964944N3840J74167K79634K44757L26150M22643N04250O10915P89857R00434
$$ 16964944 17018784 17192951 17472585 17717342 18043492 18466135 18970385 19581300 20371157 21271591
5132B1271591J071235J215745J256500J457924J501985J365605J163480R24686
$$ 21271591 22342826 23558571 24815071 26272995 27774980 29140585 30304065 31228751
5124C1228751L96697k1265k75254l86838m38492l72300l31602m05222m52468n41639
$$ 31228751 31625448 31604183 31328929 30942091 30503599 30131299 29799697 29394475 28942007 28400368
5114B8400368n84739n84018l86113j73393q6505J53699M26560O17178Q58681J108850
$$ 28400368 27815629 27231611 26845498 26672105 26585600 26739299 27165859 27783037 28641718 29750568
5104B9750568J427658J708016J964393K191410K410238K501058K386358K173936
$$ 29750568 31178226 32886242 34850635 37042045 39452283 41953341 44339699 46513635
5096D6513635J554498Q18862K37668j0046j8964L3085J12745P6044k70321q20194
$$ 46513635 48068133 48886995 49124663 49114617 49095653 49128738 49241483 49317527 49047206 48227012
5086D8227012j655739k365578k759129k854610k620191k303744j913760j534920
$$ 48227012 46571273 44205695 41446566 38591956 35971765 33668021 31754261 30219341
5078C0219341j212305p99031n20677l14498r3335J43856L50560N41667O27717
$$ 30219341 29007036 28208005 27687328 27372830 27279495 27423351 27773911 28315578 28943295
5069B8943295O69213N71141N47923L38060K52427K26924K90352K59720K06384
$$ 28943295 29612508 30183649 30731572 31069632 31322059 31548983 31839335 32099055 32305439
5060C2305439l4168m23173r89414j653746j956660k158071k143162j918424j730081
$$ 32305439 32271271 31848098 30858684 29204938 27248278 25090207 22947045 21028621 19298540
5051A9298540j508410j376756j149538r69595q96339p35622p08825o48259n08663
$$ 19298540 17790130 16413374 15263836 14294241 13397902 12662280 11953455 11305196 10796533
5042A0796533m61510m27891l77711l54653l66923l15662k33379k22957k78493
$$ 10796533 10335023 9907132 9529421 9174768 8807845 8492183 8258804 8035847 7757354
5033G757354j99735j39584k20230k26303j03309j96936j18643j14258j50100j39361
$$ 7757354 7557619 7418035 7197805 6971502 6868193 6671257 6552614 6438356 6288256 6148895
5023F148895j19862q2271r3005q2546r7251j14497j25850j46505j22858r8412
$$ 6148895 6029033 5946762 5853757 5771211 5673960 5559463 5433613 5287108 5164250 5065838
5013E065838p0054m4465j54021q9163p9913o8283K1246l8676q3513K811K2522
$$ 5065838 4995784 4951319 4797298 4708135 4628222 4559939 4581185 4542509 4458996 4461807 4484329
5002D484329P3629m369j4014n0837k5379n920k050j2502K3357L2451M67k8312
$$ 4484329 4557958 4553589 4539575 4488738 4463359 4457439 4455389 4442887 4466244 4498695 4499162 4470850
4990D470850k7286l4082J5694m811j3100N7692K9772l0809L6745M3033L141J6202
$$ 4470850 4443564 4409482 4425176 4420365 4407265 4464957 4494729 4463920 4500665 4543698 4546839 4563041
4978D563041N8154N5386K8967Q4748Q6222P1546M6133R0544Q4249M9626Q9231
$$ 4563041 4621195 4676581 4705548 4790296 4876518 4948064 4994197 5084741 5168990 5218616 5307847
4967E307847L0272P3015J11874P6348R6874R7091R0132N8626O4734J61472J06443
$$ 5307847 5338119 5411134 5523008 5599356 5696230 5793321 5883453 5942079 6006813 6168285 6274728
4956F274728J21949J64668J63841J33558J23160J80012J46923J76308J74460K11732
$$ 6274728 6396677 6561345 6725186 6858744 6981904 7161916 7308839 7485147 7659607 7871339
4946G871339J98622K32731K15546K59076K78375K62570K92947L03067K43414L65001
$$ 7871339 8069961 8302692 8518238 8777314 9055689 9318259 9611206 9914273 10157687 10522688
4936A0522688M21606L82334M08234M85367O30801O24778O74941P98489R24108
$$ 10522688 10944294 11326628 11734862 12220229 12851030 13475808 14150749 14949238 15873346
4927A5873346J014251J136139J338433J507867J617139J812582J916165K007731
$$ 15873346 16887597 18023736 19362169 20870036 22487175 24299757 26215922 28223653
4919B8223653K040904J884731J579172J096978M58084j15136n71107p04641p81724
$$ 28223653 30264557 32149288 33728460 34825438 35283522 35168386 34597279 33892638 33110914
4910C3110914o42620n96096n12241n18965n80351n53458n13413m19241k62377
$$ 33110914 32468294 31872198 31359957 30840992 30260641 29707183 29193770 28774529 28512152
4901B8512152N3724K67221M58932P40502J075091J296074J616787J875935K113686
$$ 28512152 28565876 28833097 29292029 30032531 31107622 32403696 34020483 35896418 38010104
4892C8010104K215225K171891K019071J655555J034560M08938j22046m23106n63620
$$ 38010104 40225329 42397220 44416291 46071846 47106406 47515344 47393298 46970192 46406572
4883D6406572n67858n15614n70398p14396r95945j431696j855472k147768k392769
$$ 46406572 45838714 45323100 44752702 44038306 43042361 41610665 39755193 37607425 35214656
4874C5214656k345972k163747j850578j507911j227954r87594o97704m79538k88658
$$ 35214656 32868684 30704937 28854359 27346448 26118494 25130900 24433196 23953658 23665000
4865B3665000r6736K4097K10831L61931L96614M40278M46865L80483L73220L23450
$$ 23665000 23568264 23592361 23803192 24165123 24561737 25002015 25448880 25829363 26202583 26526033
4855B6526033L01671K54565Q3762k17748n50032j013586j382455j711223j799134
$$ 26526033 26827704 27082269 27166031 26948283 26398251 25384665 24002210 22290987 20491853
4846B0491853j700887j533715j355219j161080r02000q16018o99938n78316n73614
$$ 20491853 18790966 17257251 15902032 14740952 13838952 13022934 12322996 11744680 11171066
4837A1171066n04847m23232m15928l51473l23315k60198k73819j98860k54127
$$ 11171066 10666219 10242987 9827059 9475586 9152271 8892073 8618254 8419394 8165267
4828H165267j78487j13173k41676j54780j28730r9827p2429j21578r4493p6366
$$ 8165267 7986780 7873607 7631931 7477151 7348421 7248594 7176165 7054587 6960094 6883728
4818F883728o9063q6573p6288n5191l1402n1638p2147j5858O968l0499r2139j4081
$$ 6883728 6814665 6728092 6651804 6596613 6565211 6513573 6441426 6425568 6432536 6402037 6309898 6295817
4806F295817n6351n5843p659q33j0899M8263m79M1245M6150P4833R9636P6467
$$ 6295817 6239466 6183623 6175964 6175131 6164232 6212495 6212016 6253261 6299411 6374244 6473880 6550347
4794F550347N7182R2403P6726N4084O0593O5595J24038J37232J05569J18383J14197
$$ 6550347 6607529 6699932 6776658 6830742 6891335 6956930 7080968 7218200 7323769 7442152 7556349
4783G556349J32116J31822J52908J94478J67060K58133L19386L68093M46691M46714
$$ 7556349 7688465 7820287 7973195 8167673 8334733 8592866 8912252 9280345 9727036 10173750
4773A0173750N68123P74688R37400J127506J397373J693425K091157K527271L079604
$$ 10173750 10741873 11516561 12453961 13581467 14978840 16672265 18763422 21290693 24370297
4764B4370297L742046M228770L371428O40943j744348m198851n361321m420491
$$ 24370297 28112343 32341113 35712541 36353484 34609136 30410285 25048964 20628473
4756B0628473l154590k080047j484635j043699q11885o81664n93533m64843m14314
$$ 20628473 17473883 15393836 13909201 12865502 12053617 11371953 10778420 10313577 9899263
4747I899263k69958k78027k05854j26345r8538q7201j44225m4509j4611L251J1729
$$ 9899263 9629305 9351278 9145424 9019079 8920541 8833340 8689115 8644606 8629995 8633246 8644975
4736H644975M3221N4896M8838N8460K5619J00797J17628Q7168J12095J22611J50114
$$ 8644975 8688196 8743092 8791930 8850390 8876009 8976806 9094434 9181602 9293697 9416308 9566422
4725I566422J56336K88701L21798L00125M12036M33496N58846O92134Q43729J035634
$$ 9566422 9722758 10011459 10333257 10633382 11045418 11478914 12037760 12729894 13573623 14609257
4715A4609257J280503J530703J884517K396590K823452L399936L893191L763416
$$ 14609257 15889760 17420463 19304980 21701570 24525022 27924958 31818149 35581565
4707C5581565J379616p11271j339322l264000m822049m169853k947389k035690
$$ 35581565 36961181 36249910 34910588 31646588 26824539 22654686 19707297 17671607
4699A7671607j467164j028212p52404o72139n23715l73017l32443k26251j89676
$$ 17671607 16204443 15176231 14423827 13751688 13227973 12854956 12522513 12296262 12106586
4690A2106586j20164j14291r4885l7279m0592k0759n8322J7126L5860N7376P3201
$$ 12106586 11986422 11872131 11777246 11739967 11699375 11678616 11620294 11637420 11673280 11730656 11803857
4679A1803857Q5836R9164J9786N8478J39094J32975K01211J96763J61995J96470
$$ 11803857 11889693 11988857 12008643 12067121 12206215 12339190 12540401 12737164 12899159 13095629
4669A3095629K30398K77377K25117L32545L34447L08334L23835L84625M53810
$$ 13095629 13326027 13603404 13828521 14161066 14495513 14803847 15127682 15512307 15966117
4660A5966117N18413N33037N87656P59514P23450P96424Q61804R69971J025089
$$ 15966117 16484530 17017567 17605223 18364737 19088187 19884611 20746415 21716386 22741475
4651B2741475J084007J060953J100043J030381Q34037Q18699P59131O54487N99326
$$ 22741475 23825482 24886435 25986478 27016859 27850896 28669595 29428726 30083213 30682539
4642C0682539N89103N95171N48723N08740M52139M23115L15199M49588M99657
$$ 30682539 31271642 31866813 32415536 32924276 33376415 33799530 34114729 34564317 35063974
4633C5063974N99190P88233R44888J143341J259676J389926J594708J698338J755190
$$ 35063974 35663164 36451397 37396285 38539626 39799302 41189228 42783936 44482274 46237464
4624D6237464J770009J830072J986900K148316K346194K512945K575120K504203
$$ 46237464 48007473 49837545 51824445 53972761 56318955 58831900 61407020 63911223
4616F3911223K167910J481771M44663r13849k222657l098723l283286k999273
$$ 63911223 66079133 67560904 68005567 67091718 64869061 61770338 58487052 55487779
4608E5487779k460988j837332j217526o50792j61285K87163O82017J054924J437473
$$ 55487779 53026791 51189459 49971933 49321141 49159856 49447019 50129036 51183960 52621433
4599E2621433J784660K014644K161706K105449J797975J178371N01577k98219
$$ 52621433 54406093 56420737 58582443 60687892 62485867 63664238 64165815 63867596
4591F3867596j120999j801655k455813k845252l062494l150673k994346k661145
$$ 63867596 62746597 60944942 58489129 55643877 52581383 49430710 46436364 43775219
4583D3775219k373549k058002j717804j482082j239365j136728r05535o76831
$$ 43775219 41401670 39343668 37625864 36143782 34904417 33767689 32862154 32185323
4575C2185323n67346m54830l10399j91661r4069M2932J47701K13818L23333M16244
$$ 32185323 31617977 31163147 30852748 30661087 30567018 30609950 30757651 30971469 31294802 31711046
4565C1711046N99854Q10493Q72844R82109J170298J331735J481470J624330J759726
$$ 31711046 32310900 33121393 33994237 34976346 36146644 37478379 38959849 40584179 42343905
4556D2343905J864805J921627J931921J930975J866171J781060J652010J323689
$$ 42343905 44208710 46130337 48062258 49993233 51859404 53640464 55292474 56616163
4548E6616163J067426O82716M62156P3062k35081m59498p12381q40436q53343
$$ 56616163 57683589 58366305 58828461 58901523 58666442 58206944 57494563 56654127 55800784
4539E5800784p33257o36523n46281k85827q1027J81703L79953N03448N83504O52688
$$ 55800784 55067527 54431004 53884723 53598896 53517869 53699572 54079525 54582973 55166477 55819165
4529E5819165P04908O66678P09938O31045L74424M2452l06725o95440j088989
$$ 55819165 56524073 57190751 57900689 58531734 58906158 58948610 58641885 57946445 56857456
4520E6857456j236774j343672j460108j530252j592769j567100j640526j652614
$$ 56857456 55620682 54277010 52816902 51286650 49693881 48126781 46486255 44833641
4512D4833641j585858j516969j454466j272174j090214j045289r69069q30680
$$ 44833641 43247783 41730814 40276348 39004174 37913960 36868671 35899602 35068922
4504C5068922p71560o90800o35470n76238n56342n43133n39429n42370n40103
$$ 35068922 34297362 33606562 32971092 32394854 31838512 31295379 30755950 30213580 29673477
4495B9673477n76142n28406n24330n78477o39176o21125o52546p21223p34708
$$ 29673477 29097335 28568929 28044599 27466122 26826946 26205821 25553275 24832052 24097344
4486B4097344p60383p31332p20605o33180o04065n46528n07472n07224l74600
$$ 24097344 23336961 22605629 21885024 21251844 20647779 20101251 19593779 19086555 18711955
4477A8711955l44757l43705l00259k50223k04825j01622j39956r4280m2466n0927
$$ 18711955 18367198 18023493 17723234 17473011 17268186 17166564 17026608 16932328 16889862 16838935
4467A6838935o3413p6060k1322J7965J9926N7990J38668N7332J45695K20234J40267
$$ 16838935 16775522 16699462 16678140 16696105 16716031 16774021 16912689 16970021 17115716 17335950 17476217
4456A7476217K62497K66390L01409L42235K82955L64178L99283M26485N16096
$$ 17476217 17738714 18005104 18306513 18648748 18931703 19295881 19695164 20121649 20637745
4447B0637745N08293M30523J72869K01802K73590L27176N18087N24531N89993
$$ 20637745 21146038 21576561 21749430 21951232 22224822 22551998 23070085 23594616 24184609
4438B4184609O58137P34814P20526P84963P56055Q36437Q40026R45425J043858
$$ 24184609 24842746 25577560 26298086 27083049 27839104 28675541 29515567 30460992 31504850
4429C1504850J063856J184098J336739J401853J487218J638641J830117K085073
$$ 31504850 32568706 33752804 35089543 36491396 37978614 39617255 41447372 43532445
4421D3532445K328593K612115L078842L493821L973752M501079N226311O128092
$$ 43532445 45861038 48473153 51551995 55045816 59019568 63520647 68746958 74875050
4413G4875050P244844Q511178J0071679J1838705J3757759J5829836J7852821
$$ 74875050 82119894 90631072 100702751 112541456 126299215 142129051 159981872
4406A59981872J9376291J9642064J7586155J0981650j089381j4739742k3379119
$$ 159981872 179358163 199000227 216586382 227568032 226478651 211738909 188359790
4399A88359790k5139942k2684076j8851514j5224495j2129328r698569p882310
$$ 188359790 163219848 140535772 121684258 106459763 94330435 84631866 76749556
4392G6749556o558340n618763m894274m425868l958058l525722l209455k816159
$$ 76749556 70191216 64572453 59678179 55252311 51294253 47768531 44559076 41742917
4384D1742917k555875k285579k090962j952054j677181j544755j429711j197364
$$ 41742917 39187042 36901463 34810501 32858447 31181266 29636511 28206800 27009436
4376B7009436j027257j060215r77621r00030q44972q20122p84740p11644o72545
$$ 27009436 25982179 24921964 23944343 23044313 22199341 21379219 20594479 19882835 19210290
4367A9210290o90486n75614o04291n79073n73009n13099n30353m55380m32170
$$ 19210290 18519804 17944190 17339899 16760826 16187817 15674718 15144365 14688985 14256815
4358A4256815l94517l85662l56807l53310l21827k23355k17243j70321k28053
$$ 14256815 13862298 13476636 13119829 12766519 12444692 12221337 12004094 11833773 11605720
4349A1605720k41789k13414j85028k40019k34173k46794k34665j84859j80050
$$ 11605720 11363931 11150517 10965489 10725470 10491297 10244503 10009838 9824979 9644929
4340I644929j68126j88508j73817j87488j30949j43318j73861q5449o1971q7501
$$ 9644929 9476803 9288295 9114478 8926990 8796041 8652723 8478862 8393413 8331442 8243941
4330H243941j45839j82607j88724j52888j50298j36743j18138j45980j12107j00771
$$ 8243941 8098102 7915495 7726771 7573883 7423585 7286842 7168704 7022724 6910617 6809846
4320F809846j47427j14479r4898j09661q822j6650p4522j1263l4912j4802m6522
$$ 6809846 6662419 6547940 6453042 6343381 6334559 6317909 6243387 6232124 6197212 6182410 6135888
4309F135888k6733m7672j40675q5178q9004j23165j1108o4997j16371j46942k8853
$$ 6135888 6109155 6061483 5920808 5835630 5746626 5623461 5612353 5547356 5430985 5284043 5255190
4298E255190m6768r1195q978m3030q4103k1218n1948n2018m8137j5027K0985n9757
$$ 5255190 5208422 5117227 5108249 5065219 4981116 4959898 4907950 4855932 4807795 4792768 4813753 4753996
4286D753996N078o3180r937L1309l5311n1190M2208M1765j2802p6629p7548n9815
$$ 4753996 4759074 4695894 4685957 4717266 4681955 4630765 4672973 4714738 4701936 4625307 4547759 4487944
4274D487944q1466m8878p3186l6105J5710n9274K791J2925o0780l0929O887l5618
$$ 4487944 4406478 4357600 4284414 4248309 4264019 4204745 4207536 4220461 4159681 4128752 4135639 4100021
4262D100021p9990k7481l308n0377j3127n269K1181j7370k5744o2236n7861r982
$$ 4100021 4020031 3992550 3989242 3938865 3925738 3920469 3941650 3924280 3898536 3836300 3778439 3768457
4250C768457k6122n3266q3879L9984j6935j2168m9917p195l6525q3386J3448L7505
$$ 3768457 3742335 3689069 3605190 3645174 3628239 3616071 3566154 3558959 3522434 3439048 3452496 3490001
4238C490001J465o020P78K4301L1732L5373K9678J10985O188o060M5297n25K2494
$$ 3490001 3491466 3485446 3486224 3510525 3542257 3577630 3607308 3718293 3724481 3718421 3763718 3763193 3785687
4225C785687L4796l0731k9996L9616k0503l3109M913l2883k3869L0225l1010M693
$$ 3785687 3820483 3789752 3759756 3799372 3778869 3745760 3750673 3717790 3693921 3724146 3693136 3697829
4213C697829L8739n1273N1612P52P539L5557J6382M2462J7225M4288O5968L0967
$$ 3697829 3736568 3685295 3736907 3737659 3745198 3780755 3797137 3839599 3856824 3901112 3967080 3998047
4201C998047N1602Q9493N1217P9153M5047r282j7045j23318p0458l5837n0466
$$ 3998047 4049649 4139142 4190359 4269512 4314559 4305277 4288232 4164914 4094456 4058619 4008153
4190D008153m2528q7862k4699M2978m952o4464o587K4780O8724M9777K0146L3514
$$ 4008153 3965625 3877763 3853064 3896042 3891090 3826626 3820039 3844819 3913543 3963320 3983466 4016980
4178D016980k9849J0291M9438L0370N4596n005P2879R3939N3972O7568O7459N1200
$$ 4016980 3987131 3997422 4046860 4077230 4131826 4126821 4199700 4293639 4347611 4415179 4482638 4533838
4166D533838R289m668l458p581L7611N3504Q1346O1008Q1165p045L7576K0344
$$ 4533838 4543127 4538459 4535001 4527420 4565031 4618535 4699881 4760889 4842054 4835009 4872585 4892929
4154D892929k1504m3515l0070j76590q2075m0304r8389r3452n9266k7330p235
$$ 4892929 4871425 4827910 4797840 4621250 4539175 4498871 4400482 4307030 4247764 4220434 4213199
4143D213199o8859j41373j00234j35401j6692J6343r4127l6391R443m6865Q745
$$ 4213199 4144340 4002967 3902733 3767332 3750640 3766983 3672856 3636465 3645908 3599043 3607788
4132C607788Q914J4730R759j1779J3354K2587L5342j7519P5866Q701J2800J06128
$$ 3607788 3616702 3631432 3641191 3629412 3642766 3665353 3700695 3683176 3759042 3767743 3780543 3886671
4120C886671O898L3939J7711L0877P3586L1089O3511R5838R1272J95730J36758
$$ 3886671 3893569 3927508 3945219 3976096 4049682 4080771 4144282 4240120 4331392 4527122 4663880
4109D663880J62601J78474J56779L00055K62821K45129K61823J77123J36865N2981
$$ 4663880 4826481 5004955 5161734 5461789 5724610 5969739 6231562 6408685 6545550 6598531
4099F598531o0245j33258k47130k14653k41014k12029j29196j41781l2275q1745
$$ 6598531 6538286 6405028 6157898 5943245 5702231 5490202 5361006 5219225 5186950 5105205
4089E105205p179m441l5422j7188L8227M2869O2275Q5145R4022J2914M5960P0270
$$ 5105205 5098026 5093585 5058163 5040975 5079202 5122071 5184346 5269491 5363513 5376427 5422387 5492657
4077E492657R1248Q7020J17211R6364J03535J54343J65697J60117K48295J83045
$$ 5492657 5583905 5670925 5788136 5884500 5988035 6142378 6308075 6468192 6716487 6899532
4067F899532J82847K85264K07909K77750K80936K73484L38141L31409M14579L83500
$$ 6899532 7082379 7367643 7575552 7853302 8134238 8407722 8745863 9077272 9491851 9875351
4057I875351M16975N01313N13679N19427N30482N81053N73280M37131M86928M78720
$$ 9875351 10292326 10793639 11307318 11826745 12357227 12938280 13511560 13948691 14435619 14914339
4047A4914339M62509M90601N08166N90850N95170P76099P44677Q30737Q40966
$$ 14914339 15376848 15867449 16375615 16966465 17561635 18337734 19082411 19913148 20754114
4038B0754114Q13710P06901N49680M35717K14747J64773J44079J60587J95461
$$ 20754114 21567824 22274725 22824405 23260122 23474869 23639642 23783721 23944308 24139769
4029B4139769K54110L78024N36633N95638N54216N20269L20711K19287r0095l56018
$$ 24139769 24393879 24771903 25308536 25904174 26458390 26978659 27299370 27518657 27428562 27072544
4019B7072544n44031o23279o31961o25454m94998l37125k38741k11135j03456
$$ 27072544 26528513 25905234 25273273 24647819 24152821 23815696 23576955 23365820 23262364
4010B3262364j72127k67774l33545o22321p10457p94381r32170r41022r29475
$$ 23262364 23090237 22822463 22488918 21866597 21156140 20361759 19429589 18488567 17559092
4001A7559092q05819p00909o25899n62746m97133n26171m68224m21931m67784
$$ 17559092 16753273 16052364 15426465 14863719 14366586 13840415 13372191 12950260 12482476
3992A2482476n27591o05222o01127n91964n88434n46784m90144m05002m17560
$$ 12482476 11954885 11349663 10748536 10156572 9568138 9021354 8531210 8126208 7708648
3983G708648l51388k96029l09601k94809k64840k36257k27927k57442k02466k63619
$$ 7708648 7357260 7061231 6751630 6456821 6191981 5955724 5727797 5470355 5267889 5004270
3973E004270k17902k14935k09339j45846j50086j76568j42648j10875r3383j36144
$$ 5004270 4786368 4571433 4362094 4216248 4066162 3889594 3746946 3636071 3542688 3406544
3963C406544j38404o6212j08529j08285o9509j03895q5614n1975r7613p0414n2234
$$ 3406544 3268140 3201928 3093399 2985114 2915605 2811710 2726096 2674121 2576508 2506094 2453860
3952B453860l9214q857n287m9996l873j40098j29772p4890k1125j6284r4232p9006
$$ 2453860 2414646 2405789 2400502 2350506 2346633 2206535 2076763 2001873 1980748 1964464 1870232 1791226
3940A791226j9015l6975k5150n538k2611q4492o7174k540m9407j5699K669m1211
$$ 1791226 1772211 1735236 1710086 1704548 1681937 1597445 1530271 1527731 1478324 1462625 1465294 1424083
3928A424083l9028j6341l7633k5353m5094q354P499n7390J6980j2308r608j9254
$$ 1424083 1385055 1368714 1331081 1305728 1260634 1252280 1259779 1202389 1219369 1207061 1197453 1178199
3916A178199L6895l2440n4807j0160n560m2011m9574j30j7256m2036M488L6372
$$ 1178199 1215094 1182654 1127847 1117687 1112127 1070116 1020542 1020412 1003156 961120 965608 1001980
3904A001980l3368r460l3883j3778k4901l4598L8568L1642j0723l6244k4718l2260
$$ 1001980 968612 959152 925269 911491 886590 851992 890560 922202 911479 875235 850517 818257
3892H18257j8552q486K081j3441K2379j4481p3248N451L0865l3992l3368K4809
$$ 818257 799705 791219 793300 779859 802238 787757 714509 719960 750825 716833 683465 708274
3880G08274k7210m3772q317J0066J0323M516l5968k374K0029l9338J0391K811
$$ 708274 681064 637292 628975 639041 649364 653880 617912 615538 635567 596229 606620 609431
3868F09431l7787m6686j4618l206k4770j919O752P2501j0633N014K5262l1819
$$ 609431 571644 524958 510340 507134 482364 480445 487197 559698 549065 554079 579341 547522
3856E47522J482l0223k9300J1871j2893N1847K6109p5369J600o650m1488M0560
$$ 547522 549004 518781 489481 501352 488459 540306 566415 491046 492646 485996 444508 485068
3844D85068M5359o9940k3297k0218J9234M4481o0293k6016N822K5546k9931J2828
$$ 485068 530427 460487 437190 416972 436206 480687 420394 394378 400200 425746 395815 408643
3832D08643M4057J3573n7828M9260m155k777l2025P726k3953N972K0028l7482
$$ 408643 452700 466273 408445 457705 453550 450773 418748 426474 402521 408493 428521 391039
3820C91039N8194L5534L5965k01k4630o863k6210P2258j1472j3705n682K1939
$$ 391039 449233 484767 520732 520531 495901 489038 462828 535086 523614 509909 504227 526166
3808E26166l3491l8883L0047n7959J6220j7684K3055M2568n3401q129J202J908
$$ 526166 492675 453792 483839 425880 442100 424416 447471 490039 436638 428509 429711 431619
3796D31619o8434l0715m3729M6526N5438p152j1577k1950J6524l0016l0560P186
$$ 431619 363185 332470 288741 335267 390705 383553 371976 350026 366550 336534 305974 313160
3784C13160l0516K7486O5390O940o283l4225l916J1057Q8944m8388n8631O433
$$ 313160 282644 310130 375520 382460 376177 341952 338036 349093 438037 389649 331018 337451
3772C37451K2660L243j8518L671O998j8969k9749K6861P482K6795j2387o2832
$$ 337451 360111 363354 344836 348507 355505 336536 306787 333648 341130 367925 355538 292706
3760B92706J9472J9509j1023j6600J7460j1744K6498m440L4747n9626M2285K9354
$$ 292706 312178 331687 320664 304064 321524 309780 336278 331838 366585 306959 349244 378598
3748C78598l1964l6880R4731j4698l212J6154o560p3829j0722P8808L0665Q1142
$$ 378598 346634 309754 404485 389787 386575 402729 396169 322340 311618 390426 421091 502233
3736E02233k2226m6114k8252r326L7651r043L9243k0939q490J8335o0344K4644
$$ 502233 480007 433893 405641 396315 433966 424923 464166 443227 434737 453072 392728 417372
3724D17372N7367J7493m7692l9962K503m8515L6540R894r903L8434J8167m2672
$$ 417372 474739 492232 444540 404578 407081 358566 395106 405000 395097 433531 451698 409026
3712D09026Q408L0732k5446j0053j2063J9013J6760r771r282J5406j3318j372
$$ 409026 417434 448166 422720 412667 400604 419617 436377 426606 417324 432730 419412 418040
3700D18040o0214J363L4437O4464o871N618K580m3660j1361Q013J2718N106L190
$$ 418040 357826 359189 393626 458090 451219 456837 459417 415757 404396 412409 425127 430233 433423
3687D33423K5889j3636m6202O573r209L1702K0057k1536m555J3723K5014j4298
$$ 433423 459312 445676 399474 406047 396838 428540 448597 427061 422506 436229 461243 446945
3675D46945K2186p5669K8027K2644K2095J307K3953K3854p595k5215N988o743
$$ 446945 469131 393462 421489 444133 466228 467535 491488 515342 507747 482532 488520 481777
3663D81777J5626j6858J653q609M7627k4301O1066q710q461N23j8230L3358M7862
$$ 481777 497403 480545 482198 473589 521216 496915 557981 549271 540810 541333 523103 556461 604323
3650F04323J7431k9945K1355m546j1198k1140K6309P427k3376Q890L2645N025
$$ 604323 621754 591809 613164 608618 597420 576280 602589 610016 586640 595530 628175 633200
3638F33200j9355K0040L7362K1907K4676m0601M41K5764P5900p787K0463M0616
$$ 633200 613845 633885 671247 693154 717830 677229 677670 703434 779334 771547 792010 832626
3626H32626n8431k3038L0700J3356J8207l169K0161j9029L77K2045j062k9389
$$ 832626 774195 751157 781857 795213 813420 810251 830412 811383 811760 833805 832743 803354
3614H03354L9404K9331K9220K5960K0688P675J5236J1214L7932R524M9242M2828
$$ 803354 842758 872089 901309 927269 947957 955632 970868 982082 1020014 1029538 1078780 1121608
3602A121608O7370Q6244l5202l9994M7566N9121r20k0509J318J8826L5827j37
$$ 1121608 1188978 1275222 1240020 1200026 1247592 1306713 1305793 1285284 1286602 1305428 1341255 1341118
3590A341118J1570P870j9670K388q124L4961P096j8088M1554J5929n5048j3861
$$ 1341118 1352688 1360558 1340888 1343276 1335152 1370113 1377209 1359121 1400675 1416604 1361556 1347695
3578A347695M7160k3616k7191j6448o2957r253M3506J5952j2832m1598r607j382
$$ 1347695 1394855 1371239 1344048 1327600 1264643 1255390 1298896 1314848 1302016 1260418 1250811 1249429
3566A249429J0208j8023K0585K2184k3913j8359L6727k1089n7623M6833L3849
$$ 1249429 1259637 1241614 1262199 1284383 1260470 1242111 1278838 1257749 1200126 1246959 1280808
3555A280808L5443l1132M0206j1542M720K0769M0253L749M0855L1660P100k0670
$$ 1280808 1316251 1285119 1325325 1313783 1318503 1339272 1379525 1383274 1424129 1455789 1462889 1442219
3543A442219l2592M2781L4149Q4127L0131J4826l5230N2385N4036O1657J5211
$$ 1442219 1409627 1452408 1486557 1570684 1600815 1615641 1580411 1632796 1686832 1748489 1763700
3532A763700P1259L4439P2481N7722j6516L1243J0222M4727N2234N7399m0576
$$ 1763700 1834959 1869398 1941879 1999601 1983085 2014328 2024550 2069277 2121511 2178910 2138334
3521B138334O1879J6228j9452j4442M6719K470R389M7212R435J9094k721L4046
$$ 2138334 2200213 2216441 2196989 2182547 2229266 2231736 2241125 2288337 2297772 2316866 2314145 2348191
3509B348191R72l8629N226P9477n9753M9562P3430m6309j1200l3384k354J8820
$$ 2348191 2349163 2310534 2315760 2395237 2335484 2385046 2458476 2412167 2400967 2367583 2365229 2384049
3497B384049J3838m5942L85Q3295N1478n5181O386K3515P3666O025L6181L1075
$$ 2384049 2397887 2351945 2352330 2435625 2487103 2431922 2438308 2461823 2535489 2541514 2577695 2608770
3485B608770l875P1303N2380R4759R43J3385P8163Q0267J7007N6613P9078M0773
$$ 2608770 2604895 2676198 2728578 2823337 2824280 2837665 2915828 2996095 3013102 3069715 3148793 3189566
3473C189566N8600P4606Q6350N5433P178R741j6801N8443M0171o850M903k3067
$$ 3189566 3248166 3322772 3409122 3464555 3471733 3481474 3464673 3523116 3563287 3556437 3561340 3538273
3461C538273m5697N6742Q9634K1751N4647N532K656Q9338R824M929K3235K9183
$$ 3538273 3492576 3549318 3638952 3660703 3715350 3720882 3723538 3812876 3822700 3827629 3850864 3880047
3449C880047K6968M1844L3823M3209L3718J6521J01318M6890o763N0806O2694
$$ 3880047 3907015 3948859 3982682 4025891 4059609 4076130 4177448 4224338 4217575 4268381 4331075
3438D331075L2451M8507O8747J1213M7463P8988P800R2533N8086N4073P1632N2152
$$ 4331075 4363526 4412033 4480780 4491993 4539456 4618444 4626244 4718777 4776863 4830936 4902568 4954720
3426D954720L0665O3338Q2374P7489J2038Q7793J08528J08565J16338J42062P3264
$$ 4954720 4985385 5048723 5131097 5208586 5220624 5308417 5416945 5525510 5641848 5783910 5857174
3415E857174O6271J20667J14916J22283J59608J48218O2899J24159J10158J05656
$$ 5857174 5923445 6044112 6159028 6281311 6440919 6589137 6652036 6776195 6886353 6992009
3405F992009J52707J32815J64169J16629Q2409J46567J21341J22158J37121J74579
$$ 6992009 7144716 7277531 7441700 7558329 7640738 7787305 7908646 8030804 8167925 8342504
3395H342504J06294J13032J02332J11876J31248J11933M8039R3505R2759P2156
$$ 8342504 8448798 8561830 8664162 8776038 8907286 9019219 9067258 9160763 9253522 9325678
3385I325678M1843R0441M1017l9382J08165J5184j7197P9520P0503M6166J02081
$$ 9325678 9367521 9457962 9498979 9459597 9567762 9582946 9565749 9645269 9715772 9761938 9864019
3374I864019R0239J2471M893O2989N5241J1774P0695Q1161P7901L3275O4953J34888
$$ 9864019 9954258 9966729 9971622 10034611 10089852 10101626 10172321 10253482 10331383 10364658 10429611 10564499
3362A0564499J44845J21456J65762J48693J61241K18331J84714J72830K79745
$$ 10564499 10709344 10830800 10996562 11145255 11306496 11524827 11709541 11882371 12162116
3353A2162116K51738K04988K47291K59715L22386L34128L50626L96044L64073
$$ 12162116 12413854 12618842 12866133 13125848 13448234 13782362 14132988 14529032 14893105
3344A4893105L30943M24005L77222M53803M67572N16548M91055N37538O10545
$$ 14893105 15224048 15648053 16025275 16479078 16946650 17463198 17954253 18491791 19102336
3335A9102336O32151O29741O67571P24941P87765Q47437Q35560R51447J096347
$$ 19102336 19734487 20364228 21031799 21756740 22544505 23391942 24227502 25178949 26275296
3326B6275296J134521J278659J354935J540745J727960J903145K140320K355770
$$ 26275296 27409817 28688476 30043411 31584156 33312116 35215261 37355581 39711351
3318C9711351K572902K738019L005234L212200L301683L321213L275355L075535
$$ 39711351 42284253 45022272 48027506 51239706 54541389 57862602 61137957 64213492
3310F4213492K751195K352408J754680J266012Q73029M21527K18657J07622J11716
$$ 64213492 66964687 69317095 71071775 72337787 73210816 73632343 73851000 73958622 74070338
3301G4070338K15377L15381L83708M51645L88384K30655r6193m49379r42910j457390
$$ 74070338 74285715 74601096 74984804 75436449 75824833 76055488 75959295 75509916 74567006 73109616
3291G3109616j821401k156494k454397k569453k541336k478283k355251k067117
$$ 73109616 71288215 69131721 66677324 64107871 61566535 59088252 56733001 54665884
3283E4665884j874536j627958j445896j242736j017559q68324o86310n05855m00022
$$ 54665884 52791348 51163390 49717494 48474758 47457199 46588875 45902565 45396710 44996688
3274D4996688k10525p1194O4304J59566L22669M96313M92604O14577P45119R02464
$$ 44996688 44786163 44714969 44779273 44938839 45261508 45757821 46250425 46865002 47610121 48512585
3264D8512585J030059J160350J261550J455134J622706J779694J883030K012981
$$ 48512585 49542644 50702994 51964544 53419678 55042384 56822078 58705108 60718089
3256F0718089K229192K436848K647261K917563L140576L421125L727987M133690
$$ 60718089 62947281 65384129 68031390 70948953 74089529 77510654 81238641 85372331
3248H5372331M598604N056257N429676N680365N907172N889251N631961N045869
$$ 85372331 89970935 95027192 100456868 106137233 112044405 117933656 123565617 128611486
3240A28611486M339138L339544K428231J517978O32093K4732m28745p07463p58272
$$ 128611486 132950624 136290168 138718399 140236377 140868470 140893202 140464457 139756994 138998722
3231A38998722p03363o38925n47061n66107q11774j191700j714454k367911l029601
$$ 138998722 138295359 137656434 137109373 136543266 135731492 134539792 132825338 130457427 127427826
3222A27427826l499701l912556m408771n120839o664293p722208p441796o623966
$$ 127427826 123928125 120015569 115606798 110485959 103821666 96099458 88657662 82033696
3214H2033696n832468n027883m385398l840567l269708k922951k495536k252128
$$ 82033696 76201228 71173345 66787947 62947380 59677672 56754721 54259185 52007057
3206E2007057j974916j680682j436758j256387j088092r62072p74196o15942m24660
$$ 52007057 50032141 48351459 46914701 45658314 44570222 43608150 42833954 42218012 41793352
3197D1793352k92072j16896R9632L80808O48430R71583J279403J722003K083528
$$ 41793352 41501280 41384384 41484016 41864824 42513254 43484837 44764240 46486243 48569771
3188D8569771K305340J029723k342177l644173l187339k307858j570536j090714
$$ 48569771 50875111 51904834 49562657 45918484 42731145 40423287 38852751 37762037
3180C7762037o93952m68302l92900k08388q0303n967O2200K10979L25900M34435
$$ 37762037 37068085 36599783 36206883 35998495 35918192 35912225 35974425 36185404 36511304 36945739
3170C6945739N22591M82990N58397M79131M24106M22633M05997K57281K82032
$$ 36945739 37468330 37951320 38509717 38988848 39412954 39835587 40241584 40498865 40780897
3161D0780897L13369L95450M74013N47029P52739P37173J04644j211713j647443
$$ 40780897 41094266 41489716 41963729 42510758 43263497 44000670 44105314 42893601 41246158
3152D1246158j384875q40045m47270q2346J49307L34000N50766O57546P03953
$$ 41246158 39861283 39021238 38573968 38491622 38640929 38974929 39525695 40183241 40887194
3143D0887194Q01745R37067R09881J003369J042740J011168J046660J020292R62581
$$ 40887194 41688939 42626006 43535887 44539256 45581996 46593164 47639824 48660116 49622697
3134D9622697R88458R20883J003970J048617J223933J452438J700999K061886
$$ 49622697 50611155 51532038 52536008 53584625 54808558 56260996 57961995 60023881
3126F0023881K461453K863489L232427L767411M163323M602712N037166N316746
$$ 60023881 62485334 65348823 68581250 72348661 76511984 81114696 86151862 91468608
3118I1468608N489999N478774N389742N096402M689068M283537L760484L107708
$$ 91468608 96958607 102437381 107827123 112923525 117612593 121896130 125656614 128764322
3110A28764322K583463J868349J275386P05256J53160k12798m41874q76546j135372
$$ 128764322 131347785 133216134 134491520 135196776 135349936 135137138 134695264 133818718 132683346
3101A32683346j282214j570845j880037k190490k490830k826833l044658l181048
$$ 132683346 131401132 129830287 127950250 125759760 123268930 120442097 117397439 114216391
3093A14216391l296841l270885l125321l007353k831922k615035k549988k376254
$$ 114216391 110919550 107648665 104523344 101515991 98684069 96069034 93519046 91142792
3085I1142792k234543k196547k167849k083466k093743k186848k387556k438450
$$ 91142792 88908249 86711702 84543853 82460387 80366644 78179796 75792240 73353790
3077G3353790k587173k647315k648082k522341k383889k195724j931105j661207
$$ 73353790 70766617 68119302 65471220 62948879 60564990 58369266 56438161 54776954
3069E4776954j409090j037492p24727m47921j70193J09301L94721N88948P78605
$$ 54776954 53367864 52330372 51605645 51157724 50987531 51096832 51491553 52080501 52859106
3060E2859106Q68001R13042Q75022P31440N79900L38197O2761k86025n79696q32522
$$ 52859106 53727107 54640149 55515171 56246611 56826511 57164708 57227469 56941444 56361748 55529226
3050E5529226j093223j314378j506999j649887j736285j874690j970410j867388
$$ 55529226 54436003 53121625 51614626 49964739 48228454 46353764 44383354 42515966
3042D2515966j945397j848413j837807j786453j633913j509785j499147j406532
$$ 42515966 40570569 38722156 36884349 35097896 33463983 31954198 30455051 29048519
3034B9048519j279517j081957r98955q85328q69023p67599p04093o69967n64638
$$ 29048519 27769002 26687045 25688090 24802762 23933739 23166140 22462047 21792080 21227442
3025B1227442n02719m60979m27912l77831m02269l95323l83220l07536l50859
$$ 21227442 20724723 20263744 19835832 19458001 19055732 18660409 18277189 17969653 17618794
3016A7618794l28205k17518k63781j96419j76119q0780o1356m4789l999L6301
$$ 17618794 17290589 17073071 16809290 16612871 16436752 16355972 16294616 16249827 16245828 16282129
3006A6282129L9799J46511J68345J68222K34934J53781J66153J19769Q2115L7636
$$ 16282129 16321928 16468439 16636784 16805006 17039940 17193721 17359874 17479643 17561758 17599394
2996A7599394r4926k07198k73223l22647l36240m27095m68948n10242m73729n39384
$$ 17599394 17504468 17297270 17024047 16701400 16365160 15938065 15469117 14958875 14485146 13945762
2986A3945762m48968m17797m22419l91605l35507k26953k65357k29599k47420
$$ 13945762 13496794 13078997 12656578 12264973 11929466 11702513 11437156 11207557 10960137
2977A0960137j33722j19556j22793j07839j4195l5632j6877j01470l8396N3664
$$ 10960137 10826415 10706859 10584066 10476227 10462032 10426400 10409523 10308053 10269657 10323321
2967A0323321k2162J354m204K8694M1444k8303m6824J4589L4307N6038M0205R12
$$ 10323321 10301159 10302513 10298309 10327003 10368447 10340144 10293320 10307909 10342216 10398254 10438459 10439371
2955A0439371M7791L9608R7521Q1985M3773J00727Q9559R2169J18678J55930J99040
$$ 10439371 10487162 10526770 10624291 10706276 10750049 10850776 10940335 11032504 11151182 11307112 11506152
2944A1506152J78088J93840K21990K33317K17110K02474J96703J63929K13688
$$ 11506152 11684240 11878080 12100070 12333387 12550497 12752971 12949674 13113603 13327291
2935A3327291J77081K32092K46245Q6165J72623K40856J75202K43888J94182K50789
$$ 13327291 13504372 13736464 13982709 14068874 14241497 14482353 14657555 14901443 15095625 15346414
2925A5346414K74682K62044L33054L00437L54996L14162L75292M32121M23226
$$ 15346414 15621096 15883140 16216194 16516631 16871627 17185789 17561081 17993202 18416428
2916A8416428M96057M55821N43901N33591N57561N16060N63376N09520M79787
$$ 18416428 18912485 19368306 19912207 20445798 21003359 21519419 22082795 22592315 23072102
2907B3072102M93621M95233N12708N73172O31833O73341O93160O84666O58410
$$ 23072102 23565723 24060956 24573664 25146836 25778669 26452010 27145170 27829836 28488246
2898B8488246P10812O96774P68384Q31449R45170J023256J013798J052479J234914
$$ 28488246 29199058 29895832 30664216 31495665 32440835 33464091 34477889 35530368 36765282
2889C6765282J273695J349032J458930J493654J541014J548017J639729J828225
$$ 36765282 38038977 39388009 40846939 42340593 43881607 45429624 47069353 48897578
2881D8897578J954713K097071K263377K379738K632326K772177L096382L401991
$$ 48897578 50852291 52949362 55212739 57592477 60224803 62996980 66093362 69495353
2873F9495353L787113M253607M868183N535796O307879P190203Q189552R461627
$$ 69495353 73282466 77536073 82404256 87940052 94247931 101438134 109627686 119089313
2865A19089313J0810534J2390788J4247028J6291551J8627155K1100628K3658105
$$ 119089313 129899847 142290635 156537663 172829214 191456369 212556997 236215102
2858B36215102K6087941K7720001K7722212K4364755J5396600N89504j6491878
$$ 236215102 262303043 290023044 317745256 342110011 357506611 358096115 341604237
2851C41604237k9422291l4912540l4120068l0125814k5280090k0704389j6989069
$$ 341604237 312181946 277269406 243149338 213023524 187743434 167039045 150049976
2844A50049976j4085389j1985887j0492230r289400q306049p415405o485806n658206
$$ 150049976 135964587 123978700 113486470 104197070 95891021 88475616 81989810 76331604
2836G6331604m999973m453395m063806l682465l295267l030057k792400k458660
$$ 76331604 71331631 66878236 62814430 59131965 55836698 52806641 50014241 47555581
2828D7555581k132614j978818j810788j709232j594248j444464j383793j295755
$$ 47555581 45422967 43444149 41633361 39924129 38329881 36885417 35501624 34205869
2820C4205869j237718j188329j110449j079439j047768j013422r33168q97013
$$ 34205869 32968151 31779822 30669373 29589934 28542166 27528744 26595576 25698563
2812B5698563q55773q14943q09620p89178p23092o78714o21134n50160m91517
$$ 25698563 24842790 24027847 23218227 22429049 21705957 21027243 20406109 19855949 19364432
2803A9364432n17527m16693m11983m28669m24728l88613m47219m94075m14076
$$ 19364432 18846905 18430212 18018229 17589560 17164832 16776219 16329000 15834925 15420849
2794A5420849l67764l91006m24356m20414l30148k83417l22675l11959k90152
$$ 15420849 15053085 14662079 14237723 13817309 13487161 13203744 12881069 12569110 12278958
2785A2278958k44366k66013k24371k53736l05370k75967k83092l06321l18733
$$ 12278958 12034592 11768579 11544208 11290472 10985102 10709135 10426043 10119722 9800989
2776I800989k52586j98176k06793j98751k60455j99924k17287j91914j19456j93088
$$ 9800989 9548403 9350227 9143434 8944683 8684228 8484304 8267017 8075103 7955647 7762559
2766G762559j58655o7334j41555j30172j10332n6011j47318j28921j21875j56521
$$ 7762559 7603904 7536570 7395015 7264843 7154511 7098500 6951182 6822261 6700386 6543865
2756F543865j20617j30855j37247j50275j17767j19994j33676j04364q2833r3329
$$ 6543865 6423248 6292393 6155146 6004871 5887104 5767110 5633434 5529070 5446237 5352908
2746E352908j06961j06826q3085m5818n9149n0244p9618r3670n8315p4781n5181
$$ 5352908 5245947 5139121 5056036 5010218 4951069 4900825 4821207 4727537 4669222 4594441 4539260
2735D539260l5061n2618p5119r2766n1475K1829n6846j13558n4860o6061r7172
$$ 4539260 4504199 4451581 4376462 4283696 4232221 4254050 4197204 4083646 4028786 3962725 3865553
2724C865553q0657q4413p9747O67l5451q0233r4806n5658l3828n7353k8246o0767
$$ 3865553 3784896 3700483 3620736 3621403 3585952 3505719 3410913 3355255 3321427 3264074 3235828 3175061
2712C175061l6579l6713n9300k9703p6561n3178m366O280q1794o4897k8729p1876
$$ 3175061 3138482 3101769 3042469 3012766 2936205 2883027 2878661 2884941 2803147 2738250 2709521 2637645
2700B637645l9518p1274p1540n5195o1521l2260m9468j02837k3986k7149o7558
$$ 2637645 2598127 2526853 2455313 2400118 2338597 2306337 2256869 2154032 2130046 2102897 2035339
2689B035339k7812j4277l1969q366N32o2474j3403L2476m573J3182j6124l5063
$$ 2035339 2007527 1993250 1961281 1952915 1953447 1890973 1877570 1910046 1905473 1918655 1902531 1867468
2677A867468j3942L6144n1791l0312L1982l6010k8469J4812n5138o6550j2317
$$ 1867468 1853526 1889670 1837879 1807567 1839549 1803539 1775070 1789882 1734744 1668194 1655877
2666A655877l25j3633o939l1459m9522k4229J862m637K2300k4076j9325J503n0962
$$ 1655877 1655552 1641919 1634980 1603521 1553999 1529770 1531632 1526995 1549295 1525219 1505894 1507397 1456435
2653A456435j0414L6747K2792L7177k6228k8464k4373R096k5381J560j4383j5592
$$ 1456435 1446021 1482768 1505560 1542737 1516509 1488045 1463672 1472768 1447387 1448947 1434564 1418972
2641A418972m1062l3680K9537j4112J6648j6262k809l4901o8291O150l2079L5624
$$ 1418972 1377910 1344230 1373767 1359655 1376303 1360041 1357232 1322331 1254040 1260190 1228111 1263735
2629A263735k5607j8548N2813m5821K3088N463J2859o3860j0881m4136Q86K2157
$$ 1263735 1238128 1219580 1272393 1226572 1249660 1255123 1267982 1204122 1193241 1149105 1149991 1172148
2617A172148m3084l840n7049J0552J5191n4875l5955M1640M7146R222M502L4593
$$ 1172148 1129064 1125224 1068175 1078727 1093918 1039043 1003088 1044728 1091874 1101096 1105598 1140191
2605A140191q229k8632M2266j989N560l7699k7217N4069J2537k8218J5005J5460
$$ 1140191 1131962 1103330 1145596 1143607 1149167 1111468 1084251 1138320 1150857 1122639 1137644 1153104
2593A153104J3905M0945j6826o15j6614K8634p471K6691r012M3475P5609O0855
$$ 1153104 1167009 1207954 1191128 1190513 1173899 1202533 1195062 1221753 1212741 1256216 1331825 1392680
2581A392680N0507M8455O6102P8534R6400N9288R9198J30509J17959N8989O2444
$$ 1392680 1443187 1491642 1557744 1636278 1732678 1791966 1891164 2021673 2139632 2198621 2261065
2570B261065l487m1721o3546j37022j31498j68701j47594n0433j26822j11476
$$ 2261065 2257578 2215857 2152311 2015289 1883791 1715090 1567496 1517063 1390241 1278765
2560A278765n9870m6257j8110o3114j10280m2709l853j9398n3888o146o5563P405
$$ 1278765 1218895 1172638 1154528 1091414 981134 938425 934572 915174 861286 855140 789577 796982
2548G96982l8198m5475j9236l9974k9756K4992k3147j6128n825o3381j5650K1852
$$ 796982 758784 713309 694073 654099 624343 649335 626188 610060 604235 540854 525204 547056
2536E47056l6322k9599N4132m5015m0027k5636k8380l5409J6635k2294l3420O3741
$$ 547056 510734 481135 535267 490252 450225 424589 396209 360800 377435 355141 321721 385462
2524C85462M8639k5700n1228l1147J274N1624p5125K6251k5619L3339j3818l0724
$$ 385462 434101 408401 357173 326026 327300 378924 303799 330050 304431 337770 323952 293228
2512B93228M4029o608k2346n1880k5959J8287K1689r214l2813n7298K3305L0181
$$ 293228 337257 330649 308303 256423 230464 248751 270440 261226 228413 171115 194420 224601
2500B24601M7126J3732p742K9038o2713M997M097o732k3826k1519K5262o701l229
$$ 224601 271727 285459 277717 306755 244042 249039 253136 246404 222578 201059 226321 219620 216391
2487B16391l6660N5940p336J0010p817l3468M3310L6629L464k6549q4968k0933
$$ 216391 179731 235671 228335 238345 230528 197060 240370 276999 280463 253914 168946 148013
2475A48013Q3543K7758o7244j5403j8535N9251L3927K9506l5401j1094m6738k6295
$$ 148013 231556 259314 192070 176667 158132 217383 251310 280816 245415 234321 187583 161288
2463A61288K2006K222Q53L8032L1140j9945p1827j2696M6855J5630j1059j0764
$$ 161288 183294 185516 186369 224401 255541 235596 163769 151073 197928 213558 202499 191735
2451A91735l5758k0409M1553k551j4202j634N286K394L7886p095m1780J2515l2946
$$ 191735 155977 135568 177121 174570 160368 158734 164020 166414 204300 197205 155425 167940 134994
2438A34994K5307j5345k258J778n1517J6743k0397K6717M6534L2564K6590l1112
$$ 134994 160301 144956 142698 144476 92959 109702 89305 116022 162556 195120 221710 190598
2426A90598p6021j6401L0740m8935N4230K5186k0083j5277j7031l9312N52L7512
$$ 190598 114577 98176 128916 79981 134211 159397 139314 124037 107006 67694 68246 105758
2414A05758L712O255l8267K9025O9890j2520m8962j9380P8281n700j2926J8410
$$ 105758 109470 115725 77458 106483 176373 163853 114891 95511 173792 168092 155166 173576
2402A73576m0938M6770n151o6002K9100N6619r816J0142k5530n7761j5052N5231
$$ 173576 132638 179408 174257 108255 137355 193974 184158 194300 168770 111009 95957 151188
2390A51188j0417J6774L2447l0111k3786Q3286J0655o5524j7766j7838p691M0654
$$ 151188 140771 157545 189992 159881 136095 219381 230036 164512 146746 128908 121217 161871
2378A61871O458O2053k0611n7950j311k5463l5395Q7114K4209r379j2457l055
$$ 161871 168329 230382 209771 151821 150510 125047 89652 176766 200975 191596 179139 176084
2366A76084l637j2004M5462k7545k9178l028l5454k7062L6477P1295m8394J4650
$$ 176084 172447 160443 205905 178360 149182 146154 110700 83638 120115 191410 143016 157666
2354A57666J0310l0590J2924j3648k5962n3419L3890O700n5845N2003n061m4265
$$ 157666 167976 137386 150310 136662 110700 57281 91171 97871 42026 94029 88968 44703
2342D4703J8321O993Q073k5030P9K0914Q330K02r788j3654p893K1602K502J8031
$$ 44703 63024 70017 78090 53060 53139 74053 82383 82585 72797 59143 51250 72852 75354 93385
2328I3385J4431J4906k1978l6743L5823j4035J6028l8999l0216J0048j8559K2989
$$ 93385 107816 122722 100744 64001 99824 85789 101817 62818 32602 42650 24091 47080
2316D7080k8216j5908O2473k2649L0382j6346l3948J3088k3466K7979L5567J7521
$$ 47080 18864 2956 65429 42780 73162 56816 22868 35956 12490 40469 76036 93557
2304I3557J0602q804J2163r278o165J3973k0793j1470N1679l2764m9959L6298
$$ 93557 104159 95355 107518 98240 92075 106048 85255 73785 125464 92700 42741 79039
2292G9039J6881J3823l4861j7661m1002N5178k1065j9091P3885L5126k8535J2383
$$ 79039 95920 109743 74882 57221 16219 71397 50332 31241 105126 140252 111717 124100
2280A24100J6562o4249o392m6410j5329J614L454M2161L8433J553j205l2827o5091
$$ 124100 140662 76413 70021 23611 8282 9896 13350 55511 93944 95497 94292 61465 -3626
2267c626j2314L9906l4875L0070J6973j9340L4335k3261J7110M9460l0947k9132
$$ -3626 -15940 23966 -10909 19161 36134 16794 51129 27868 44978 94438 63491 34359
2255C4359K6701n001l6459K3793J0517N324m6447j6994L6282o848r388K0340K5390
$$ 34359 61060 56059 19600 43393 53910 59234 12787 -4207 32075 25227 15839 36179 61569
2242F1569j2294m0603L6506m4011L0109K7943n652J9053m1176L1902K7961m7155
$$ 61569 49275 8672 45178 1167 31276 59219 53567 72620 31444 63346 91307 44152
2230D4152J9092L7945j0936l0108l6587L7748L3971m3998k0760L4938L9508j0649
$$ 44152 63244 101189 90253 60145 23558 61306 95277 51279 30519 65457 104965 94316
2218I4316l817k6874J1889l537K3422j8562J1134j3352Q368j218j4103N7372k9890
$$ 94316 90499 63625 75514 71977 95399 76837 87971 74619 82987 81769 67666 125038 95148
2205I5148K0131Q516L3943J4952k3930p151K6479o263L2881K1289N1814J6855
$$ 95148 115279 123795 157738 172690 148760 141609 168088 161825 194706 215995 267809 284664
2193B84664j4737j7060L2805K4590J622n6367o2627J6091P9277j6599j3501K1355
$$ 284664 269927 252867 285672 310262 311884 255517 192890 208981 288258 271659 258158 279513
2181B79513J5073J0307l772L2180j7505K7046M3929K3128K3218l7189J2583N0059
$$ 279513 294586 304893 301121 333301 315796 342842 386771 409899 433117 395928 408511 458570
2169D58570K1027j2035K9723M5234Q418j8029L7875M4004m4557M6139Q3738J1008
$$ 458570 479597 467562 497285 542519 550937 532908 570783 614787 570230 616369 700107 711115
2157G11115M6187k2412L7166O2690J9803l1993K3097J8735L6431J07406M9359
$$ 711115 757302 734890 772056 834746 854549 822556 845653 864388 900819 1008225 1057584
2146A057584Q7129N8402N8930O4557L9552K3404J5843Q3435P1029P1892O6662
$$ 1057584 1144713 1203115 1262045 1326602 1366154 1389558 1405401 1488836 1559865 1631757 1698419
2135A698419N5751Q8220J14005J64409J89210J91133J80180K61094K22248J37397
$$ 1698419 1754170 1842390 1956395 2120804 2310014 2501147 2681327 2942421 3164669 3302066
2125C302066J93910J99206L98543N05446O87358Q24853J065659J202271J567064
$$ 3302066 3495976 3695182 4093725 4599171 5286529 6111382 7177041 8379312 9946376
2116I946376J754502K282493K625567L144491P39231l788446m151235l015263
$$ 9946376 11700878 13983371 16608938 19753429 20492660 16704214 12552979 9537716
2108I537716j935744j356205r24644p40401n29202l67577l05213k67117j64767
$$ 9537716 7601972 6245767 5321123 4580722 4051520 3683943 3378730 3111613 2946846
2099B946846j55697p0019j90688k49278k07133k02012j66224j73517j30309q0316
$$ 2946846 2791149 2721130 2530442 2281164 2074031 1872019 1705795 1532278 1401969 1321653
2089A321653p0280k0732N270p6418k4840l4102m3836n8729q6462m4880J5026o8524
$$ 1321653 1251373 1230641 1235911 1159493 1134653 1100551 1056715 997986 911524 866644 881670 813146
2077H13146m4245l8007q199o2386p2367m4314m7001M1526l7299R181l0315k6713
$$ 813146 768901 730894 722695 660309 587942 543628 496627 538153 500854 510035 479720 453007
2065D53007J4907J6543k7361l9351K500N835j4241l0120Q396o6101j021m904M894
$$ 453007 467914 484457 457096 417745 420245 426080 411839 381719 390115 324014 322993 318089 322983
2052C22983j0725K2875N7172n0616m336K9052n8370j4861K178k5419k490l1653
$$ 322983 312258 335133 392305 341689 337353 366405 308035 293174 295352 269933 267443 235790
2040B35790N419k5373m1484L9776k4256o741l9044O0952l7630k8055P340j7718
$$ 235790 241209 215836 174352 214128 189872 183131 144087 205039 167409 139354 146694 128976
2028A28976O3122k4845m9884j214L3743K8651R843n1105l019Q76l2326J0945j9726
$$ 128976 192098 167253 117369 116155 149898 178549 188392 137287 134268 135144 102818 113763 94037
2015I4037K0319k0356J1776k6518J161k8108k6037R716K7339Q454K070j8296k0596
$$ 94037 114356 94000 105776 79258 80419 52311 26274 35990 63329 71783 73853 55557 34961
2002C4961j4534K1533K6109j4941J8499J1388o3686M0627Q0145m3565n0744j7445
$$ 34961 20427 41960 68069 53128 71627 83015 19329 59956 140101 96536 45792 28347
1990B8347K1874l7957K2649j6192R951K8410J9636k7894n3900M4195L0519K4887
$$ 28347 50221 12264 34913 18721 28672 57082 76718 48824 -5076 39119 69638 94525
1978I4525p6031p410m754j6830J8897K6259l9398k6668N6832J3579n4806n6630
$$ 94525 18494 11084 6330 -10500 8397 34656 -4742 -31410 25422 39001 -15805 -72435
1966g2435N4194J3967n635j5757L942n1131M0235k6633N6713O362k8667M2825
$$ -72435 -18241 -4274 -9909 -25666 -21724 -72855 -32620 -59253 -2540 3822 -24845 17980
1954A7980j8760o1900J2187K6949j6694O114K2187O233k7746Q233j7963j9294
$$ 17980 -780 -62680 -50493 -23544 -40238 -34124 -11937 -5704 -33450 -25217 -43180 -62474
1942f2474L0814M020l3284K2697k628n1424p579P146j520J6801K964L411k5184
$$ -62474 -31660 -27640 -60924 -38227 -40855 -92279 -99858 -92712 -94232 -77431 -74467 -71056 -96240
1929i6240m8268O1520J9165L9496L5445m9714J2102J9435j2818n4301m5030K8561
$$ -96240 -144508 -82988 -63823 -24327 11118 -38596 -26494 -7059 -19877 -74178 -119208 -90647
1917i0647O119J5261K1326j3975J3510K1691m942k5318L181K2867Q747p4523o4606
$$ -90647 -84528 -69267 -47941 -61916 -48406 -26715 -31657 -56975 -53794 -30927 -22180 -96703 -161309
1904a61309J2576M6378J0669J3675L5139J9881K458k6272L470M960k8688j3976
$$ -161309 -148733 -102355 -91686 -78011 -42872 -22991 -20533 -46805 -43335 -38375 -67063 -81039
1892h1039K2186K933m897j6398l1950N5807L58j1957j9638q049n1217J9605J2694
$$ -81039 -58853 -55920 -60817 -77215 -109165 -53358 -53000 -64957 -84595 -92644 -143861 -124256 -111562
1879a11562K4347J7033J1068J2811q867N4698m9745J0934m333l0076k2862N4753
$$ -111562 -87215 -70182 -59114 -46303 -55170 -472 -50217 -39283 -43616 -73692 -96554 -41801
1867d1801L5016q4449q93q920O158M0912k0824k2730O359k5853K5595L5031l5750
$$ -41801 -6785 -91234 -92127 -101047 -94889 -53977 -74801 -97531 -91172 -117025 -91430 -56399 -92149
1854i2149L2164J5327o71M8870l9311m719M8469q483m4601J0272K3674k7744k583
$$ -92149 -59985 -44658 -45329 3541 -35770 -40489 7980 -503 -45104 -34832 -11158 -38902 -41485
1841d1485o929k6917q402L5168j38J4483j3769J3201k3212j7641K1322m2298k1089
$$ -41485 -48414 -75331 -83733 -48565 -48703 -34220 -47989 -34788 -58000 -75641 -54319 -96617 -117706
1828a17706L5628J1450j5789L0766J9061j0220k1864N293M2971j8554l9110N339
$$ -117706 -82078 -70628 -86417 -55651 -36590 -46810 -68674 -63381 -20410 -38964 -78074 -72735
1816g2735q318J1543l245k1782l67J5021O1867r618J974j5433m2369L9763n729
$$ -72735 -81053 -69510 -72755 -94537 -94904 -79883 -18016 -27634 -25660 -41093 -83462 -43699 -49428
1803d9428l108k521j6026j9585j7781l7914K2295L5518p700L025K0344K2851K4013
$$ -49428 -52536 -55057 -71083 -90668 -108449 -146363 -124068 -88550 -96250 -93225 -72881 -50030 -26017
1790b6017J997m3197K2775J7951q041O530k0372j8334j6027n779k8961M9580K7377
$$ -26017 -24020 -67217 -44442 -26491 -34532 -28002 -48374 -66708 -82735 -88514 -117475 -67895 -40518
1777d0518k1391m2390j3139K0955j2098j192J1262Q232o891P09K0452l1099L1884
$$ -40518 -61909 -104299 -117438 -96483 -108581 -109773 -98511 -90279 -97170 -96461 -76009 -107108 -75224
1764g5224J2893k3511m7049K0098L6227m9605N362K0057m313K5942l16L451J4266
$$ -75224 -62331 -85842 -132891 -112793 -76566 -126171 -120809 -100752 -105065 -79123 -79439 -75988 -61722
1751f1722k0762J6097K2425k3140L1240k5893l200l2356j8897M6289j3984j5957
$$ -61722 -82484 -66387 -43962 -67102 -35862 -61755 -64955 -97311 -116208 -69919 -83903 -99860
1739i9860K6570M4278o946o227J0582J4966o4188l2393K184L8515L018M1673k3502
$$ -99860 -73290 -29012 -35958 -42185 -31603 -16637 -80825 -113218 -111034 -72519 -69501 -27828 -51330
1726e1330p389M9101j8531n4896k5262k3062l1084K3225M7896J0090K7107p0217
$$ -51330 -58719 -9618 -28149 -83045 -108307 -131369 -162453 -139228 -91332 -81242 -54135 -124352
1714a24352K1105J4589Q730k3352k0455j214L9354M4306j3129k3183n557J8631
$$ -124352 -103247 -88658 -79928 -103280 -123735 -124949 -85595 -41289 -54418 -77601 -83158 -64527
1702f4527O1108l9973k4691J5042K7840k3799m3140L3308l8668L4193K6020k4795
$$ -64527 -3419 -43392 -68083 -53041 -25201 -49000 -92140 -58832 -97500 -63307 -37287 -62082
1690f2082p170J7336k6286L5536n151k3326Q468k8015M9465l0086j6307j6967
$$ -62082 -69252 -51916 -78202 -42666 -47817 -71143 -62675 -90690 -41225 -71311 -87618 -104585
1678a04585m665M2230J0749k9330j1079M6940k9753J6230J2483k9763l9702m988
$$ -104585 -109250 -67020 -56271 -85601 -96680 -49740 -79493 -63263 -50780 -80543 -120245 -125233
1666a25233J1224k3971J259M9127l7854k3366N4562N6802k5414J9771K4872k3652
$$ -125233 -114009 -137980 -136721 -87594 -125448 -148814 -94252 -37450 -62864 -43093 -18221 -41873
1654d1873l8408k0685N5464O0129o3685k31n1405j2576L4408P2241k7084m4467
$$ -41873 -80281 -100966 -45502 14627 -49058 -49289 -100694 -113270 -78862 -6621 -33705 -78172
1642g8172J9115k5041j0041J7368M0219K1206j8791o5209l1688k409j2842N1554
$$ -78172 -59057 -84098 -94139 -76771 -36552 -15346 -34137 -99346 -131034 -133443 -146285 -94731
1630i4731n150J2267K715j9029N17j026L7231k614K5550k0361k8068J9534j2361
$$ -94731 -99881 -87614 -84899 -103928 -103411 -104437 -67206 -69820 -44270 -64631 -92699 -73165 -85526
1617h5526k7036J5404N541j2595p418j1364M4202q997J5386P795n2495J0882l465
$$ -85526 -112562 -97158 -91617 -104212 -111630 -122994 -78792 -87789 -72403 -64608 -117103 -106221 -109686
1604a09686J0851J2596M2568J9789k7005k5048m8179k5051Q1477q293L9289L4822
$$ -109686 -98835 -86239 -43671 -23882 -50887 -75935 -124114 -149165 -67688 -75981 -36692 -1870
1592a870J296k7019q192K3491o5054R983L5461K950K2743k6798o9628K5455L6327
$$ -1870 -574 -27593 -35785 -12294 -77348 -67365 -31904 -28954 -6211 -33009 -102637 -77182 -40855
1579d0855n81m724k7685L352m4764J3361Q549k9676O694Q8482j0671j7027j6584
$$ -40855 -41436 -46160 -73845 -70493 -115257 -101896 -93347 -123023 -116329 -27847 -38518 -55545 -72129
1566g2129k3027R549K6933N0770j4371j3350k4678l189M0015j9868J1593o0494
$$ -72129 -95156 -85607 -58674 -7904 -22275 -35625 -60303 -63492 -23477 -43345 -31752 -92246
1554i2246l5352j633K6200N2520k3842L2137k4775L3713l4260l901j2722K4198
$$ -92246 -127598 -129231 -103031 -50511 -74353 -42216 -66991 -33278 -67538 -71439 -84161 -59963
1542e9963o971K3495o059n662K8538k4213P314j3418r80j4194o859N511M7585
$$ -59963 -66934 -43439 -49498 -55160 -26622 -50835 -43521 -56939 -57919 -72113 -78972 -73461 -25876
1529b5876m4027m716K8063J1479l3155l4237l364M2078M4029M179m5768o645j902
$$ -25876 -69903 -74619 -46556 -35077 -68232 -102469 -105833 -63755 -19726 -15547 -61315 -67960 -69862
1516f9862k3534l807j8423J2944N7318L3678j399j8702n7895k470M25N0328m929
$$ -69862 -93396 -97203 -115626 -102682 -45364 -11686 -13085 -31787 -89682 -92152 -91727 -41399 -46328
1503d6328O0257n6363n9334P95J9473L171L2488N0179n9119K7015l6164n5301
$$ -46328 13929 -42434 -101768 -100973 -81500 -78329 -45841 4338 -54781 -27766 -63930 -119231
1491a19231l7900K701j2840L5917Q893K6987L409l5498j856M8051j104q630j725
$$ -119231 -157131 -154430 -167270 -131353 -122460 -95473 -92064 -127562 -129418 -81367 -82471 -91101 -92826
1478i2826J8224L5355k6482q511J3895M1185j1867K0968k4382n012k0139l4997
$$ -92826 -74602 -39247 -65729 -74240 -60345 -19160 -31027 -10059 -34441 -39453 -59592 -94589
1466i4589k5115j2383J72K1227L3846L931O3568P600o1836K2362K9863l4414o033
$$ -94589 -119704 -132087 -131915 -110688 -76842 -72911 -9343 -1743 -63579 -41217 -11354 -45768 -51801
1453e1801L4012j3291m0944j4272K9608R735l6031J5257j3951N8980M1541l7765
$$ -51801 -17789 -31080 -72024 -86296 -56688 -46953 -82984 -67727 -81678 -22698 18843 -18922
1441a8922l2554J9711k4853l0421j8135J7566r776O9906N0802o1652l767j3553
$$ -18922 -51476 -31765 -56618 -87039 -105174 -87608 -97384 -27478 23324 -38328 -42095 -55648
1429e5648L9652q587j1325k4989K64K6954j8227k3805r107M2101J0751j5369o338
$$ -55648 -15996 -24583 -35908 -60897 -60633 -33679 -51906 -75711 -84818 -42717 -31966 -47335 -53673
1416e3673j9908j254k0841k9405k8193J05775J4572n2275K1679j6150k56M1145
$$ -53673 -73581 -74835 -95676 -125081 -153274 -47499 -32927 -85202 -63523 -79673 -79929 -38784
1404c8784r541m007r866q776j7620J3818J5477O5599k8297o994M5041k2400k2306
$$ -38784 -48325 -52332 -62198 -70974 -88594 -74776 -59299 6300 -21997 -28991 16050 -6350 -28656
1391b8656j3494k2523J4589O261k1144K5617Q569k3154K294k349j4788o975r276
$$ -28656 -42150 -64673 -50084 -43823 -64967 -39350 -30781 -53935 -51641 -53990 -68778 -75753 -85029
1378h5029P7908J0106k6515m2116J5390K0592K0419R361J4063n3741p674K9315
$$ -85029 -7121 2985 -23530 -65646 -50256 -29664 -9245 116 14179 -39562 -47236 -17921
1366a7921L172k9014j4305l530K6147O523J8004n7243M2824P120o1673L1809k8098
$$ -17921 -14749 -43763 -58068 -61598 -35451 -28928 -10924 -68167 -25343 -18223 -79896 -48087 -76185
1353g6185k1438m6540J5417L9054J1537l9215L9455R586N38j2822M1866N9724
$$ -76185 -97623 -144163 -128746 -89692 -78155 -117370 -77915 -68329 -67791 -80613 -38747 20977
1341B0977k9824l0644J7652k017k3334J4746O403k466j4822k6360L4248K0905
$$ 20977 -8847 -39491 -21839 -23856 -47190 -32444 -26041 -28507 -43329 -69689 -35441 -14536
1329a4536k5234o003M208K5336o6866j3182L3329l4447O612P8572J1906j8046
$$ -14536 -39770 -45773 -41565 -16229 -83095 -96277 -62948 -97395 -90783 -12211 -305 -18351
1317a8351J6280j848R670l4360l8352j0724O0704J7799j1744q658l4615K9012
$$ -18351 -2071 -3919 5751 -28609 -66961 -77685 -16981 818 -10926 -19584 -54199 -25187
1305b5187j3810m570L2669O811m1935k0611j5289N390O0099l5258n3544J7953
$$ -25187 -38997 -43567 -10898 -4087 -46022 -66633 -81922 -76532 -16433 -51691 -105235 -87282
1293h7282k2800L7984M1458l2426J8955q514j4325k4051k386j0478L1062J6515
$$ -87282 -110082 -72098 -30640 -63066 -44111 -52625 -66950 -91001 -93387 -103865 -72803 -56288
1281e6288l5544k103M4474q050n405P527J6900O748m7516N0620l1659n1491Q0833
$$ -56288 -91832 -93935 -49461 -57511 -62916 -55389 -38489 -31741 -79257 -28637 -60296 -111787 -30954
1268c0954q843m6297L6728N227R22k3193l9277K4115N6067j4388p295k0954L6331
$$ -30954 -39797 -86094 -49366 -44139 -43217 -66410 -105687 -81572 -25505 -39893 -47188 -68142 -31811
1255c1811j338n5915J4226J4076P07M613j4609o132L808K2008N2657l1922p339
$$ -31811 -33149 -89064 -74838 -60762 -60055 -55442 -70051 -76183 -72375 -50367 2290 -29632 -36971
1242c6971O1678l4163j8054J1683l8528J4684l796k1745K1816Q944k1595Q457
$$ -36971 24707 -9456 -27510 -15827 -54355 -39671 -43467 -65212 -43396 -34452 -56047 -47590
1230d7590n0373P124K7754Q753K0695J3669j1135L3395J1106k5882J1378M720
$$ -47590 -97963 -90839 -63085 -54332 -33637 -19968 -31103 2292 13398 -12484 -1106 3614
1218C614p386k3902j0447j1893L7021j8496L375k674m7251p415L4885K7779J7589
$$ 3614 -3772 -27674 -38121 -50014 -12993 -31489 -28114 -30788 -78039 -85454 -50569 -22790 -5201
1205e201j802k9796J6191K814l8606J7480j3488l407k9016k1390J317M4318P0283
$$ -5201 -7003 -36799 -20608 -17794 -56400 -38920 -52408 -55815 -84831 -106221 -104904 -60586 9697
1192I697m8067k3498J3804M3881R985m7916j7647J8962k3613k32J1579K8046k7980
$$ 9697 -38370 -61868 -48064 -4183 5802 -42114 -59761 -40799 -64412 -64644 -53065 -25019 -52999
1179e2999k0238K1110L179L9714l6524P247L0185l338K2517m77K2571M124o7489
$$ -52999 -73237 -52127 -48948 -9234 -45758 -38511 -8326 -11664 10853 10376 32947 37071 -30418
1166c0418k3662l5383J8953N1590N7807N136L164p0336n4405K9046J0319M4613
$$ -30418 -54080 -89463 -70510 -18920 38887 44023 47187 -23149 -77554 -48508 -38189 6424
1154F424k0324j466K0345m1933k6571j6851M6855n875O274J8446k8700J9060j0878
$$ 6424 -13900 -15366 4979 -36954 -63525 -80376 -33521 -39396 -33122 -14676 -43376 -24316 -35194
1141c5194O3532J9390r589k2402j8406J77J4811k6836K2774M3340O899o4651n6048
$$ -35194 28338 47728 38139 15737 -2669 -2492 12319 -14517 8257 51597 58496 -6155 -62203
1128f2203K024O7221k4015l014k5509M1663K3163l8319m4872R66Q6677o0073p0693
$$ -62203 -60179 7042 -16973 -19987 -45496 -3833 19330 -18989 -63861 -62895 23782 -36291 -106984
1115a06984J2307l665J3302k768j6J6347m174L1158R063k0527l0509K968J8522
$$ -106984 -94677 -98342 -85040 -87808 -87824 -71477 -75651 -44493 -35430 -55957 -86466 -83498 -64976
1102f4976N4988k6363M572j6008N163M866j1874N1811k0064j4K5900k2114K1730
$$ -64976 -9988 -36351 -31779 -47787 -42624 -37758 -49632 2179 -17885 -17899 8001 -14113 7617
1089G617m1981R492L6369n2141l0271N0740N7424k9045m5122k351o170L1502l0625
$$ 7617 -34364 -24872 11497 -40644 -70915 -20175 37249 8204 -36918 -39269 -45439 -13937 -44562
1076d4562j9939j6029q079J7494M1736N2115n2587l4608L7372L9297j2852Q267
$$ -44562 -64501 -80530 -88609 -71115 -29379 22736 -29851 -64459 -27087 12210 -642 7625
1064G625K5983k4627J928l4580k1844K4041J9418l5047M1376q636o7057L5914
$$ 7625 33608 8981 10909 -23671 -45515 -21474 -2056 -37103 4273 -4363 -71420 -35506
1052c5506j7694K3187J6403L7696k8053p655J422R329K2271j8856j70L4096l3944
$$ -35506 -53200 -30013 -13610 24086 -3967 -11622 -10200 -871 21400 2544 2374 36470 2526
1039B526K7272j3994l3962L823J2602M0149k4100K1649j3646K4187n1784n492
$$ 2526 29798 15804 -18158 -14335 -1733 38416 14316 35965 22319 46506 -5278 -10770
1027a0770k2771Q092J3571J8238k977K2535O106n8987k3863l3751K0161M9870
$$ -10770 -33541 -25449 -11878 6360 3383 25918 32024 -26963 -50826 -84577 -64416 -14546
1015a4546N9478j8162L0235m9019R075K5273l7815r033l62j6856o422p380L3799
$$ -14546 44932 26770 57005 7986 17061 42334 4519 -4514 -4876 -21732 -28154 -35534 -1735
1002a735M6231n1592m795o94j0765M5079K7641j6420n5639k1771M0071r100k7064
$$ -1735 44496 -7096 -11891 -12585 -23350 21729 49370 32950 -22689 -44460 -4389 -13489 -40553
989d0553J9240K2222m6771L4791m2509O020N9362q662J9559k7643l0318k4762
$$ -40553 -21313 909 -45862 -11071 -53580 -47560 11802 3140 22699 -4944 -35262 -60024
977f0024j1092J7125k383O8833L0226o4219K6539N1231J0020l0539K0624m6366
$$ -60024 -71116 -53991 -56374 12459 42685 -21534 5005 56236 66256 35717 56341 9975
965I975m9693P8893L146k4040J722P684L3907m0539l0570l320n969j6621K5757
$$ 9975 -39718 39175 42321 18281 20003 27687 61594 21055 -9515 -12835 -18804 -35425 -9668
952i668K6919p4830O962Q2684M330n4166j3728k9870J2350K0642l149M0051L9236
$$ -9668 17251 -57579 -50617 32067 36397 -17769 -31497 -61367 -49017 -28375 -31524 8527 47763
939D7763K0347k4524o125k1409k8471m5692K7927P3625n9179l9498Q2121J9558
$$ 47763 68110 43586 37461 16052 -12419 -58111 -30184 43441 -15738 -55236 26885 46443
927D6443O351Q630m9269j4411j2820L6110j4653k3194K468J4311J0160l6858N8619
$$ 46443 52794 61424 12155 -2256 -15076 21034 6381 -16813 -14345 -34 10126 -26732 31887
914C1887l8683M25K9087l0324j8686N9873j6024j3594J5269l896k7894K0227K1379
$$ 31887 -6796 -6371 22716 -7608 -26294 33579 17555 3961 19230 15334 -12560 7667 29046
901B9046k2528j114M7618o0933k9378M6046j878L193j0797J4527J8071j1055k5920
$$ 29046 6518 5404 53022 -7911 -37289 8757 6879 10072 -725 13802 31873 20818 -5102
888e102k7066l8100L2292J0788n177N79Q176k8585j0196O5637O519j8770J4560
$$ -5102 -32168 -70268 -37976 -27188 -32365 -31786 -23610 -52195 -62391 3246 9765 -9005 5555
875E555K7312L5930j8014J0743K644J6642k6145K803j7425j1024Q175q23l4454
$$ 5555 32867 68797 50783 61526 64170 80812 54667 57470 40045 29021 37196 36373 1919
862A919N3364j4835k5416k0909j4189J0073k999K8455n1322L0972N1090n4374
$$ 1919 55283 40448 15032 -5877 -20066 -9993 -12992 15463 -35859 -4887 46203 -8171
850h171M33O1929M411k1724l92l0023l6639k333L1298P109P573L1177l038n4517
$$ -8171 -7738 54191 58602 36878 36486 6463 -30176 -32509 -1211 5898 13471 44648 41610 -12907
836a2907J2048L7827m252l4164j5246K713J3836N1100Q087j9947l7439M7286M7754
$$ -12907 -859 36968 32716 -1448 -16694 -13981 -145 50955 59042 39095 1656 48942 96696
823I6696L3693m9913l2059m5975J2903J8912J8843M000k8618J4608j4105k2822
$$ 96696 130389 80476 48417 2442 15345 34257 53100 57100 28482 43090 28985 6163
811F163k343L0186k376l2700j3120L3284l8623j2985L7993M4155n353n4913p65
$$ 6163 3820 34006 31630 -1070 -14190 19094 -19529 -32514 5479 49634 44281 -10632 -11397
798a1397M1067M4943J3258o8455m9994K9722K7232P362j4297J870L5638L222k5528
$$ -11397 29670 74613 87871 19416 -30578 -856 26376 33738 19441 21311 56949 60171 34643
785C4643j8894j0304Q338K7537k5800k2870L0842J6114K5470m8315K0250k7269
$$ 34643 15749 5445 13783 41320 15520 -7350 23492 39606 65076 16761 37011 9742
773I742k8463K6609l5784K9877J6723M158J0051Q332k1101J4451K3739r639n6717
$$ 9742 -18721 7888 -27896 1981 18704 22862 32913 41245 20144 34595 58334 48695 -8022
760h022M6768O397l340k6124K0956m230p654K1654J3308J7041n8323M4780K0302
$$ -8022 38746 45143 41803 15679 36635 32405 24751 46405 59713 76754 18431 63211 83513
747H3513m0237J6196o261m1791M272k6742J0212k782O667M3332l4171m7217M6345
$$ 83513 43276 59472 53211 11420 15692 -11050 -838 -3620 3047 46379 12208 -35009 11336
734A1336j3034J746M8168N545K7446J6382j4053J0510l7397L088n6430M3431R142
$$ 11336 -1698 48 48216 53761 81207 97589 83536 94046 56649 59737 3307 46738 55880
721E5880l0390l017K2607J3291j7243J608J136j864l3793p331M8675M0094l6196
$$ 55880 25490 22473 45080 58371 41128 42736 43872 42008 8215 884 49559 89653 53457
708E3457k0090M79N6779k8144j1355L5748o539l3071k2032j0328P837j1058m4375
$$ 53457 33367 33846 90625 62481 51126 86874 80335 47264 25232 14904 22741 11683 -32692
695c2692L5251N6158q182P181m8820j497L8107j2637J672K780l6999J4261J3787
$$ -32692 2559 58717 50535 57716 8896 7399 45506 32869 34541 37321 322 14583 28370
682B8370q2533K7300L7392n3685J1685Q6776l0439n6565L6874L2246M588P643
$$ 28370 -54163 -26863 10529 -43156 -31471 55305 24866 -31699 5175 37421 42009 49652
670D9652Q268l6469K5164j0428J4303j5667L105K5209n3256l482J1142j149m42
$$ 49652 57920 21451 46615 36187 50490 34823 37928 63137 9881 6399 17541 16392 15950
657A5950r680M3586L495K848Q064l2444J9497j0449j2732J8389L7255n774J6234
$$ 15950 6270 49856 53351 56199 64263 31819 51316 40867 28135 46524 83779 78005 94239
644I4239k3992j5608n5192K9764K6591n721K3156J808j7903j4485K7210J683o591
$$ 94239 70247 54639 -553 29211 55802 50081 73237 75045 57142 42657 69867 71550 64959
631F4959J5232M8473n6824N044k0557n726K4004j2322j8426J754M053p938k0250
$$ 64959 80191 128664 71840 76884 56327 50601 74605 62283 43857 45611 49664 41726 21476
618B1476l941j466P091k461l779L56P730K3293M9278j676l3537k5795l7083J7689
$$ 21476 17535 16069 23160 20699 16920 17276 25006 48299 97577 95901 62364 36569 -514 17175
604A7175R669j4184J3801P3779n5271j3852Q0536r229o1396P2583m3750k2212
$$ 17175 26844 12660 26461 100240 44969 31117 111653 102424 41028 113611 69861 47649
592D7649q235M1484N0068q2929M3566M7267m5781Q35k4420n2110p549J681J5773
$$ 47649 39414 80898 130966 48037 91603 138870 93089 93924 69504 17394 9845 11526 27299
579B7299N656q249P6945J0175K3490j4601p2114N5342L0586k0185j7763k0351
$$ 27299 32955 24706 101651 111826 135316 120715 48601 103943 134529 114344 96581 76230
567G6230l0475O510r538l5297n639M6832k4967L3690J5712k3372P981K6081m8315
$$ 76230 45755 52265 42727 7430 1791 48623 23656 57346 73058 49686 57667 83748 35433
554C5433j925J6055J8895m2467k6899L6839L0316j0179l0412J1130O3425K122
$$ 35433 33508 49563 68458 25991 -908 35931 66247 56068 25656 36786 100211 102333
542A02333r220k0712j1396O977j0197m5707K161L7019J7936K734R809K0472l6408
$$ 102333 93113 72401 61005 67982 57785 12078 14239 51258 69194 71928 81737 102209 65801
529F5801j4558l053R36k3628O489L808N988j938l5286K2787L9484L5543M560p9844
$$ 65801 51243 48190 49126 25498 31987 35795 41783 39845 4559 27346 66830 102373 106933 27089
515B7089k8479L2438K8067L0273o359m3966N1193K5694q8239J4431K6762J9398
$$ 27089 -1390 31048 59115 89388 83029 39063 90256 115950 27711 42142 68904 88302
503H8302M71l8403j4889N2007K2674k9201M5105m3006k7903R986J8382l2044j2401
$$ 88302 88773 50370 35481 87488 110162 80961 126066 83060 55157 65143 83525 51481 39080
490C9080N0747o5314l8082K1371M1183q556l840Q245l2341L9000k470J076J9644
$$ 39080 89827 24513 -13569 7802 48985 40429 36589 44834 12493 51493 49023 50099 69743
477F9743J0884j1513J0025k3021n274J1600p508k6497M1312J9385l0651J8339
$$ 69743 80627 69114 79139 56118 50844 62444 54936 28439 69751 89136 58485 76824
465G6824j9885j4627N2024J1773o295m988l0570M7330j5356m8578N4157K1876
$$ 76824 56939 42312 94336 106109 99814 94826 64256 111586 96230 47652 101809 123685
453A23685m7389l3295M2110j1223m4369n413L8038L3276P219l1523J4724p374
$$ 123685 76296 43001 85111 73888 29519 24106 62144 95420 102639 71116 85840 78466
441G8466m709M0662K5747l9613l4818L2135J052P835L331l1062j5290K5665J6940
$$ 78466 73757 114419 140166 100553 65735 97870 98922 106757 110088 79026 63736 89401 106341
428A06341l6324M406j7598J2153J5882J7901j7460k9060k5211k1932Q305K4374
$$ 106341 70017 74423 56825 68978 84860 102761 85301 56241 31030 9098 17403 41777
416D1777L0080J3152l6895M0036j8917m9203M2998J9983k1864L79j4214o123K9706
$$ 41777 71857 85009 48114 88150 69233 20030 63028 83011 61147 61526 47312 41189 70895
403G0895L2763j8456k0836J8031k3049K414M036N918j2852K7981P277R732o557
$$ 70895 103658 85202 64366 82397 59348 61762 65798 71716 58864 86845 94122 103854 97297
390I7297N479k5425j3305n5810N4168J8773l168J645K1061P755j8008L5819j3477
$$ 97297 102776 77351 64046 8236 62404 81177 78009 79654 100715 108470 90462 126281 112804
377A12804o1493q486J6517J08459j0645l3620Q39l4403n3308M3087K8463l1533
$$ 112804 51311 42825 59342 167801 157156 123536 124375 89972 36664 79751 108214 76681
365G6681N590M9950k1031m6583k806K199K1654m356J7213m4759N70J3062n8800
$$ 76681 82271 132221 111190 64607 61801 64000 85654 81298 98511 53752 54322 67384 8584
352H584N5982J3496o179K5026j9203j3245M9173j4623o880o309l4597K9310K2329
$$ 8584 64566 78062 71883 96909 77706 64461 113634 99011 92131 85822 51225 80535 102864
339A02864J9191l3594L5216l5982R056L7363p222K452j4831k5722L367j4122j0310
$$ 102864 122055 88461 123677 87695 96751 134114 126892 129344 114513 88791 92158 78036 67726
326F7726r264J2217J3539k4699p627n024J315M3680M35j0140k969k5736N1519
$$ 67726 58462 70679 84218 59519 51892 46868 48183 91863 92298 82158 79189 53453 104972
313A04972l5440k9810M9952L3151m4555J5904K3835j8111K7859n9103K8424J124
$$ 104972 69532 39722 89674 122825 78270 94174 118009 99898 127757 68654 97078 98202
301I8202J153l7649j493L0701j9137K9317J2783J5017k5367o0927o763M1541k929
$$ 98202 99355 61706 60213 90914 71777 101094 113877 128894 103527 42600 35837 77378 74449
288G4449L0172q795n048J3249j1494l6878j6378R030J9839M4703J0514l8271J4951
$$ 74449 104621 95826 90778 104027 92533 55655 39277 48307 68146 112849 123363 85092 100043
275A00043K0040k7086J1016l9179o907P998K8693m043k1943M7014N0372m987l4645
$$ 100043 120083 92997 104013 64834 57927 65925 94618 90575 68632 115646 166018 161031 126386
262A26386l1862k4342K5401K7265l7703j2238l1080K7934J0379j345M9965K4131
$$ 126386 94524 70182 95583 122848 85145 72907 41827 69761 80140 78795 128760 152891
250A52891n1132M5201n3891J8099j047p2833j1158M7790K2652J3297L2350l0402
$$ 152891 101759 146960 93069 111168 110121 37288 26130 73920 96572 109869 142219 111817
238A11817k8510L0340P299J6317j5890r244K7684M37J565l9564J8954j6698j4934
$$ 111817 83307 113647 120946 137263 121373 112129 139813 140250 141815 102251 121205 104507 89573
225H9573l159O682R498k1269J5243P086K1362j8493l8894J0498j7944J2246j6830
$$ 89573 86414 93096 102594 81325 96568 103654 125016 106523 67629 78127 60183 72429 55599
212E5599K3090L8611L159K4560q261n7279K5752m1895j3730N385j3550N1276K3709
$$ 55599 78689 117300 120459 145019 136758 79479 105231 63336 49606 54991 41441 92717 116426
199A16426j6784J017j6723j3613O1837L732K895m5948J1163l7053K2744L3597
$$ 116426 99642 100659 83936 70323 132160 135892 138787 92839 104002 66949 89693 123290
187A23290n7403o112j1418L4956j2979L1983j5274L9061j3668l2640Q26O3996
$$ 123290 65887 59775 48357 83313 70334 102317 87043 126104 112436 79796 80622 144618
175A44618j92n0587K6527M179j2009L0584l3302l1999j2552J2359p432K0637K1207
$$ 144618 144426 93839 120366 124545 112536 143120 109818 77819 65267 77626 70194 90831 112038
162A12038K6320K2709K4851j5890l4241l3829q494J4148m401r005M3270k6491
$$ 112038 138358 161067 185918 170028 135787 101958 93464 107612 103211 94206 137476 110985
150A10985q417M8092l4463J5590J841Q636J0729j0308k3598k0267P366J6122J2121
$$ 110985 102568 150660 116197 131787 133628 142264 152993 142685 119087 98820 106186 122308 134429
137A34429j4979K6859j7970l4086K8947j9306k3212j4648K0322K5702K4901J5190
$$ 134429 119450 146309 128339 94253 123200 103894 80682 66034 86356 112058 136959 152149
125A52149j820O056k5470K6j3178m166K1961M407j5531P260m0020l704j4328j5515
$$ 152149 150329 156385 130915 130941 117763 113597 135558 139965 124434 131694 91674 87970 73642 58127
111E8127J5138N491j7475M118N2959J2610n5398k5349M8042o160N3070l5950l5798
$$ 58127 73265 78756 61281 65399 118358 130968 75570 50221 98263 92103 145173 109223 73425
98G3425R675K4722P001k578l1189K7416r83p138M5115P63l0941J8716K3235j0043
$$ 73425 83100 107822 114823 112245 81056 108472 107489 100351 145466 146229 115288 134004 157239 147196
84A47196p454N86j9443k0618M502o300o413K3302J9633K997k8617K731l119J7432
$$ 147196 139742 140328 120885 100267 104769 98469 92056 115358 134991 137988 109371 112102 108983 126415
70A26415m1328N266K9666l5412J3926L6440J180Q217L902N943Q748q668k6410
$$ 126415 85087 90353 120019 84607 98533 134973 136153 144370 148272 154215 162963 154295 127885
57A27885k7446K0741o986j1347J3471j4275j5948Q429J6052K5007j618k2487J8980
$$ 127885 100439 121180 114194 102847 116318 102043 86095 94524 110576 135583 133965 111478 130458
44A30458Q718J5090j0690l6714n194j929j6764K4317K097K2491L1484M934n6755
$$ 130458 139176 154266 143576 106862 101668 99739 82975 107292 109389 131880 163364 168298 111543
31A11543j9534J4517r892j7059J7255k1750K0870L3048R090J5458k6694J5686
$$ 111543 92009 106526 96634 79575 96830 75080 95950 128998 138088 153546 126852 142538
19A42538p597K1856r670k7556J0473K1967k2833P390j3544K6820k7609J7251L1152
$$ 142538 134941 156797 147127 119571 130044 152011 129178 136568 123024 149844 122235 139486 170638
6A70638k4327j0838m4454K525J0781J3738
$$ 170638 146311 135473 91019 93544 104325 118063
0A18063
$$ 118063
$$ Imaginary data points
##PAGE= N=2
##DATA TABLE= (X++(I..I)), XYDATA
16383a792396J1227J7638O3294j156K7187L2524J8196J7204M4647J2320M9382
$$ -1792396 -1781169 -1763531 -1700237 -1701393 -1674206 -1641682 -1623486 -1606282 -1561635 -1549315 -1499933
16372a499933L4472K1866Q090o462N2174N1454L7124K0440L0886Q194K2925M7462
$$ -1499933 -1465461 -1443595 -1435505 -1441967 -1389793 -1338339 -1301215 -1280775 -1249889 -1241695 -1218770 -1171308
16360a171308K6142K69L2507o466O4897L7274L0061M1584R291K7266K9059k5266
$$ -1171308 -1145166 -1144897 -1112390 -1118856 -1053959 -1016685 -986624 -945040 -935749 -908483 -879424 -904690
16348i04690J4793M4900K8802L2989j452J8294Q8453L9484M136L0400M251K5859
$$ -904690 -889897 -844997 -816195 -783206 -784658 -766364 -677911 -638427 -634291 -603891 -599640 -573781
16336e73781M4536M6660q468N6544K3396L8622K264K3434q718O509N1335L9385
$$ -573781 -529245 -482585 -491053 -434509 -411113 -372491 -370227 -346793 -355511 -349002 -297667 -258282
16324b58282Q856J3914M7856L8177N3666j4994J9344Q726N904L4845M2197q832
$$ -258282 -249426 -235512 -187656 -149479 -95813 -110807 -91463 -82737 -76833 -41988 209 -8623
16312h623P770N1447M6616K0480N4977K1923M184o16O0991J6251j8452L9754N3044
$$ -8623 -853 50594 97210 117690 172667 194590 198774 198158 259149 275400 256948 296702 349746
16299C49746l17j6039L1444L0689J4394N617L8457L8821J8305k2088L4657J0245
$$ 349746 349429 333390 364834 395523 409917 415534 453991 492812 511117 489029 523686 533931
16287E33931J4572K2570L33L5638R6886Q511n4783L6163N0702L5071K6768o113
$$ 533931 548503 571073 571406 607044 703930 712441 657658 693821 744523 779594 806362 800249
16275H00249k2317L5507L9312K2100N526K9576l57L2006M2270R431j2095R368
$$ 800249 777932 813439 852751 874851 880377 909953 909596 941602 983872 993303 981208 990576
16263I90576L0978K7862L5033L7543O188L047l0188L5924L2117N2178n140M0143
$$ 990576 1021554 1049416 1084449 1121992 1128180 1131227 1101039 1136963 1169080 1221258 1216118 1256261
16251A256261r112J6880L9828l6867L8578J0051M9617M1279j0360K151O9472L0481
$$ 1256261 1247149 1264029 1303857 1266990 1305568 1315619 1365236 1406515 1396155 1398306 1467778 1498259
16239A498259q490Q90J0429J1601m412J6517J7596j0417K6605P92p414K5124L9984
$$ 1498259 1489769 1490659 1501088 1512689 1508277 1524794 1542390 1531973 1558578 1559370 1551956 1577080 1617064
16226A617064J1494M957j3620L1724J2519N9366J1805p3551N613J8312Q97L9565
$$ 1617064 1628558 1633515 1619895 1651619 1664138 1723504 1735309 1661758 1667371 1685683 1686580 1726145
16214A726145P5096L372j3642k4934L4488J1349m031j4451L4486J9810j3582k8730
$$ 1726145 1801241 1804613 1790971 1766037 1800525 1811874 1807843 1793392 1827878 1847688 1834106 1805376
16202A805376k4093L1938J645R658J8878L8325N8567l3092p512L8730K8582J174
$$ 1805376 1781283 1813221 1814866 1824524 1843402 1881727 1940294 1907202 1899690 1938420 1967002 1968176
16190A968176k8J2400K3583M3393J497J0535m3838K4073O2202J546l7842J6319
$$ 1968176 1968148 1980548 2004131 2047524 2049021 2059556 2015718 2039791 2101993 2103539 2065697 2082016
16178B082016j8790O605L9309L8675R945q588K3493l2540n129K8383J5721K262
$$ 2082016 2063226 2069831 2109140 2147815 2157760 2149172 2172665 2140125 2134996 2163379 2179100 2181362
16166B181362j4687m7061K8784N0332q140J3808j7054J4403O1723j7718m6779
$$ 2181362 2166675 2119614 2148398 2198730 2190590 2204398 2187344 2201747 2263470 2245752 2198973
16155B198973L4907p616K2446k164L3878N908j7613k9666M4465q496K4097L3315
$$ 2198973 2233880 2226264 2248710 2246546 2280424 2286332 2268719 2239053 2283518 2275022 2299119 2332434
16143B332434m0491J9526J042n1969k2514Q6149K8448j813k2235P58j9369j6562
$$ 2332434 2291943 2311469 2312511 2260542 2238028 2324177 2352625 2350812 2328577 2329335 2309966 2293404
16131B293404m396M681Q9644J1179j6909L9804l6417n711K9632K132m5150Q890
$$ 2293404 2289008 2293689 2383333 2394512 2377603 2417407 2380990 2375279 2404911 2407043 2361893 2370783
16119B370783M639k142L105J545J9231k5416J6940L238n312k2790L8474k4722
$$ 2370783 2375422 2373280 2376385 2377930 2397161 2371745 2388685 2391923 2386611 2363821 2402295 2377573
16107B377573k5312N7470J0240m8424k695P1829L5639J3755n5210L0888O9629
$$ 2377573 2352261 2409731 2419971 2371547 2368852 2440681 2476320 2490075 2434865 2465753 2535382
16096B535382n5189J3816n613o0636M6742Q611l219M0805l6544k3624q693q891
$$ 2535382 2480193 2494009 2488396 2427760 2474502 2483113 2479894 2520699 2484155 2460531 2451838 2442947
16084B442947J8896J5190J408L0238j043M2829J9097p0675k0352K8790j3509Q284
$$ 2442947 2461843 2477033 2478441 2508679 2507636 2550465 2569562 2498887 2478535 2507325 2493816 2502100
16072B502100n4433m6918Q0137L1964j4887l1325J2996J9651J8268m2931n2107
$$ 2502100 2447667 2400749 2480886 2512850 2497963 2466638 2479634 2499285 2517553 2474622 2422515
16061B422515R790K0185K5092l594l5786K4205J3216n835N1521J4025n9534J6810
$$ 2422515 2432305 2452490 2477582 2473988 2438202 2462407 2475623 2469788 2521309 2535334 2475800 2492610
16049B492610L8558r690l382j796l3803N7552k5192K1913k3861J8057m6238k0607
$$ 2492610 2531168 2521478 2518096 2516300 2482497 2540049 2514857 2536770 2512909 2530966 2484728 2464121
16037B464121K7604j270J5321K2525m0099m0839N9614K8625P52j5291n2874k833
$$ 2464121 2491725 2490455 2505776 2528301 2488202 2447363 2506977 2535602 2536354 2521063 2468189 2465356
16025B465356K0827J9284J1028R619L9528K2859k1493k6557k1270n1705J2151
$$ 2465356 2486183 2505467 2516495 2526114 2565642 2588501 2567008 2540451 2519181 2467476 2479627
16014B479627p158O576J3415J8832O829o1030P2047L6592K0658o255l4807k3624
$$ 2479627 2472469 2479045 2492460 2511292 2518121 2457091 2529138 2565730 2586388 2580133 2545326 2521702
16002B521702l7282N2581j1765J6820K6759l1760j1650J4658l4427R919L8208
$$ 2521702 2484420 2537001 2525236 2542056 2568815 2537055 2525405 2540063 2505636 2515555 2553763
15991B553763J1066l8804r213K5511l1831l2859J6931K0757L2044l8076O848j3769
$$ 2553763 2564829 2526025 2516812 2542323 2510492 2477633 2494564 2515321 2547365 2509289 2516137 2502368
15979B502368K6576L0950l2710J8022k0697Q232j3397m5445r071N107J4914M4444
$$ 2502368 2528944 2559894 2527184 2545206 2524509 2532741 2519344 2473899 2464828 2469935 2484849 2529293
15967B529293K7628k187j7741k1488r815l6816M2833q400N671J6351J4575l8334
$$ 2529293 2556921 2554734 2536993 2515505 2505690 2468874 2511707 2503307 2508978 2525329 2539904 2501570
15955B501570K6508k542j3460l2046M9079M3149k1648l5471k8611M865J5750J3071
$$ 2501570 2528078 2525536 2512076 2480030 2529109 2572258 2550610 2515139 2486528 2491393 2507143 2520214
15943B520214j0730J6764k4736j088N3334l013l2911J3746j0496j7084J0704j1695
$$ 2520214 2509484 2526248 2501512 2500424 2553758 2550745 2517834 2531580 2521084 2504000 2514704 2503009
15931B503009J2312m103J3242L2056j4657L4122N452j1656Q949j6591m8496L9468
$$ 2503009 2515321 2511218 2524460 2556516 2541859 2575981 2581433 2569777 2578726 2562135 2513639 2553107
15919B553107k7477K6178J907j2897N653j6311L1859l549M1275k1998k8221j785
$$ 2553107 2525630 2551808 2553715 2540818 2546471 2530160 2562019 2558470 2599745 2577747 2549526 2547741
15907B547741K1900N1362o4101m6077J5820l253J5514o763q98M7441K8693j3752
$$ 2547741 2569641 2621003 2556902 2510825 2526645 2523392 2538906 2532143 2531245 2578686 2607379 2593627
15895B593627j0813j9268j3092K0331J3776o2862P265M2491P696J0181r059n0685
$$ 2593627 2582814 2563546 2550454 2570785 2584561 2521699 2528964 2571455 2579151 2589332 2580273 2529588
15883B529588r041m365L8542L8939l7221J006R950j6639j9021j9629O988l5931
$$ 2529588 2520547 2516182 2554724 2593663 2556442 2557448 2567398 2550759 2531738 2512109 2519097 2483166
15871B483166N4538N9561l4452R31k369j102j632J3492l6283M5515K752l0396
$$ 2483166 2537704 2597265 2562813 2563744 2561375 2560273 2558641 2572133 2535850 2581365 2584117 2553721
15859B553721k5825N0755l9763L6965k3899Q461k6107l0123J4330L2697M1156
$$ 2553721 2527896 2578651 2538888 2575853 2551954 2560415 2534308 2504185 2518515 2551212 2592368
15848B592368J217m8317l772M6285n1312o1649L7913L0004J0380l6952k0288M4101
$$ 2592368 2593585 2545268 2541496 2587781 2536469 2474820 2512733 2542737 2553117 2516165 2495877 2539978
15836B539978j0165j8452j2182j2407K460M6619L0672J8551k4791j4346n310L7485
$$ 2539978 2529813 2511361 2499179 2486772 2489232 2535851 2566523 2585074 2560283 2545937 2540627 2578112
15824B578112J3724M971j9209j132q486j4194n5923o635K4673P012N777R483J9226
$$ 2578112 2591836 2596807 2577598 2576466 2567980 2553786 2497863 2491228 2515901 2522913 2528690 2538173 2557399
$$ [...]
##END NTUPLES=NMR SPECTRUM
##END=
