##TITLE=1H_CA-8981-2
 CDCl3
 8 sc, 
 16.03.2022
##JCAMPDX= 6.0         $$ Bruker NMR JCAMP-DX V2.0
##DATA TYPE= NMR SPECTRUM
##DATA CLASS= NTUPLES
##ORIGIN= UXNMR, Bruker Analytische Messtechnik GmbH
##OWNER= root
$$ XWIN-NMR		Version 3.5
$$ Wed Mar 16 12:48:14 2022 Russian Standard Time (UT+4h)  she@DPX200
##.OBSERVE FREQUENCY= 200.131346
##.OBSERVE NUCLEUS= ^1H
##.ACQUISITION MODE= SIMULTANEOUS
##.ACQUISITION SCHEME= undefined
##.AVERAGES= 8
##.DIGITISER RES= 18
##SPECTROMETER/DATA SYSTEM= spect
##.PULSE SEQUENCE= zg30
##.SOLVENT NAME= Acetone
##.SHIFT REFERENCE= (INTERNAL, Acetone, 0, 15.7094)
##AUDIT TRAIL= $$ (NUMBER, WHEN, WHO, WHERE, WHAT)
$$ ##TITLE= Audit trail, XWIN-NMR		Version 3.5
$$ ##JCAMPDX= 5.01
$$ ##ORIGIN= Bruker BioSpin GmbH
$$ ##OWNER= she
$$ F:/spectra/data/she/nmr/H-F/1/pdata/1/auditp.txt
$$ ##AUDIT TRAIL=  $$ (NUMBER, WHEN, WHO, WHERE, WHAT)
(   1,<2022-03-16 12:46:41.54 +0400>,<she>,<DPX200>,
      <created by zg, POWCHK disabled, PULCHK disabled
       configuration hash MD5:
       00 E9 B6 7A A2 85 ED C7 34 08 36 98 17 FE 4E 26
       data hash MD5: 16K
       48 3C F6 06 8E 14 A5 02 5D 0B AD 7F E8 5D CF B7>)
(   2,<2022-03-16 12:47:11.57 +0400>,<she>,<DPX200>,
      <Start of raw data processing
       efp BC_mod = 2 LB = 0.24 FT_mod = 6 PKNL = 1 PHC0 = -16947.36 PHC1 = 7.800779 SI = 16K 
       data hash MD5: 16K
       77 B9 88 04 5F 33 6D A2 54 6C 92 B7 B7 C4 60 34>)
(   3,<2022-03-16 12:47:30.40 +0400>,<she>,<DPX200>,
      <pk PHC0 = -1.170787 PHC1 = 1.2 
       data hash MD5: 16K
       00 32 D4 91 0E B5 79 CF CD 99 75 9E 0F 8C 57 5D>)
(   4,<2022-03-16 12:47:34.00 +0400>,<she>,<DPX200>,
      <abs ABSG = 5 
       data hash MD5: 16K
       44 FB A4 B8 25 2F DB C2 C3 F3 20 79 9E C4 F9 0A>)
$$ ##END=
$$ 
$$ hash MD5
$$ 55 25 1A 87 38 90 41 A6 24 AF 24 46 4A C8 EE A4
##$RELAX= 
##$RELAX= 
##$RELAX= 
##$RELAX= 
##$RELAX= 
##$RELAX= 
$$ Bruker specific parameters
$$ --------------------------
##$DU= <F:/spectra>
##$EXPNO= 1
##$NAME= <H-F>
##$PROCNO= 1
##$TYPE= <nmr>
##$USER= <she>
##$AMP= (0..31)
100 100 100 100 100 100 100 100 100 100 100 100 100 100 100 100 100 100 
100 100 100 100 100 100 100 100 100 100 100 100 100 100 
##$AQSEQ= 0
##$AQ_mod= 1
##$AUNM= <au_zg>
##$AUTOPOS= <>
##$BF1= 200.13
##$BF2= 200.13
##$BF3= 200.13
##$BF4= 200.13
##$BF5= 200.13
##$BF6= 200.13
##$BF7= 200.13
##$BF8= 200.13
##$BYTORDA= 1
##$CFDGTYP= 0
##$CFRGTYP= 5
##$CHEMSTR= <none>
##$CNST= (0..31)
1 1 145 1 1 1 1 1 1 1 1 1 1 1 1 1 1 1 1 1 1 1 1 1 1 1 1 1 1 1 1 1 
##$CPDPRG= <>
##$CPDPRG1= <>
##$CPDPRG2= <>
##$CPDPRG3= <>
##$CPDPRG4= <mlev>
##$CPDPRG5= <mlev>
##$CPDPRG6= <mlev>
##$CPDPRG7= <mlev>
##$CPDPRG8= <mlev>
##$CPDPRGB= <>
##$CPDPRGT= <>
##$D= (0..31)
0 1.2 0 0 0 0 0 0 0 0.06 0 0.03 0 0 0 0 0.0002 0 0 0 0 0 0 0 0 0 0 0 0 
0 0 0 
##$DATE= 1647420400
##$DBL= (0..7)
120 120 120 120 120 120 120 120 
##$DBP= (0..7)
150 150 150 150 150 150 150 150 
##$DBP07= 0
##$DBPNAM0= <>
##$DBPNAM1= <>
##$DBPNAM2= <>
##$DBPNAM3= <>
##$DBPNAM4= <>
$$ [...]
##$SUBNAM2= <"">
##$SUBNAM3= <"">
##$SUBNAM4= <"">
##$SUBNAM5= <"">
##$SUBNAM6= <"">
##$SUBNAM7= <"">
##$SUBNAM8= <"">
##$SUBNAM9= <"">
##$SW= 18.0517287032376
##$SWIBOX= (0..15)
0 0 2 0 0 0 0 0 0 0 0 0 0 0 0 0 
##$SW_h= 3612.71676300578
##$TD= 16384
##$TD0= 1
##$TE= 0
##$TE2= 300
##$TE3= 300
##$TEG= 300
##$TL= (0..7)
0 120 120 120 120 120 120 120 
##$TP= (0..7)
150 150 150 150 150 150 150 150 
##$TP07= 0
##$TPNAME0= <>
##$TPNAME1= <>
##$TPNAME2= <>
##$TPNAME3= <>
##$TPNAME4= <>
##$TPNAME5= <>
##$TPNAME6= <>
##$TPNAME7= <>
##$TPOAL= (0..7)
0.5 0.5 0.5 0.5 0.5 0.5 0.5 0.5 
##$TPOFFS= (0..7)
0 0 0 0 0 0 0 0 
##$TUNHIN= 0
##$TUNHOUT= 0
##$TUNXOUT= 0
##$USERA1= <user>
##$USERA2= <user>
##$USERA3= <user>
##$USERA4= <user>
##$USERA5= <user>
##$V9= 5
##$VALIST= <valist>
##$VCLIST= <CCCCCCCCCCCCCCC>
##$VD= 0
##$VDLIST= <DDDDDDDDDDDDDDD>
##$VPLIST= <PPPPPPPPPPPPPPP>
##$VTLIST= <TTTTTTTTTTTTTTT>
##$WBST= 1024
##$WBSW= 4
##$XGAIN= (0..3)
0 0 0 0 
##$XL= 0
##$YL= 0
##$YMAX_a= 334397
##$YMIN_a= -644612
##$ZGOPTNS= <>
##$ZL1= 120
##$ZL2= 120
##$ZL3= 120
##$ZL4= 120
##$ABSF1= 15.67306
##$ABSF2= -2.378789
##$ABSG= 5
##$ABSL= 3
##$ALPHA= 0
##$AQORDER= 0
##$ASSFAC= 0
##$ASSFACI= 0
##$ASSFACX= 0
##$ASSWID= 0
##$AUNMP= <proc_1d>
##$AZFE= 0.1
##$AZFW= 0.1
##$BCFW= 0
##$BC_mod= 2
##$BYTORDP= 0
##$COROFFS= 0
##$CY= -3
##$DATMOD= 1
##$DC= 0
##$DFILT= <>
##$DTYPP= 0
##$F1P= 0
##$F2P= 0
##$FCOR= 1
##$FTSIZE= 16384
##$FT_mod= 6
##$GAMMA= 0
##$GB= 0
##$INTBC= 1
##$INTSCL= 0
##$ISEN= 128
##$LB= 0.24
##$LEV0= 0
##$LPBIN= 0
##$MAXI= 10000
##$MC2= 0
##$MEAN= 0
##$ME_mod= 0
##$MI= 1.114404
##$NCOEF= 0
##$NC_proc= -6
##$NLEV= 6
##$NOISF1= 3.799351
##$NOISF2= 2.8
##$NSP= 0
##$NTH_PI= 0
##$NZP= 0
##$OFFSET= 15.70943
##$PC= 1
##$PHC0= -16948.53
##$PHC1= 9.000779
##$PH_mod= 1
##$PKNL= yes
##$PPARMOD= 0
##$PSCAL= 0
##$PSIGN= 0
##$REVERSE= no
##$SF= 200.130008429673
##$SI= 16384
##$SIGF1= 3
##$SIGF2= 2
##$SINO= 5.538805
##$SIOLD= 16384
##$SREGLST= <1H.CDCl3>
##$SSB= 0
##$STSI= 16384
##$STSR= 0
##$SW_p= 3612.71676300578
##$SYMM= 0
##$S_DEV= 0
##$TDeff= 16384
##$TDoff= 0
##$TI= <>
##$TILT= no
##$TM1= 0
##$TM2= 0
##$TOPLEV= 0
##$USERP1= <user>
##$USERP2= <user>
##$USERP3= <user>
##$USERP4= <user>
##$USERP5= <user>
##$WDW= 1
##$XDIM= 16384
##$YMAX_p= 366749039
##$YMIN_p= -493301
$$ End of Bruker specific parameters
$$ ---------------------------------
##NTUPLES= NMR SPECTRUM
##VAR_NAME=  FREQUENCY,     SPECTRUM/REAL,   SPECTRUM/IMAG
##SYMBOL=    X,             R,               I
##VAR_TYPE=  INDEPENDENT,   DEPENDENT,       DEPENDENT
##VAR_FORM=  AFFN,          ASDF,            ASDF
##VAR_DIM=   16384,         16384,           16384
##UNITS=     HZ,            ARBITRARY UNITS, ARBITRARY UNITS
##FACTOR=    0.220516191357247, 1,           1
##FIRST=     3143.92830647283, 0,            0
##LAST=      -468.788456532954, 0,           0
##MIN=       -468.788456532954, -493301,     0
##MAX=       3143.92830647283, 366749039,    0
$$ Real data points
##PAGE= N=1
##DATA TABLE= (X++(R..R)), XYDATA
$$ [...]
7385C230733n4994Q0052M1670p6090q447O1369k9681K6170m8595N2826k6169K2665
$$ 3230733 3175739 3255791 3297461 3221371 3212924 3274293 3244612 3270782 3222187 3275013 3248844 3271509
7373C271509r116k7419J1781j10059k5770O6999n0374J1337j4262j6862K5438
$$ 3271509 3262393 3234974 3246755 3136696 3110926 3177925 3127551 3138888 3124626 3107764 3133202
7362C133202l1401n5876Q9952P5987p7198p7895K497Q8288k2212p7029N5797r2916
$$ 3133202 3101801 3045925 3135877 3211864 3134666 3056771 3059268 3147556 3125344 3048315 3104112 3011196
7350C011196m1800L2800M9506j12449l4431m5661o8379L7767J54543R1443O52
$$ 3011196 2969396 3002196 3051702 2939253 2904822 2859161 2790782 2828549 2983092 3074535 3075187
7339C075187p2996J2456o2031m4925j0780K475N8333q9626J8963K1345j8515L5504
$$ 3075187 3002191 3014647 2952616 2907691 2896911 2899386 2957719 2868093 2887056 2908401 2889886 2925390
7327B925390q5567n228k4033j1092j00217r9825N9233O4855Q5194p6524Q9019
$$ 2925390 2839823 2834595 2810562 2799470 2699253 2599428 2658661 2723516 2808710 2732186 2821205
7316B821205m7572k0468m6951l0712L9503Q9611j7397j05019m3323N2929k4143
$$ 2821205 2773633 2753165 2706214 2675502 2715005 2804616 2787219 2682200 2638877 2691806 2667663
7305B667663N5217k4599l5092p1365J12857r3312o8233J5872P3999j13628m6945
$$ 2667663 2722880 2698281 2663189 2591824 2704681 2611369 2543136 2559008 2633007 2519379 2472434
7294B472434K9877J36984Q051l0727l6195o2523O786R098p5166J22927p954j14178
$$ 2472434 2502311 2639295 2647346 2616619 2580424 2517901 2524687 2533785 2458619 2581546 2573592 2459414
7282B459414m044J352m634M8155l7937K2109J12767J5994m585j11175N794M4216
$$ 2459414 2455370 2456722 2452088 2500243 2462306 2484415 2597182 2613176 2608591 2497416 2503210 2547426
7270B547426K985l196J2713N861K0357l301k2415n6213Q7999O6586q7723L2031
$$ 2547426 2550411 2547215 2559928 2565789 2586146 2582845 2560430 2504217 2592216 2658802 2571079 2603110
7258B603110J403K3605j9050j18634l41m4199n297j4077m2140j9004q1096k6562
$$ 2603110 2604513 2628118 2609068 2490434 2490093 2445894 2440597 2426520 2384380 2365376 2284280 2257718
7246B257718J26503m9738j64114l2670P7764K1691O3494n4848j01052Q5856Q4984
$$ 2257718 2384221 2334483 2170369 2137699 2215463 2237154 2300648 2245800 2144748 2230604 2315588
7235B315588r3432o6949o8903J20861p8372o0228l4163Q573m1416O009k9931l7797
$$ 2315588 2222156 2155207 2086304 2207165 2128793 2068565 2034402 2042975 2001559 2007568 1977637 1939840
7223A939840K5417J17175k7148q7272j7285O1532k3081K8962o1580Q2933M2842
$$ 1939840 1965257 2082432 2055284 1968012 1950727 2012259 1989178 2018140 1956560 2039493 2082335
7212B082335p6290o5505L4572j4696k7807J00267k0271j07363Q08O5642k2354
$$ 2082335 2006045 1940540 1975112 1960416 1932609 2032876 2012605 1905242 1906050 1971692 1949338
7201A949338J9j2442M8721k8882p8188m5665k530M8638Q575K2789N679L1916K2020
$$ 1949338 1949357 1936915 1985636 1956754 1878566 1832901 1830371 1879009 1887584 1910373 1916052 1947968 1969988
7188A969988J8765j0186j24619k3259L6552L4946k5059L6764K3244P876M2618
$$ 1969988 1988753 1978567 1853948 1830689 1867241 1902187 1877128 1913892 1937136 1945012 1987630
7177A987630j031l9592p8012n0251J00896j9689K084q6724o2285o6962l9124J9693
$$ 1987630 1986599 1947007 1868995 1818744 1919640 1899951 1902035 1815311 1753026 1686064 1646940 1666633
7165A666633J20104n4930O353K9840k3316q277R301j7595j351k7634j41016J3212
$$ 1666633 1786737 1731807 1738160 1768000 1744684 1736407 1745708 1728113 1726762 1699128 1558112 1571324
7153A571324J7820K5526K1398M0767j14865M2349J8943q5915J4841M9465o8506
$$ 1571324 1589144 1614670 1636068 1676835 1561970 1604319 1623262 1537347 1552188 1601653 1533147
7142A533147p6224j2190J31193O9713r3761l4266q8153J82679l5249n1875j8290
$$ 1533147 1456923 1444733 1575926 1645639 1551878 1517612 1429459 1612138 1576889 1525014 1506724
7131A506724k8848J2408j3803J1279J62945r0323N9495K4014q8503Q723n0400
$$ 1506724 1477876 1490284 1476481 1487760 1650705 1560382 1619877 1643891 1555388 1564111 1513711
7120A513711J2519J3683l9080k7418K8447p1364R257J5839R3123o8799j16618
$$ 1513711 1526230 1539913 1500833 1473415 1501862 1430498 1439755 1455594 1548717 1479918 1363300
7109A363300l4568J40341J6138N9157K1470j26387o2753M881P0146o9804Q8855
$$ 1363300 1328732 1469073 1485211 1544368 1565838 1439451 1376698 1381579 1451725 1381921 1470776
7098A470776j8571M3342j3028q6491n8173J31586J27635k0957j12323o9770O5325
$$ 1470776 1452205 1495547 1482519 1396028 1337855 1469441 1597076 1576119 1463796 1394026 1459351
7087A459351L5478j454p4235O7807J49327K025l1119j9965M3758K2289j55258
$$ 1459351 1494829 1493375 1419140 1486947 1636274 1638299 1607180 1587215 1630973 1653262 1498004
7076A498004M3392l2597j0602l2307j01729k6320k079O5446K4348Q2018k8187
$$ 1498004 1541396 1508799 1498197 1465890 1364161 1337841 1335762 1401208 1425556 1507574 1479387
7065A479387M2946j5409j70408l2969q6073J04076l6313J17112j05325K105J19695
$$ 1479387 1522333 1506924 1336516 1303547 1217474 1321550 1285237 1402349 1297024 1299129 1418824
7054A418824o2255m5579Q0750O6183l9945j4736J1486L2430m0196M1202O5234
$$ 1418824 1356569 1310990 1391740 1457923 1417978 1403242 1414728 1447158 1406962 1448164 1513398
7043A513398m4790M9033K2679j12625l6434J49607Q3910j0778l3204o2478N7581
$$ 1513398 1468608 1517641 1540320 1427695 1391261 1540868 1624778 1614000 1580796 1518318 1575899
7032A575899m7890j29723k7458M0485P8741M529R1709J43189j9680j06320k230
$$ 1575899 1528009 1398286 1370828 1411313 1490054 1494583 1586292 1729481 1709801 1603481 1601251
7021A601251L5835l9517l1069O2184L1480l8791O2218p8538J9348K7178j8134
$$ 1601251 1637086 1597569 1566500 1628684 1660164 1621373 1683591 1605053 1624401 1651579 1633445
7010A633445m0151j12390l3954l7392L6306L6573n4474l1900k9266l6293o7950
$$ 1633445 1593294 1480904 1446950 1409558 1445864 1482437 1427963 1396063 1366797 1330504 1262554
6999A262554k176k2246J7603m6407M6739J1891q2057K6238M3885o7762J3291p1721
$$ 1262554 1260378 1238132 1255735 1209328 1256067 1267958 1185901 1212139 1256024 1188262 1201553 1129832
6987A129832l7288m1909L3590J17932k593j48296O5313K18681p3236J7418K7605
$$ 1129832 1092544 1050635 1084225 1202157 1199564 1051268 1116581 1335262 1262026 1279444 1307049
6976A307049o1936L0654m9803O8282l1089j14847N9091k1433q6815L100J8228
$$ 1307049 1245113 1275767 1225964 1294246 1263157 1148310 1207401 1185968 1099153 1102253 1120481
6965A120481L9825N15n8755P595j6567M4293n5687M0638L9998r552l9178k7792
$$ 1120481 1160306 1160821 1102066 1109661 1093094 1137387 1081700 1122338 1162336 1152784 1113606 1085814
6953A085814J11729r8398L3486R789o2369M4360P0203N161p0869o8785j02578
$$ 1085814 1197543 1099145 1132631 1142420 1080051 1124411 1194614 1199775 1128906 1060121 957543
6942I57543R7521O5669j3179p4864N9955M7678q6122q8570R2336j1344M1337M9425
$$ 957543 1055064 1120733 1107554 1032690 1092645 1140323 1054201 965631 1057967 1046623 1087960 1137385
6930A137385J8544j556q5193J09081o8097Q984M4658m514l6844Q288q494O3168
$$ 1137385 1155929 1154373 1069180 1178261 1110164 1119148 1163806 1159292 1122448 1130736 1122242 1185410
6918A185410R9783L5688J10390k7695K5370k9277j4427J1941m4085O8218L0741
$$ 1185410 1285193 1320881 1431271 1403576 1428946 1399669 1385242 1397183 1353098 1421316 1452057
6907A452057p913J2310p7721j4813J32098l3174j03999N0403p3823j6499k2644
$$ 1452057 1444144 1456454 1378733 1363920 1496018 1462844 1358845 1409248 1335425 1318926 1296282
6896A296282J18549N4308k8685p3849o5144l4773j07413K5853K352j2447P583
$$ 1296282 1414831 1469139 1440454 1366605 1301461 1266688 1159275 1185128 1187480 1175033 1182616
6885A182616j9129N7744k6980j7339j10043J7464R4518l577L5930n3465l7642
$$ 1182616 1163487 1221231 1194251 1176912 1066869 1084333 1178851 1175274 1211204 1157739 1120097
6874A120097L5351L8258M824J8753M949j8455o1179J47895J14441O1251K1112
$$ 1120097 1155448 1193706 1198530 1217283 1222232 1203777 1142598 1290493 1404934 1466185 1487297
6863A487297m4982Q1026M2077q730n6809k6006J4506Q3770R0130M2602R796l0818
$$ 1487297 1442315 1523341 1565418 1556688 1499879 1473873 1488379 1572149 1662279 1704881 1714677 1683859
6851A683859K5494J4457l1974p8729k8666j05578p493k4120o9808j07829J00588
$$ 1683859 1709353 1723810 1691836 1613107 1584441 1478863 1471370 1447250 1377442 1269613 1370201
6840A370201n0554j21266q8733L6812L230j2497m3519r1744O0819l3333j25264
$$ 1370201 1319647 1198381 1109648 1146460 1149690 1137193 1093674 1001930 1062749 1029416 904152
6829I04152O2446P2179R650N1314q3239r6744K8335K1039k5857J3231m9535O7991
$$ 904152 966598 1038777 1048427 1099741 1016502 919758 948093 969132 943275 956506 906971 974962
6817I74962M1439m0187l2441o5345j4182K2884J5758K5860k2288R257j01761l6031
$$ 974962 1016401 976214 943773 878428 864246 887130 902888 928748 906460 915717 813956 777925
6805G77925J29758N1215j11309j0444j9565p3932j7092N0142r0244n925Q5511
$$ 777925 907683 958898 847589 837145 817580 743648 726556 776698 686454 680529 766040
6794G66040k6517k261j8575M3136n4916K3602J08060o2065j8803k9631p1956N7607
$$ 766040 739523 737262 718687 761823 706907 730509 838569 776504 757701 728070 656114 713721
6782G13721L9471o3784j08922n8065R4579L8527l5789p3838j8414m0819N0684
$$ 713721 753192 689408 580486 522421 617000 655527 619738 545900 527486 486667 537351
6771E37351L7645J7573Q0522R385l6394K3684k5044n0302M09n1489m2343k0510
$$ 537351 574996 592569 673091 682476 646082 669766 644722 594420 594829 543340 500997 480487
6759D80487n0050j7283P2635Q8530n8669j00915M9058R779O8739m3703k8537O7690
$$ 480487 430437 413154 485789 574319 515650 414735 463793 473572 542311 498608 470071 537761
6747E37761n8206j6210k2175p446J01697p2593J34443L990j08231M0762k367j5388
$$ 537761 479555 463345 441170 433724 535421 462828 597271 601261 493030 533792 531425 516037
6735E16037J7393P33K4128o187l6232m1270L929m6919P088O5388j32690M4668
$$ 516037 533430 534163 558291 552104 515872 474602 478531 431612 438700 504088 371398 416066
6723D16066J19381M7648M4060p861j00196q9744P9651J7853L4615j00312q2009
$$ 416066 535447 583095 627155 619294 519098 429354 509005 526858 561473 461161 379152
6712C79152J49774M8570n741m4870p3286O8637J8930k8130R231j19327K7439O6032
$$ 379152 528926 577496 571755 526885 453599 522236 541166 513036 522267 402940 430379 496411
6700D96411k1924L1661M4020p6368M5602O1766k3649j08503j1583J1343Q2061
$$ 496411 474487 506148 550168 473800 519402 581168 557519 449016 437433 448776 530837
6689E30837o7558J5696n5145K6765O4330O1103r4465k1774J2147k7767P1875J4695
$$ 530837 463279 478975 423830 450595 514925 576028 481563 459789 471936 444169 516044 530739
6677E30739o4716m5954J5826p3078k4789P6551Q6191m3570n169N982P3455k1517
$$ 530739 466023 420069 435895 362817 338028 414579 500770 457200 452031 458013 531468 509951
6665E09951j41097J8528R1194p0851q4392L8939K8018N9419J65697q9912m3352
$$ 509951 368854 387382 478576 407725 323333 362272 390290 449709 615406 525494 482142
6654D82142J39178J9223J2332r11j49784M1033K0533n1m3536J03275J3865L5951
$$ 482142 621320 640543 652875 651964 502180 543213 563746 563695 520159 623434 637299 673250
6642F73250m3473q5197k0596o449J8676j32723L6074J2068J5751O5331j2521R873
$$ 673250 629777 544580 523984 517535 536211 403488 439562 451630 467381 532712 520191 530064
6630E30064j3866q466N045m7757j1052j15854L2251J15262o0971Q6164Q6324j15423
$$ 530064 516198 507732 512777 465020 453968 338114 370365 485627 424656 510820 597144 481721
6618D81721r2657P6673r1525p1655J49987O7398j5974n7499K5270q389N874O4139
$$ 481721 389064 465737 374212 302557 452544 519942 503968 446469 471739 463350 469224 533363
6606E33363p247r6226o9334O8905m0331L585n9469P229N1548L2030N0943m2210
$$ 533363 526116 429890 360556 429461 389130 392715 333246 340475 392023 424053 474996 432786
6594D32786m2683K1977j3596J27430J0400r9104j3043J5185J0054R324J7433n651
$$ 432786 390103 412080 398484 525914 536314 437210 424167 439352 449406 458730 476163 470512
6582D70512l4767N6493j08161j1228J11846N2517l3759l7696o8918j40022J00846
$$ 470512 435745 492238 384077 372849 484695 537212 503453 465757 396839 256817 357663
6571C57663K3428O8155j1124K4275K6512j5864j03969J75P1737M3868P02P7392
$$ 357663 381091 449246 438122 462397 488909 473045 369076 369251 440988 484856 485558 562950
6559E62950k5275J8527Q5218j22548O251k4387n7375J14465J3192j3299n526l1414
$$ 562950 537675 556202 641420 518872 525123 500736 443361 557826 571018 557719 552193 520779
6547E20779O1292n5228L6204R1270k6227k2723K9746l3686l8629j1526N76n8447
$$ 520779 582071 526843 563047 654317 628090 605367 635113 601427 562798 551272 551848 493401
6535D93401p4954R4335M7272j2054o2358J13701N9389l6806N5512m787j36026
$$ 493401 418447 512782 560054 548000 485642 599343 658732 621926 677438 672651 536625
6524E36625l867J0569M2964N3686k6844j00700M722N5378o4201m4727j6705O2146
$$ 536625 532758 543327 586291 639977 613133 512433 517155 572533 508332 463605 446900 509046
6512E09046J21164K4965O869n5421j6861j0588l8464M0272N1982j02000o5457
$$ 509046 630210 655175 662044 606623 589762 579174 540710 580982 632964 530964 465507
6501D65507N5201Q1758o034j0927j9725L9367L3796l7991L5003p4946M7070M1324
$$ 465507 520708 602466 596432 585505 565780 605147 638943 600952 635955 561009 608079 649403
6489F49403L1945j0893o3111N8673O0873j9130j17166L1684M6239L3097J7805
$$ 649403 681348 670455 607344 666017 726890 707760 590594 622278 668517 701614 719419
6478G19419j05260k0385p2001L3774J52866j0040q3759p1049M4839O9485m4388
$$ 719419 614159 593774 521773 555547 708413 698373 614614 543565 588404 657889 613501
6467F13501J2033o0552J35156q846r5165P5880o6796J0784P4765M775o9366j1640
$$ 613501 625534 564982 700138 691292 596127 672007 605211 615995 690760 695535 626169 614529
6455F14529j8336O3770M7534J3994K0902q7295O2174l9054o355K4874p5950N4130
$$ 614529 596193 659963 707497 721491 742393 655098 717272 678218 671863 696737 620787 674917
6443F74917O8047j593k4504o7695p5371k751J25718P1250j33598r1623O3245j045
$$ 674917 742964 741371 716867 649172 573801 571050 696768 768018 634420 542797 606042 604997
6431F04997P0462N9150l1081O5732k9753r152N5819l9480m636q1191R8990R9474
$$ 604997 675459 734609 703528 769260 739507 730355 786174 746694 742058 660867 759857 859331
6419H59331M1066p9466o371l6646J01214L8579J8033j0885o0140k4298J34888
$$ 859331 900397 820931 814560 777914 879128 917707 935740 924855 864715 840417 975305
6408I75305k2692L5338J39404n0284l0769j2360J20810l2858n7075j2470N0060
$$ 975305 952613 987951 1127355 1077071 1046302 1033942 1154752 1121894 1064819 1052349 1102409
6397A102409P2691J4750j01043n8797R7676L1911M5076M0697O566n3332m1986
$$ 1102409 1175100 1189850 1088807 1030010 1127686 1159597 1204673 1245370 1251936 1198604 1156618
6386A156618J98156J0774l0234N046R4203M4507K7448P4766O2338l0792m840J20
$$ 1156618 1354774 1365548 1335314 1340360 1434563 1479070 1506518 1581284 1643622 1612830 1607990 1608110
6374A608110N2071q7090P3410j5831l2049R5943R5643j1098J8946r726k3138n0422
$$ 1608110 1660181 1573091 1646501 1630670 1598621 1694564 1790207 1779109 1798055 1788329 1765191 1714769
6362A714769n5609L5982P0579R9366J41395j2791m0423J28284P8009J31632M0298
$$ 1714769 1659160 1695142 1765721 1865087 2006482 1993691 1953268 2081552 2159561 2291193 2331491
6351B331491J4009n436R9395R6492J95245K521J10639J65518N8481J69658J23931
$$ 2331491 2345500 2340064 2439459 2535951 2731196 2733717 2844356 3009874 3068355 3238013 3361944
6340C361944K27880J99972J87787L44924K70192L03851M29704K85758M86459N46935
$$ 3361944 3589824 3789796 3977583 4322507 4592699 4896550 5326254 5612012 6098471 6645406
6330F645406N79349O55286N08261N04308L51802J68763k7218l79144n44634o41795
$$ 6645406 7224755 7880041 8388302 8892610 9244412 9413175 9385957 9006813 8462179 7820384
6320G820384o83304o49713n36254n22355l91181l26081k43553j66795k33999j55871
$$ 7820384 7137080 6487367 5951113 5428758 5037577 4711496 4467943 4301148 4067149 3911278
6310C911278l9124m6582j22293l6645o1924k2168j24365q6727P0126J14993o9159
$$ 3911278 3872154 3825572 3703279 3666634 3604710 3582542 3458177 3371450 3441576 3556569 3487410
6299C487410q5393j21298m8249l9091m5502p3944j35169J2684k3479L1401j779
$$ 3487410 3402017 3280719 3232470 3193379 3147877 3073933 2938764 2951448 2927969 2959370 2957591
6288B957591N7900r2418j06943M0999n6496p0395r5862j34348m6749j76681j04991
$$ 2957591 3015491 2923073 2816130 2857129 2800633 2730238 2634376 2500028 2453279 2276598 2171607
6277B171607O9933k050Q0216q2145j4228j9722j09503r8912O464K2291j54326
$$ 2171607 2241540 2239490 2319706 2237561 2223333 2203611 2094108 1995196 2001660 2023951 1869625
6266A869625j3060N722o4768N9163R3367n9843j36240n6617j3846M1565m7292
$$ 1869625 1856565 1862287 1797519 1856682 1950049 1890206 1753966 1697349 1683503 1725068 1677776
6255A677776k9178N6754m0577n7311M2062L775q7091O4182R984k620L3011j03462
$$ 1677776 1648598 1705352 1664775 1607464 1649526 1653301 1566210 1630392 1640376 1637756 1670767 1567305
6243A567305k6704J62291O6359K5334J399j1629L2172M0058P4167J27478J6439
$$ 1567305 1540601 1702892 1769251 1794585 1795984 1784355 1816527 1856585 1930752 2058230 2074669
6232B074669J42796R0716J8957l9603l4759R4606j8880P7992j08j64744l3165
$$ 2074669 2217465 2308181 2327138 2287535 2252776 2347382 2328502 2406494 2406386 2241642 2208477
6221B208477k9493j6252q7493j0030J07432j5931p5754j13978o5626P710J7007
$$ 2208477 2178984 2162732 2075239 2065209 2172641 2156710 2080956 1966978 1901352 1909062 1926069
6210A926069j6267j735r4622m0575J0551o9840L8387k0820o4850L145j08729R9174
$$ 1926069 1909802 1908067 1813445 1772870 1783421 1713581 1751968 1731148 1666298 1669443 1560714 1659888
6198A659888q92p9688r3072o1444O4417j07462m5211N524O706J7839m7871O5035
$$ 1659888 1658996 1579308 1486236 1424792 1489209 1381747 1336536 1342060 1348766 1366605 1318734 1383769
6186A383769o3744j01180O2737k0459j7057j8089j7497M9746j3392j6405J7472
$$ 1383769 1320025 1218845 1281582 1261123 1244066 1225977 1208480 1258226 1244834 1228429 1245901
6175A245901M7297m942K6339n0892L474Q0296M7884j8470j4462k4036l683r4066
$$ 1245901 1293198 1288256 1314595 1263703 1267177 1347473 1395357 1376887 1362425 1338389 1334706 1240640
6163A240640j11710Q3100O6529j28042o2676n035K018J3804j1281J9269J3805
$$ 1240640 1128930 1212030 1278559 1150517 1087841 1082806 1084824 1098628 1087347 1106616 1120421
6152A120421L6743K5292n8360M7715J06779p8360j462O0632q0491k2009L4739
$$ 1120421 1157164 1182456 1124096 1171811 1278590 1200230 1198768 1259400 1178909 1156900 1191639
6141A191639j3099m3145j01234J4207j490o0543l6897k5596M769K3648L4315k4542
$$ 1191639 1178540 1135395 1034161 1048368 1046878 986335 949438 923842 928611 952259 986574 962032
6129I62032l9002K3608j3209M4489K6624O3897r9912j40843K5878k0854J84K870
$$ 962032 923030 946638 933429 977918 1004542 1068439 968527 827684 853562 832708 832892 835762
6117H35762l9757P6338R2254j2674j23769J03801l3366o3391J20184L3066j6069
$$ 835762 796005 872343 964597 951923 828154 931955 898589 835198 955382 988448 972379
6106I72379j0820o5414j7290l10R3823Q0757k0105K7389k8832J2750q4483l6723
$$ 972379 961559 896145 878855 878545 972368 1053125 1033020 1060409 1031577 1044327 959844 923121
6094I23121M6920k868N5546j8284q4384O3299M1860r544P5893Q9682p2145r0105
$$ 923121 970041 967173 1022719 1004435 920051 983350 1025210 1015666 1091559 1181241 1109096 1018991
6082A018991J06177L2756j5633k6963K596L4236k994m0953O948Q5411J07940K2456
$$ 1018991 1125168 1157924 1142291 1115328 1117924 1152160 1149166 1108213 1115161 1200572 1308512 1330968
6070A330968k5753o3422q514Q4083O8903k4308L6191L8722J6234M6932K2694N0848
$$ 1330968 1305215 1241793 1233279 1317362 1386265 1361957 1398148 1436870 1453104 1500036 1522730 1573578
6058A573578k2402P2609k3707l8151O4164J44586r250O811K8731o6150O3441M6090
$$ 1573578 1551176 1623785 1600078 1561927 1626091 1770677 1761427 1768238 1796969 1730819 1794260 1840350
6046A840350K9296Q1736K40652J30133p1687P7321O9833N5024J40201J22993J15411
$$ 1840350 1869646 1951382 2192034 2322167 2250480 2327801 2397634 2452658 2592859 2715852 2831263
6035B831263K07888J79826K08140P6117L4713L0873N5189J16253M9412n8909j022
$$ 2831263 3039151 3218977 3427117 3503234 3537947 3568820 3624009 3740262 3789674 3730765 3729743
6024C729743j7599N3302K0928R8859J01217J146J42152J07355K16104O0332J82606
$$ 3729743 3712144 3765446 3786374 3885233 3986450 3987596 4129748 4237103 4453207 4513539 4696145
6013D696145K48109K13013L49650L50617L63201L89490M64078M92401M52318L52223
$$ 4696145 4944254 5157267 5506917 5857534 6220735 6610225 7074303 7566704 8019022 8371245
6003H371245K88239K29992Q4676q4513j07728k39746l56598l35733j62710j78318
$$ 8371245 8659484 8889476 8974152 8889639 8781911 8542165 8185567 7849834 7687124 7508806
5993G508806j18592r6991o1028k3922P4653M2617P6360J89928L13737L14962L87130
$$ 7508806 7390214 7293223 7232195 7208273 7282926 7325543 7401903 7591831 7905568 8220530 8607660
5982H607660M87435M45086N83165N42162P29265N84722M70632K09256K26120o5731
$$ 8607660 9095095 9540181 10123346 10665508 11394773 11979495 12450127 12659383 12885503 12819772
5972A2819772k76139n04265o10818o43131o70203n11554m42489m90194k97039
$$ 12819772 12543633 12039368 11428550 10785419 10115216 9603662 9161173 8670979 8373940
5963H373940l36633k11187j09035r1844k8892k8288J6168Q4069P7838K47317L13961
$$ 8373940 8037307 7826120 7717085 7625241 7596349 7568061 7584229 7668298 7746136 7993453 8307414
5952H307414K07253K76512L56301L47626R5195J25545J00018r8475k34513l05919
$$ 8307414 8514667 8791179 9147480 9495106 9590301 9715846 9815864 9717389 9482876 9176957
5942I176957o15495n07011m95914n44004l37593l38761m22901l22367k29323j12520
$$ 9176957 8561462 8054451 7558537 7014533 6676940 6338179 5915278 5592911 5363588 5251068
5932E251068k46484N799j97034j58394k1434l5558L6643K5800m1377q8932l3363
$$ 5251068 5004584 5010383 4813349 4654955 4633521 4597963 4634606 4660406 4619029 4530097 4496734
5921D496734J46585o2457j6970o7387o1843k51645j56042j18376j22585j31383
$$ 4496734 4643319 4580862 4563892 4496505 4434662 4183017 4026975 3908599 3786014 3654631
5911C654631k55706j39163j36973q8163K7175p8348k08085j47431m8928n7931
$$ 3654631 3398925 3259762 3122789 3034626 3061801 2983453 2775368 2627937 2579009 2521078
5901B521078k5346O1904l7324q529r5077l1432m2014q6204k5240J39371j6030
$$ 2521078 2495732 2557636 2520312 2511783 2416706 2385274 2343260 2257056 2231816 2371187 2355157
5890B355157q3404m2219J5973l4220k773p5248l1274j9403L9089M2057J0183P463
$$ 2355157 2271753 2229534 2245507 2211287 2208514 2133266 2101992 2082589 2121678 2163735 2173918 2181381
5878B181381j9766K5278q7574L966N4557r6870M8187r5188r412K7354M8751j42825
$$ 2181381 2161615 2186893 2099319 2103285 2157842 2060972 2109159 2013971 2004559 2031913 2080664 1937839
5866A937839J3771L1386p2760j20453j497O6854P0273J0073l1730k31l9710R650
$$ 1937839 1951610 1982996 1910236 1789783 1788286 1855140 1925413 1935486 1903756 1903525 1863815 1873465
5854A873465p5841Q015M9790k6877J7359k5529p6108K5739O5928k1872R0113L4915
$$ 1873465 1797624 1805639 1855429 1828552 1845911 1820382 1744274 1770013 1835941 1814069 1904182 1939097
5842A939097m8980M7633L2508p8918L135j8189n0587k665q2394O1419N2359M9866
$$ 1939097 1890117 1937750 1970258 1891340 1894475 1876286 1825699 1823034 1740640 1802059 1854418 1904284
5830A904284J04268N5191j9546R5637j2220l7263m4546M3057l9771O7147O8104
$$ 1904284 2008552 2063743 2044197 2139834 2127614 2090351 2045805 2088862 2049091 2116238 2184342
5819B184342K0397J06287k1109L451L7556J29723k4194j79235M5723J34534n2
$$ 2184342 2204739 2311026 2289917 2293368 2330924 2460647 2436453 2257218 2302941 2437475 2437423
5808B437423Q5619L2458j09543n4705M651M6858l5818J00912j1796j7774Q0034
$$ 2437423 2523042 2555500 2445957 2391252 2395903 2442761 2406943 2507855 2496059 2478285 2558319
5797B558319q8385N2276n585O4909J45108N6754K2090K0639M9450L7215J8548
$$ 2558319 2469934 2522210 2516625 2581534 2726642 2783396 2805486 2826125 2875575 2912790 2931338
5786B931338k4607O0204J00447j834l701R0087J27306J46360J13618m1810j35255
$$ 2931338 2906731 2966935 3067382 3065548 3061847 3151934 3279240 3425600 3539218 3497408 3362153
5775C362153J46938R6142N0935N68O0907K7321k7489O8K27956O9009r071J77578
$$ 3362153 3509091 3605233 3656168 3656736 3717643 3744964 3717475 3717543 3945499 4014508 4005437 4183015
5763D183015J18346M3842J39554j10661O9399K82503J07569J00528J70999K63916
$$ 4183015 4301361 4345203 4484757 4374096 4443495 4725998 4833567 4934095 5105094 5369010
5753E369010J77769J73403K47872K49754K01901J94327K20517L57334M00487N02268
$$ 5369010 5546779 5720182 5968054 6217808 6419709 6614036 6834553 7191887 7592374 8094642
5743H094642M28861L90308L46808M15599L93676L10753J41378M3637L2654j91154
$$ 8094642 8523503 8913811 9260619 9676218 10069894 10380647 10522025 10565662 10598316 10407162
5733A0407162m75164m15538l64389m49869l80424l50329l39686l12665k74500
$$ 10407162 9931998 9516460 9152071 8702202 8321778 7971449 7631763 7319098 7044598
5724G044598k50547j88314j98544n8040j21194k07199j10459m2827j06845j33891
$$ 7044598 6794051 6605737 6407193 6349153 6227959 6020760 5910301 5867474 5760629 5626738
5714E626738M1739j52634p2534r1385n8463J0862j275R2627l1961m0271l3856
$$ 5626738 5668477 5515843 5443309 5351924 5293461 5304323 5303048 5395675 5363714 5323443 5289587
5703E289587J8346j7599J02681M2383j10800j17292K632P2399n4312r4553n9630
$$ 5289587 5307933 5290334 5393015 5435398 5324598 5207306 5209938 5282337 5228025 5133472 5073842
5692E073842m4224q3873n7531q2534o4067n3783p7806l448n3171q9331o7100J5538
$$ 5073842 5029618 4945745 4888214 4805680 4741613 4687830 4610024 4606576 4553405 4464074 4396974 4412512
5680D412512l6089j04613J8204l8334J5826l2773M2828Q803K9548j045j13176
$$ 4412512 4376423 4271810 4290014 4251680 4267506 4234733 4277561 4286364 4315912 4314867 4201691
5669D201691n3835P03m0179J58735J22602l069L116O324j4J5849J05320Q718L3813
$$ 4201691 4147856 4148559 4108380 4267115 4389717 4386648 4389764 4396088 4396074 4411923 4517243 4525961 4559774
5656D559774J01569j6403N9773L8901o857n7447j0207n71K3991l2163k9800P8745
$$ 4559774 4661343 4644940 4704713 4743614 4736757 4679310 4669103 4668532 4692523 4660360 4630560 4709305
5644D709305m5082m5716J67627J1109L136n2472J44516J48237k1751M9128J4070
$$ 4709305 4664223 4618507 4786134 4797243 4800379 4747907 4892423 5040660 5018909 5068037 5082107
5633E082107o820n797N936K9057J6156n1567k9630j39174K5312o0984m5417p2385
$$ 5082107 5075287 5069490 5075426 5104483 5120639 5069072 5039442 4900268 4925580 4864596 4819179 4746794
5621D746794r5803j07754j7231k1592N0606o2422j38300O7714J0760r1558l4628
$$ 4746794 4650991 4543237 4526006 4504414 4555020 4492598 4354298 4422012 4432772 4341214 4306586
5610D306586m4202k1137k3547J6352j1312q6360k8368J5324R426K01594o4985
$$ 4306586 4262384 4241247 4217700 4234052 4222740 4136380 4108012 4123336 4132762 4334356 4269371
5599D269371m078L6746j5448K7718J6769K9694N7013M5798n243j162k1824K8611
$$ 4269371 4265293 4302039 4286591 4314309 4331078 4360772 4417785 4463583 4458340 4457178 4435354 4463965
5587D463965R163l6216N070Q9784l4868j32510M8955m7300k4342M9397j3545n3253
$$ 4463965 4473128 4436912 4441982 4531766 4496898 4364388 4413343 4366043 4341701 4391098 4377553 4324300
5575D324300k5161L3641K2209K1487M8639J828j5189O7103l3926L9302j17282
$$ 4324300 4299139 4332780 4354989 4376476 4425115 4426943 4411754 4478857 4444931 4484233 4366951
5564D366951J03670O6678J01397k1302o6284K4902J26910k837m4363J01694Q411
$$ 4366951 4470621 4537299 4638696 4617394 4551110 4576012 4702922 4700085 4655722 4757416 4765827
5553D765827j3797j5773Q7624o6925K8769m6828l8608R9976o3727L1512L5236
$$ 4765827 4752030 4736257 4823881 4756956 4785725 4738897 4700289 4800265 4736538 4768050 4803286
5542D803286p6856M6870R0321L8901J40627Q7920L3267J07891L1236O2707J25809
$$ 4803286 4726430 4773300 4863621 4902522 5043149 5131069 5164336 5272227 5303463 5366170 5491979
5531E491979l9143L3533P7649k6380K5700Q4924m2000p4617M4050k633J68497
$$ 5491979 5452836 5486369 5564018 5537638 5563338 5648262 5606262 5531645 5575695 5573062 5741559
5520E741559m8115j7725R8544k9471m5934O9258o2004J0446J09473n5375K5856
$$ 5741559 5693444 5675719 5774263 5744792 5698858 5768116 5706112 5716558 5826031 5770656 5796512
5509E796512K2168j9682j1855J68422n344p4253M5340J33574J00973N6160J26599
$$ 5796512 5818680 5798998 5787143 5955565 5950221 5875968 5921308 6054882 6155855 6212015 6338614
5498F338614L871M9665J43106J01591J68449J10168J35614J77515J20130j04116
$$ 6338614 6342485 6392150 6535256 6636847 6805296 6915464 7051078 7228593 7348723 7244607
5488G244607q9856l9077n1965R7287K8287J93059O5954L9357J92901J19592P8680
$$ 7244607 7154751 7115674 7063709 7160996 7189283 7382342 7448296 7487653 7680554 7800146 7878826
5477G878826R4055P9352K11818J77039K48053J95919J30548K52112J12361J59151
$$ 7878826 7972881 8052233 8264051 8441090 8689143 8885062 9015610 9267722 9380083 9539234
5467I539234J86147K83913K15433L47234M40014M32446M14421N41180N59798J63084
$$ 9539234 9725381 10009294 10224727 10571961 11011975 11444421 11858842 12400022 12959820 13122904
5457A3122904j74979j97812j30389J4615J02079P1239J40411L07437K82340K14387
$$ 13122904 12947925 12750113 12619724 12634339 12736418 12807657 12948068 13255505 13537845 13752232
5447A3752232K82460L03438L21533M50568K96859L55906M93421L49932M44693
$$ 13752232 14034692 14338130 14659663 15110231 15407090 15762996 16256417 16606349 17051042
5438A7051042N22087O60399O24948O37847O70484P05031Q56357Q21989P86480
$$ 17051042 17573129 18233528 18858476 19496323 20166807 20871838 21728195 22550184 23336664
5429B3336664R89746J009620J094032J023111N25095N87939O49875Q48965R03544
$$ 23336664 24326410 25336030 26430062 27453173 27978268 28566207 29216082 30065047 30968591
5420C0968591J134879J268758J287150J447070J764383J923580K190044K463541
$$ 30968591 32103470 33372228 34659378 36106448 37870831 39794411 41984455 44447996
5412D4447996K613626L041277L449382L933638M543702N315129N762080O600959
$$ 44447996 47061622 50102899 53552281 57485919 62029621 67344750 73106830 79707789
5404G9707789P281394P995339Q476441Q741283Q731343Q516787Q054448P689439
$$ 79707789 86989183 94984522 103460963 112202246 120933589 129450376 137504824 145194263
5396A45194263P167635O490360N013570K452994q68877m377119p105581q314020
$$ 145194263 152361898 158852258 163865828 166318822 165449945 161072826 153967245 145653225
5388A45653225q777399q808394q818099r086736r210353r177014q695888q004698
$$ 145653225 136875826 128067432 119249333 110162597 100952244 91775230 83079342 75074644
5380G5074644p071657o102520n250168m556967l887140l484186l014597k559365
$$ 75074644 68002987 61900467 56650299 52093332 48206192 44722006 41707409 39148044
5372C9148044k299494k026041j921895j656092j579888j475119j256232j106724
$$ 39148044 36848550 34822509 32900614 31244522 29664634 28189515 26933283 25826559
5364B5826559j034056r35919q46629p55665o12207o79841o32089n44667n19420
$$ 25826559 24792503 23856584 23009955 22254290 21642083 20962242 20330153 19785486 19266066
5355A9266066n59919m53691m24793m39894n30820m90713m29713m31351l74561
$$ 19266066 18706147 18252456 17827663 17387769 16856949 16366236 15936523 15505172 15130611
5346A5130611k25220l20087l97728k86539k38659l00757j62400k88128l02924
$$ 15130611 14905391 14585304 14187576 13901037 13662378 13361621 13199221 12911093 12608169
5337A2608169k11280q5951j54005r2450j70544k30131k53616j86145j66182n7909
$$ 12608169 12396889 12310938 12156933 12064483 11893939 11663808 11410192 11224047 11057865 10999956
5327A0999956j07576k61550j34464j51289j16880l4610j82398j84713j11612j84563
$$ 10999956 10892380 10630830 10496366 10345077 10228197 10193587 10011189 9826476 9714864 9530301
5317I530301k0627j18676j47273j6123q9283j45001L3265j21985j00584l3901
$$ 9530301 9509674 9390998 9243725 9227602 9138319 8993318 9026583 8904598 8804014 8770113
5307H770113m5988j89483j25143j20435j28938n5186n8230P1500j3211n3229n3550
$$ 8770113 8724125 8534642 8409499 8289064 8160126 8104940 8046710 8118210 8104999 8051770 7998220
5296G998220k49366q0683N7736q6648o9167J05664L9109j57831J571j646M883
$$ 7998220 7748854 7668171 7725907 7639259 7570092 7675756 7714865 7557034 7558605 7556959 7561842
5285G561842j0170p3350J446p0613N6084j03464j31982l2988p5935k6212r6931
$$ 7561842 7551672 7478322 7479768 7409155 7465239 7361775 7229793 7196805 7120870 7094658 6997727
5274F997727K4235N5827L4311m2414M9856q5098j9644n330R038J06909r2697m7378
$$ 6997727 7021962 7077789 7112100 7069686 7119542 7034444 7014800 7009470 7018508 7125417 7032720 6985342
5262F985342L5544J46383J4325P1291Q154m4425K5788K4570L2264J59900J42591
$$ 6985342 7020886 7167269 7181594 7252885 7261039 7216614 7242402 7266972 7299236 7459136 7601727
5251G601727L1953P346N8451J95790K1100R8036P0979L4394J86797J31421Q2716
$$ 7601727 7633680 7641026 7699477 7895267 7916367 8014403 8085382 8119776 8306573 8437994 8520710
5240H520710J34605J54232J82689K28830K03253K64484L62875K07861K74477M73579
$$ 8520710 8655315 8809547 8992236 9221066 9424319 9688803 10051678 10259539 10534016 11007595
5230A1007595M14503M43663N43751M75911N91797O82471O22955Q31087P08753
$$ 11007595 11422098 11865761 12409512 12885423 13477220 14159691 14782646 15613733 16322486
5221A6322486O79772O14452N21589L16713J28611M2525k0920n4625L0010l5390
$$ 16322486 17002258 17616710 18138299 18455012 18583623 18626148 18605228 18550603 18580613 18545223
5211A8545223N2724O5596K8582J721J89942M01799L84606P11979J007545J130070
$$ 18545223 18597947 18663543 18692125 18693846 18883788 19285587 19670193 20382172 21389717 22519787
5201B2519787R65837P9616q23245j004399n70287k94401P4351M42567N71126O63002
$$ 22519787 23485624 23565240 22741995 21737596 21167309 20872908 20947259 21389826 21960952 22623954
5191B2623954P09187P02451M53511M31558K71793J52545K31530J81629J36877
$$ 22623954 23333141 24035592 24489103 24920661 25192454 25344999 25576529 25758158 25895035
5182B5895035J62669K1573J5051k11819m5262o1709k33718m87549o86888r31783
$$ 25895035 26057704 26079277 26094328 25882509 25837247 25775538 25541820 25054271 24367383 23435600
5172B3435600j097461j099333j168432j004019q29897p22063m62261n41501l79880
$$ 23435600 22338139 21238806 20070374 19066355 18236458 17514395 17052134 16510633 16130753
5163A6130753j42953l147Q5382J24754J34324K29740L06422L00282L75230K72326
$$ 16130753 15987800 15984653 16070035 16194789 16329113 16558853 16865275 17165557 17540787 17813113
5153A7813113K50528P3958M2511J82804J41686J05642m1346k73378l84771o80620
$$ 17813113 18063641 18137599 18180110 18362914 18504600 18610242 18568896 18295518 17910747 17230127
5143A7230127q74406r24853j048968r07703q65112q22906p46972n21531n34998
$$ 17230127 16355721 15430868 14381900 13474197 12609085 11786179 11039207 10517676 9982678
5134I982678n24025m01363l83166k53094l77642k23766k10296k18571j98974k42706
$$ 9982678 9458653 9057290 8674124 8421030 8043388 7819622 7609326 7390755 7191781 6949075
5124F949075j33859j38843k81124j63892q4079q9400r6372q4356p7171n2935r0233
$$ 6949075 6815216 6676373 6395249 6231357 6147278 6057878 5961506 5877150 5799979 5747044 5656811
5113E656811L835m7063n911q1104k0845r724r818K3950n4922k6358l6376j26278
$$ 5656811 5660646 5613583 5607672 5526568 5505723 5495999 5486181 5510131 5455209 5428851 5392475 5266197
5101E266197J03188K2746o9700P8160L8366m7853l3691K0147N9012O8741n8567
$$ 5266197 5369385 5392131 5322431 5400591 5438957 5391104 5357413 5377560 5436572 5505313 5446746
5090E446746n1160k3318K4054r288j6427P1869l212j52050r3900j52641q5534
$$ 5446746 5395586 5372268 5396322 5387034 5370607 5442476 5439264 5287214 5193314 5040673 4955139
5079D955139k8099K0166j39761j27872j16175m93O1591r3175q4254N115l1649
$$ 4955139 4927040 4947206 4807445 4679573 4563398 4562905 4624496 4531321 4447067 4452182 4420533
5068D420533q0984l6490N1277J2427P0508j07941r8921N8069R161J25113M9415
$$ 4420533 4339549 4303059 4354336 4366763 4437271 4329330 4230409 4288478 4297639 4422752 4472167
5057D472167p7921r9362m8170O9852M3448o6610L0636J07600K6231j0584K9085
$$ 4472167 4394246 4294884 4246714 4316566 4360014 4293404 4324040 4431640 4457871 4447287 4476372
5046D476372M3024l8679l0568r009P3915N0925J0800J1033O4335J38573J0010
$$ 4476372 4519396 4480717 4450149 4441140 4515055 4565980 4576780 4587813 4652148 4790721 4800731
5035D800731J14877O5203Q1494n4695O8975Q5421k2379L1522N8915J21246Q6209
$$ 4800731 4915608 4980811 5062305 5007610 5076585 5162006 5139627 5171149 5230064 5351310 5437519
5024E437519l6815l7189L7369K42504K0537q6771Q0330M4341J12196J67498R9795
$$ 5437519 5400704 5363515 5400884 5643388 5663925 5577154 5657484 5701825 5814021 5981519 6081314
5013F081314K9524J89622O6689Q7055K14437J03028J26428J33356J52338J91190
$$ 6081314 6110838 6300460 6367149 6454204 6668641 6771669 6898097 7031453 7183791 7374981
5003G374981J42677J05439J81563J81955L00834K59089L19758L29553L21824L07435
$$ 7374981 7517658 7623097 7804660 7986615 8287449 8546538 8866296 9195849 9517673 9825108
4993I825108L29902M74611M31618O35362N74108P66892Q27172P70918R08001J024699
$$ 9825108 10155010 10629621 11061239 11696601 12270709 13037601 13864773 14635691 15543692 16568391
4983A6568391R52349R95090J014231P48088N38147K27254q4341j56965l45460
$$ 16568391 17520740 18515830 19530061 20278149 20816296 21043550 20959209 20802244 20456784
4974B0456784l45522j55638k50881k67959k29558k01191k82883j55128r9577l9209
$$ 20456784 20111262 19955624 19704743 19436784 19207226 19006035 18723152 18568024 18468447 18429238
4964A8429238K4532q720J32281L90506O21704N24239P15486Q53957Q50248P94808
$$ 18429238 18453770 18445050 18577331 18967837 19589541 20113780 20829266 21683223 22533471 23328279
4954B3328279P19068Q15177N86518K83844O4357K9779j09159j76812j79515k15478
$$ 23328279 24047347 24862524 25449042 25732886 25797243 25827022 25717863 25541051 25361536 25146058
4944B5146058j04873k72084l67169j97056l19492l52880k57300k97978k50745
$$ 25146058 25041185 24769101 24401932 24204876 23885384 23532504 23275204 22977226 22726481
4935B2726481l97748o01571p28735p71079r28369p49933p19697o27513l96345
$$ 22726481 22328733 21727162 20998427 20227348 19298979 18549046 17829349 17201836 16805491
4926A6805491m13381l18828j82307k09540J5152N0518p921J50046J93390J63904
$$ 16805491 16392110 16073282 15890975 15681435 15696587 15747105 15739184 15889230 16082620 16246524
4916A6246524M7672K06570R4316J20503K02637M8214M2850m2918j95941m97057
$$ 16246524 16294196 16500766 16595082 16715585 16918222 16966436 17009286 16966368 16770427 16273370
4906A6273370o48036p55320q33286q23752q12504p14623m99112n25143m77856
$$ 16273370 15625334 14870014 14036728 13212976 12400472 11685849 11186737 10661594 10183738
4897A0183738m44544l75006k86377l08754k29630j65962k75764j37476n7602j35469
$$ 10183738 9739194 9364188 9077811 8769057 8539427 8373465 8097701 7960225 7902623 7767154
4887G767154k07425j49047p4701m9918j08625r2504j275n4462N4758j50573p4029
$$ 7767154 7559729 7410682 7335981 7286063 7177438 7084934 7083659 7029197 7083955 6933382 6859353
4876F859353K0732r1045k64412n6196L0847j442r7784j34947q0723j2132J06532
$$ 6859353 6880085 6789040 6524628 6468432 6499279 6497837 6400053 6265106 6184383 6172251 6278783
4865F278783L8196N6751O774l0021n0304o869K5671K2392Q7014n6291n8849J7527
$$ 6278783 6316979 6373730 6380504 6350483 6300179 6293310 6318981 6341373 6428387 6372096 6313247 6330774
4853F330774J12448q5330j1659J5096N2632k689j4657J8516k771K3076M8330P2752
$$ 6330774 6443222 6357892 6346233 6361329 6413961 6411272 6396615 6415131 6412360 6435436 6483766 6556518
4841F556518n242L8916K3643N901Q5248J2575q1166N5787J96700M2935j4715J14852
$$ 6556518 6551276 6590192 6613835 6619736 6704984 6717559 6636393 6692180 6888880 6931815 6917100 7031952
4829G031952m191R4214O5447R4648k1735N3783P676m606J77318L7349L3357M9608
$$ 7031952 7027761 7121975 7187422 7282070 7260335 7314118 7321794 7317188 7494506 7531855 7565212 7614820
4817G614820J11435J06566O1478J41029J93427K78161R2979J03122R8435J22738
$$ 7614820 7726255 7832821 7894299 8035328 8228755 8506916 8599895 8703017 8801452 8924190
4807H924190J71644J69623L4642J51373L07672Q4674K61804P3176J85588K37217
$$ 8924190 9095834 9265457 9300099 9451472 9759144 9843818 10105622 10178798 10364386 10601603
4797A0601603J61462L34739L26974K03015L28592M08505M72952N87494P11527
$$ 10601603 10763065 11097804 11424778 11627793 11956385 12364890 12837842 13425336 14136863
4788A4136863P81538R51714J121202J356477J564340J960671K524373L019733
$$ 14136863 14918401 15870115 16991317 18347794 19912134 21872805 24397178 27416911
4780B7416911L689114M314484M091634J608853j017636l562128n186799m915834
$$ 27416911 31106025 35420509 39512143 41120996 40103360 36541232 31354433 26438599
4772B6438599l518699k325045j621622j156206p39465n36853m41659l90861l19345
$$ 26438599 22919900 20594855 18973233 17817027 17077562 16540709 16099050 15708189 15388844
4763A5388844k20475j39030o1974j93111P504J24399J4012P8920J21832J53303
$$ 15388844 15168369 15029339 14967365 14774254 14781758 14906157 14920169 14999089 15120921 15274224
4753A5274224J79242N2277J43769J99626K43075K31427K04624K14538K38223K90787
$$ 15274224 15453466 15505743 15649512 15849138 16092213 16323640 16528264 16742802 16981025 17271812
4743A7271812L31613L78320L98720L39916O53035N78338O21392Q17370Q89009
$$ 17271812 17603425 17981745 18380465 18720381 19373416 19951754 20573146 21390516 22279525
4734B2279525R94603J214697J246246J644763K006395K122367K530699K960005
$$ 22279525 23274128 24488825 25735071 27379834 29386229 31508596 34039295 36999300
4726C6999300L716905M428107M189396J629960l50921j146218l440029m818483
$$ 36999300 40716205 45144312 49333708 50963668 50612747 49466529 46026500 41208017
4718D1208017m048980k708676j703417j145660p32024m52466l64068n10227k32921
$$ 41208017 37159037 34450361 32746944 31601284 30869260 30416794 30052726 29542499 29309578
4709B9309578j10124j88944r7525k81166k70467j40184j95726j71775j67213j502
$$ 29309578 29199454 29010510 28912985 28631819 28361352 28221168 28025442 27853667 27686454 27684952
4699B7684952N870J5007K4949q2239Q0349K01805J13184J23452J64983J73575
$$ 27684952 27690822 27705829 27730778 27648539 27728888 27930693 28043877 28167329 28332312 28505887
4689B8505887J46368N1056K6260K20221K13687K10189J88263J96871J33114K38693
$$ 28505887 28652255 28703311 28729571 28949792 29163479 29373668 29561931 29758802 29891916 30130609
4679C0130609K80477K51723N00396N38600N14235N03609O47805P17113P35198
$$ 30130609 30411086 30662809 31163205 31701805 32216040 32719649 33367454 34084567 34819765
4670C4819765Q33945R63624R85206J141039J191557J294771J401922J514731J789927
$$ 34819765 35653710 36617334 37602540 38743579 39935136 41229907 42631829 44146560 45936487
4661D5936487J891728J868217J829330J862936J747304J498448J280456R97665
$$ 45936487 47828215 49696432 51525762 53388698 55136002 56634450 57914906 58912571
4653E8912571Q24439O48913M17871L47798J42738P0685Q9864R83J09652M18350
$$ 58912571 59737010 60385923 60803794 61151592 61294330 61365015 61454879 61455862 61565514 61983864
4643F1983864P46767J084965J429069J658484K204107K529940K707350L082986
$$ 61983864 62730631 63815596 65244665 66903149 69107256 71637196 74344546 77427532
4635G7427532L449777L578941L700563L623847L638639L695150L492013L247634
$$ 77427532 80877309 84456250 88156813 91780660 95419299 99114449 102606462 105854096
4627A05854096K965801K226192Q59298j051349l288588m970370n630113n713768
$$ 105854096 108819897 111046089 111905387 110854038 107565450 102595080 96964967 91251199
4619I1251199m900481l932993k978669k123231j410450n93207m0343N83765J032696
$$ 91251199 86350718 82417725 79439056 77315825 75905375 75312168 75271825 75855590 76888286
4610G6888286J561139J922382K474346K681293K856508K750673K148402J221637
$$ 76888286 78449425 80371807 82846153 85527446 88383954 91134627 93283029 94504666
4602I4504666K04073j171171k190853l199669m088511m635209m884201m684183
$$ 94504666 94708739 93537568 91346715 88147046 84058535 79423326 74539125 69854942
4594F9854942m299516l925331l455518l152051k671487k213240k050959j764619
$$ 69854942 65555426 61630095 58174577 55022526 52351039 50137799 48086840 46322221
4586D6322221j487632j321107j123325j104393r04797q05331q08652n45881m73057
$$ 46322221 44834589 43513482 42390157 41285764 40380967 39575636 38766984 38221103 37748046
4577C7748046m79146m14481k31731l61515k51272j67966K1034Q684J42013J01914
$$ 37748046 37268900 36854419 36622688 36261173 36009901 35841935 35862969 35871653 36013666 36115580
4567C6115580J03686J27528L63156L70216L03996M31142M76676O19622P30516
$$ 36115580 36219266 36346794 36709950 37080166 37384162 37815304 38291980 38911602 39642118
4558C9642118P48868P93840R97189J282642J233199J351928J530457J763982J829184
$$ 39642118 40390986 41184826 42182015 43464657 44697856 46049784 47580241 49344223 51173407
4549E1173407J988166K149419K407898K661969K729562K812312K803519K780077
$$ 51173407 53161573 55310992 57718890 60380859 63110421 65922733 68726252 71506329
4541G1506329K775871K751323K638618K085486J864505J516050J050489O62114
$$ 71506329 74282200 77033523 79672141 81757627 83622132 85138182 86188671 86850785
4533H6850785K97792j28512m78593p72522q29661p95054p61081n21616l11193
$$ 86850785 87148577 87020065 86541472 85768950 84939289 84144235 83383154 82861538 82550345
4524H2550345j3727J86719O30045R57509J263680J381979J545442J682141J625699
$$ 82550345 82536618 82723337 83353382 84310891 85574571 86956550 88501992 90184133 91809832
4515I1809832J681790J621791J348650Q74526M62538L684p30996j161666j697658
$$ 91809832 93491622 95113413 96462063 97336589 97799127 97802811 97071815 95910149 94212491
4506I4212491j846276k177343k335399k404583k522094k579781k560915k354519
$$ 94212491 92366215 90188872 87853473 85448890 82926796 80347015 77786100 75431581
4498G5431581k190843j960633j776931j452370j128408r86934p71976p42454n81912
$$ 75431581 73240738 71280105 69503174 68050804 66922396 65935462 65163486 64421032 63839120
4489F3839120n24307m48621n46207n33295n36176o22276p55251o85800p64957
$$ 63839120 63314813 62866192 62319985 61786690 61250514 60628238 59872987 59187187 58422230
4480E8422230p03675p89759r44249j059923j022511q82031r47875p66529p89438
$$ 58422230 57718555 56928796 55984547 54924624 53902113 53020082 52072207 51305678 50516240
4471E0516240o62507l80487l09012k84367j65207j852J36601L18018L34629J73299
$$ 50516240 49853733 49473246 49164234 48879867 48714660 48712808 48849409 49167427 49502056 49675355
4461D9675355r5927L2293Q7914M59118N93657P94307Q41443P34921R97164R99264
$$ 49675355 49579428 49611721 49699635 50158753 50752410 51546717 52388160 53123081 54120245 55119509
4451E5119509J182456J141001J266777J433555J538619J668093J898734K072436
$$ 55119509 56301965 57442966 58709743 60143298 61681917 63350010 65248744 67321180
4443F7321180K464582K656767K816362L093621L435994M081378M918030N893549
$$ 67321180 69785762 72442529 75258891 78352512 81788506 85869884 90787914 96681463
4435I6681463O834522P788188Q911119J0300558J2017353J4034032J6663572J9775966
$$ 96681463 103515985 111304173 120215292 130515850 142533203 156567235 173230807 193006773
4427A93006773K3101337K6455751K9759636L2362570L1749222K4114805O198945
$$ 193006773 216108110 242563861 272323497 304686067 336435289 360550094 366749039
4420C66749039j7907078l5529225m0770184l7457242l0937873k4367560j8978507
$$ 366749039 348841961 313312736 272542552 235085310 204147437 179779877 160801370
4413A60801370j4757648j1615654r462670p791981o659561o386221o107152n864227
$$ 160801370 146043722 134428068 124965398 117173417 110513856 104127635 98020483 92156256
4405I2156256n416823n088785m747770m132431l796229l479723l063994k686540
$$ 92156256 86739433 81650648 76902878 72770447 68974218 65494495 62430501 59743961
4397E9743961k394785k286262k178335k107927j996100j772921j664960j512350
$$ 59743961 57349176 55062914 52884579 50776652 48780552 47007631 45342671 43830321
4389D3830321j279931j223642j218454j236833j088674r27079r35655r43707q59394
$$ 43830321 42550390 41326748 40108294 38871461 37782787 36855708 35920053 34976346 34116952
4380C4116952q85550q46664p95932n91837n54018o07683n20702n22356n77352
$$ 34116952 33231402 32384738 31588806 30996969 30442951 29835268 29314566 28792210 28214858
4371B8214858n59555n00279m22644l89607m71379n66332m18914k12065k92526
$$ 28214858 27655303 27155024 26732380 26342773 25871394 25305062 24886148 24674083 24381557
4362B4381557m08433l06780k81669m65100m49433l65261k92612k64838j95427
$$ 24381557 23973124 23666344 23384675 22919575 22470142 22104881 21812269 21547431 21352004
4353B1352004k49413j78802l8203k4087k13992k07192j61786j13727j60555k58747
$$ 21352004 21102591 20923789 20885586 20861499 20647507 20440315 20278529 20164802 20004247 19745500
4343A9745500k21802j15346k29445k40126j97004j30315j95552k31940o0951j86124
$$ 19745500 19523698 19408352 19178907 18938781 18741777 18611462 18415910 18183970 18123019 17936895
4333A7936895k47480p2061j06594p8208k1404j70358l2795o4272j01145k1003
$$ 17936895 17689415 17617354 17510760 17432552 17411148 17240790 17207995 17143723 17042578 17021575
4323A7021575j38251p1876l571j01862q5873J3213k439P5222P0959q4195j28218
$$ 17021575 16883324 16811448 16807877 16706015 16620142 16633355 16630916 16706138 16777097 16692902 16564684
4312A6564684p3220j093j76073k49145o7527o9962M0323j23884k6839j44071o2822
$$ 16564684 16491464 16490371 16314298 16065153 15997626 15927664 15967987 15844103 15817264 15673193 15610371
4301A5610371J0003P3135M7922m8765J42455K761R0631R1969O1826J23401K20759
$$ 15610371 15620374 15693509 15741431 15692666 15835121 15837882 15928513 16020482 16082308 16205709 16426468
4290A6426468J35481K51634L25834K77341L26735L7972k47228k54448k16715k92025
$$ 16426468 16561949 16813583 17139417 17416758 17743493 17781465 17534237 17279789 17063074 16771049
4280A6771049k21596j54766j93184j04530n8074p7444j76364k3206J6360o8044
$$ 16771049 16549453 16394687 16201503 16096973 16038899 15961455 15785091 15761885 15778245 15710201
4270A5710201L5363L43q800J9836O7789p2429J3091J49252m0887O6185k0546R0612
$$ 15710201 15745564 15745907 15737107 15756943 15824732 15752303 15765394 15914646 15873759 15939944 15919398 16010010
4258A6010010L3500M5532Q5490J06918J0779L6542J27047J05824J56592J51802
$$ 16010010 16043510 16089042 16174532 16281450 16292229 16328771 16455818 16561642 16718234 16870036
4248A6870036K87213L48284M17789K91104L62675K63425L86002L53672L35064
$$ 16870036 17157249 17505533 17923322 18214426 18577101 18840526 19226528 19580200 19915264
4239A9915264N6076L5032m0221j34410j41796j67167n2147r77q6951n3060j06524
$$ 19915264 19971340 20006372 19966151 19831741 19689945 19522778 19470631 19469654 19382703 19329643 19223119
4228A9223119j65100j31045j76881p5652N0067P5364k5009J5783J10454J0001
$$ 19223119 19058019 18926974 18750093 18674441 18724508 18799872 18774863 18790646 18901100 18911101
4218A8911101J51194K62023J7740J76404K05467J95552J26499K06354L11779K86219
$$ 18911101 19062295 19324318 19342058 19518462 19723929 19919481 20045980 20252334 20564113 20850332
4208B0850332L18705J99538Q1381J48887J21956J27326R4875J40250O7694P5697
$$ 20850332 21169037 21368575 21449956 21598843 21720799 21848125 21943000 22083250 22150944 22226641
4198B2226641j27446j05500j50111k00427j54394q4313N0776M6283J5540q1888
$$ 22226641 22099195 21993695 21843584 21643157 21488763 21404450 21455226 21501509 21517049 21435161
4188B1435161j23360j39375k1197l16300m80052m23895m50573l56700l00805j50277
$$ 21435161 21311801 21172426 21151229 20834929 20354877 19930982 19480409 19123709 18822904 18672627
4178A8672627k46539k20732o3020n0129q4371J19272N5748r159Q6639J57431m5551
$$ 18672627 18426088 18205356 18142336 18092207 18007836 18127108 18182856 18173697 18260336 18417767 18372216
4167A8372216p5874k12394k74331j78132k98494k42882k10319k32039j88966j09112
$$ 18372216 18296342 18083948 17809617 17631485 17332991 17090109 16879790 16647751 16458785 16349673
4157A6349673k00115k52379j11330j73864J3235m3342j26210p3019k28615r9234
$$ 16349673 16149558 15897179 15785849 15611985 15625220 15581878 15455668 15382649 15154034 15054800
4147A5054800Q73j3619R171m4651k0244N3122J9685M485j4690n500K1645J96076
$$ 15054800 15055673 15042054 15051225 15006574 14986330 15039452 15059137 15063622 15048932 15043432 15065077 15261153
4135A5261153K55552o6804j20177j6983n5066L8132O0010J52869J61693L29098
$$ 15261153 15516705 15449901 15329724 15312741 15257675 15295807 15355817 15508686 15670379 15999477
4125A5999477K55567K70343M80695M78488L96792M91041K89853n4036l72155n02074
$$ 15999477 16255044 16525387 17006082 17484570 17881362 18372403 18662256 18608220 18236065 17733991
4115A7733991m74883n18827m56833l45019k66202o5812j50364j63951j56667j4660
$$ 17733991 17259108 16740281 16283448 15938429 15672227 15606415 15456051 15292100 15135433 15120773
4105A5120773J41224J13684J6897j7638m4162M8259L6185P1323R0709J03758R0881
$$ 15120773 15261997 15375681 15392578 15374940 15330778 15379037 15415222 15486545 15577254 15681012 15771893
4094A5771893J63580J50043J72946K38104K65631K66528J69351R0279J08584M405
$$ 15771893 15935473 16085516 16258462 16496566 16762197 17028725 17198076 17288355 17396939 17401344
4084A7401344J06157J32705O0151K14778K08659K63673M57138L01007L26855M91018
$$ 17401344 17507501 17640206 17700357 17915135 18123794 18387467 18844605 19145612 19472467 19963485
4074A9963485N68415N04515N16092P39335P71516Q71538Q23851R71193J074021
$$ 19963485 20531900 21036415 21552507 22291842 23063358 23934896 24758747 25729940 26803961
4065B6803961R48062Q31537P60393N64460L05800n2769l09785l04737l79712l22439
$$ 26803961 27752023 28583560 29343953 29908413 30214213 30161444 29851659 29546922 29167210 28844771
4055B8844771j82826j45886J62885Q7601K18652J65168P3052L2674O9523p6856
$$ 28844771 28661945 28516059 28678944 28766545 28985197 29150365 29223417 29256091 29325614 29248758
4045B9248758p2189j58817j29689P664J1965J36945J37646J21822J49100N3810
$$ 29248758 29176569 29017752 28888063 28895727 28907692 29044637 29182283 29304105 29453205 29507015
4035B9507015N4010j12951l14118m17213m93620m39207n00204m49709m22246m01999
$$ 29507015 29561025 29448074 29133956 28716743 28223123 27783916 27283712 26834003 26411757 26009758
4025B6009758l31395k75270k25246k98140k98932l07783m99584n52516n12445
$$ 26009758 25678363 25403093 25177847 24879707 24580775 24272992 23773408 23220892 22708447
4016B2708447o37006o41369o19272n11974n21730m16376m71712m12379l64158
$$ 22708447 22071441 21430072 20810800 20298826 19777096 19360720 18889008 18476629 18112471
4007A8112471l70680k60423m14937l01306m67863m92081n23469m28920l53462
$$ 18112471 17741791 17481368 17066431 16765125 16297262 15805181 15281712 14852792 14499330
3998A4499330k27281l74522j64193k94819l36176l50378l27162l60438m83152
$$ 14499330 14272049 13897527 13733334 13438515 13102339 12751961 12424799 12064361 11581209
3989A1581209l88165k50584k94619l29522j27031k71254k24114k18873j16872
$$ 11581209 11193044 10942460 10647841 10318319 10191288 9920034 9695920 9477047 9360175
3980I360175k30420k68764o5212j54353j32587J1664k24280j45540j67779j87659
$$ 9360175 9129755 8860991 8795779 8641426 8508839 8520503 8296223 8150683 7982904 7795245
3970G795245j49413j85110q0690j09773k34090N3898q8235j02232m2283k03983
$$ 7795245 7645832 7460722 7380032 7270259 7036169 7090067 7001832 6899600 6857317 6653334
3960F653334o3308j28865q6657p9471q708j6470K5703m5494n1685j00194j40921
$$ 6653334 6590026 6461161 6374504 6295033 6286325 6269855 6295558 6250064 6198379 6098185 5957264
3949E957264N3030M3137j12555k8997K5694j40484q7048j34161j6011l7882k2194
$$ 5957264 6010294 6053431 5940876 5911879 5937573 5797089 5710041 5575880 5559869 5521987 5499793
3938E499793p9964o2817j23080l8816o7879p6297k7210j49592q5551j31741m5876
$$ 5499793 5419829 5357012 5233932 5195116 5127237 5050940 5023730 4874138 4788587 4656846 4610970
3927D610970r0082m3359R750j86463K5760Q479j96523r3983r4274m137J423m6020
$$ 4610970 4520888 4477529 4487279 4300816 4326576 4335055 4138532 4044549 3950275 3946138 3947561 3901541
3915C901541p6478Q9592j26080j03445m3089k6229J4626k3400r9125k0518J6940
$$ 3901541 3825063 3914655 3788575 3685130 3642041 3615812 3630438 3607038 3507913 3487395 3504335
3904C504335p3729q5298Q5260j37592q2926o4353M095j7030n2948M871j30684
$$ 3504335 3430606 3345308 3430568 3292976 3210050 3145697 3149792 3132762 3079814 3084685 2954001
3893B954001O0400k2227k4678m6306m1789r0429p2508P8747J26576o0184p8629
$$ 2954001 3014401 2992174 2967496 2921190 2879401 2788972 2716464 2795211 2921787 2861603 2782974
3882B782974n8530r9784o270j19093k2107L3859p9242l0777L1274o7230r253J18523
$$ 2782974 2724444 2624660 2618390 2499297 2477190 2511049 2431807 2401030 2432304 2365074 2355821 2474344
3870B474344k9220r888r9689l6510R1636k3676j09515K0045P2842P5155k4207
$$ 2474344 2445124 2435236 2335547 2299037 2390673 2366997 2257482 2277527 2350369 2425524 2401317
3859B401317j34925n311J8091o2607j9123o858L7586j2180l8313M2069R2412j16975
$$ 2401317 2266392 2261081 2279172 2216565 2197442 2190584 2228170 2215990 2177677 2219746 2312158 2195183
3847B195183R3183K1769o9807l6532N844J4739M6916Q5109n4439j112L8777q847
$$ 2195183 2288366 2310135 2240328 2203796 2209640 2224379 2271295 2356404 2301965 2300853 2339630 2330783
3835B330783j09957J21103O5471n4077O2473M9804n3901m483J34999P2892n0445
$$ 2330783 2220826 2341929 2407400 2353323 2415796 2465600 2411699 2407216 2542215 2615107 2564662
3824B564662J4235O9445j13094j08616L6811P1110Q61p0331m0750o5111p2705
$$ 2564662 2578897 2648342 2535248 2426632 2463443 2534553 2535414 2465083 2424333 2359222 2286517
3813B286517o2784k2745J45631k6148r6387l3451l8230P8425q5362J6311j12998
$$ 2286517 2223733 2200988 2346619 2320471 2224084 2190633 2152403 2230828 2145466 2161777 2048779
3802B048779r9186j4465J6544K4709r527N5279m6346M2866n0956J1027p5760O222
$$ 2048779 1949593 1935128 1951672 1976381 1966854 2022133 1975787 2018653 1967697 1978724 1902964 1909186
3790A909186K4776J2827j587j0371L5480n6056K8826k7674Q5248k8926o2053N8068
$$ 1909186 1933962 1946789 1945202 1934831 1970311 1914255 1943081 1915407 2000655 1971729 1909676 1967744
3778A967744j4900j9735n5575L7362K6338K1867N6740n3376Q696j26732P8884
$$ 1967744 1952844 1933109 1877534 1914896 1941234 1963101 2019841 1966465 1975161 1848429 1927313
3767A927313O7416J12898p8996p7732J5600n8573M2201K5119p6974J8339m9304
$$ 1927313 1994729 2107627 2028631 1950899 1966499 1907926 1950127 1975246 1898272 1916611 1867307
3756A867307r750O7847J2990k121J3473M9715K1106p0306K2501R2486j29596o486
$$ 1867307 1857557 1925404 1938394 1936273 1949746 1999461 2020567 1950261 1972762 2065248 1935652 1929166
3744A929166K0077N6516m0450p2841k0853R3116O8045L4690K0706n233P0664L8699
$$ 1929166 1949243 2005759 1965309 1892468 1871615 1964731 2032776 2067466 2088172 2082939 2153603 2192302
3732B192302L9691J3912l6574K118n1725o6672R1581Q0820m2183K1964P6860L2771
$$ 2192302 2231993 2245905 2209331 2211449 2159724 2093052 2184633 2265453 2223270 2245234 2322094 2354865
3720B354865m3447o4944J14537J14040j0596J1250K4828O8007n5291L2099R0427
$$ 2354865 2311418 2246474 2361011 2475051 2464455 2475705 2500533 2568540 2513249 2545348 2635775
3709B635775J7466n225J08609Q2271M4493m2121p4260K781k1142L8433K0582M3498
$$ 2635775 2653241 2648016 2756625 2838896 2883389 2841268 2767008 2769789 2748647 2787080 2807662 2851160
3697B851160P0578O1268J13958K6190n4933L1323J29826K409P0231R5455m611
$$ 2851160 2921738 2983006 3096964 3123154 3068221 3099544 3229370 3231779 3302010 3397465 3392854
3686C392854N9898m3846J2642J00436l7245l3837k545J0013P5043N1237J0483
$$ 3392854 3452752 3408906 3421548 3521984 3484739 3450902 3448357 3458370 3533413 3584650 3595133
3675C595133P4870M3448m5823J05459J09767j28418p3346J7685p4448l6492j8883
$$ 3595133 3670003 3713451 3667628 3773087 3882854 3754436 3681090 3698775 3624327 3587835 3568952
3664C568952K5563l3862j5637L4366Q7974J24331j30016q3646r2706k7563K7326
$$ 3568952 3594515 3560653 3545016 3579382 3667356 3791687 3661671 3578025 3485319 3457756 3485082
3653C485082m086l9726L9057O352q6837k4908M1148j3050O8627O9991n6656K5740
$$ 3485082 3480996 3441270 3480327 3486679 3399842 3374934 3416082 3403032 3471659 3541650 3484994 3510734
3641C510734K7144L2253j19428L5419l7360k9882Q1544q4167R910J15395n209
$$ 3510734 3537878 3570131 3450703 3486122 3448762 3418880 3500424 3416257 3426167 3541562 3536353
3630C536353R9572R2424m0333j8739L2848K3036l4136J7200L5386n8489N2123
$$ 3536353 3635925 3728349 3688016 3669277 3702125 3725161 3691025 3708225 3743611 3685122 3737245
3619C737245J47219j5159l6543Q2848P2356Q063k1547o035O0362Q7131m5804k1895
$$ 3737245 3884464 3869305 3832762 3915610 3987966 3996029 3974482 3968447 4028809 4115940 4070136 4048241
3607D048241K4651m4483K0815L3307M7308N4905O8377M8592m8111N1157J03928
$$ 4048241 4072892 4028409 4049224 4082531 4129839 4184744 4253121 4301713 4253602 4304759 4408687
3596D408687o8519j6699N7032k3041n7566j8237J9910J7144R8649J41916K0357
$$ 4408687 4340168 4323469 4380501 4357460 4299894 4281657 4301567 4318711 4417360 4559276 4579633
3585D579633J00291L7284L5041n0435m1601J46498k322J66234O8808Q2895R944
$$ 4579633 4679924 4717208 4752249 4701814 4660213 4806711 4804389 4970623 5039431 5122326 5132270
3574E132270P0450J16200O0091j5789P1613J9180N9741M4170P5790K04569N6307
$$ 5132270 5202720 5318920 5379011 5363222 5434835 5454015 5513756 5557926 5633716 5838285 5894592
3563E894592Q9552N4129O1834R5662Q2997K648Q8165P9883J20732L8738j3006
$$ 5894592 5984144 6038273 6100107 6195769 6278766 6281414 6369579 6449462 6570194 6608932 6595926
3552F595926J12794J35958P1088R1855J38852K16955J14544Q1877M6358O6212
$$ 6595926 6708720 6844678 6915766 7007621 7146473 7363428 7477972 7559849 7606207 7672419
3542G672419O4844Q9230K00108J04363R6318J05195J43810J16492J81938J93663
$$ 7672419 7737263 7826493 8026601 8130964 8227282 8332477 8476287 8592779 8774717 8968380
3532H968380J63063J47602J91029K03471J11044K43856J84201J00762K25517K14719
$$ 8968380 9131443 9279045 9470074 9673545 9784589 10028445 10212646 10313408 10538925 10753644
3522A0753644J48953L11396J91976J00715K33785K23029L03189J95977J89990
$$ 10753644 10902597 11213993 11405969 11506684 11740469 11963498 12266687 12462664 12652654
3513A2652654K77407J81244K18570K78946L19410K17997L64803K12708L04632
$$ 12652654 12930061 13111305 13329875 13608821 13928231 14146228 14511031 14723739 15028371
3504A5028371K81255K09317J78218K45515M15654L18341K61761L38612K03241
$$ 15028371 15309626 15518943 15697161 15942676 16358330 16676671 16938432 17277044 17480285
3495A7480285K78346J75230K63156K27914J16013K07026K59536J85622P2233J31194
$$ 17480285 17758631 17933861 18197017 18424931 18540944 18747970 19007506 19193128 19265361 19396555
3485A9396555j3183K0186o3547L234n1076J11117k5758L5455m7328j55206p5985
$$ 19396555 19383372 19403558 19340011 19343245 19292169 19403286 19377528 19412983 19365655 19210449 19134464
3474A9134464q5143L4907l7700j15194j12856j98528j16821k31131j58398l7271
$$ 19134464 19049321 19084228 19046528 18931334 18818478 18619950 18503129 18271998 18113600 18076329
3464A8076329j61753j75334j35011j36084k23483j50158l4191q0550j24409r7285
$$ 18076329 17914576 17739242 17604231 17468147 17244664 17094506 17060315 16979765 16855356 16758071
3454A6758071n4122j65362q0043j86557j26703N2753l9587r9275j77284j17887
$$ 16758071 16703949 16538587 16458544 16271987 16145284 16198037 16158450 16059175 15881891 15764004
3444A5764004L739M0313K9847m4627J9268O4762R0274J0078J63207O4714m6191
$$ 15764004 15767743 15808056 15837903 15793276 15812544 15877306 15967580 15977658 16140865 16205579 16159388
3433A6159388K95632J78805n2814J59511J70067O4559M5540P0124R4317q226p8721
$$ 16159388 16455020 16633825 16581011 16740522 16910589 16975148 17020688 17090812 17185129 17176903 17098182
3422A7098182m8037J76463j9541r4315J37961J15385P9454J1278k2215k0770j6759
$$ 17098182 17050145 17226608 17207067 17112752 17250713 17366098 17445552 17456830 17434615 17413845 17397086
3411A7397086o7925k16709k1895j06292r6238j43549n8585m1339j10839j70040
$$ 17397086 17329161 17112452 17090557 16984265 16888027 16744478 16685893 16644554 16533715 16363675
3401A6363675k8906k2655l9945L3829P383J04663r5311J42508J10979l4895J06222
$$ 16363675 16334769 16312114 16272169 16305998 16313381 16418044 16322733 16465241 16576220 16541325 16647547
3390A6647547r503P2198K0730R0058J26923K60392J52240J35779J26157K21612
$$ 16647547 16638044 16710242 16730972 16821030 16947953 17208345 17360585 17496364 17622521 17844133
3380A7844133L55588J57257P7975K90881J68095J37965L14825K97047L45295L07038
$$ 17844133 18199721 18356978 18434953 18725834 18893929 19031894 19346719 19643766 19989061 20296099
3370B0296099K36406K48022L48288L32246L71926L64272M95378M32158M80085
$$ 20296099 20532505 20780527 21128815 21461061 21832987 22197259 22692637 23124795 23604880
3361B3604880L74623M92047N55001M91240N20462N85686O92484N52303O04077
$$ 23604880 23979503 24471550 25026551 25517791 26038253 26623939 27316423 27868726 28472803
3352B8472803O80834P64993O74565Q34363Q15508P85521R50588Q52543J119442
$$ 28472803 29153637 29918630 30593195 31427558 32243066 33028587 33979175 34831718 35951160
3343C5951160J145452J196730J161136J334368J466744J553636J751617J740469
$$ 35951160 37096612 38293342 39454478 40788846 42255590 43809226 45560843 47301312
3335D7301312J963126J961623K004349K040989J944815J830013J710230J586047
$$ 47301312 49264438 51226061 53230410 55271399 57216214 59046227 60756457 62342504
3327F2342504J358267R28381P45833N69485M44396K39093K36831L69312M42580
$$ 62342504 63700771 64629152 65374985 65944470 66388866 66627959 66864790 67234102 67676682
3318F7676682M01983N45354O05236M80158N26916L58168J59799j72376k47061
$$ 67676682 68078665 68624019 69229255 69709413 70236329 70594497 70754296 70581920 70334859
3309G0334859l27820m04373o70319m83852n43104m69558l15424j60759j27084
$$ 70334859 70007039 69602666 68932347 68448495 67905391 67435833 67120409 66959650 66832566
3300F6832566k0784R9753K01621M15627M50870L87763N61824N84794M89983N82351
$$ 66832566 66811782 66911535 67113156 67528783 67979653 68367416 68929240 69514034 70004017 70586368
3290G0586368O86421O80668N65996O87400N72525O15273N92137O26200N63358
$$ 70586368 71272789 71953457 72519453 73206853 73779378 74394651 74986788 75612988 76176346
3281G6176346O39500O07022N02897N79216M43460L37902M08854L97620K43967
$$ 76176346 76815846 77422868 77925765 78504981 78948441 79286343 79695197 80092817 80336784
3272H0336784J91572J51621M0093N7042m3267R5171J0449J5670q9043k1574M5143
$$ 80336784 80528356 80679977 80720070 80777112 80733845 80829016 80839465 80855135 80766092 80744518 80789661
3261H0789661R3560P5541J56203L36595M82528O36493P78185R88411Q96015J248819
$$ 80789661 80883221 80958762 81114965 81451560 81934088 82570581 83348766 84337177 85233192 86482011
3251H6482011J438002J544774J732008J991299J980625K184537K199313K217030
$$ 86482011 87920013 89464787 91196795 93188094 95168719 97353256 99552569 101769599
3243A01769599K444810K372428K334975K132501J620500J039546M04819K35392
$$ 101769599 104214409 106586837 108921812 111054313 112674813 113714359 114119178 114354570
3235A14354570j8836k88193m39433o66009r52184j112591j214580j565387j897034
$$ 114354570 114335734 114047541 113608108 112942099 111989915 110877324 109662744 108097357 106200323
3226A06200323k076851k439978k524846k608932k745042k844675k967802k823946
$$ 106200323 104123472 101683494 99158648 96549716 93804674 90959999 87992197 85168251
3218H5168251k841688k906471k807484k815670k685683k435386k512034k228985
$$ 85168251 82326563 79420092 76612608 73796938 71111255 68675869 66163835 63934850
3210F3934850k057919j725944j532283j818770k538283k651303k307200j875001
$$ 63934850 61876931 60150987 58618704 56799934 54261651 51610348 49303148 47428147
3202D7428147j611367j356217j188994j125065q59331o93722o37355n22625m85197
$$ 47428147 45816780 44460563 43271569 42146504 41287173 40593451 39956096 39433471 38948274
3193C8948274l26762k11953k02091r4264L4528J26629K42670L04729L64576L83267
$$ 38948274 38621512 38409559 38207468 38113204 38147732 38274361 38517031 38821760 39186336 39569603
3183C9569603M78547M10107N38655N38117M91563N37077L45790L75317M2394m75668
$$ 39569603 40048150 40458257 40996912 41535029 42026592 42563669 42909459 43284776 43327170 42851502
3173D2851502o83388o96756p48161o29095m54824m03589m52406l27185j45394
$$ 42851502 42168114 41471358 40723197 40094102 39639278 39235689 38783283 38456098 38310704
3164C8310704j84840j13674k7075j4273J01644K9041J51280J53388L04579L68473
$$ 38310704 38125864 38012190 37985115 37970842 38072486 38101527 38252807 38406195 38710774 39079247
3154C9079247J42817L49585N88649M95039N47937P67799P77923P41801R11233
$$ 39079247 39222064 39571649 40160298 40655337 41203274 41971073 42748996 43490797 44402030
3145D4402030Q31793R05583Q45441Q93295J054445J000709J179892J446702J634225
$$ 44402030 45233823 46139406 46984847 47878142 48932587 49933296 51113188 52559890 54194115
3136E4194115J791858J920418K213379K427174K514503K497883K396062K446989
$$ 54194115 55985973 57906391 60119770 62546944 65061447 67559330 69955392 72402381
3128G2402381K097874J981736J750282J371051J123956Q75857M91946L20073p7927
$$ 72402381 74500255 76481991 78232273 79603324 80727280 81603137 82095083 82415156 82337229
3119H2337229p3814j78885l13006j50118j32784m6598q5456k43132j17765l5500
$$ 82337229 82263415 82084530 81771524 81621406 81488622 81442024 81356568 81113436 80995671 80960171
3109H0960171k87232l40826m10895o03734r10786r45430j184158j205192j380835
$$ 80960171 80672939 80332113 79921218 79317484 78406698 77461268 76277110 75071918 73691083
3100G3691083j345459j440524j405696j307259j326488j294904j246487j251775
$$ 73691083 72345624 70905100 69499404 68192145 66865657 65570753 64324266 63072491
3092F3072491j309762j137808j146516j207050j169012j240049j446496j603324
$$ 63072491 61762729 60624921 59478405 58271355 57102343 55862294 54415798 52812474
3084E2812474j645347j524496j505660j671213j636185j470231j480962j369313
$$ 52812474 51167127 49642631 48136971 46465758 44829573 43359342 41878380 40509067
3076D0509067j017189r91265j042701o47049p15171o37542l29373k11261m562
$$ 40509067 39491878 38500613 37457912 36810863 36095692 35458150 35128777 34917516 34912954
3067C4912954r3850L5451K73704K40767K78458M03451N50255M41354L36635O17922
$$ 34912954 34819104 34854555 35128259 35369026 35647484 36050935 36601190 37042544 37379179 37997101
3057C7997101N57991N82311L67062J76222J60669N3775j37909m41972m55619p23775
$$ 37997101 38555092 39137403 39504465 39680687 39841356 39895131 39757222 39315250 38859631 38135856
3047C8135856q64748j010078j185113j046303j158352j334706j227086j140174
$$ 38135856 37271108 36261030 35075917 34029614 32871262 31536556 30309470 29169296
3039B9169296j214918j182134j136294r89695q65148r78608r60564o46438o88734
$$ 29169296 27954378 26772244 25635950 24646255 23781107 22802499 21841935 21195497 20506763
3030B0506763o50377n30922m50603m89748m62235l16001l14550j73456l41104
$$ 20506763 19856386 19325464 18874861 18385113 17922878 17606877 17292327 17118871 16777767
3021A6777767k72713k53328k15315k99831q0355k4266k52194j36002o9468n6122
$$ 16777767 16505054 16251726 16036411 15736580 15656225 15631959 15379765 15243763 15174295 15118173
3011A5118173l4828m9468r8596R2113J4360p5944M8614N4367J23283M3753J08439
$$ 15118173 15083345 15033877 14935281 15027394 15041754 14965810 15014424 15068791 15192074 15235827 15344266
3000A5344266J59203J78851J38040J73155K83763J08835Q6756J59362J06143J5552
$$ 15344266 15503469 15682320 15820360 15993515 16277278 16386113 16472869 16632231 16738374 16753926
2990A6753926O987O370o0870q4048j19224j11643j37884l72913k81044k60781
$$ 16753926 16760913 16767283 16706413 16622365 16503141 16391498 16253614 15880701 15599657 15338876
2980A5338876k36974k41545l02786k80760k19571k81659k86203j52819j10958
$$ 15338876 15101902 14860357 14557571 14276811 14057240 13775581 13489378 13336559 13225601
2971A3225601K7359r976n8160J7461R6471j3506N6360L2507J421R6556J64313
$$ 13225601 13252960 13242984 13184824 13202285 13298756 13285250 13341610 13374117 13375538 13472094 13636407
2960A3636407M5821J88402J80978J07692Q8808K68567K65534K32509K88449K72642
$$ 13636407 13682228 13870630 14051608 14159300 14248108 14516675 14782209 15014718 15303167 15575809
2950A5575809L66357L54696K86222L69925L62558M11333M66659N20474L68785
$$ 15575809 15942166 16296862 16583084 16953009 17315567 17726900 18193559 18714033 19082818
2941A9082818M28930N20501N30458N77734O02081Q02797O43071P88944P99613
$$ 19082818 19511748 20032249 20562707 21140441 21742522 22545319 23188390 23977334 24776947
2932B4776947Q75442R70802Q60887Q46241R54508Q53969Q31917P43955O23752
$$ 24776947 25652389 26623191 27484078 28330319 29284827 30138796 30970713 31714668 32338420
2923C2338420M07203L06563K73254J77756K33087K01592L26113L12045M75227
$$ 32338420 32745623 33052186 33325440 33503196 33736283 33937875 34263988 34576033 35051260
2914C5051260O02568M84130O19392O71366O43450O82944O64598P31818Q45361
$$ 35051260 35653828 36137958 36757350 37428716 38072166 38755110 39419708 40151526 40996887
2905D0996887R55242R23359J088225J070971J104524J259594J318339J512092
$$ 40996887 41952129 42875488 43963713 45034684 46139208 47398802 48717141 50229233
2897E0229233J562079J655644J943307J953456K122000K390010K541222K646370
$$ 50229233 51791312 53446956 55390263 57343719 59465719 61855729 64396951 67043321
2889F7043321K758772K934988L008311L422368L836324M341460M634197M973174
$$ 67043321 69802093 72737081 75745392 79167760 83004084 87345544 91979741 96952915
2881I6952915N226877N485737N559891N648185N796524N835861N787699N412752
$$ 96952915 102179792 107665529 113225420 118873605 124670129 130505990 136293689 141706441
2873A41706441N049087N010619N189689O059523P320394Q730239J0160611J1507574
$$ 141706441 146755528 151766147 156955836 163015359 170335753 179065992 189226603 200734177
2865B00734177J2814982J3460805J2782489R581267L062726n842698j4361606
$$ 200734177 213549159 227009964 239792453 249373720 252436446 246593748 232232142
2858B32232142j8929787j9944249j8365682j5685579j2964821j0690399q756956
$$ 232232142 213302355 193358106 174992424 159306845 146342024 135651625 126894669
2851A26894669p064666n810803n186083n051306n553356o257992o554020o173587
$$ 126894669 119830003 114019200 108833117 103781811 98228455 91970463 85416443 79242856
2843G9242856n242277m572732l842392l310298k821640k503320k200394k218110
$$ 79242856 74000579 69427847 65585455 62275157 59453517 56950197 54749803 52531693
2835E2531693j817332j809925j756639j599178j389989j324214j317299j058613
$$ 52531693 50714361 48904436 47147797 45548619 44158630 42834416 41517117 40458504
2827D0458504j015061r12040o78002o61668n95789n76421m50526k84881k66016
$$ 40458504 39443443 38531403 37853401 37191733 36595944 36019523 35568997 35284116 35018100
2818C5018100M4035J50268L13335L05186N13171O79011O60736M98297K39419j15163
$$ 35018100 35062135 35212403 35525738 35830924 36344095 37023106 37683842 38182139 38421558 38306395
2808C8306395n52914j170543j545603j673818j770781j723210j529177j392896
$$ 38306395 37753481 36582938 35037335 33363517 31592736 29869526 28340349 26947453
2800B6947453j336870j288070r70839r71559r82967q57654p95532o02463o67217
$$ 26947453 25610583 24322513 23351674 22380115 21397148 20539494 19743962 19141499 18474282
2791A8474282m90883n58907n84203m51447l93340l78799n12673m62121l04748
$$ 18474282 17983399 17424492 16840289 16388842 15995502 15616703 15104030 14641909 14337161
2782A4337161l13270l43342l44357l28895m25478l15038l23819l04193k13444
$$ 14337161 14023891 13680549 13336192 13007297 12581819 12266781 11942962 11638769 11425325
2773A1425325k83058l67542k98504k38718k32768k30181k28599k47896k85693
$$ 11425325 11142267 10774725 10476221 10237503 10004735 9774554 9545955 9298059 9012366
2764I012366k30566j74730k40750p9645k11873j87917k00221p5528j65755j63721
$$ 9012366 8781800 8607070 8366320 8286675 8074802 7886885 7686664 7611136 7445381 7281660
2754G281660j25696j18796j69586o5514j49087j76825j01945j73734j12232k2215
$$ 7281660 7155964 7037168 6867582 6802068 6652981 6476156 6374211 6200477 6088245 6066030
2744F066030p4435j98460k23774j92382j01611r4293J01675j62003k0079j7024
$$ 6066030 5991595 5793135 5569361 5376979 5275368 5181075 5282750 5120747 5100668 5083644
2734E083644j56412j76652o2900q9418r9512k0772R1237j24115j36995j15539
$$ 5083644 4927232 4750580 4687680 4598262 4498750 4477978 4569215 4445100 4308105 4192566
2724D192566j06558K2589j22049j08005q9270K8247P450K175O714j13163r9160
$$ 4192566 4086008 4108597 3986548 3878543 3789273 3817520 3824970 3827145 3833859 3720696 3621536
2713C621536l7160n4970p028j10814m0153K4743N565j05997o2682j245j2013n5256
$$ 3621536 3584376 3529406 3522378 3411564 3371411 3396154 3401719 3295722 3233040 3231795 3219782 3164526
2701C164526j5251J717j13520j21265k1428m7437J6655m1232j14499m8952r3446
$$ 3164526 3149275 3150992 3037472 2916207 2894779 2847342 2863997 2822765 2708266 2659314 2565868
2690B565868p522P804n8328j9535M0757r2383n8045k9991j3659K33l0711j05583
$$ 2565868 2558346 2566150 2507822 2488287 2529044 2436661 2378616 2348625 2334966 2335199 2304488 2198905
2678B198905L689K7594m4737j01834N1388m9929j17303K1674L9441l4440o867
$$ 2198905 2202594 2230188 2185451 2083617 2135005 2085076 1967773 1989447 2028888 1994448 1987581
2667A987581J6310n7368l8370L3111k1599j05239j1189N614n9446M2911p766J0195
$$ 1987581 2003891 1946523 1908153 1941264 1919665 1814426 1803237 1808851 1749405 1792316 1784550 1794745
2655A794745J733l4647l8844j42367l0954j7347O7897J63709j40389k5259k9391
$$ 1794745 1796478 1761831 1722987 1580620 1549666 1532319 1600216 1763925 1623536 1598277 1568886
2644A568886J5912j5838p279M5275m7129j64963m9274L0179L2589J06995p0850
$$ 1568886 1584798 1568960 1561681 1606956 1559827 1394864 1345590 1375769 1408358 1515353 1444503
2633A444503l7515K1450J6174J8431l7696j67683M8799K4592r9482Q7096J26962
$$ 1444503 1406988 1428438 1444612 1463043 1425347 1257664 1306463 1331055 1231573 1318669 1445631
2622A445631j5190q2044m9608O8310q435n055J0711r3718l1595J5857L2929l170
$$ 1445631 1430441 1348397 1298789 1367099 1358664 1353609 1364320 1270602 1239007 1254864 1287793 1284623
2610A284623j19674n7436P9827j5905K3845k1448P0239J09628o0957R3143m4009
$$ 1284623 1164949 1107513 1187340 1171435 1195280 1173832 1244071 1353699 1292742 1385885 1341876
2599A341876j00843L1516P3695L3501k8271O6391k5086K2355J8135l9539j4264
$$ 1341876 1241033 1272549 1346244 1379745 1351474 1417865 1392779 1415134 1433269 1393730 1379466
2588A379466O0356J2386K8364P86k9153J54684M9789J2226j19254J00750J67983
$$ 1379466 1439822 1452208 1480572 1481358 1452205 1606889 1656678 1668904 1549650 1650400 1818383
2577A818383m2129r321l9465j15193n9107j72514q1943J20120J3515j20668p1309
$$ 1818383 1776254 1766933 1727468 1612275 1553168 1380654 1298711 1418831 1432346 1311678 1240369
2566A240369o1976n1521n8547n4763k3140J02800j62409p9078L3031j2778j4643
$$ 1240369 1178393 1126872 1068325 1013562 990422 1093222 930813 851735 884766 871988 857345
2555H57345o4012r6210m657R4268j04254N8029M2016j41596l495O4464r8954r6194
$$ 857345 793333 697123 692466 786734 682480 740509 782525 640929 637434 701898 602944 506750
2543E06750k8897N7951O8238n0968R837J1957n3399K0971p506m9559N6400L029
$$ 506750 477853 535804 604042 553074 562911 574868 521469 542440 534934 485375 541775 544804
2531E44804L9603J8283r4396M2988Q9906o3199M0876N6907k1877p0094r3459J4328
$$ 544804 584407 602690 508294 551282 641188 577989 618865 675772 653895 583801 490342 504670
2519E04670l5729r804Q0379J723K6525m5687p5767N1833j7076r6871l8703R9889
$$ 504670 468941 459137 539516 541239 567764 522077 446310 498143 481067 384196 345493 445382
2507D45382m9452j7754q574l2745O2305O6405k3905k1110k2252k9527K153J7422
$$ 445382 395930 378176 369602 336857 399162 465567 441662 420552 398300 368773 370926 388348
2495C88348m1127q0452J0873N987l8111J7349J15270P2993l5660n007k9987M3538
$$ 388348 347221 266769 277642 283629 245518 262867 378137 451130 415470 410463 380476 424014
2483D24014r7804j89845J01635J18790J5935l8964R354L1053J9147K3571k3664
$$ 424014 326210 136365 238000 356790 372725 333761 343115 374168 393315 416886 393222
2472C93222n9216r6739l3166k5498Q3738k3311J02379m1038j18190O0379n7922
$$ 393222 334006 237267 204101 178603 262341 239030 341409 300371 182181 242560 184638
2461A84638Q0880J4717J9869j07176j11468K0188J6243N6860m7483N3553L1802
$$ 184638 265518 280235 300104 192928 81460 101648 117891 174751 127268 180821 212623
2450B12623R2949M2252n7904l9956m4698L4785m5874J0017K8605P182j532j09028
$$ 212623 305572 347824 289920 249964 205266 240051 194177 204194 232799 239981 238449 129421
2438A29421K3927M676o1157J18385k8510m1814M3188O0321n6358N8139j20410
$$ 129421 153348 158024 96867 215252 186742 144928 188116 248437 192079 250218 129808
2427A29808m4680M6721J4390J07551j1659j01592J207l3987k7336O2514j06036
$$ 129808 85128 131849 146239 253790 242131 140539 141746 107759 80423 142937 36901
2416C6901J923J0558O5688l7854R2763m1119J05727k8886r3887L3469L1954J9375
$$ 36901 38824 49382 115070 77216 169979 128860 234587 205701 111814 145283 177237 196612
2404A96612r9497k4894J01233k6921L0205j2007l0849J11611M2942q2550N1994
$$ 196612 97115 72221 173454 146533 176738 164731 133882 245493 288435 205885 257879
2393B57879J38329l5630j7986j7065j1012p0571k293j09120R8052j3167j00977
$$ 257879 396208 360578 342592 325527 314515 243944 241651 132531 230583 217416 116439
2382A16439q2551J23992q9358P3872j5516n0059N9737p990N4405n0915j1589J6771
$$ 116439 33888 157880 68522 142394 126878 76819 136556 128566 182971 132056 120467 137238
2370A37238l3457n7079J23467q2480n295J54686j2786r4497n8324K0574M7303
$$ 137238 103781 46702 170169 87689 82394 237080 224294 129797 71473 92047 139350
2359A39350q6215R6626n5306L6804Q310r5691J13580j6297n4326N8159n7480l5613
$$ 139350 53135 149761 94455 131259 139569 43878 157458 141161 86835 144994 87514 51901
2347E1901Q7749L4069K4011M0871N0054Q6741r6693n2948n0981M4535p768Q217
$$ 51901 139650 173719 197730 238601 288655 375396 278703 225755 174774 219309 211541 219758
2335B19758n2691m7354R0432j23077K078m4492M5692o8241j8151L5022m3885N7297
$$ 219758 167067 119713 210145 87068 89146 44654 90346 22105 3954 38976 -4909 52388
2323E2388j1367m4547l761K2673Q6891p0678l8233J34777m5722O3449R0852k2692
$$ 52388 41021 -3526 -7287 15386 102277 31599 -6634 128143 82421 145870 236722 214030
2311B14030l2795j16821r1876N617K9937K5586Q2687J00304n5401k318r7358n2758
$$ 214030 181235 64414 -27462 -21845 8092 33678 116365 216669 161268 158950 61592 8834
2299H834Q3313N8468q8842J6232N6852p6305O256K3577O8294L8531J1772K4125
$$ 8834 92147 150615 61773 78005 134857 58552 64808 88385 156679 195210 206982 231107
2287B31107p0577q2819N7349N0009j7250N4293j20052r085Q3044n4784J46269
$$ 231107 160530 77711 135060 185069 167819 222112 102060 92975 176019 121235 267504
2276B67504n3566k3350l4443Q4470j35229n0793M8965K4367O1228O585M9350n6359
$$ 267504 213938 190588 156145 240615 105386 54593 103558 127925 189153 195738 245088 188729
2264A88729o3005M5630J8453q446N2497M2110M6637j21459o1723Q9865j619p9175
$$ 188729 125724 171354 189807 181361 233858 275968 322605 201146 139423 229288 227669 148494
2252A48494J852P388n672O1515P1868m1321l0886k539L6562O0278n5583L6515
$$ 148494 150346 157734 152062 213577 285445 244124 213238 210699 247261 307539 251956 288471
2240B88471k7001J0346l9428j4246K5071k2M831j3931j3463J34029J05330r0924
$$ 288471 261470 271816 232388 218142 243213 243191 248022 234091 220628 354657 459987 369063
2228C69063q5435j6131M0690R6695k8366q4144L9929L704Q3021R8415o7209L8859
$$ 369063 283628 267497 308187 404882 376516 292372 332301 336005 419026 517441 450232 489091
2216D89091q1997j3666K3186M2573l5371l5576J37549J51929k4201m1398j406
$$ 489091 407094 393428 416614 459187 423816 388240 525789 677718 653517 612119 610713
2205F10713N4030J7846L8002L3577l769M2819n8766M5020n243J35550Q7927k9661
$$ 610713 664743 682589 720591 754168 750399 793218 734452 779472 774229 909779 997706 968045
2193I68045n4710M0813n6046m377K7444P0307L5440r3017O9663J06476N4743K4655
$$ 968045 913335 954148 898102 893725 921169 991476 1026916 933899 1003562 1110038 1164781 1189436
2181A189436p44j2158L9294N2682O8075J20882j7695P6787J09497L1778J04411
$$ 1189436 1188692 1176534 1215828 1268510 1336585 1457467 1439772 1516559 1626056 1657834 1762245
2170A762245J31772j05575J03922R3288N7101J4967P5396J68813J32193J09732
$$ 1762245 1894017 1788442 1892364 1985652 2042753 2057720 2133116 2301929 2434122 2543854
2160B543854J66238Q900J87338R6571J29092Q2697J80241J32269J76271J45108
$$ 2543854 2710092 2718992 2906330 3002901 3131993 3214690 3394931 3527200 3703471 3848579
2150C848579J58306J70443K85292K23507K84703K14311M08496K69229M77892O72871
$$ 3848579 4006885 4177328 4462620 4686127 4970830 5185141 5593637 5862866 6340758 7013629
2140G013629N49366M63152O40968O69280R58052J165725J500220J977261K782943
$$ 7013629 7562995 8026147 8667115 9336395 10294447 11460172 12960392 14937653 17720596
2131A7720596L172591L618737M087637O101994Q690390R472975K63174j2190527
$$ 17720596 20893187 24511924 28599561 34701555 43391945 52864920 53128094 40937567
2123D0937567j0952426p485707m607982l193686k142141j526973j306048r71172
$$ 40937567 29985141 22499434 17891452 14697766 12555625 11028652 9722604 8751432
2115H751432r06249n00110m64728l56236j35902k77040n23392n94601n87529m83350
$$ 8751432 7845183 7345073 6880345 6524109 6388207 6111167 5587775 4993174 4405645 3922295
2105C922295k21813k21850j28623j35302j94540j33114j23860j87404n3101k08365
$$ 3922295 3700482 3478632 3350009 3214707 3020167 2887053 2763193 2575789 2522688 2314323
2095B314323j10407p7284j72298k8153j03695p8848J18997n2128m1174p1777r6108
$$ 2314323 2203916 2126632 1954334 1926181 1822486 1743638 1862635 1810507 1769333 1697556 1601448
2084A601448j49694J7308l5251j51666o9743j4166o5900l7825O5936N841j9392
$$ 1601448 1451754 1469062 1433811 1282145 1212402 1198236 1132336 1094511 1160447 1166288 1146896
2073A146896j94044j58171O2388J47059l3308K9733r7005k943j36785M019l3346
$$ 1146896 952852 794681 857069 1004128 970820 1000553 903548 900605 763820 767839 734493
2062G34493p7247o3024M6638P0113r4433m9176Q9574M0505q7264m4222J07152
$$ 734493 657246 594222 640860 710973 616540 567364 656938 697443 610179 565957 673109
2051F73109R2984j14891j20248n0437L7373n2884j6283K541n1698O788M6074j0249
$$ 673109 766093 651202 530954 480517 517890 465006 448723 451264 399566 406354 452428 442179
2039D42179p2682n1803O3917N5209n5090o7457m460m2707J46947O8215j51380
$$ 442179 369497 317694 381611 436820 381730 314273 309813 267106 414053 482268 330888
2028C30888Q2136q3899q9521R7454O6213o7816j9854m9024Q909j36769j07850
$$ 330888 413024 329125 239604 337058 403271 335455 315601 266577 275486 138717 30867
2017C0867J63188L0748J3132P1886j21078q140r9246N4850N7898l5457j01724
$$ 30867 194055 224803 237935 309821 188743 180603 81357 136207 194105 158648 56924
2006E6924J2186R1601P970J21152o1121m8938p7258j26943Q6461J07515K2313
$$ 56924 69110 160711 168681 289833 228712 179774 102516 -24427 62034 169549 191862
1995A91862o3135M8811n1888j1716J14149o1361j28760j2542m2677J3676O5156
$$ 191862 128727 177538 125650 113934 228083 166722 37962 25420 -17257 -3581 61575
1984F1575j9756K1596P772o3349O8789O8767j5060n6017N3346P7203j09413k4333
$$ 61575 41819 63415 71187 7838 76627 145394 130334 74317 127663 204866 95453 71120
1972G1120R292l4977M3576p4202n5712Q2035m5860n2499K3173L6914n1550n2752
$$ 71120 80412 45435 89011 14809 -40903 41132 -4728 -57227 -34054 2860 -48690 -101442
1960a01442M1194M8381K7764j4277n9080Q3669J7070O4834k1350j37877Q283P82
$$ -101442 -60248 -11867 15897 1620 -57460 26209 43279 108113 86763 -51114 -42831 -42049
1948d2049k0441l4504R7998J5562q438j7657m9626j0173J9966J48040m9759o2464
$$ -42049 -62490 -96994 1004 16566 8128 -9529 -59155 -69328 -49362 98678 48919 -13545
1936a3545M1581o5607n2201Q5629M7550p1031Q179M0947M3467o2679o3220M2761
$$ -13545 28036 -37571 -89772 -4143 43407 -27624 -19445 21502 64969 2290 -60930 -18169
1924a8169M8631j16842K852P1501m4622N9226j009p2804L2633L4841k598J2182
$$ -18169 30462 -86380 -83528 -12027 -56649 2577 1568 -71236 -38603 -3762 -6360 5822
1912E822n4362m3923L0975o7092N7808Q9397j15n927r844k4937j58384Q8327M4788
$$ 5822 -48540 -92463 -61488 -128580 -70772 18625 18510 12583 2739 -22198 -180582 -92255 -47467
1899d7467m7246K7679Q4809l8610n2569k4266Q8093o611l4734M7031m2922K1040
$$ -47467 -94713 -67034 17775 -20835 -73404 -97670 -9577 -16188 -50922 -3891 -46813 -25773
1887b5773q3026P7414Q9979N0769k3066m6248q8150O7635P6716n280j01328l4032
$$ -25773 -108799 -31385 58594 109363 86297 40049 -48101 19534 96250 90970 -10358 -44390
1875d4390R297j5985M4925J9480q384k8894L3440r1649J984j8385j472P3648J11631
$$ -44390 -35093 -51078 -6153 13327 4943 -23951 9489 -82160 -80176 -98561 -100033 -26385 85246
1862H5246n4156j05672Q5394J34330l47N2061J8465j9700m740N090p1391K613
$$ 85246 31090 -74582 10812 145142 144795 196856 215321 195621 190881 195971 124580 127193
1850A27193m3101m884q6583o6978N8618P3478m6592l0005o6488j02403Q3004O7726
$$ 127193 84092 79208 -7375 -74353 -15735 57743 11151 -18854 -85342 -187745 -104741 -37015
1838c7015R177K4054l4015N3679K6041K0689m2548r4601j8985M5167k0968k6977
$$ -37015 -27838 -3784 -37799 15880 41921 62610 20062 -74539 -93524 -48357 -69325 -96302
1826i6302J36968K3785j34919P6260j08305M1684M2915P0357j905K9781j41239
$$ -96302 40666 64451 -70468 5792 -102513 -60829 -17914 52443 50538 80319 -60920
1815f0920m9083J4484k0475Q6707L8367O0856M2969j02112m2075M4732o4132j2153
$$ -60920 -110003 -95519 -115994 -29287 9080 69936 112905 10793 -31282 13450 -50682 -62835
1803f2835l895m038l1117M4183n4110j7758l332N0499r007M8354n8263M2837p3333
$$ -62835 -66730 -70768 -101885 -57702 -111812 -129570 -132902 -82403 -91410 -43056 -101319 -58482 -131815
1790a31815l0295K7772K3846L7787n9827m7834J22884k1421K9289L9078j8689
$$ -131815 -162110 -134338 -110492 -72705 -132532 -180366 -57482 -78903 -49614 -10536 -29225
1779b9225N5996o6162j08230n2138L6244L3527K6539K1735n2834O736j9388J45778
$$ -29225 26771 -39391 -147621 -199759 -163515 -129988 -103449 -81714 -134548 -127812 -147200 -1422
1767a422n5396J5498K3538n8571j2660K0838j32250R8789N1564k8474r0877M7665
$$ -1422 -56818 -41320 -17782 -76353 -89013 -68175 -200425 -101636 -50072 -78546 -169423 -121758
1755a21758J8114R1599K1532m7770r6818j6441J7425j3582J4623O159M2386m0861
$$ -121758 -103644 -12045 9487 -38283 -135101 -151542 -134117 -147699 -133076 -126917 -84531 -125392
1743a25392Q4694k6669J03376K4409l7486n778j09082M0756P9909m5336m2551
$$ -125392 -40698 -67367 36009 60418 22932 17154 -91928 -51172 28737 -16599 -59150
1732e9150j6308o1094N6376P1076n3185k2966M301j8337l1595k6684K2334k072
$$ -59150 -75458 -136552 -80176 -9100 -62285 -85251 -80950 -99287 -130882 -157566 -135232 -137304
1720a37304M9679N8730J3491j0970m8574j3810m0244N5480L6436N3863m8689j1769
$$ -137304 -87625 -28895 -15404 -26374 -74948 -88758 -129002 -73522 -37086 16777 -31912 -43681
1708d3681M389J1066o0260l9532k3753p0815P0521Q4578k7518M3551R4307r2772
$$ -43681 -39292 -28226 -88486 -128018 -151771 -222586 -152065 -67487 -95005 -51454 42853 -49919
1696d9919p13k6847N7985J8390o0342O0122K491l5874n2538M2910K2042m230l2705
$$ -49919 -50632 -77479 -19494 -1104 -61446 -1324 1167 -34707 -87245 -44335 -22293 -26523 -59228
1683e9228O687k3105l8280K5242N0139K3126K9210p4583N5327M660K0582n1666
$$ -59228 -52541 -75646 -113926 -88684 -38545 -15419 13791 -60792 -5465 -805 19777 -31889
1671c1889n7054J1254Q3402q156o875l2474L6546k3721p7673R5488Q0583j07776
$$ -31889 -88943 -77689 5713 -2443 -9318 -41792 -5246 -28967 -106640 -11152 69431 -38345
1659c8345K4528p2071p3687N8012J2048Q2036K732j49694K3031M3986O1418j26519
$$ -38345 -13817 -85888 -159575 -101563 -89515 -7479 -4747 -154441 -131410 -87424 -26006 -152525
1647a52525K2084R5404j9058m8448r744L9181Q457j5452l4211O0354K8831J4188
$$ -152525 -130441 -35037 -54095 -102543 -112287 -73106 -64649 -80101 -114312 -53958 -25127 -10939
1635a0939n4268K2806n8922N0842n0454M633Q2968m6831k991k1815m1015o1168
$$ -10939 -65207 -42401 -101323 -50481 -100935 -96302 -13334 -60165 -63156 -84971 -125986 -187154
1623a87154Q9628J4667o4930k3246K8668J8179O9447J25381p5488j04775L620
$$ -187154 -97526 -82859 -147789 -171035 -142367 -124188 -54741 70640 -4848 -109623 -106003
1612a06003j0952M6443r4893r874J10109R7597k1097o2228p742o6897m0606J20285
$$ -106003 -116955 -70512 -165405 -175279 -65170 32427 11330 -50898 -58640 -125537 -166143 -45858
1600d5858M1014j69336J3944R3745M1251L2354M7184r6503o6584P7236Q60n443
$$ -45858 -4844 -174180 -160236 -66491 -25240 7114 54298 -42205 -108789 -31553 -30693 -36136
1588c6136q2384n9415K258K9552J01633J2943J1785l1964k5872J8550j7199m5677
$$ -36136 -118520 -177935 -175677 -146125 -44492 -31549 -19764 -51728 -77600 -59050 -76249 -121926
1576a21926K217j367K0471m9188K5985O8670m5222o3101J10398M7181J9334J0830
$$ -121926 -119709 -121076 -100605 -149793 -123808 -55138 -100360 -163461 -53063 -5882 13452 24282
1564B4282L8769p3552q2232L4164O6422k2881m6012j59281J18320j7189O981n4018
$$ 24282 63051 -10501 -92733 -58569 7853 -15028 -61040 -220321 -102001 -119190 -112209 -166227
1552a66227O2960O2297P418n9299o6468J7250M7488k6846J33970j3432n4572K9856
$$ -166227 -103267 -40970 -33552 -92851 -159319 -142069 -94581 -121427 12543 -889 -55461 -25605
1540b5605k9399J19538q0419k3815J2378k7856m7717J81679l553j16050r235M8659
$$ -25605 -55004 64534 -15885 -39700 -27322 -55178 -102895 78784 75231 -40819 -50054 -1395
1528a395N1708q3831m4922j7650Q4693J5642m6850K6786j6943j7215J4056O8913
$$ -1395 50313 -33518 -78440 -96090 -11397 4245 -42605 -15819 -32762 -49977 -35921 32992
1516C2992O0395j01064l1602P5539m4669j42965n1563M5163N6293L7980r1884
$$ 32992 93387 -7677 -39279 36260 -8409 -151374 -202937 -157774 -101481 -63501 -155385
1505a55385M6353n676N523M1367n740m2732j36068j7439O5417o9476O0872Q4949
$$ -155385 -109032 -114708 -109185 -67818 -73558 -116290 -252358 -269797 -204380 -273856 -212984 -128035
1493a28035l5146o244K2157k2725R5175n6593m4215J35442J1574r491k6149K1886
$$ -128035 -163181 -169425 -147268 -169993 -74818 -131411 -175626 -40184 -28610 -38101 -64250 -42364
1481d2364K5510J7580p689j4288J37348k7162j30806o3428j1351L1329O5218q648
$$ -42364 -16854 726 -6963 -21251 116097 88935 -41871 -105299 -116650 -85321 -20103 -28751
$$ [...]
##END NTUPLES=NMR SPECTRUM
##END=
