##TITLE=1H_CA-8981-1
 CDCl3
 8 sc, 
 16.03.2022
##JCAMPDX= 6.0         $$ Bruker NMR JCAMP-DX V2.0
##DATA TYPE= NMR SPECTRUM
##DATA CLASS= NTUPLES
##ORIGIN= UXNMR, Bruker Analytische Messtechnik GmbH
##OWNER= root
$$ XWIN-NMR		Version 3.5
$$ Wed Mar 16 12:56:52 2022 Russian Standard Time (UT+4h)  she@DPX200
##.OBSERVE FREQUENCY= 200.131346
##.OBSERVE NUCLEUS= ^1H
##.ACQUISITION MODE= SIMULTANEOUS
##.ACQUISITION SCHEME= undefined
##.AVERAGES= 8
##.DIGITISER RES= 18
##SPECTROMETER/DATA SYSTEM= spect
##.PULSE SEQUENCE= zg30
##.SOLVENT NAME= Acetone
##.SHIFT REFERENCE= (INTERNAL, Acetone, 0, 15.7601)
##AUDIT TRAIL= $$ (NUMBER, WHEN, WHO, WHERE, WHAT)
$$ ##TITLE= Audit trail, XWIN-NMR		Version 3.5
$$ ##JCAMPDX= 5.01
$$ ##ORIGIN= Bruker BioSpin GmbH
$$ ##OWNER= she
$$ F:/spectra/data/she/nmr/H-F/1/pdata/1/auditp.txt
$$ ##AUDIT TRAIL=  $$ (NUMBER, WHEN, WHO, WHERE, WHAT)
(   1,<2022-03-16 12:55:37.31 +0400>,<she>,<DPX200>,
      <created by zg, POWCHK disabled, PULCHK disabled
       configuration hash MD5:
       00 E9 B6 7A A2 85 ED C7 34 08 36 98 17 FE 4E 26
       data hash MD5: 16K
       CB CE 13 06 C8 B2 5F 34 C6 D7 F8 BB D2 38 FA 19>)
(   2,<2022-03-16 12:55:39.57 +0400>,<she>,<DPX200>,
      <Start of raw data processing
       efp BC_mod = 2 LB = 0.24 FT_mod = 6 PKNL = 1 PHC0 = -16948.53 PHC1 = 9.000779 SI = 16K 
       data hash MD5: 16K
       7F E6 2A 00 D2 B0 D2 EC B8 CC 07 84 A6 5C 9B 9C>)
(   3,<2022-03-16 12:55:58.81 +0400>,<she>,<DPX200>,
      <pk PHC0 = -2.564559 PHC1 = 4.4 
       data hash MD5: 16K
       9C CF BB FB 06 F3 BD 92 C1 1B F8 E7 3A F4 E1 5C>)
(   4,<2022-03-16 12:56:01.64 +0400>,<she>,<DPX200>,
      <abs ABSG = 5 
       data hash MD5: 16K
       A9 80 E2 65 11 FB BC E5 C3 4B 23 82 70 75 43 FB>)
$$ ##END=
$$ 
$$ hash MD5
$$ FD D3 DC 23 78 76 11 4E 38 4A B3 2F EC 07 39 11
##$RELAX= 
##$RELAX= 
##$RELAX= 
##$RELAX= 
##$RELAX= 
##$RELAX= 
$$ Bruker specific parameters
$$ --------------------------
##$DU= <F:/spectra>
##$EXPNO= 1
##$NAME= <H-F>
##$PROCNO= 1
##$TYPE= <nmr>
##$USER= <she>
##$AMP= (0..31)
100 100 100 100 100 100 100 100 100 100 100 100 100 100 100 100 100 100 
100 100 100 100 100 100 100 100 100 100 100 100 100 100 
##$AQSEQ= 0
##$AQ_mod= 1
##$AUNM= <au_zg>
##$AUTOPOS= <>
##$BF1= 200.13
##$BF2= 200.13
##$BF3= 200.13
##$BF4= 200.13
##$BF5= 200.13
##$BF6= 200.13
##$BF7= 200.13
##$BF8= 200.13
##$BYTORDA= 1
##$CFDGTYP= 0
##$CFRGTYP= 5
##$CHEMSTR= <none>
##$CNST= (0..31)
1 1 145 1 1 1 1 1 1 1 1 1 1 1 1 1 1 1 1 1 1 1 1 1 1 1 1 1 1 1 1 1 
##$CPDPRG= <>
##$CPDPRG1= <>
##$CPDPRG2= <>
##$CPDPRG3= <>
##$CPDPRG4= <mlev>
##$CPDPRG5= <mlev>
##$CPDPRG6= <mlev>
##$CPDPRG7= <mlev>
##$CPDPRG8= <mlev>
##$CPDPRGB= <>
##$CPDPRGT= <>
##$D= (0..31)
0 1.2 0 0 0 0 0 0 0 0.06 0 0.03 0 0 0 0 0.0002 0 0 0 0 0 0 0 0 0 0 0 0 
0 0 0 
##$DATE= 1647420936
##$DBL= (0..7)
120 120 120 120 120 120 120 120 
##$DBP= (0..7)
150 150 150 150 150 150 150 150 
##$DBP07= 0
##$DBPNAM0= <>
##$DBPNAM1= <>
##$DBPNAM2= <>
##$DBPNAM3= <>
##$DBPNAM4= <>
$$ [...]
##$SUBNAM2= <"">
##$SUBNAM3= <"">
##$SUBNAM4= <"">
##$SUBNAM5= <"">
##$SUBNAM6= <"">
##$SUBNAM7= <"">
##$SUBNAM8= <"">
##$SUBNAM9= <"">
##$SW= 18.0517287032376
##$SWIBOX= (0..15)
0 0 2 0 0 0 0 0 0 0 0 0 0 0 0 0 
##$SW_h= 3612.71676300578
##$TD= 16384
##$TD0= 1
##$TE= 0
##$TE2= 300
##$TE3= 300
##$TEG= 300
##$TL= (0..7)
0 120 120 120 120 120 120 120 
##$TP= (0..7)
150 150 150 150 150 150 150 150 
##$TP07= 0
##$TPNAME0= <>
##$TPNAME1= <>
##$TPNAME2= <>
##$TPNAME3= <>
##$TPNAME4= <>
##$TPNAME5= <>
##$TPNAME6= <>
##$TPNAME7= <>
##$TPOAL= (0..7)
0.5 0.5 0.5 0.5 0.5 0.5 0.5 0.5 
##$TPOFFS= (0..7)
0 0 0 0 0 0 0 0 
##$TUNHIN= 0
##$TUNHOUT= 0
##$TUNXOUT= 0
##$USERA1= <user>
##$USERA2= <user>
##$USERA3= <user>
##$USERA4= <user>
##$USERA5= <user>
##$V9= 5
##$VALIST= <valist>
##$VCLIST= <CCCCCCCCCCCCCCC>
##$VD= 0
##$VDLIST= <DDDDDDDDDDDDDDD>
##$VPLIST= <PPPPPPPPPPPPPPP>
##$VTLIST= <TTTTTTTTTTTTTTT>
##$WBST= 1024
##$WBSW= 4
##$XGAIN= (0..3)
0 0 0 0 
##$XL= 0
##$YL= 0
##$YMAX_a= 296265
##$YMIN_a= -475035
##$ZGOPTNS= <>
##$ZL1= 120
##$ZL2= 120
##$ZL3= 120
##$ZL4= 120
##$ABSF1= 15.70943
##$ABSF2= -2.34242
##$ABSG= 5
##$ABSL= 3
##$ALPHA= 0
##$AQORDER= 0
##$ASSFAC= 0
##$ASSFACI= 0
##$ASSFACX= 0
##$ASSWID= 0
##$AUNMP= <proc_1d>
##$AZFE= 0.1
##$AZFW= 0.1
##$BCFW= 0
##$BC_mod= 2
##$BYTORDP= 0
##$COROFFS= 0
##$CY= -3
##$DATMOD= 1
##$DC= 0
##$DFILT= <>
##$DTYPP= 0
##$F1P= 0
##$F2P= 0
##$FCOR= 1
##$FTSIZE= 16384
##$FT_mod= 6
##$GAMMA= 0
##$GB= 0
##$INTBC= 1
##$INTSCL= 0
##$ISEN= 128
##$LB= 0.24
##$LEV0= 0
##$LPBIN= 0
##$MAXI= 10000
##$MC2= 0
##$MEAN= 0
##$ME_mod= 0
##$MI= 1.114404
##$NCOEF= 0
##$NC_proc= -5
##$NLEV= 6
##$NOISF1= 3.799351
##$NOISF2= 2.8
##$NSP= 0
##$NTH_PI= 0
##$NZP= 0
##$OFFSET= 15.76011
##$PC= 1
##$PHC0= -16951.09
##$PHC1= 13.40078
##$PH_mod= 1
##$PKNL= yes
##$PPARMOD= 0
##$PSCAL= 0
##$PSIGN= 0
##$REVERSE= no
##$SF= 200.129998286899
##$SI= 16384
##$SIGF1= 3
##$SIGF2= 2
##$SINO= 5.538805
##$SIOLD= 16384
##$SREGLST= <1H.CDCl3>
##$SSB= 0
##$STSI= 16384
##$STSR= 0
##$SW_p= 3612.71676300578
##$SYMM= 0
##$S_DEV= 0
##$TDeff= 16384
##$TDoff= 0
##$TI= <>
##$TILT= no
##$TM1= 0
##$TM2= 0
##$TOPLEV= 0
##$USERP1= <user>
##$USERP2= <user>
##$USERP3= <user>
##$USERP4= <user>
##$USERP5= <user>
##$WDW= 1
##$XDIM= 16384
##$YMAX_p= 298088014
##$YMIN_p= -145730
$$ End of Bruker specific parameters
$$ ---------------------------------
##NTUPLES= NMR SPECTRUM
##VAR_NAME=  FREQUENCY,     SPECTRUM/REAL,   SPECTRUM/IMAG
##SYMBOL=    X,             R,               I
##VAR_TYPE=  INDEPENDENT,   DEPENDENT,       DEPENDENT
##VAR_FORM=  AFFN,          ASDF,            ASDF
##VAR_DIM=   16384,         16384,           16384
##UNITS=     HZ,            ARBITRARY UNITS, ARBITRARY UNITS
##FACTOR=    0.220516191357247, 1,           1
##FIRST=     3154.07076757417, 0,            0
##LAST=      -458.64599543161, 0,            0
##MIN=       -458.64599543161, -145730,      0
##MAX=       3154.07076757417, 298088014,    0
$$ Real data points
##PAGE= N=1
##DATA TABLE= (X++(R..R)), XYDATA
$$ [...]
7985C2574k795K9032n7238j6287R675M1155k4030p440j6428L802M9908J1887p182
7972D6633Q79K4328j6735l3104j1270m2663O9494N8691J1945m6834m4627m1650
7960b4913K0419L2076N7417j8647l0021o0458j2978j6351K45L5559j804K1398
7948A942R91l116J7081k2978M3824K0897o2601m170K4168P367o895J8333K1057
7935E5900M7795r3195J7041Q037k0710M4022K1888k3796r523O162R086l6987j9111
7922F609L0722l0391k415N9369q09O604j6603j3266M219p9858K8039L7708k468
7909B7460j2657m0942j5690M1538K8352J1591k0366m5409K0337J7106k9573K2030
7897C777L9329j4567R362K7671K2188j9777o2839k6878L4334o6850J8498j6562
$$ y = [32574, 29779, 58811, 1573, -14714, -5039, 36116, 12086, 4646, -11782, -7980, 41928, 53815, 46633, 47512, 71840, 55105, 22001, 10731, -31932, 37562, 96253, 108198, 61364, 16737, -24913, -4494, 27582, 84999, 66352, 36331, -24127, -37105, -53456, -53211, -17652, -19456, 1942, 2933, -183, 16898, -6080, 37744, 58641, -3960, -8130, 16038, 23405, 16510, 34843, 55900, 103695, 10500, 27541, 35578, 14868, 58890, 80778, 56982, 47459, 53621, 62707, 25720, 6609, 37331, 6940, 4525, 63894, 63085, 69689, 53086, 39820, 44039, -35819, -7780, 29928, 27460, 14803, -26139, -41829, -291, 28061, 39652, 19286, -26123, -5786, 11320, -18253, 3777, 43106, 28539, 37901, 65572, 87760, 67983, 5144, -21734, 12600, -54250, -35752, -52314]
7885e2314N7724K5272k1777M4557k3134j04976N055Q683L3058M5563o795J3939
7873B4855j4845K519k0307k0296L9458M3549m9930n87j9377J1080m629J9154k9067
7860a8423n251j0726K826O3022k9773j8307J2037j9536k9789P707K0986N2678
7848B7451K0419m0495o4655K013M9842m305k2421j101r099J1045O9743o676J744
7835C3505J4055k5736r366L854k4554L9535r788m9031j1761K8753K771K7234J5324
7822C4795l2488m1236J4937K7880K2898m8156j6287K6394L3997m5168j0840L4118
7810H44n096J7012k0876k5378P001l8407J83400L2265j10810L2613n1106J4340
7798C5802k9201j6233j8212r208J4870K4854L1082l1441j0849M3319k9986R974
$$ y = [-52314, 5410, 30682, 8905, 53462, 30328, -74648, -69593, -60910, -27852, 17711, 10916, 24855, 10010, 12529, -7778, -28074, 11384, 54933, 5003, 4416, -14961, -3881, -8510, 10644, -18423, -23674, -34400, -31574, 31448, 1675, -16632, -4595, -24131, -53920, -46213, -25227, 27451, 47870, 7375, -57280, -55267, -5425, -9730, -32151, -33252, -42351, -31306, 38437, 31761, 33505, 47560, 21824, 12458, 16312, -8242, 31293, 21505, -27526, -39287, -10534, -7763, 19471, 34795, 2307, -38929, -23992, 3888, 26786, -21370, -37657, -11263, 22734, -22434, -33274, 844, -4252, 12760, -8116, -33494, -26493, -64900, 118500, 150765, 39955, 72568, 21462, 35802, 6601, -9632, -27844, -37052, -22182, 2672, 33754, 2313, -8536, 34783, 4797, 14771]
7786A4771J6718k53l9443l5970m4378P7459O097K8094J4110l4183L3245k8908
7774G359l1387l583p912K3338J7512m691n582l0330n5619j1419K2449N5170M9204
7761B4509o9829j2854O1996L7971K6101j2453k8985q3728J6924n588m733M3127
7749g542Q522k2860J9892J3500L9616M327n9121k2454Q63n188L4705K3086m4623
7736a7277L5089k5657o1660J9368M8714l3727K6526m2323m1654K3301P649l6036
7724i7687K0386N1575J5764m0351K4075m45L3133k7955K1713K9792q688l5655
7712a4343j769K4161j5415M4228k1476L824N315L803l9110K5280K61L559k48j3627
7698D443j4067P4584l9947j3897K5319j3949o1386P130K7020N7807R705M063J5133
$$ y = [14771, 31489, 31236, -8207, -44177, -88555, -11096, -4999, 23095, 37205, 3022, 36267, 7359, -24028, -27611, -35523, -12185, 5327, 636, -4946, -35276, -90895, -102314, -79865, -24695, 24509, -45320, -58174, 3822, 41793, 67894, 55441, 26456, -57272, -40348, -45936, -50669, -7542, 980, -21880, -1988, 11512, 51128, 55455, -3666, -26120, -25257, -30445, 4260, 27346, -17277, 17812, -7845, -69505, -50137, -1423, -35150, -8624, -50947, -92601, -69300, -61651, -97687, -77301, -25726, -9962, -50313, -26238, -26683, 6450, -21505, 208, 30000, 21312, -14343, -16112, 8049, -7366, 36862, 15386, 19210, 24525, 28328, -10782, 14498, 14759, 18318, 18070, 4443, -9624, 64960, 25013, 11116, 36435, 22486, -38900, -31770, -4750, 53057, 62762, 66825, 81958]
7685H1958k7871J725J7586J5498n7890L1047r928O4290L3396p890J4323n5342
7673A00902m9176m0511L3165L8513l2334o952l9593N6078l2493m3522O6753K3208
7661G4038J4096j8690n2042L7172r970n9621j646L3873l950r714R756K6189j113
7648C8378L8329l6504L301K2282o7276l3006O9281M2579M3491m5772o6695j0278
7636a890k2585k524M9677n643o1278M0515l1161N3906M8602P52k3255q3676N39
7623c8021L3831P9081J4867k3756P948r0405o5746O1611L2809K1381n764k2333
7611E503j879K6906J5953m2685M5657o197M2135l6863N30P459o770J1931r58k8084
7597C2638L3180K168J0532o415j9781L387R590M4421j2572k7970k1666j6102O563
$$ y = [81958, 54087, 55812, 73398, 88896, 31006, 62053, 52125, 116415, 149811, 141921, 156244, 100902, 51726, 11215, 44380, 82893, 50559, 43607, 4014, 60092, 27599, -15923, 50830, 74038, 88134, 69444, 17402, 54574, 44604, -15017, -16663, 17210, 13260, 3546, 13302, 39491, 38378, 76707, 40203, 43504, 65786, -1490, -34496, 34785, 77364, 120855, 75083, 8388, -1890, -24475, -26999, 22678, 17035, -44243, -3728, -34889, 19017, 67619, 68371, 45116, -38560, -38021, -4190, 74891, 89758, 66002, 73950, -16455, -82201, -20590, 12219, 33600, 27836, 5503, 3624, 30530, 46483, 3798, 49455, 43258, 85393, 48530, 49060, 56519, 49749, 61680, 60722, 32638, 65818, 67986, 78518, 72103, 52322, 55709, 65299, 109720, 97148, 69178, 47512, 31410, 37973]
7584C7973N218q832N9852l9291n0753K2607j9249j888o0506j2319O3837N9422
7572E6071J056j7226k1423m301J5852k4688r241R273j0977Q268j5139k102K4090
7559I513N4641k0955m8647K3800k4141q440l875N540M543L9530K2548M9127O995
7546A10179l6334o7151k2879J4079O7453K0968p223l2661m0713M5717o089k9636
7534A5710r967O5561r747j24017K9604Q1128j9852K354O888P559M4342L130j2344
7521H0349k3804l9953M625N6313M1493q406k4025L1819m9149m1664n595P832J4392
7508D4227R950Q100k8383L6029K207j2039N2650m5907j2319L7421Q889L149o34
7495A03340l1155k6482K9866q382p243j3845M1647j1204L400L0880R001n05m0281
$$ y = [37973, 43191, 34359, 94211, 54920, 4167, 26774, 7525, 5637, -54869, -67188, -3351, 56071, 57127, 39901, 18478, 14177, 30029, 5341, -3900, 5373, -5604, 2664, -12475, -14577, 9513, 64154, 43199, -5448, 18352, -5789, -14229, -18104, -12564, -8021, 31509, 54057, 103184, 110179, 73845, 6694, -16185, -2106, 65347, 86315, 79092, 46431, 5718, 51435, 45346, 15710, 5743, 71304, 61557, -62460, -32856, 48272, 28420, 30774, 37662, 45221, 89563, 92693, 80349, 56545, 16592, 21217, 77530, 119023, 110617, 86592, 118411, 69262, 27598, 22003, 29835, 44227, 54177, 62277, 33894, 69923, 72130, 60091, 112741, 66834, 54515, 91936, 100825, 103974, 103340, 72185, 45703, 75569, 67187, 59944, 46099, 87746, 76542, 79942, 110822, 119823, 119318, 79037]
7482G9037j8328J6377j4625K152K4985o5311L049M5996J2959L1631P609n2056
7470G3475R42L5585m1881K7614L0603K516k7842j7085L8158N4213J8987k7341
7458A67944P285m6067L763L8422k32k4611j6698l0088K6984M4182J7836p249q720
7445A72751k1592K2269J4723o58N5125m4764k1197j6716p127J1538r49o454J8005
7432A74954J9084j7295L0514K5867N0198l2340l8858m8824j7601L7178K9041N3227
7420B65145R036k5255l0395L5633n3112o064K2619L8506L573k4949k5100L1347
7408B40984Q44R343m3944k7497l702M183N1452M2759j7205l293j2965K1100K1518
7395B83577n7864K0184N2059k3327K6122M602r5353M944L8675L6305m7695j6103
$$ y = [79037, 60709, 77086, 62461, 64613, 89598, 24287, 27336, 73332, 86291, 117922, 125531, 73475, 74417, 110002, 68121, 95735, 126338, 128854, 101012, 83927, 122085, 176298, 195285, 167944, 175229, 129162, 132925, 171347, 171115, 146504, 129806, 99718, 126702, 170884, 188720, 181471, 172751, 151159, 173428, 188151, 187493, 242618, 197854, 176657, 159941, 152814, 164352, 163403, 156949, 174954, 194038, 176743, 207257, 233124, 283322, 250982, 212124, 163300, 145699, 182877, 211918, 265145, 274181, 248926, 218531, 254164, 201052, 194988, 217607, 256113, 259686, 234737, 209637, 240984, 241828, 251171, 207227, 179730, 176028, 180211, 231663, 274422, 257217, 253924, 240959, 262059, 283577, 225713, 245897, 297956, 274629, 300751, 305353, 210000, 214944, 253619, 289924, 242229, 226126]
7383B26126j9733p132M2992N1003k4742q568o2533l6491N0681M3844j0158N5243
7371C00532m4472o2235M1412M2790j3380q2431n389L1121J2349N1458q619k3379
7359B39757M1391o1909M291Q0914R902p8261m8494L4456K3085K170k5640J3830
7347B35492p643j9518L6004j2251J1990j0483j9934L4258n747J930l5171l8439
7335A70488J360P171J6222N2460K1415j4784o7885o8296n521M4858R6937m1512
7323B12913j2871j767k1789k4062k5805M5993K7279J0269m8213k0229M9650k2034
7311A69334J6754k6959k453M165K0522j91m36j9527n3897J502J3782O5438M9207
7298B37241k4389l2377k877l7412K5188K4570L594p261n2007j5296J2738K9622
$$ y = [226126, 206393, 199261, 242253, 293256, 268514, 259946, 197413, 160922, 211603, 255447, 245289, 300532, 256060, 193825, 235237, 278027, 264647, 182216, 176827, 207948, 220297, 271755, 263136, 239757, 281148, 219239, 223530, 304444, 314346, 236085, 187591, 222047, 245132, 247302, 221662, 235492, 227849, 208331, 244335, 232084, 244074, 233591, 213657, 247915, 242168, 244098, 208927, 170488, 171848, 179019, 195241, 247701, 269116, 254332, 186447, 118151, 112630, 157488, 254425, 212913, 200042, 198275, 176486, 152424, 126619, 172612, 199891, 210160, 161947, 141718, 191368, 169334, 186088, 159129, 156676, 160841, 181363, 181172, 180736, 161209, 107312, 108814, 122596, 188034, 237241, 212852, 180475, 177598, 140186, 165374, 189944, 193538, 186277, 134270, 118974, 131712, 161334]
7286A61334L8127n6314m9063K8081K1441J8657J7751M4174M02j8216k4799j6217
7274A65358k4832J072P5058J4428j1049l2045L1069l0661K5793J2400o3904K1564
7262A84251K2011q617K675l2020J0830L611k2779J9423N1055j5703R276k7857
7250A96156n7782J1829Q3327K5377k4215l40l597p493M2808M1316k9948J1369
7238B88807j2067P092o5061P294j1379K2384K6553n0060k0862n1659K4749N6743
7226B22534J6673l0671l8351j7294l0614j7004J4950M2786L5328q452J1342L395
7214B04622J2326K7336j6775N90n4551q072L8155m6921M2166j7772m4821O7143
7202B03426m0495K4632J9590q008k1119M2102o991J7754J6622J7830o4054l0365
$$ y = [161334, 199461, 143147, 94084, 122165, 143606, 162263, 180014, 224188, 224590, 206374, 181575, 165358, 140526, 141598, 216656, 231084, 220035, 187990, 219059, 188398, 214191, 226591, 162687, 184251, 206262, 197645, 200320, 168300, 179130, 182741, 159962, 179385, 230440, 214737, 224013, 196156, 138374, 150203, 233530, 258907, 234692, 234352, 230755, 223262, 266070, 307386, 277438, 288807, 276740, 283832, 218771, 226065, 214686, 237070, 263623, 213563, 192701, 141042, 165791, 222534, 239207, 208536, 170185, 152891, 122277, 105273, 120223, 163009, 198337, 189885, 201227, 204622, 216948, 244284, 227509, 228099, 173548, 165476, 203631, 156710, 198876, 181104, 136283, 203426, 162931, 187563, 207153, 199145, 178026, 220128, 213137, 230891, 247513, 265343, 201289, 170924]
7190A70924O1044K7749j1919J0697j9456K5349q789p774K4730k6255m2946J837
7178B05191j8157l8353r750Q213j2042K4783Q1963j0041P399Q54M5790K960j6863
7165B71947k8805K067j1383k1512j2032o709m048j7323j5672n219M3798K3964
7153B19073n122o70K9476L9085j11126j1815O830L3207p361J8389l5170M67L0761
7140B06024j7088N1726J788p8514N057M9761K762J831R9225o2972l9534l8689
7128A81377o373K1680N3104Q447m2955L7854m075m9197K4820N4562j971j9939
7116B57334J2497K9694k9059k2086K3745M3158j9599l862J5453K661K5411m0036
7104B95311m6128N5480M089K7917n2941P670K7825P413m5517p0470N7563L0580
$$ y = [170924, 231968, 259717, 247798, 258495, 239039, 264388, 255599, 247825, 272555, 246300, 203354, 205191, 187034, 148681, 138931, 147144, 135102, 159885, 241848, 231807, 239206, 240060, 285850, 288810, 271947, 243142, 245209, 233826, 212314, 200282, 193573, 189525, 172202, 156530, 151311, 195109, 219073, 213951, 213281, 242757, 281842, 170716, 158901, 165731, 198938, 191577, 209966, 174796, 175263, 206024, 188936, 240662, 242450, 163936, 168993, 218754, 221516, 223347, 322572, 259600, 220066, 181377, 175004, 196684, 249788, 258235, 215280, 253134, 249059, 199862, 224682, 279244, 277273, 257334, 269831, 299525, 270466, 248380, 272125, 315283, 295684, 291822, 307275, 309936, 335347, 295311, 249183, 304663, 308752, 336669, 283728, 291398, 319223, 326636, 281119, 210649, 268212, 298792]
7092B98792k0889l1560J184K6804j0141L4116J5624m018l6325L5998m7665n3155
7080B08765j646M2162L4356K0356n6402k6301M0609K797Q74o89q611k8551j816
7067B25903L0410N479L5541L054o0699k7889n3089M4766N530M1502O0704o5721
7055B45491m4344O364J6571J4904m735m0012l6230k0770j8912L4686M4236k8780
7043A68469P882o448J5228l1995j3042K2584J7538J57K5466k1527L5531k490n6498
7030A60855J7397M5653j0682L2429r370k2570N174J3049j4803l2082j5511M0176
7018B09715O2185O3p3053k2780J1840J5682L442j1514J43264k2916l15l5079O900
7005B87434j282j070k2225l0996k4045k084k6939K3729J8326J5639l2747Q256
$$ y = [298792, 277903, 246343, 247527, 274331, 264190, 298306, 313930, 309912, 273587, 309585, 261920, 208765, 207119, 249281, 283637, 303993, 247591, 221290, 261899, 264696, 265570, 264881, 256270, 227719, 225903, 256313, 261792, 297333, 300387, 239688, 211799, 158710, 203476, 209006, 250508, 311212, 245491, 201147, 207511, 224082, 238986, 234251, 194239, 158009, 137239, 118327, 153013, 197249, 168469, 176351, 169903, 185131, 153136, 140094, 162678, 180216, 180373, 205839, 184312, 219843, 217353, 160855, 178252, 223905, 213223, 245652, 236282, 213712, 218886, 231935, 217132, 185050, 169539, 209715, 271900, 271963, 198910, 176130, 187970, 203652, 207094, 195580, 338844, 315928, 315613, 280534, 287434, 286152, 285082, 262857, 231861, 207816, 205732, 178793, 202522, 220848, 236487, 203740, 211996]
6993B11996J1250j8421k7475R424k0104K1348P1555K694k4575n1467k391j218
6981A82616N2784J538O3579j7486m7917l5369l643J5473K829J0106L1789m6807
6969B09492J1427L6488n6583n7953J9356M1879n11O997l0314l532O707k8641R2309
6956B47121Q4330m4274j6299n2587m8753j1339j0833R772P8848j9006J4601L6335
6944B67916K7384L7480m3061m4818m821m1839J6101K0673k3869M3045K8979p78
6932B82392J5179k7566K6395j313n7077l8438L1184j2890R351J8351k2559J6827
6920B39836k5343M3800M2278L5417p0740J0204J3064l7893k5920k3418P3508m0881
6908B33912j2392j4964k5825O3126m5269n2543O7956K5111M5540n0389j6090M3933
$$ y = [211996, 223246, 204825, 177350, 186774, 166670, 188018, 259573, 262267, 237692, 186225, 183834, 182616, 235400, 236938, 300517, 283031, 235114, 199745, 196102, 211575, 214404, 224510, 256299, 209492, 220919, 257407, 200824, 142871, 162227, 204106, 203595, 210592, 180278, 176746, 183453, 154812, 247121, 331451, 287177, 270878, 218291, 169538, 158199, 147366, 157138, 235986, 216980, 231581, 267916, 295300, 332780, 289719, 244901, 240080, 198241, 214342, 235015, 211146, 254191, 283170, 282392, 297571, 270005, 296400, 295087, 238010, 199572, 230756, 217866, 227217, 245568, 223009, 239836, 214493, 258293, 300571, 335988, 265248, 275452, 288516, 250623, 224703, 201285, 274793, 233912, 221520, 206556, 180731, 243857, 198588, 146045, 214001, 239112, 284652, 234263, 218173, 262106]
6896B62106k7402P814N2542J7462J0915o895K5336m8992O463M4080j4589L9160
6884C68000K4422J5900l306l7666o0556M0075L2654j0636k6925r199R261n732
6872C36292l5604k6868J6544k9498l3765O3164j4204K307P4195n6516n1285J7056
6860B61818n0899L5612m0444K1427m9345L4826L818j759m1319J3105m7777N4140
6848A93203N2906N885J249o8567N1897N1893j436m2462K4488L457K4444n4723
6836B42234n879q340L3273k7563j071n536k5616L7939R332k0255k0288J0852j568
6823B17514J6825L139l1092l8319j0587K3805J4963J2810J4159l1625m0438m3659
6811A07495O7875J4018O210N0012l401r1489l3921N7446J0184M1922k3381L7758
$$ y = [262106, 234704, 242518, 295060, 312522, 323437, 316542, 341878, 292886, 299349, 343429, 328840, 368000, 392422, 408322, 405016, 367350, 306794, 346869, 379523, 368887, 341962, 332763, 342024, 336292, 300688, 273820, 290364, 260866, 227101, 290265, 276061, 278368, 352563, 296047, 244762, 261818, 210919, 246531, 206087, 227514, 178169, 212995, 216813, 215054, 173735, 186840, 139063, 193203, 246109, 251994, 253243, 184676, 236573, 288466, 287030, 244568, 269056, 272513, 296957, 242234, 236355, 228015, 261288, 233725, 232654, 227118, 201502, 239441, 248773, 228518, 208230, 219082, 217514, 234339, 237478, 206386, 168067, 157480, 181285, 196248, 209058, 223217, 191592, 151154, 107495, 175370, 189388, 195598, 245610, 242209, 150720, 116799, 174245, 184429, 226351, 202970, 240728]
6799B40728L229j8343n9806J5843K4016k7004K7157J4450m341J0516l6244K2193
6787B12394L5476J5149K7588n3422l2048j4856K3500P0152r827J1375l3012P520
6775B59989k4138J3637M172l391j8086K5433J2755k176J5725J6090k7396l1045
6763B41569j3797k3720L0243m4283N566j922p829J6004l481L331L5485p045r795
6750B20326P292m1406K362O470J1680K0496j8782L1206L911L2745l278M546k4201
6737B53367m1486j6716k605N7817K2260k1778m3321M1660L3615p8246k7127M3416
6725B20856M8519k0712m4952o548K1356m9643K0343N1769j629l3884j0057L8614
6713B34032J3996p383j5239j9470l3969q416O638N5539K5191k033N0012j8341
$$ y = [240728, 243957, 225614, 165808, 181651, 205667, 178663, 205820, 220270, 215929, 226445, 190201, 212394, 247870, 263019, 290607, 237185, 205137, 190281, 213781, 283933, 274106, 285481, 252469, 259989, 235851, 249488, 253660, 250269, 232183, 257616, 270371, 268195, 283920, 300010, 272614, 241569, 227772, 204052, 234295, 190012, 195578, 193656, 185827, 201831, 198350, 201681, 237166, 230121, 220326, 227618, 186212, 188574, 195044, 206724, 227220, 208438, 239644, 243555, 276300, 273022, 277568, 253367, 211881, 195165, 192560, 250377, 272637, 250859, 207538, 249198, 282813, 204567, 177440, 220856, 269375, 248663, 203711, 197163, 218519, 168876, 189219, 240988, 239359, 205475, 195418, 234032, 248028, 240645, 225406, 205936, 171967, 163551, 170189, 225728, 250919, 248886, 298898, 280557]
6701B80557l9856J744m226o712M3120l2850L6881L3143j759l1786k9146O986k8978
6688B27118l595K484K1643q603M0801j0848o973K5693q271k5626K185o040P6562
6675C26530m5148j8402K2817K4922M3916l0212q786j197j2381o441L2068J2263
6663C39949m5590k6932K7270K7477P605k4566r562m343J4840k13j418L6639K594
6650C43750l3373J7944K8866k5971j5246J5660K3802j0360R161j3303J078l0434
6638C11574p763J6638J8401J6796J0761l5591M313m5883j9310Q240L64L7925k1918
6625B94547K653l0288J9141J6994K7859K476K8521n8348K8088Q1446L133m2562
6613C73660J8890j7922n224K0205k84q5411K2183M47R559j435n1791J0424M5690
$$ y = [280557, 240701, 242445, 238219, 231507, 274627, 241777, 278658, 311801, 310042, 278256, 249110, 256096, 227118, 223523, 226007, 247650, 239047, 279848, 269000, 262027, 287720, 279449, 253823, 256008, 249968, 326530, 281382, 262980, 285797, 310719, 354635, 324423, 315637, 314440, 302059, 295618, 327686, 339949, 294359, 267427, 294697, 322174, 329779, 305213, 295651, 291308, 306148, 305935, 304517, 341156, 343750, 310377, 328321, 357187, 331216, 315970, 331630, 355432, 345072, 354233, 340930, 342008, 311574, 303811, 320449, 338850, 355646, 366407, 330816, 335129, 289246, 269936, 278176, 278540, 316465, 294547, 297200, 266912, 286053, 303047, 330906, 333382, 361903, 303555, 331643, 413089, 416222, 373660, 392550, 374628, 369404, 389609, 389325, 303914, 326097, 326544, 336103, 334668, 282877, 293301, 338991]
6600C38991j7822l8800m1188J0921j6470N2816L5601K5090j6751p282l2751l4320
6588B58035K4193K8336L7975j0997K136l7937J3935Q261M1210n370J7107n6987
6576C19897N2494J5548q483k9093J1895m7417K1166M2337l0032L425L5293p708
6564C79322k9023j1706K3057k550j3570k7934j7201N598J6041L8255m3124k2596
6552B94569K8238L1763k7135k3198j5247K7260K767O682k8341P512L0061o5757
6540B69174O4483K0866M0385J1377p0317m3217M516j4134p1M4076M3506j5130
6528C55514K923P206L4001M814K7374j2896j1870j7214l5273k164N9496K3864
6516D35775n5006L2150K13J9519M031M208N4067J0590n2204O0318n0214j6745
$$ y = [338991, 321169, 282369, 241181, 252102, 235632, 288448, 324049, 349139, 332388, 325106, 292355, 258035, 282228, 310564, 348539, 337542, 339678, 301741, 315676, 323937, 365147, 359777, 376884, 319897, 372391, 387939, 379456, 350363, 362258, 314841, 336007, 378344, 348312, 351737, 387030, 379322, 350299, 338593, 361650, 359100, 345530, 317596, 300395, 305993, 322034, 360289, 317165, 294569, 322807, 354570, 327435, 304237, 288990, 316250, 319017, 325699, 297358, 304870, 334931, 269174, 333657, 354523, 394908, 406285, 335968, 292751, 297267, 283133, 283062, 327138, 370644, 355514, 358437, 365643, 399644, 404458, 431832, 418936, 407066, 389852, 354579, 352415, 411911, 435775, 380769, 412919, 413132, 432651, 436682, 440890, 494957, 505547, 453343, 513661, 463447, 446702]
6504D46702l746j3304Q927L0542j2036J6329J2720l2681K7615K1446m7858n7044
6492C97612q438m598O3885M0090K8495k2142K3308k8501l3792P4599N4259J0910
6480E95687m0508k069p279M8512J3230k305R559L912L7575k8864l8581J9913L3933
6467F42715m5580n2034M943N2409M9775r931m4403l725M5492J0090l5177k3922
6455E90652M5601q301q846L3084M1731o647o1408k1170K1220K4863p452M3443
6443F86770K1090l4659q997K2935M2202J1336k1830j7385M739J2253M6732k7603
6431G37583o0191M867J13806k5344j3057O0555R283P595j604L3943J9477M2334
6419I29247L5385K7662k2771n4627Q500m8912j6953m2889l3678k072j9335J0406
$$ y = [446702, 442956, 429652, 438579, 469121, 457085, 473414, 486134, 453453, 481068, 502514, 454656, 397612, 389174, 384576, 448461, 488551, 517046, 494904, 518212, 489711, 455919, 530518, 584777, 595687, 555179, 553110, 545831, 594343, 607573, 605268, 614827, 618739, 656314, 627450, 588869, 608782, 642715, 597135, 545101, 550044, 602453, 652228, 642297, 597894, 594169, 639661, 649751, 614574, 590652, 636253, 627952, 619106, 652190, 693921, 687274, 625866, 604696, 625916, 650779, 643327, 686770, 707860, 673201, 664204, 687139, 729341, 740677, 718847, 701462, 706201, 718454, 765186, 737583, 677392, 682259, 796065, 770721, 757664, 818219, 827502, 835097, 833493, 867436, 886913, 929247, 964632, 992294, 969523, 914896, 923396, 874484, 857531, 814642, 780964, 778892, 759557, 769963]
6407G69963K4337L8331l9494n1673n332L6401q442o290N4067L6975p7320l2402
6395G39121P1035R8480j7394j3977J6352N708J7583M2321p6476o9072N3956J4629
6383H82266m6348k422K8788l7776N9689M0658n1285K9995l6974j8598j4446K9283
6371H62830Q9650J2649K7876K820o0830M5684Q4351J9179R035K2844Q04P538M2132
6358A166562K574K0904P2243K9479N6861M9768k6554O417P3667R1944L6019M7819
6346A627703R3712N675K7613J36050Q4542K0122K2049m9416o3921n3502p0650
6335A779977p295J8845L0891J2820k8507L760Q0947K3828M1647K4793L6448O7799
6323B085953J25538M2560J03274J07269J20092J22356J64998J18605J00989J66294
$$ y = [769963, 794300, 832631, 793137, 741464, 736132, 772533, 764091, 757801, 811868, 848843, 771523, 739121, 810156, 908636, 891242, 877265, 893617, 899325, 916908, 959229, 882753, 813681, 867637, 882266, 835918, 833496, 862284, 824508, 884197, 924855, 873570, 903565, 866591, 847993, 833547, 862830, 952480, 965129, 993005, 995825, 934995, 980679, 1065030, 1084209, 1093244, 1116088, 1116892, 1124430, 1166562, 1169136, 1190040, 1262283, 1291762, 1348623, 1398391, 1371837, 1378254, 1451921, 1543865, 1579884, 1627703, 1721415, 1727090, 1754703, 1890753, 1975295, 1995417, 2017466, 1968050, 1904129, 1850627, 1779977, 1772682, 1791527, 1822418, 1835238, 1806731, 1810491, 1891438, 1915266, 1956913, 1981706, 2018154, 2085953, 2211491, 2254051, 2357325, 2464594, 2584686, 2707042, 2872040, 2990645, 3091634, 3257928]
6313C257928P4739M9727J693o8801q4560j52297j35098j55590j91306j15174j06771
6302B374490o6550o8751p9140p9354o8220o0768l2475k1737k338l3143j15782
6291A746232k9191n6480r1637j3442l8420j8886Q701Q657o7141j4075k2029p6686
6279A335603R820M2889m6580p3705o1741K5216n9348p203L2534l6645K0852K1390
6267A203082n3858k2699L1276J7239l0868m4933j3301k6340M6775l563l5338J4972
6255A082444o9134n65k5473j8994q39N237O9522l3572j4949J6150n3188o728M2234
6242I92145K1966J9606l3591n7444k2426j5820J9749k5331l7284N6180L9771o29
6230I56892m116K3908L3102n854J6468j9410m0136K9724p642k7846L0099J5815
$$ y = [3257928, 3332667, 3382394, 3384087, 3315286, 3230726, 3078429, 2943331, 2787741, 2596435, 2481261, 2374490, 2307940, 2239189, 2160049, 2080695, 2012475, 1951707, 1919232, 1897495, 1895157, 1862014, 1746232, 1717041, 1660561, 1568924, 1555482, 1517062, 1498176, 1506877, 1515534, 1448393, 1434318, 1412289, 1335603, 1345423, 1388312, 1341732, 1268027, 1206286, 1231502, 1172154, 1164951, 1197485, 1160840, 1181692, 1203082, 1149224, 1126525, 1157801, 1175040, 1144172, 1099239, 1085938, 1059598, 1106373, 1102810, 1067472, 1082444, 1013310, 1012745, 987272, 968278, 967439, 972676, 1042198, 1008626, 993677, 1009827, 956639, 949911, 992145, 1014111, 1033717, 1000126, 942682, 920256, 904436, 924185, 898854, 861570, 917750, 957521, 956892, 952776, 976684, 1009786, 1003932, 1020400, 1000990, 960854, 990578, 982936, 955090, 985189, 1001004]
6218A001004o7225K0030J5098o7832J1009K292J3249M393J2043J7669j527J8529
6206I78732K051l3365j5947J8657K3401N2426j4543J5586k0620j9600J245k0946
6194I67077M5769N068j8615l3622j7615j7256M4339J4596Q193k9108k7154n0753
6182H90919P374P835M823k0611j2344K1806k6883r419J6748M046j1757k750M3013
6169I12800P0293k2343j3497k0301J6201j0103Q5446L5189J4196j1496m268K7879
6157A079996J3617n0243J9095o7024k5244k5852n2466L0476K5900k7221q161j1203
6145I01670m9695k5452K81L3569j0564K0642r115Q408L1117j7991k9119r971J6400
6132H60180p772K8373P4221j5187o34J0342L5052Q4545m34N139J9725j1545m1694
$$ y = [1001004, 933779, 953809, 968907, 901075, 912084, 914376, 927625, 932018, 944061, 961730, 960203, 978732, 980783, 947418, 931471, 950128, 973529, 1025955, 1011412, 1026998, 1006378, 986778, 988023, 967077, 1012846, 1017914, 999299, 965677, 948062, 930806, 975145, 989741, 997934, 968826, 941672, 890919, 898293, 906128, 910951, 890340, 877996, 899802, 872919, 863500, 880248, 884294, 872537, 869787, 912800, 983093, 960750, 947253, 926952, 943153, 933050, 1018496, 1053685, 1067881, 1056385, 1052117, 1079996, 1093613, 1043370, 1062465, 995441, 970197, 944345, 891879, 922355, 948255, 921034, 912873, 901670, 851975, 826523, 826804, 860373, 849809, 870451, 861336, 869744, 900861, 882870, 853751, 843780, 860180, 852408, 880781, 955002, 939815, 939181, 949523, 984575, 1069120, 1068686, 1073825, 1093550, 1082005, 1040311]
6119A040311j5086q635p5939l5009J9232q3311l3003n457N6634k1794j4908m354
6107H18681J2040K9017O822K1124o4521l4123K8122R6212m0985k6692M244L5533
6095H85474R497Q765J8115m8928p9135m3475k3405J5780O632P43J5733k8317L0636
6082G68115M6021m34m1539m582r623j8990k9824k3756M0735m5271M4806k0704
6070G04954k7078Q493j2692l9446O0822M4736J1507K4858j5978p115n777p39M2458
6057G89003M5103l987N782j157M7882M1803o507L4480j7067k2111k3867j338p9686
6044H08333l0520N196l3441j073K2085L5962M677l5759n5158k2941O1767k7114
6032G32014J185j7956L793M3684j6892J4120M0402O2742j9485K9581l911j1814
$$ y = [1040311, 1025225, 1016590, 940651, 905642, 924874, 841563, 808560, 803103, 859737, 837943, 823035, 818681, 830721, 859738, 866560, 887684, 823163, 789040, 817162, 913374, 872389, 845697, 849941, 885474, 894971, 903736, 921851, 872923, 793788, 750313, 726908, 742688, 749320, 750063, 765796, 737479, 768115, 814136, 813702, 772163, 767581, 757958, 738968, 709144, 685388, 726123, 680852, 725658, 704954, 677876, 686369, 673677, 634231, 695053, 739789, 751296, 776154, 760176, 753061, 747284, 746545, 789003, 834106, 830119, 835901, 834744, 882626, 924429, 917922, 952402, 935335, 913224, 889357, 888019, 808333, 777813, 783009, 749568, 748495, 770580, 806542, 811219, 775460, 720302, 697361, 759128, 732014, 733199, 715243, 719036, 762720, 745828, 759948, 800350, 863092, 843607, 873188, 869277, 857463]
6020H57463K7985Q400J6377k1968l2066j6803N383O8053j7316l4781l2412l5250
6008G93065L0942J744j3197j289o4435q96N1104O0972n838m202m1343j7633j2441
5995G76553m780J3414J2960L6487l9379R581P7883r347P68L6216m7414n9078Q9682
5982H93546Q2027K5805J2219m2274o2889P7000j8834k2782o911l1019j5485k5609
5970H64794k074k299M4544L925j2392k9326j8969L8671N447J825L2128K3762M179
5957I54215J8636n5809k2996j9002Q176K9407l8399L0383l8244k0766K6795M5976
5945I18372K5523l2100k0823J7735p223J8694L3165J4688j3230j7627M514R759
5933I51447l0384L733J3523l1367N1927J3124L160Q222p1115l3581o214l6188
$$ y = [857463, 885448, 893848, 910225, 888257, 856191, 839388, 844771, 912824, 895508, 860727, 828315, 793065, 824007, 825751, 812554, 811265, 746830, 745934, 797038, 858010, 852172, 847970, 806627, 788994, 776553, 771773, 785187, 798147, 834634, 795255, 804836, 882719, 873372, 874140, 910356, 862942, 803864, 893546, 975573, 1001378, 1013597, 971323, 908434, 985434, 966600, 943818, 936907, 905888, 890403, 864794, 862720, 860421, 904965, 908890, 896498, 867172, 848203, 886874, 892321, 894146, 926274, 950036, 954215, 972851, 917042, 894046, 875044, 883220, 912627, 874228, 904611, 866367, 845601, 872396, 918372, 943895, 911795, 890972, 908707, 901484, 920178, 953343, 968031, 954801, 937174, 941688, 951447, 921063, 924796, 938319, 906952, 958879, 972003, 975163, 983385, 912270, 878689, 872475, 836287]
5921H36287J4658J354L0715J1129j9408J3167l7829O845P1239J5842q507J5918
5909I51410k7655K183M0675L8515j6226k8043k1469l177J5113J3547j700J9200
5897I82373j8095r07N578J5541J747j6203j5046J9620K7644m724K2199O162J9455
5884A045344J9944O4018o0842n8664j2126J7476j1125M492M8144l211k7366n2052
5872I74032Q1006q540J0707L1552J3777L1370N3038j5168m0305L4604J1675n331
5860A172417j6801k8991J1917P979L940L5961k8826J0277K0952K476l9190M4871
5848A196982Q6740j5202n8895O112N5193m162J2541k1266k1442J9259j3992L6723
5836A278591K9633n0m3283J1185j3698Q652M054k513J7430j8201k9111L5292O4967
$$ y = [836287, 850945, 852299, 883014, 894143, 874735, 887902, 850073, 856918, 928157, 943999, 935492, 951410, 923755, 925938, 966613, 1005128, 988902, 960859, 939390, 936213, 951326, 964873, 963173, 982373, 964278, 963371, 968949, 984490, 986237, 970034, 954988, 974608, 1002252, 997528, 1019727, 1025889, 1045344, 1065288, 1129306, 1068464, 1009800, 997674, 1015150, 1004025, 1008517, 1056661, 1053450, 1026084, 974032, 1055038, 1046498, 1057205, 1088757, 1102534, 1133904, 1186942, 1171774, 1131469, 1166073, 1177748, 1172417, 1155616, 1126625, 1138542, 1146521, 1150461, 1186422, 1157596, 1167873, 1188825, 1191301, 1152111, 1196982, 1283722, 1268520, 1209625, 1215737, 1270930, 1266768, 1279309, 1258043, 1236601, 1255860, 1241868, 1278591, 1308224, 1308174, 1264891, 1276076, 1262378, 1271030, 1275084, 1272571, 1290001, 1271800, 1242689, 1277981, 1342948]
5823A342948o4770o444J4619n0641l3o1j2006L3080j6263J5202K7730J7573L5075
5810A336009j0944P249O6739O2554P8900L6634K7846M6963L1791l699N8968k0082
5798A718928O5359M3028J3498P4697M6152N7157L9973p947J7858K8804p2158j09003
5786A916346p3725j5506j237k5463k2736m8879o169l6916m6130k3546j7146k9651
5774A569242p6768K3202l7279j5232p7885q2006O8889J8132P2506n066P106K9867
5762A494708J2926M9863J2594L0818l5147R459M4980N1145q817o001m1518M6245
5750A661255j194M84k8806M0681P0211l0280n276q4852j5826N8965k3140J0842
5738A653064L757O180K1894k7888L3477m5525M5817Q5390j7167n5728j3924O1698
$$ y = [1342948, 1278178, 1271734, 1286353, 1235712, 1235679, 1235618, 1223612, 1256692, 1240429, 1255631, 1283361, 1300934, 1336009, 1325065, 1332314, 1399053, 1461607, 1540507, 1577141, 1604987, 1651950, 1683741, 1680042, 1739010, 1718928, 1784287, 1827315, 1840813, 1915510, 1961662, 2018819, 2058792, 2050845, 2068703, 2097507, 2025349, 1916346, 1842621, 1827115, 1825878, 1800415, 1777679, 1728800, 1722631, 1685715, 1639585, 1616039, 1598893, 1569242, 1492474, 1515676, 1478397, 1463165, 1385280, 1303274, 1372163, 1390295, 1462801, 1457735, 1464841, 1494708, 1507634, 1557497, 1570091, 1600909, 1565762, 1575221, 1620201, 1671346, 1662529, 1656528, 1615010, 1661255, 1660061, 1660545, 1631739, 1672420, 1742631, 1712351, 1707075, 1622223, 1606397, 1665362, 1642222, 1653064, 1656821, 1663001, 1684895, 1657007, 1690484, 1644959, 1690776, 1776166, 1758999, 1703271, 1689347, 1751045]
5726A751045L8744M7845L6978L4377L5751J5906M0022M2453L8247M7971L1204
5715B160543N5141J9765K5240L6722j5368K470J7768j2023j4927k2182J0320L3821
5703B297290l8458o7613o0154K8711m2338p5452l2066k6560o5341m5318l181j7029
5691A852491L4287o7112k1303L771n8849j4045N0183J9178N5856l8139m2809k27
5679A773282M5567N2964R089j9980o166p160l4678K5737K2271M513j487J092k9979
5666A835065J4302k9123k4939L2706M1056K2554m5702r638m5294J1277L0849l493
5654A829620J1216k3856l0396j2822O0863J5044o0813K849N8534K7134p5717N3235
5642A854891J4118n6928K989M3985J1603k785j2650o0787Q157k2358M7316N4453
$$ y = [1751045, 1789789, 1837634, 1874612, 1908989, 1944740, 1960646, 2000668, 2043121, 2081368, 2129339, 2160543, 2215684, 2235449, 2260689, 2297411, 2282043, 2284513, 2302281, 2290258, 2275331, 2253149, 2263469, 2297290, 2258832, 2191219, 2131065, 2159776, 2117438, 2041986, 2009920, 1983360, 1918019, 1872701, 1869520, 1852491, 1886778, 1819666, 1798363, 1802134, 1743285, 1729240, 1779423, 1798601, 1854457, 1816318, 1773509, 1773282, 1818849, 1871813, 1880902, 1860922, 1854756, 1847596, 1812918, 1838655, 1860926, 1865439, 1863952, 1865044, 1835065, 1849367, 1820244, 1795305, 1828011, 1869067, 1891621, 1845919, 1836281, 1790987, 1802264, 1833113, 1829620, 1840836, 1816980, 1786584, 1773762, 1834625, 1849669, 1788856, 1791705, 1850239, 1877373, 1801656, 1854891, 1869009, 1812081, 1815070, 1859055, 1870658, 1867873, 1855223, 1794436, 1802593, 1780235, 1827551, 1882004]
5630A882004o10l5310o245j3276j1849j2590k5147L9324l0879n0029K9300j4356
5618A750337K7811m0310L4147k1712k1182k029j8522L2615J2263m486j0330r258
5606A729344M1575K0258l0340n2264L7272L0266N0332L2253m1491M3636L612N2643
5594A917096J4006O364J8919l3312J9632L1232J5461j548L2751K2009M0619P552
5582B090781M4925O0075o245j0143J7771M0126K1053O7153K0637j0906K778Q000
5570B346005M229J2533M1740j8872k078n1764J7125N5762K5369L8478n3901M5248
5558B459874O0987J8488O2688p810O1269J9549p011J219K376K9866J1065L0577
5546B743137K699M9574J299M6620L8615N6419L8797K8125O9820J69798J91455
$$ y = [1882004, 1881394, 1846084, 1839839, 1826563, 1814714, 1802124, 1776977, 1816301, 1785422, 1735393, 1764693, 1750337, 1778148, 1737838, 1771985, 1750273, 1729091, 1727062, 1708540, 1741155, 1753418, 1748932, 1738602, 1729344, 1770919, 1791177, 1760837, 1708573, 1745845, 1776111, 1826443, 1858696, 1817205, 1860841, 1864453, 1917096, 1931102, 1937466, 1956385, 1923073, 1942705, 1973937, 1989398, 1987850, 2020601, 2042610, 2083229, 2090781, 2135706, 2195781, 2189536, 2179393, 2197164, 2237290, 2258343, 2325496, 2346133, 2335227, 2338005, 2346005, 2350234, 2362767, 2404507, 2385635, 2383557, 2331793, 2348918, 2404680, 2430049, 2468527, 2414626, 2459874, 2520861, 2539349, 2602037, 2594227, 2655496, 2675045, 2668034, 2669253, 2671629, 2701495, 2712560, 2743137, 2745836, 2795410, 2796709, 2843329, 2881944, 2938363, 2977160, 3005285, 3075105, 3244903, 3436358]
5535C436358N7914L4621n9139j20470p8330n0710p3264n6373l5806k7845p8808
5524B948148J690l2545M1335K4294n6268q5234r0126o0425m9867N0599k4732j7625
5512B649244J2954J2733K2392N1015m76N0262m2191L3416J3567J86p2042n3973
5500B677087L1476n2639j1047p855P317j0511k3873p9350j7334J5173l736J9621
5488B544329l9796j9493k8203J0072j1193O657j2772n7374j119J944j1863M6274
5476B427463N0897K3145j1865j2514P1174P1152J02194O8391M9054J32947R2289
5465C064327P0881J07673J90034J17822L9314L8387q080o119R2444O6646O4708
5454C838037J03132J35321J33652J89748R2366k3568j47529k67805k40823k32631
$$ y = [3436358, 3494272, 3528893, 3469754, 3349284, 3270954, 3220244, 3146980, 3090607, 3054801, 3026956, 2948148, 2949838, 2917293, 2958628, 2982922, 2926654, 2841420, 2751294, 2690869, 2641002, 2691601, 2666869, 2649244, 2662198, 2674931, 2697323, 2748338, 2747862, 2798124, 2755933, 2789349, 2802916, 2803102, 2731060, 2677087, 2708563, 2655924, 2644877, 2637022, 2644339, 2633828, 2609955, 2530605, 2513271, 2528444, 2524708, 2544329, 2504533, 2485040, 2456837, 2466909, 2455716, 2462373, 2449601, 2392227, 2391108, 2393052, 2381189, 2427463, 2478360, 2501505, 2489640, 2477126, 2548300, 2619452, 2721646, 2790037, 2839091, 2972038, 3064327, 3135208, 3242881, 3432915, 3550737, 3590051, 3628438, 3620358, 3614239, 3706683, 3773329, 3838037, 3941169, 4076490, 4210142, 4399890, 4492256, 4468688, 4321159, 4053354, 3812531, 3579900]
5444C579900k11454j37374j03692m9190j02265l0087Q807j6514N1808O2211J05086
5433C157236J7782N7935R4541J36330J57688J80709J49582O9789Q8556r623j21122
5422C979403j23001n1569j50982j49755j51123r4681p3092J5893J4081j9286P7043
5411C272931R113j7281k7309o4202m7975K1193m5595J981j13584l5342J398J14305
5399C069633N2789O945L6961J3169m6769N7736k0028j0147n0495r5069m3958p029
5387B963738q3023n297L732n8430q3607j3523l3051l8917L7655l5489l6789j8797
5375B598202L4337J0591M6408j8566n1828K1913N9917P91L7283Q3655P0411M7719
5363B940833l851L3999J11819Q9072P3164O3452J00958Q4629O4068R668J5469
$$ y = [3579900, 3368446, 3231072, 3127380, 3078190, 2975925, 2945838, 2954645, 2938131, 2989939, 3052150, 3157236, 3175018, 3232953, 3327494, 3463824, 3621512, 3802221, 3951803, 4021592, 4110148, 4100525, 3979403, 3856402, 3804833, 3653851, 3504096, 3352973, 3258292, 3185200, 3201093, 3215174, 3195888, 3272931, 3282044, 3264763, 3237454, 3173252, 3125277, 3146470, 3100875, 3102856, 2989272, 2953930, 2955328, 3069633, 3122422, 3129367, 3166328, 3179497, 3132728, 3190464, 3170436, 3160289, 3109794, 3014725, 2970767, 2963738, 2880715, 2875418, 2879150, 2820720, 2737113, 2723590, 2690539, 2651622, 2689277, 2653788, 2616999, 2598202, 2632539, 2643130, 2689538, 2670972, 2619144, 2641057, 2700974, 2701765, 2739048, 2822703, 2893114, 2940833, 2936982, 2970981, 3082800, 3171872, 3245036, 3308488, 3409446, 3494075, 3558143, 3567811, 3583280]
5352C583280J0178l8742k2070j7215l3527l9930o8826j1226k313k5627j7830P551
5340C323703J7106J9980M5659J03276K6872R1275J36737M6472O1318j5779L8988
5329C895607r312K9074n0036m2598J0790J0535K5145J14496P1597O4164R5714
5318D215176J35195J72526J26539J20513N7326P7953M6297M9599N5012L5870j0213
5307E081793p035q873j5195K9528O6458q253j55045j39595j58795j56235l6993
5296D491760j00701m3650k2680O8390J4454m9315p0499j09950m7962k211K1022
5285D148658N0041P20J7754m1562o2322p5396k5401j36526j45852j42227j49024
5274C438863k48872j83330r2829j76425r0871m9601p3780p8782o5046K6501l2421
$$ y = [3583280, 3593458, 3554716, 3532646, 3515431, 3481904, 3441974, 3373148, 3361922, 3359609, 3333982, 3316152, 3323703, 3340809, 3360789, 3406448, 3509724, 3536596, 3627871, 3764608, 3811080, 3872398, 3856619, 3895607, 3886295, 3915369, 3865333, 3822735, 3833525, 3844060, 3869205, 3983701, 4055298, 4119462, 4215176, 4350371, 4522897, 4649436, 4769949, 4827275, 4905228, 4951525, 5001124, 5056136, 5092006, 5081793, 5074758, 5065885, 5050690, 5080218, 5146676, 5138423, 4983378, 4843783, 4684988, 4528753, 4491760, 4391059, 4347409, 4324729, 4393119, 4407573, 4358258, 4287759, 4177809, 4129847, 4127636, 4148658, 4198699, 4199419, 4217173, 4175611, 4113289, 4037893, 4012492, 3875966, 3730114, 3587887, 3438863, 3189991, 3006661, 2913832, 2737407, 2646536, 2596935, 2523155, 2444373, 2379327, 2405828, 2373407]
5263B373407q7481l1472K5459k7103q7363m3684m7812j5230P810l1771n9322j935
5251A973503N184K8445p994j2223m9853k8073o001j5094j4688K6476K6630j8668
5239A907644p646n0961M009O956L8083L1173l6774L2188M7158J5606K5068Q1545
5227B094049Q7898R8157P7652P4520K1767q8730r1358j56798p2986o0530n0945
5216A932696r5769j323N458j8539j5770n6814j4296K0510l8993n54k2891k8034
5204A665681M2123j2542Q8756P913k9727q678P349M818K0540p3233M1620K53n1641
5191A703232l2415N385j5751J2852N9809J711L148r0786j3153N9543o473q83o495
5178A679724M0882l2186j0324J6957m1782L5143N1946K352K879k0869m8002J2097
$$ y = [2373407, 2285926, 2254454, 2279913, 2252810, 2165447, 2121763, 2073951, 2058721, 2066531, 2034760, 1975438, 1973503, 1978687, 2007132, 1999138, 1986915, 1937062, 1908989, 1902988, 1887894, 1873206, 1899682, 1926312, 1907644, 1899998, 1849037, 1853046, 1860002, 1898085, 1929258, 1892484, 1924672, 1971830, 1987436, 2012504, 2094049, 2181947, 2280104, 2357756, 2432276, 2454043, 2365313, 2273955, 2117157, 2044171, 1983641, 1932696, 1836927, 1835604, 1841062, 1822523, 1806753, 1749939, 1735643, 1756153, 1717160, 1716606, 1693715, 1665681, 1707804, 1695262, 1784018, 1791931, 1762204, 1753526, 1760875, 1765693, 1786233, 1713000, 1754620, 1754873, 1703232, 1670817, 1676202, 1660451, 1673303, 1733112, 1734823, 1737971, 1647185, 1634032, 1693575, 1687102, 1686219, 1679724, 1720606, 1688420, 1678096, 1695053, 1653271, 1688414, 1740360, 1742712, 1745591, 1724722, 1676720, 1688817]
5166A688817M7835l2797q0887J6413j5276P831k3418o8528J9561k3852p1527J3894
5154A478066M4626l4122K760R721K4317p064k990k764K1773O3681K8554n4390
5142A572168O238j2863O9321k7760K4686j7838p4762M7237M4717Q239Q880p013
5130A641250j4405j09M300Q425L2315K3943m0272K7932L6128n4346J4103N2339
5118A731603k9421K2885j0765j0346J6052m007o98q868j93K6394M856k3299K6139
5105A740332k1880O000j0223M3956R9360N0230k1311Q438k186N3690L0081j8867
5093A957620J9075O3737Q5488M5826L9486K5030L7023J07667Q1470P7609J54872
5082B694903P7674K06966J76768J01772l3936j12957j71875k16121k39830j62407
$$ y = [1688817, 1736652, 1703855, 1622968, 1639381, 1624105, 1631936, 1608518, 1539990, 1559551, 1535699, 1464172, 1478066, 1522692, 1488570, 1491330, 1501051, 1525368, 1518304, 1515314, 1512550, 1534323, 1598004, 1626558, 1572168, 1578406, 1565543, 1634864, 1607104, 1631790, 1613952, 1539190, 1586427, 1631144, 1639383, 1648263, 1641250, 1626845, 1626736, 1631036, 1639461, 1671776, 1695719, 1655447, 1683379, 1719507, 1665161, 1679264, 1731603, 1702182, 1725067, 1714302, 1703956, 1720008, 1716001, 1715303, 1706435, 1706242, 1732636, 1737492, 1714193, 1740332, 1718452, 1724452, 1714229, 1758185, 1857545, 1907775, 1886464, 1894902, 1892716, 1946406, 1976487, 1957620, 1976695, 2040432, 2125920, 2171746, 2211232, 2236262, 2273285, 2380952, 2462422, 2540031, 2694903, 2772577, 2979543, 3156311, 3258083, 3224147, 3111190, 2939315, 2723194, 2483364, 2320957]
5072B320957q8961m7475o3817k3344l8888p2906j9566o231J0184N4205M412p8445
5060A950125o2891M7497M9664k4057J891k2903m0070L0239J2238K1630m8452l6217
5048A878694J0609P42k6340M0250k7006N405L2180K8435l6584j0342L7864O1502
5036A995409l0585R665O0401l6145L3146J8863M6104N9486K2986K4545l6862J1979
5024B178992j0064M0868O590R5834O0818m701P1084J05381J27276J28106J23627
5013B923811R8839J02683J87073J62431J16341M3717p6745j65759j16293j95847
5003C080251k10977j37763n0076k7939r1977j7904N3959M2231k6330n3570m8270
4992B511635L7308N2241Q8260J3472k1662J3270K2344J3382j9047j5732k7045
$$ y = [2320957, 2231996, 2184521, 2120704, 2097360, 2058472, 1985566, 1966000, 1959769, 1969953, 2024158, 2028570, 1950125, 1887234, 1934731, 1984395, 1960338, 1962229, 1939326, 1899256, 1929495, 1941733, 1963363, 1914911, 1878694, 1889303, 1890045, 1863705, 1903955, 1876949, 1882354, 1914534, 1942969, 1906385, 1896043, 1933907, 1995409, 1964824, 1974489, 2034890, 1998745, 2031891, 2050754, 2096858, 2156344, 2179330, 2203875, 2167013, 2178992, 2168928, 2209796, 2216386, 2312220, 2373038, 2368337, 2439421, 2544802, 2672078, 2800184, 2923811, 3022650, 3125333, 3312406, 3474837, 3591178, 3634895, 3558150, 3392391, 3276098, 3080251, 2869274, 2731511, 2681435, 2653496, 2561519, 2543615, 2597574, 2639805, 2613475, 2559905, 2511635, 2548943, 2601184, 2689444, 2702916, 2681254, 2694524, 2716868, 2730250, 2711203, 2695471, 2668426]
4981B668426Q322O7291M6426j8727l1648m8665k0833L6504O097J8266P319K374
4969B741152K7495M4464M119P6134M5284J3805L023M2930Q453L6532L2078O4632
4957C140101R51k8740Q700O2471n530M6247L1819J2315K8866N6551m469j9763
4945C329519M5267L9783M6422M1835N6351R5817J7008O304J6870Q3444Q8516J8432
4933C885568l7228R657M0089L1756M3412R4059O3004O5051M7418P231R648P0863
4921D330528M8402J00397J1290K9721M2965M7506K5479M6103R9827N2222L6749
4910D871189O3768O6070N7440R2593M3613n038K2887m9250J3874M9513R4395M8120
4898E369174L5069Q6777P5746J41701P9454J9799M6087L3864K3851j5133M6329
$$ y = [2668426, 2676748, 2744039, 2790465, 2771738, 2740090, 2691425, 2670592, 2707096, 2713193, 2731459, 2738778, 2741152, 2768647, 2813111, 2817230, 2893364, 2938648, 2952453, 2955476, 2998406, 3006859, 3043391, 3075469, 3140101, 3141052, 3112312, 3121012, 3183483, 3177953, 3224200, 3256019, 3268334, 3297200, 3353751, 3349282, 3329519, 3374786, 3414569, 3460991, 3502826, 3559177, 3654994, 3672002, 3678306, 3695176, 3778620, 3867136, 3885568, 3848340, 3857997, 3898086, 3929842, 3973254, 4067313, 4130317, 4195368, 4242786, 4250017, 4259665, 4330528, 4378930, 4479327, 4490617, 4520338, 4563303, 4610809, 4636288, 4682391, 4782218, 4834440, 4871189, 4934957, 5001027, 5058467, 5151060, 5194673, 5189635, 5212522, 5163272, 5177146, 5226659, 5321054, 5369174, 5404243, 5491020, 5566766, 5708467, 5787921, 5807720, 5853807, 5887671, 5911522, 5896389, 5942718]
4887E942718M2034N0461n085K2494L5121R6779R1345J11950J09205O0162J10709
4876F667893J34748P3606J01678J71735J04128J46385R4808J23439J41552Q2701
4866G842673J27877J05060J14415J73091K09166J88698J79770K08658K51344J89907
4856I590659J23916K19961K08380K03982J85094K61941K58440K76422K87750K06696
4846A1823241J83776K36741J74249K27001J44587K27157J10609J77246K18719
4837A3523326K43219K28884K31715K11734K71582J82871K96981L58471L26514
4828A5875297K31920K60484K91929L46008L07523L18481K67730L32003L36171
4819A8567546M50082M03963M45831M55737M67349M97756N22084N52370O59295
$$ y = [5942718, 5984752, 6035213, 6030128, 6052622, 6087743, 6184522, 6275867, 6387817, 6497022, 6557184, 6667893, 6802641, 6876247, 6977925, 7149660, 7253788, 7400173, 7494981, 7618420, 7759972, 7842673, 7970550, 8075610, 8190025, 8363116, 8572282, 8760980, 8940750, 9149408, 9400752, 9590659, 9714575, 9934536, 10142916, 10346898, 10531992, 10793933, 11052373, 11328795, 11616545, 11823241, 12007017, 12243758, 12418007, 12645008, 12789595, 13016752, 13127361, 13304607, 13523326, 13766545, 13995429, 14227144, 14438878, 14710460, 14893331, 15190312, 15548783, 15875297, 16107217, 16367701, 16659630, 17005638, 17313161, 17631642, 17899372, 18231375, 18567546, 19017628, 19421591, 19867422, 20323159, 20790508, 21288264, 21810348, 22362718, 23022013]
4810B3022013O03421O36852N12227N42128M36494N96049N78262N78260N28854
4801B8034560O31227O33225P64704Q82481R85887J030239J182019J195330J360733
4792C6700405J400229J684085J817742K137206K275742K599028K785458L211393
4784E4611288L570634M369561N237790O704280Q223636J0060099J1816353J3963748
4776A18557389J5687064J7598754J9122162K2143262K6080611L1705948K8426526
4769B79321716J7505762J260536k5742980l6900433m2441465l8437050k7503707
4762A27062379j9410045j3869455j0520573q121432o465277n380673m522148l723803
4754E5048973l250830k783249k350707j942654j634292j238535r96006q17293
$$ y = [23022013, 23625434, 24262286, 24774513, 25316641, 25753135, 26349184, 26927446, 27505706, 28034560, 28665787, 29299012, 30063716, 30946197, 31932084, 32962323, 34144342, 35339672, 36700405, 38100634, 39784719, 41602461, 43739667, 46015409, 48614437, 51399895, 54611288, 58181922, 62551483, 67789273, 74493553, 82717189, 92777288, 104593641, 118557389, 134244453, 151843207, 170965369, 193108631, 219189242, 250895190, 279321716, 296827478, 298088014, 272345034, 235444601, 193003136, 154566086, 127062379, 107652334, 93782879, 83262306, 75140874, 68675597, 63294924, 58772776, 55048973, 51798143, 49014894, 46664187, 44721533, 43087241, 41848706, 40852700, 40035407]
4746D0035407o87775n63396m73058m48307m33265k61552j63040j83224k18262
4737C6603528j31965j86949r4852l1678J27298L5010J56596J33519L17730L37130
4727C7265367M34556M64513O60420P21576Q84395R11269J080351J052691J286232
4718D4761370J476500J700724J784347K163219K413420K810633L116120L967331
4710F4193664M930389O142359P595435R402447J1276736J3456227J5305448J6987232
4702A49289937J8704458K2177585K6474695L0060884K2389146J2235131J564939
4695B82896775k0298446k9275130l4846765l8713575l0034365k1064046j5051690
4688I3612758j1498957q759930o989379n691778m823870l974753l477385l007925
$$ y = [40035407, 39347632, 38784236, 38311178, 37862871, 37429606, 37168054, 37005014, 36821790, 36603528, 36471563, 36284614, 36189762, 36158084, 36285382, 36320392, 36476988, 36610507, 36928237, 37265367, 37699923, 38164436, 38824856, 39546432, 40430827, 41342096, 42422447, 43475138, 44761370, 46237870, 47938594, 49722941, 51886160, 54299580, 57110213, 60226333, 64193664, 69124053, 75266412, 82861847, 92264294, 103541030, 116997257, 132302705, 149289937, 167994395, 190171980, 216646675, 246707559, 269096705, 281331836, 282896775, 262598329, 233323199, 198476434, 159762859, 129728494, 108664448, 93612758, 82113801, 73353871, 66364492, 60672714, 55848844, 51874091, 48396706, 45388781]
4680D5388781k657306k327603k016516j656315j441936j247260j190086j139753
4672C1712006j143341j061819j097276r44093q51619p65639p51471o72902p03675
4663B3720171o66913o02849n49234n62669m71008m18984m24027m18555l95402
4654A9210530m82934l90333l85448l47024l13314k47285k39598k57587k77631
4645A6269376m15396l85670m19071l43485k49556k49411k34435j84657j58534
4636A3629161j75045j27741m7306k7180m7906r8474o2224n508K9134m1335o9232
4625A2956344o2875j39499l25742l09339l25033l09340l01440k79556j91703j36913
4615A0574904p3138l7120l0603j337O4051R0204K7767J3692k762P1887k3978q6398
$$ y = [45388781, 42731475, 40403872, 38387356, 36731041, 35289105, 34041845, 32851759, 31712006, 30568665, 29506846, 28409570, 27465477, 26613858, 25848219, 25096748, 24423846, 23720171, 23053258, 22450409, 21901175, 21338506, 20867498, 20448514, 20024487, 19605932, 19210530, 18727596, 18337263, 17951815, 17604791, 17291477, 17044192, 16804594, 16547007, 16269376, 15853980, 15468310, 15049239, 14705754, 14456198, 14206787, 13972352, 13787695, 13629161, 13454116, 13326375, 13279069, 13251889, 13203983, 13105509, 13043285, 13037777, 13066911, 13025576, 12956344, 12893469, 12753970, 12428228, 12118889, 11793856, 11484516, 11183076, 10903520, 10711817, 10574904, 10501766, 10464646, 10434043, 10432706, 10496757, 10586961, 10614728, 10628420, 10625658, 10697545, 10673567, 10587169]
4603A0587169j17376j53565j35934j42332j77069k06035k34825r5319j7284p1730
4593I235700p8967p0569r6309j07169j06124q4907n2238k3787p4474j33306j67566
4582H240284k25616k07637k35184k40829k43781j53004p8291j03781n9021n2228
4572F640912l9744J1001o068l3873J1090r8526j29302j80139j31036j89013j60704
4561E694598j73909j66215j42259q2971j50232j49011m4557j11764p3627k4833
4551D575220j18680m9254j13933n6220l0506l1066o6171J3059j2051k9762K1652
4540D102288K886m1108q616j2532M0174N2100M3051M6136k2947K0177j6481j6150
4528D188978k4731K5208K0288q4231r1106l6478m0835p5098j03694n3282r376
$$ y = [10587169, 10469793, 10316228, 10180294, 10037962, 9860893, 9654858, 9420033, 9324714, 9307430, 9235700, 9156733, 9086164, 8989855, 8882686, 8776562, 8691655, 8639417, 8615630, 8541156, 8407850, 8240284, 8014668, 7807031, 7571847, 7331018, 7087237, 6934233, 6855942, 6752161, 6693140, 6640912, 6601168, 6612169, 6606101, 6572228, 6583318, 6484792, 6355490, 6175351, 6044315, 5855302, 5694598, 5520689, 5354474, 5212215, 5129244, 4979012, 4830001, 4785444, 4673680, 4600053, 4575220, 4456540, 4407286, 4293353, 4237133, 4206627, 4175561, 4109390, 4122449, 4110398, 4080636, 4102288, 4105174, 4064066, 4055450, 4042918, 4083092, 4135192, 4178243, 4224379, 4201432, 4221609, 4205128, 4188978, 4164247, 4189455, 4209743, 4125512, 4034406, 3997928, 3957093, 3881995, 3778301, 3725019, 3715643]
4517C715643o8046m3280k9840J6185J3990p601R739j1136j0730m8433K3180O8964
4505C628635Q215J1966J7428l3303K6922P804k2482K1254n3997j08051n3427o243
4493C444721j934l8358o194l4549l4327K7553J980M354j8750L8862k1142J3487
4481C375703N1025L1563L6320L458O529k4224L5422R7891O8118J7236N6528K3631
4469C779200Q8818P1941J62071J19504J90314J23221J28730J60327J66639J90976
4459E181741J02694J36377J20608K5364R8949l5196j27354k10944k50615k08840
4449D832784j21077j1639N0777q603M4907K5494k6113l9192j1703k4543k4636
4438D686456M6086L3261J10470J02748J08551J03944J33367J72320J98658J97854
$$ y = [3715643, 3647597, 3604317, 3574477, 3590662, 3604652, 3597051, 3606790, 3595654, 3584924, 3536491, 3559671, 3628635, 3636850, 3648816, 3666244, 3632941, 3659863, 3667667, 3645185, 3666439, 3612442, 3504391, 3450964, 3444721, 3442787, 3404429, 3398235, 3363686, 3329359, 3356912, 3358892, 3363246, 3344496, 3383358, 3362216, 3375703, 3426728, 3458291, 3494611, 3498069, 3504598, 3480374, 3515796, 3613687, 3681805, 3699041, 3755569, 3779200, 3868018, 3939959, 4102030, 4221534, 4411848, 4535069, 4663799, 4824126, 4990765, 5181741, 5284435, 5420812, 5541420, 5566784, 5665733, 5630537, 5503183, 5292239, 5041624, 4832784, 4711707, 4700068, 4750845, 4742242, 4787149, 4812643, 4786530, 4747338, 4735635, 4711092, 4686456, 4732542, 4765803, 4876273, 4979021, 5087572, 5191516, 5324883, 5497203, 5695861, 5893715]
4428E893715J17859R7973M1576J30003J73617J82946K66507L29389L71406L37026
4418G942017K76992J33285N703j53151k93177k64692l06280k25370j77893q7618
4408F849816N0923J4201o2616j30765j64038k16601j39842n2773m7532P9027J59774
4397F339574J94632K18443J30282O0728n6627p4678q9740M7879K12887K01863
4387G185243K65938K54259J93924J49429J0275q1387k03198l47130l93291l64019
4377F670043m51728n09086m17107l33660l21486k07659j81227j75579j77692q3199
4367C811620q6639o2964o8518m985q9689r5382n2254l0677M8537K3081n828p3038
4355C313264k883J3492l769o4889p9317n4930l8899n9091r9120j07976n3159o1322
$$ y = [5893715, 6011574, 6109547, 6151123, 6281126, 6454743, 6637689, 6904196, 7233585, 7604991, 7942017, 8219009, 8352294, 8357997, 8204846, 7911669, 7646977, 7340697, 7115327, 6937434, 6849816, 6900739, 6914940, 6852324, 6721559, 6557521, 6340920, 6201078, 6148305, 6100773, 6179800, 6339574, 6534206, 6752649, 6882931, 6943659, 6887032, 6812354, 6722614, 6770493, 6983380, 7185243, 7451181, 7705440, 7899364, 8048793, 8059068, 7977681, 7774483, 7427353, 7034062, 6670043, 6218315, 5709229, 5292122, 4958462, 4636976, 4429317, 4248090, 4072511, 3894819, 3811620, 3724981, 3662017, 3593499, 3588514, 3498825, 3403443, 3351189, 3320512, 3369049, 3392130, 3386302, 3313264, 3310381, 3323873, 3320104, 3255215, 3175898, 3120968, 3082069, 3022978, 2923858, 2815882, 2762723, 2701401]
4343B701401J191p2542o6311k1326k4962m0979j1421j9873j3547J5822K4697k1698
4331B450452k5056o5377o6144o727k0087N9569j4595L8383k0399k5962m6162P417
4319B265312M0736L4676M4185K0747N882n6937m68N7969K8236J3703p8852j7698
4307B357491p2861J348o628N214m9780J9788q762j2510M1327k2617m415K3566
4295B271161N953J5299P4357J2329k085n0160p970P2284L1930j9834j4412J1393
4283B400245K2808j2447l7923j3508K6381m1303M910p713J4038l873K8951M4247
4271B424813k8145K3119K3910J0101q268L5557J6650j7963O145J8694J1969O5614
4259B582196j1748J7068L4321j5877K5150J6036k6375n547K9979j4849O6172l403
$$ y = [2701401, 2702592, 2630050, 2563739, 2542413, 2517451, 2476472, 2465051, 2445178, 2431631, 2447453, 2472150, 2450452, 2425396, 2360019, 2293875, 2287148, 2267061, 2326630, 2312035, 2350418, 2330019, 2304057, 2257895, 2265312, 2306048, 2340724, 2384909, 2405656, 2411538, 2354601, 2354133, 2412102, 2440338, 2454041, 2375189, 2357491, 2284630, 2285978, 2279350, 2284564, 2234784, 2254572, 2245810, 2233300, 2274627, 2252010, 2247595, 2271161, 2277114, 2292413, 2366770, 2379099, 2377014, 2326854, 2318884, 2391168, 2423098, 2403264, 2388852, 2400245, 2423053, 2410606, 2372683, 2359175, 2385556, 2344253, 2349163, 2341450, 2355488, 2351615, 2380566, 2424813, 2396668, 2419787, 2443697, 2453798, 2445530, 2481087, 2497737, 2479774, 2485919, 2504613, 2516582, 2582196, 2570448, 2587516, 2621837, 2605960, 2631110, 2647146, 2620771, 2615224, 2645203, 2630354, 2696526, 2693123]
4247B693123N0489J23843Q5704O7016P4139J39726J66468J14077J97704J68882
4237C881171K65126L44244L30588p719j42899m41534m89720k85077k17742j42975
4227C093463p5921m5562n2254m2811l1962n4439j6379p810m0672J3671p972m8710
4215B682642j6581k4316j16348j0382j1153k6408m2823J1396n2465q9340j1290
4204B292932l7767p717M3022J6477K2977n8866j5136k9931K6212N194l6331O285
4192B227351P009L3699l9968M676M3262m7850K8815L4488M284M3276j2062l2929
4180B294051j5224p521L5168K0476K0734o945k2242L9444J7407k273M1845L7058
4168B451978j5695k070M0233J0725K8233K1923K600J5681O3329N3425m203r574
$$ y = [2693123, 2743612, 2867455, 2953159, 3020175, 3094314, 3234040, 3400508, 3514585, 3712289, 3881171, 4146297, 4490541, 4821129, 4813410, 4670511, 4228977, 3739257, 3454180, 3236438, 3093463, 3017542, 2971980, 2919726, 2876915, 2844953, 2790514, 2774135, 2766325, 2725653, 2739324, 2731352, 2682642, 2666061, 2641745, 2525397, 2515015, 2503862, 2477454, 2434631, 2446027, 2393562, 2304222, 2292932, 2255165, 2247448, 2290470, 2306947, 2329924, 2271058, 2255922, 2225991, 2252203, 2257397, 2221066, 2227351, 2234360, 2268059, 2228091, 2232767, 2276029, 2228179, 2256994, 2291482, 2295766, 2339042, 2326980, 2294051, 2278827, 2271306, 2306474, 2326950, 2347684, 2340739, 2318497, 2357941, 2375348, 2373075, 2414920, 2451978, 2436283, 2434213, 2474446, 2485171, 2513404, 2535327, 2537927, 2553608, 2616937, 2670362, 2666159, 2656585]
4156B656585M5712O9978j8853N5981M2365L5404J5489L1241j5692m7300M6245
4145B917155M2020M6425P5489J25496Q9801O4046J05225J18000J87258J46788
4135C917703J62744P5110r974j19040j73672k15292j46307q6503m0370j12914
4125C251485l7650q169L1650J853k5827L2860l560M0368R256L0013J8382J431
4113C342092n770R149k0865Q686M8479N313L6782l1101K1363O4695j4789J5970
4101C480004M2308J033j234N4957J8218N4126L9057M5715L2376L9159K3738K5808
4089C855265k4249N6460L0582J06781P9116M5755N6217J04449O6936M3852J08218
4078D529382J25105O4714O0338O3755K8973O8459R0488O6608P7627N7181J19722
$$ y = [2656585, 2702297, 2772275, 2753422, 2809403, 2851768, 2887172, 2902661, 2933902, 2918210, 2870910, 2917155, 2959175, 3005600, 3081089, 3206585, 3296386, 3360432, 3465657, 3583657, 3770915, 3917703, 4080447, 4155557, 4145583, 4026543, 3852871, 3637579, 3491272, 3404769, 3364399, 3251485, 3213835, 3205666, 3237316, 3239169, 3213342, 3246202, 3242642, 3283010, 3292266, 3322279, 3340661, 3342092, 3336322, 3345471, 3324606, 3333292, 3381771, 3387084, 3423866, 3392765, 3414128, 3478823, 3464034, 3480004, 3522312, 3523345, 3522111, 3577068, 3595286, 3649412, 3688469, 3734184, 3766560, 3805719, 3829457, 3855265, 3831016, 3887476, 3918058, 4024839, 4103955, 4149710, 4205927, 4310376, 4377312, 4421164, 4529382, 4654487, 4719201, 4779539, 4843294, 4872267, 4940726, 5031214, 5097822, 5175449, 5232630, 5352352]
4067E352352J14654R6395J17580J27248J10690J71463J14139M8221M9372Q9188
4057F391302J09514J27257R2594J00395Q5289P9064O3387O5814J1068M9801K9320
4046G204805N3028j1088m3115M4868R0182P132K548O1777L1947J7398q6741j37990
4034G234751p6446j09162o5645l9216l1264k1832n1732n2462r7628J6169r6263
4023F609270j42792j63429j35071j30064j65115j59011o9443j38745j73035j88354
4013E144211n6377j42467j35417j17958j39068j24307p9452r5026j40672j22158
4003C991309r3553j25711j23949l3991o5959n1242l4310j43047p3694p2279k6139
3992C147435j1041J0789o3120L415n351k5009N299Q889K2257l3824R106k8021
$$ y = [5352352, 5467006, 5563401, 5680981, 5808229, 5918919, 6090382, 6204521, 6252742, 6302114, 6391302, 6500816, 6628073, 6720667, 6821062, 6906351, 6985415, 7048802, 7114616, 7125684, 7175485, 7204805, 7257833, 7246745, 7203630, 7248498, 7338680, 7345812, 7348360, 7410137, 7442084, 7459482, 7372741, 7234751, 7158305, 7049143, 6983498, 6944282, 6913018, 6891186, 6839454, 6786992, 6689364, 6705533, 6609270, 6466478, 6303049, 6167978, 6037914, 5872799, 5713788, 5644345, 5505600, 5332565, 5144211, 5087834, 4945367, 4809950, 4691992, 4552924, 4428617, 4349165, 4254139, 4113467, 3991309, 3897756, 3772045, 3648096, 3614105, 3548146, 3496904, 3462594, 3319547, 3245853, 3173574, 3147435, 3136394, 3147183, 3084063, 3087478, 3082127, 3057118, 3062417, 3071306, 3093563, 3059739, 3068845, 3040824]
3980C040824m0887j9220q2900j01131j86068j15252l1595q4661o9212n4165l6164
3969B219569j537m0793J3149L3530o814l6946m5429o3256p0081M002l7107o4018
3957A904269o5354k8818o0226J4012J3498m6229K2811l0679n6030n7547p0492
3946A539215K5576l792l3305K0837j4265m6022L583n43q198l5479j6222l0196
3934A401189m0550l5806k1150k5588K1137n4141j986j7335j3442L2406K599o0718
3922A186615m2957L7899N2772M8414k2697r799J1584l4952k5892M7415k0132l6660
3910A191610k4872L1840n8056m6638K6765j6281j4826k2603K6021o805J7654M676
3898A108485l1093k1957j7153p258J4106l7032O243J5841L0776L5812j8058l8462
$$ y = [3040824, 2999937, 2980717, 2897817, 2796686, 2610618, 2495366, 2463771, 2379110, 2309898, 2255733, 2219569, 2218032, 2177239, 2190388, 2223918, 2217104, 2180158, 2134729, 2071473, 2001392, 2005394, 1968287, 1904269, 1838915, 1810097, 1749871, 1763883, 1777381, 1731152, 1753963, 1723284, 1667254, 1609707, 1539215, 1564791, 1560999, 1527694, 1548531, 1534266, 1488244, 1491827, 1491284, 1483086, 1447607, 1431385, 1401189, 1360639, 1324833, 1303683, 1278095, 1299232, 1245091, 1243105, 1225770, 1212328, 1244734, 1247333, 1186615, 1143658, 1181557, 1234329, 1282743, 1260046, 1250247, 1261831, 1226879, 1200987, 1248402, 1228270, 1191610, 1166738, 1198578, 1140522, 1093884, 1120649, 1104368, 1089542, 1066939, 1092960, 1086155, 1103809, 1108485, 1077392, 1055435, 1038282, 1031024, 1045130, 1008098, 1014341, 1030182, 1060958, 1096770, 1078712, 1040250]
3886A040250l7763J3836M3648M50R835K1520o8715K3395k5317m6465M7046M8205
3874A069925j0246o3851L1410K296K1774O0518l6185k3966O096O982J1828K2314
3862A098895J943n163j4656K869R315J2606K3139N147k6521m1688q905n164K5336
3849A077153J0920L3364m710j3882k0306j6296m6844M3249O1005M934r3701n718
3837A029168k0804O5415M8495l3541K3163M1773q642j3483j1013J6413m1707j7279
3825A077958J7691j5408J01151L3663k8455j0355P733m296P951k9726R5033K5349
3813A278289j5732J0638L535l109j0967O2540O7425J4520L1664N093j7799M4700
3801A470797L51n908L253N2271L4365m4777l5642K7709N9763l6910M800J1544
$$ y = [1040250, 1002487, 1016323, 1059971, 1060421, 1070256, 1091776, 1023061, 1046456, 1021139, 974674, 1021720, 1069925, 1059679, 995828, 1027238, 1029534, 1051308, 1111826, 1075641, 1051675, 1057771, 1064753, 1076581, 1098895, 1100838, 1095675, 1081019, 1083888, 1093203, 1105809, 1128948, 1134095, 1107574, 1065886, 1056981, 1051817, 1077153, 1088073, 1121437, 1116727, 1102845, 1082539, 1066243, 1019399, 1062648, 1123653, 1128587, 1034886, 1029168, 1008364, 1073779, 1122274, 1088733, 1111896, 1153669, 1145027, 1131544, 1120531, 1136944, 1095237, 1077958, 1095649, 1080241, 1181392, 1215055, 1186600, 1176245, 1183978, 1179682, 1187633, 1157907, 1252940, 1278289, 1262557, 1273195, 1276730, 1273621, 1262654, 1325194, 1392619, 1407139, 1438803, 1443896, 1426097, 1470797, 1471148, 1465240, 1468493, 1520764, 1555129, 1510352, 1474710, 1502419, 1562182, 1525272, 1530072, 1541616]
3789A541616Q3391Q7377O775J4953Q6516O7186R6119K5122N6397J34757K2647
3778B222856P5555J13342M8490R9826M3865J04024R2152K6719K4684k3212l7916
3767B790385J939J2099o156L3141o2346r050l1868L6611K9316q0278m6109j23122
3755B544562q9115r9174j2000l3055n5959j9952m8198q8243l5652p6254l4774
3744A952186j5000p3266K8936J0633l9916m7494j3035L6647j2585j9970R622M6161
3732A862919k4152l4025r775J0289N8143o199k8713P788j5890K8934K717Q216
3720A860252M1781L3127N4571K3274j8924j6598L5144L1186M1004M9961P278O931
3708B148987K3629j7219J6480O4845M7111j1730Q8211L5007p2k0266L1260L5589
$$ y = [1541616, 1625007, 1712384, 1719159, 1734112, 1820628, 1887814, 1983933, 2009055, 2065452, 2200209, 2222856, 2298411, 2411753, 2460243, 2560069, 2603934, 2707958, 2800110, 2826829, 2851513, 2828301, 2790385, 2792324, 2804423, 2798267, 2831408, 2769062, 2760012, 2728144, 2764755, 2794071, 2713793, 2667684, 2544562, 2455447, 2356273, 2344273, 2311218, 2255259, 2235307, 2187109, 2098866, 2063214, 1986960, 1952186, 1937186, 1863920, 1892856, 1903489, 1863573, 1816079, 1803044, 1839691, 1827106, 1807136, 1816758, 1862919, 1838767, 1804742, 1794967, 1805256, 1863399, 1857200, 1828487, 1836275, 1820385, 1849319, 1852036, 1860252, 1902033, 1935160, 1989731, 2013005, 1994081, 1977483, 2012627, 2043813, 2084817, 2134778, 2142056, 2148987, 2172616, 2155397, 2171877, 2236722, 2283833, 2272103, 2360314, 2395321, 2395249, 2374983, 2406243, 2441832]
3696B441832N2326P8848m0466j4606J1768K6081M9693M599l8792q511L7269M4731
3684B644772K7904N88o80k9520J9087L3288L4450N2906L029n4525j6720P6961
3672B791540j620k6931P1340n782R1132O5073n6686m7513J6864K1720m3012l1214
3660B844911M3152J6953l182k8366l216J4023L5050M4911J7781n8193r972j6682
3648B897170N912J0588L4081J0005k1292j2831j1390P0223K3913L5669J5777L5452
3636C093277m1598J6671N4449L3675P6491J3059L5837N6177O2063J28080m009
3625C524172K8171J03910J20041J23398J43255K4620Q3100J46963J92165J65698
3615D655493Q2784R8199J22252O1151O2150J04863J14630J29364J26343R2947
$$ y = [2441832, 2494158, 2573006, 2532540, 2517934, 2529702, 2555783, 2605476, 2610075, 2571283, 2562772, 2600041, 2644772, 2672676, 2673264, 2672584, 2643064, 2662151, 2695439, 2729889, 2782795, 2785824, 2731299, 2714579, 2791540, 2789920, 2762989, 2834329, 2828547, 2919679, 2984752, 2928066, 2880553, 2897417, 2919137, 2876125, 2844911, 2888063, 2905016, 2901834, 2873468, 2870252, 2884275, 2919325, 2964236, 2982017, 2923824, 2913852, 2897170, 2903082, 2913670, 2947751, 2957756, 2936464, 2923633, 2912243, 2982466, 3006379, 3042048, 3057825, 3093277, 3051679, 3068350, 3122799, 3156474, 3232965, 3246024, 3281861, 3338038, 3400101, 3528181, 3524172, 3552343, 3656253, 3776294, 3899692, 4042947, 4067567, 4150667, 4297630, 4489795, 4655493, 4738277, 4836476, 4958728, 5019879, 5082029, 5186892, 5301522, 5430886, 5557229, 5650176]
3605E650176J18219J74546K22128K40597K17555K13763K15886K25575J29948J66835
3595G575228L6777J0210o7481r6277j51870p9365k60395k64285k78996k06136
3585F217410j87845k29848j64970j47590j53554j94469q7420j22492n9863j02736
3575D766623q5277k0397m7222m7724l6573o6562l65J8828j2292l4131N07K7937
3563D463352k8168m1869N6635N445K9373K1582N1796Q590N1744P0756L7113N0782
3551D777131R7699J05692Q9517L6597L9529J24034J52953Q0797R7153O5992J36429
3540E803523J71038J08870J32609R6346J55155J43429R8278J14535J03638J19250
3530G046671J60511R0773N6858P8132N7007Q9209J06439M7393L5475M6359P9813
$$ y = [5650176, 5768395, 5942941, 6165069, 6405666, 6623221, 6836984, 7052870, 7278445, 7408393, 7575228, 7612005, 7622215, 7554734, 7458457, 7306587, 7227222, 6966827, 6702542, 6423546, 6217410, 6029565, 5799717, 5634747, 5487157, 5333603, 5139134, 5051714, 4929222, 4869359, 4766623, 4681346, 4660949, 4613727, 4566003, 4529430, 4462868, 4462503, 4481331, 4469039, 4434908, 4435415, 4463352, 4435184, 4393315, 4449950, 4455395, 4484768, 4506350, 4558146, 4566736, 4618480, 4689236, 4726349, 4777131, 4874830, 4980522, 5070039, 5106636, 5146165, 5270199, 5423152, 5503949, 5601102, 5667094, 5803523, 5974561, 6083431, 6216040, 6312386, 6467541, 6610970, 6709248, 6823783, 6927421, 7046671, 7207182, 7297955, 7354813, 7432945, 7489952, 7579161, 7685600, 7732993, 7768468, 7814827, 7894640]
3519G894640R1210P1264L8511N1107R2395L1240k300N5663P8871M1364r088M0047
3507H474924J3948n331L1161k7236j0094K9298k4402Q0593J28013J04712M9705
3496H845291J08903J86969J63200J51473J67835J37986J64062J07432J10400J79991
3486A0323542J40612J37975J53072J42833O1677R9781J16589Q0797O4613K4835
3476A1346326k1089K5022k4958r389n8321j48046p5564k4138r5940n1941r4488
3465A0767474j36252j31085j01703r3904j41863j01396q0703j19401j51761j19288
3455I590118j64609j35311j22004j02497o4399j31189j14866q9790p8913m9261
3445H537279n1654m4964m0160o7245p029k3723l6490P1673k83L272K9163Q2281
$$ y = [7894640, 7985850, 8057114, 8095625, 8146732, 8239127, 8270367, 8268067, 8323730, 8402601, 8443965, 8434877, 8474924, 8488872, 8483541, 8514702, 8487466, 8477372, 8506670, 8482268, 8562861, 8690874, 8795586, 8845291, 8954194, 9141163, 9304363, 9455836, 9623671, 9761657, 9925719, 10033151, 10143551, 10323542, 10464154, 10602129, 10755201, 10898034, 10959711, 11059492, 11176081, 11256878, 11321491, 11346326, 11325237, 11350259, 11325301, 11315912, 11257591, 11109545, 11033981, 11009843, 10913903, 10861962, 10767474, 10631222, 10500137, 10398434, 10304530, 10162667, 10061271, 9980568, 9861167, 9709406, 9590118, 9425509, 9290198, 9168194, 9065697, 9001298, 8870109, 8755243, 8665453, 8586540, 8537279, 8485625, 8440661, 8400501, 8333256, 8326227, 8302504, 8266014, 8337687, 8337404, 8340676, 8369839, 8452120]
3433H452120O4326N3166O928J01606J40047J53978J75665J04345J39911J23442
3423I515534O9506R1729O1330Q6185J04141M3818M0870J492j4118J6282l9604
3412I977165k0998k9323j9865l5266o754k3406J3498L6017j8116J8976p73j8974
3400I872181q1400j21990q0646l0637n7001q4147o2449n1202j04853k6446j2758
3389I158652q402L4730P1400O7765P5219R6539Q3292R5325P3622O5247J31667
3378I945056Q6553J73524J61588P1563Q8648P5920P6526Q0677Q0040J55729J79152
3367A1174976J48260J22402J83932J80389J42462J41080Q4148O5184J26175M7456
3357A2416464K05697J79321Q4967J71792J48374J93886K32836K32621K09073K41065
$$ y = [8452120, 8516446, 8569612, 8576540, 8678146, 8818193, 8972171, 9147836, 9252181, 9392092, 9515534, 9585040, 9676769, 9738099, 9824284, 9928425, 9972243, 10013113, 10014605, 10000487, 10016769, 9977165, 9956167, 9926844, 9906979, 9871713, 9864959, 9841553, 9855051, 9891068, 9872952, 9891928, 9891155, 9872181, 9790781, 9668791, 9588145, 9557508, 9500507, 9416360, 9353911, 9302709, 9197856, 9171410, 9158652, 9150250, 9184980, 9256380, 9324145, 9399364, 9495903, 9579195, 9674520, 9748142, 9813389, 9945056, 10031609, 10205133, 10366721, 10438284, 10526932, 10602852, 10679378, 10760055, 10840095, 10995824, 11174976, 11323236, 11445638, 11629570, 11809959, 11952421, 12093501, 12177649, 12242833, 12369008, 12416464, 12622161, 12801482, 12886449, 13058241, 13206615, 13400501, 13633337, 13865958, 14075031, 14316096]
3347A4316096J87112K75311L00341K55055K23063K78863K93684K90819K82088
3338A6702432L00471L00664K61112K67699L15497K74984L44295K97171K52642
3329A9316967K72139L30717K60549L29443K77940K88758L87551M01139M25160
3320B2290363M02497M34280L89859L27426K45840J80558J8494p6367j49134j70827
3310B3892989j16646j90238j70784m0549n6139m023n3269l1531J7059M915O9795
3299B3321579J03495O6991Q5619Q3825J22881J98675K14060K46051K94326K98392
3289B5035894L65829M24950M58628N64232O36684N83237O44776O75094O45519
3280C0034843N86880N88672N00820L95909L73057K80638L09660L51427L78987
$$ y = [14316096, 14503208, 14778519, 15078860, 15333915, 15556978, 15835841, 16129525, 16420344, 16702432, 17002903, 17303567, 17564679, 17832378, 18147875, 18422859, 18767154, 19064325, 19316967, 19589106, 19919823, 20180372, 20509815, 20787755, 21076513, 21464064, 21865203, 22290363, 22692860, 23127140, 23516999, 23844425, 24090265, 24270823, 24289317, 24212950, 24063816, 23892989, 23776343, 23586105, 23415321, 23374772, 23318633, 23314610, 23261341, 23229810, 23246869, 23251784, 23321579, 23425074, 23492065, 23577684, 23661509, 23784390, 23983065, 24197125, 24443176, 24737502, 25035894, 25401723, 25826673, 26285301, 26849533, 27486217, 28069454, 28714230, 29389324, 30034843, 30621723, 31210395, 31711215, 32107124, 32480181, 32760819, 33070479, 33421906, 33800893]
3271C3800893L57504K97020K50513K41414K70830K28233K19970J46507J14094
3262C5926978P2638J58919K44599J98586J96344K24607K56623K99797K61193L24949
3252C8165233K53801K70122M00524L17551K99519J94758N2613j68792j80807k43287
3242C9361235k94328l14508m30421m06428m13741m09665l55801l51069l52823
3233C6032451l49071l86233l72809l72277m16163m48329m30548m50666m65666
3224C2340689m14925m14773m12392m90734o47056p25696r39076j105717j148587
3215B6041733j202417j084029r51652r21935q22275p31878o35147n59689n06759
3206A8625952n25235m37721m04502l72644l13741l31472l74865k32665k73892
$$ y = [33800893, 34158397, 34455417, 34705930, 34947344, 35218174, 35446407, 35666377, 35812884, 35926978, 35999616, 36158535, 36403134, 36601720, 36798064, 37022671, 37279294, 37579091, 37840284, 38165233, 38419034, 38689156, 39089680, 39407231, 39706750, 39901508, 39954121, 39785329, 39604522, 39361235, 39066907, 38752399, 38321978, 37915550, 37501809, 37092144, 36736343, 36385274, 36032451, 35683380, 35297147, 34924338, 34552061, 34135898, 33687569, 33257021, 32806355, 32340689, 31925764, 31510991, 31098599, 30607865, 29960809, 29235113, 28296037, 27190320, 26041733, 24839316, 23755287, 22803635, 21881700, 21059425, 20327547, 19692400, 19132711, 18625952, 18100717, 17662996, 17258494, 16885850, 16572109, 16240637, 15865772, 15633107, 15359215]
3197A5359215l06754j94909k50443j79828k41272k01236j70875j20774j48364
3188A3544760j62869j16592j33095j48445j63570j32066j10206j32965j32915
3179A2312037p1588j01276j02349q9977q1722l1902l2292J315o7311k2397l6457
3168A1676081j5255K4074P227k6490K0189L7705Q8273J4271R1693J07282J65867
3157A2190917J07315R0181R6475J11443J13278J12235J28749Q6203K5228Q7855
3147A3149879M9430l5825l453q0847M5073L770m9097p6901o9242r4827j36097
3136A2701863k00265j34024j43200j25677n3818q4691j20508j11919j31476r1068
3126A1505217j02810j03061p7467m2370o893K0513q837L3298J21523J28424J02464
$$ y = [15359215, 15052461, 14857552, 14607109, 14427281, 14186009, 13984773, 13813898, 13693124, 13544760, 13381891, 13265299, 13132204, 12983759, 12820189, 12688123, 12577917, 12444952, 12312037, 12240449, 12139173, 12036824, 11946847, 11865125, 11833223, 11800931, 11802246, 11734935, 11712538, 11676081, 11660826, 11684900, 11692127, 11665637, 11685826, 11723531, 11811804, 11826075, 11917768, 12025050, 12190917, 12298232, 12388413, 12484888, 12596331, 12709609, 12821844, 12950593, 13036796, 13062024, 13149879, 13199309, 13163484, 13160031, 13079184, 13124257, 13128027, 13078930, 13002029, 12932787, 12837960, 12701863, 12501598, 12367574, 12224374, 12098697, 12044879, 11960188, 11839680, 11727761, 11596285, 11505217, 11402407, 11299346, 11221879, 11179509, 11172616, 11193129, 11184292, 11217590, 11339113, 11467537, 11570001]
3115A1570001R8177J36000K24719J97707J46545J69245J84400J20752P1895J19218
3105A3038659K9256l4481m4445r0086r3040q0454r5427j09874p5735q9713o2880
3094A2291780J6014n3067L0852Q4487J2703P1673L3787M5334M0979K9623K4590
3083A2628755k4631o114J8077j9259j0077j7493j25170j09988m0169j27722q8070
3072A2078139j28464j54331j61986j23599j53246k20418j86098k39240k18509
3063A0492248k92761l00517l22994l65239l46431l97188l34387k86933l44948
3054G500850k66895k29238k44298j37173j78433k54121j55918j54462j33013j14991
3044E632308j36175r2740m8946r1204r0381r3945q9620p5684o7403n8526p1733
$$ y = [11570001, 11668178, 11804178, 12028897, 12226604, 12373149, 12542394, 12726794, 12847546, 12919441, 13038659, 13067915, 13033434, 12988989, 12898903, 12805863, 12725409, 12629982, 12520108, 12444373, 12354660, 12291780, 12307794, 12254727, 12285579, 12370066, 12382769, 12454442, 12488229, 12533563, 12574542, 12604165, 12628755, 12604124, 12598010, 12616087, 12596828, 12586751, 12569258, 12444088, 12334100, 12293931, 12166209, 12078139, 11949675, 11795344, 11633358, 11509759, 11356513, 11136095, 10949997, 10710757, 10492248, 10199487, 9898970, 9575976, 9210737, 8864306, 8467118, 8132731, 7845798, 7500850, 7233955, 7004717, 6760419, 6623246, 6444813, 6190692, 6034774, 5880312, 5747299, 5632308, 5496133, 5403393, 5354447, 5263243, 5172862, 5078917, 4989297, 4913613, 4846210, 4787684, 4715951]
3033D715951n5438k8431l9822r0352K0341l6398l6663k0547M8341m711J7752L697
3021D493720j4125O6015J1960j3816M7853M3192M1803j5523m9917j2813M958K2897
3009D626204k2624k6874m0698m7660m78J1057m4284o0958m0705j0809k5566K9285
2997D345890J0685P694K8479L8019Q198L6757m8737M8622M3808J4111J9669M0619
2985D593814M2747O0591j4598P8437J3341K943Q2685Q0932O7626k6602O5500O9478
2973E116894j1504P4014N5544M1176R907M8036M9831J5793j9813n1576M3998P9621
2961E451921R4111J00458Q5449J15516J26589J02792J28561J86884J62243R3309
2951F647833J17491J38704J82842J30105J45145J52224J57137K10250J45272J01248
$$ y = [4715951, 4660513, 4632082, 4592260, 4501908, 4522249, 4485851, 4449188, 4428641, 4476982, 4472271, 4490023, 4493720, 4479595, 4545610, 4557570, 4543754, 4591607, 4634799, 4676602, 4661079, 4611162, 4598349, 4603307, 4626204, 4603580, 4576706, 4536008, 4488348, 4487870, 4498927, 4454643, 4393685, 4352980, 4342171, 4316605, 4345890, 4356575, 4364269, 4392748, 4430767, 4438965, 4475722, 4426985, 4475607, 4519415, 4533526, 4553195, 4593814, 4636561, 4697152, 4682554, 4760991, 4774332, 4777275, 4859960, 4940892, 5008518, 4981916, 5047416, 5116894, 5105390, 5179404, 5234948, 5276124, 5286031, 5334067, 5383898, 5399691, 5379878, 5328302, 5372300, 5451921, 5546032, 5646490, 5731939, 5847455, 5974044, 6076836, 6205397, 6392281, 6554524, 6647833, 6765324, 6904028, 7086870, 7216975, 7362120, 7514344, 7671481, 7881731, 8027003, 8128251]
2941H128251J76344R7663J27666N6690L3106J35924J05318K04519K36250K07214
2931I508945J79893J08075P9083L3211N3140L3911M8112P9981J42215O4841K03870
2920A0535277J99544K11656K10010K46692K43947K37100L03238L17351L46993
2911A2851808L93104L78167M69078N19506N00318N15579N60109N89513O07218
2902A7384400O31262O74876P59969P82073Q24769P76810P27678O23169N59304
2893B3744310N51541N23687O12997P64713R43793Q54591O67780M59083K71534
2884B9394029L46852N79364Q03697J123813J363163J142322O89265M4595n43656
2875C4943444o98898n08448j77195J62663M31774O80999R63000J411713J777088
$$ y = [8128251, 8304595, 8402258, 8529924, 8586614, 8619720, 8755644, 8860962, 9065481, 9301731, 9508945, 9688838, 9796913, 9875996, 9909207, 9962347, 9996258, 10044370, 10124351, 10266566, 10331407, 10535277, 10734821, 10946477, 11156487, 11403179, 11647126, 11884226, 12187464, 12504815, 12851808, 13244912, 13623079, 14092157, 14611663, 15111981, 15627560, 16187669, 16777182, 17384400, 18015662, 18690538, 19450507, 20232580, 21057349, 21834159, 22561837, 23185006, 23744310, 24295851, 24819538, 25432535, 26197248, 27141041, 27995632, 28663412, 29122495, 29394029, 29740881, 30320245, 31123942, 32247755, 33610918, 34753240, 35442505, 35487100, 34943444, 34244546, 33736098, 33558903, 33721566, 34153340, 34834339, 35797339, 37209052, 38986140]
2866C8986140K198676K632265L002806L238970L526332L770704L976199M086453
2858F5418545M056576L892534L321093K223853P81342p71079k047505l136218
2850G3739141m002090m790149n151916m872325m283184l639006l083432k802785
2842D1114254k677151k559282k332001k056963j804616j640503j452685j309231
2834B5281822j150842j109677j086713j026753r72902q66908p81695p17987o84638
2825A6883707o67850o24748o47155n60727n95165n59669m97488n33086n01461
2816A1696358m65969m25767l81422l30536l82822l63999k74359l09335k89790
2807H472359k25982k55390k62595j83390j13341j99007j97221k13987j35683k19193
$$ y = [38986140, 41184816, 43817081, 46819887, 50058857, 53585189, 57355893, 61332092, 65418545, 69475121, 73367655, 76688748, 78912601, 79693943, 78922864, 76875359, 73739141, 69737051, 64946902, 59794986, 54922661, 50639477, 47000471, 43917039, 41114254, 38437103, 35877821, 33545820, 31488857, 29684241, 28043738, 26591053, 25281822, 24130980, 23021303, 21934590, 20907837, 19934935, 19068027, 18286332, 17568345, 16883707, 16215857, 15591109, 14943954, 14383227, 13788062, 13228393, 12730905, 12197819, 11696358, 11230389, 10804622, 10423200, 10092664, 9709842, 9345843, 9071484, 8762149, 8472359, 8246377, 7990987, 7728392, 7545002, 7431661, 7232654, 7035433, 6821446, 6685763, 6466570]
2797F466570j68413j81828j02806q4589j33731j67618j38009j13846j09347r1221
2787E175162j17918p3788r8935j79481m6010o2941n4561o5840j23529p7418j41336
2776D133405o4665r7966q0694n5583j23575r3814o7686m7347q2384k5170m7060
2765C347461m4856l975m6637j12856o7504p8856m4597o0954q07k9748l4819l7463
2753B784389r0444n9635k4250J9039J1690r2792j04091m0578l2412n8791l8639
2742B273486q021m2963k0229k4554l5045m0140j31p8352l8520o4937l0037l1695
2730A858862M030l1882m2219o821l1001p83m3331L404n8293n6555K7607k6632
2718A596386p322m1829q0123k8112J5152l6622J2534P292M556n6381o0299q155
$$ y = [6466570, 6298157, 6116329, 6013523, 5928934, 5795203, 5627585, 5489576, 5375730, 5266383, 5175162, 5057244, 4983456, 4884521, 4705040, 4659030, 4596089, 4541528, 4475688, 4352159, 4274741, 4133405, 4068740, 3970774, 3890080, 3834497, 3710922, 3617108, 3549422, 3502075, 3419691, 3394521, 3347461, 3302605, 3298630, 3251993, 3139137, 3071633, 2992777, 2948180, 2887226, 2886419, 2856671, 2821852, 2784389, 2693945, 2634310, 2610060, 2629099, 2640789, 2547997, 2443906, 2403328, 2370916, 2312125, 2273486, 2265465, 2222502, 2202273, 2177719, 2142674, 2102534, 2102403, 2024051, 1985531, 1920594, 1890557, 1858862, 1862892, 1831010, 1788791, 1781970, 1750969, 1750186, 1706855, 1710259, 1651966, 1595411, 1623018, 1596386, 1589064, 1547235, 1467112, 1439000, 1454152, 1417530, 1430064, 1437356, 1441912, 1385531, 1325232, 1317077]
2706A317077Q737j8907o8681j8926N565L9648l4251Q099J974j5416L953Q498q886
2693A228484k790k7636n536m6905r0443N229O1907K5264l5596j0430L0844n1008
2681A081384m9136m5709N1354J242j1266J7332m1343j0752n1632K2372j2303P90
2669I52333K2756J2894m1199K3397J1944j8645l4546m1378n7010L8150K0983K0621
2657I10300j059J2392K3049j9967m3558J7990J0842n7756J7871J6701J9586K7193
2645I33584l1944K9392j7308q1524j4480L8126j0489M9143l0976k719l3232m9384
2633G78189R0542L0570Q645l6926R576M8598m3503R399N1019j7385l684J48L9814
2620I65002m2727j3715J2617l6802j1042K9552M9979Q982o466O292J9034K3048
$$ y = [1317077, 1325814, 1306907, 1238226, 1219300, 1224865, 1264513, 1230262, 1238361, 1240335, 1224919, 1228872, 1237370, 1228484, 1225694, 1198058, 1192522, 1145617, 1055174, 1060403, 1122310, 1147574, 1111978, 1101548, 1132392, 1081384, 1032248, 986539, 1037893, 1039135, 1027869, 1045201, 1003858, 993106, 941474, 963846, 951543, 952333, 975089, 987983, 946784, 970181, 982125, 963480, 928934, 887556, 830546, 868696, 889679, 910300, 909241, 921633, 944682, 924715, 881157, 899147, 909989, 852233, 870104, 886805, 906391, 933584, 901640, 931032, 913724, 832200, 817720, 855846, 845357, 894500, 863524, 860805, 827573, 778189, 868731, 899301, 907946, 871020, 880596, 929194, 885691, 895090, 946109, 928724, 925040, 925188, 965002, 922275, 908560, 921177, 884375, 873333, 902885, 952864, 961846, 955380, 961672, 980706, 1003754]
2608A003754M8905M430j8361m836K457L9931M6910P209K1014L5991J0388o761
2596A191031J9611K812j738L6182l2463k6069K2685K4894j2558k3555n2658l5401
2584A112773K0303M6182L5133J6248m7493M4966L5274K8441J2038L2465k9922
2573A306408L7776M0721K7572M2967L1883j5368n6117J2990k0618j5234m348j9667
2561A368965l3540j3485o5278o2406k8177j2264K718k4656J319n149q5552k8033
2549A014462L5223l0768L849k6697K5801j33j2565r5549m5388M4692M8095m9932
2537I11090q52L2257m0381J9694l4098M423M7896k2228J6465m3534k7195K5839
2525H89376k8320k7777l7148m8926j3L5m9654p1512j0578j1721J1315m339m752
$$ y = [1003754, 1052659, 1057089, 1038728, 1033892, 1036349, 1076280, 1123190, 1130399, 1151413, 1187404, 1197792, 1191031, 1210642, 1213454, 1211716, 1247898, 1215435, 1189366, 1212051, 1236945, 1224387, 1200832, 1148174, 1112773, 1133076, 1179258, 1214391, 1230639, 1183146, 1228112, 1263386, 1291827, 1303865, 1336330, 1306408, 1344184, 1384905, 1412477, 1455444, 1487327, 1471959, 1415842, 1428832, 1408214, 1392980, 1388632, 1368965, 1335425, 1321940, 1256662, 1194256, 1166079, 1153815, 1156533, 1131877, 1133196, 1128047, 1042495, 1014462, 1049685, 1018917, 1022766, 996069, 1021870, 1021737, 1009172, 913623, 868235, 912927, 961022, 911090, 910238, 942495, 902114, 921808, 887710, 892133, 940029, 917801, 934266, 890732, 863537, 889376, 861056, 833279, 796131, 747205, 747192, 747227, 697573, 626061, 615483, 603762, 615077, 610738, 605986]
2512F05986J8607j9909k0434J992l4253O395N5119o0723k4248m5845p0321K466
2500D14832K7275p991J7525j5152l2174k1001N1132L5917J3678m8798j599m160
2488D29484m6588m6834m425L2266k0104P126J6959m7769P586j700n651J9252n0428
2475B89174J2683j1626J1826N3336n9046L1961o8431M0825Q973k2869J3089n4226
2463B45669K5J0577l7213K3235L8643L2045l1398l0483m7274j6249L426J1966
2451B02969m894k446L2113m2662m8491L0819L0931J7180j2289o232k7036J3422
2439A83384K758K5314J4928n8496k169l3163J6263L3154N541k1061K7182K6489
2427B20124j4790K4176k6065l3801m2183N5548L3423m7284k0477J9881K9230j1987
$$ y = [605986, 624593, 604684, 584250, 586242, 551989, 558384, 613503, 552780, 528532, 482687, 412366, 414832, 442107, 434116, 451641, 436489, 404315, 383314, 434446, 470363, 484041, 435243, 433644, 429484, 382896, 336062, 331637, 363903, 343799, 350925, 367884, 320115, 327701, 326001, 320350, 339602, 289174, 301857, 290231, 302057, 355393, 296347, 328308, 259877, 300702, 309675, 286806, 299895, 245669, 245694, 256271, 219058, 242293, 280936, 312981, 281583, 251100, 203826, 187577, 191003, 202969, 198075, 195629, 227742, 185080, 136589, 167408, 198339, 215519, 203230, 196998, 169962, 183384, 186142, 211456, 226384, 167888, 165719, 132556, 148819, 181973, 187514, 166453, 193635, 220124, 205334, 229510, 203445, 169644, 127461, 183009, 216432, 169148, 148671, 168552, 197782, 185795]
2415A85795j1874j2275L0767m3644N3435L3974l0184p2917l7897L1132L0581q183
2403A48710J3633O918l1067r842J2410l6385l108l989r055j9928M5581J3482k9174
2390I8186L0199L312J4738K6736o538j5391l9093K404N5169k1187j2350L8472
2378A74657j8112K1210K3249k3326k3669p0388j05L6896k3278K9726L2356j8853
2366A40363m5275Q915n853M8754k7359k6352P052J3099P3288j3898j4656N9003
2354B17081m4480o1372L5536K0556P6822J3243p182K296k6231o4970J421K0679
2342A83399M7774k9473l7603j8840l5078J1840K0514K7196n3709N623J7473m8461
2330I0655l3232P5388J4411N058j8508M044J4145j0202K3653n809m8947k1587
$$ y = [185795, 173921, 161646, 192413, 148769, 202204, 236178, 205994, 133077, 95180, 126312, 156893, 148710, 162343, 169261, 138194, 128352, 140762, 104377, 101269, 97280, 88225, 68297, 113878, 127360, 98186, 128385, 131697, 146435, 173171, 166633, 151242, 112149, 114553, 169722, 148535, 136185, 174657, 156545, 177755, 201004, 177678, 154009, 83621, 83516, 120412, 97134, 126860, 159216, 140363, 95088, 104003, 98150, 146904, 119545, 93193, 100245, 113344, 186632, 172734, 158078, 217081, 172601, 111229, 146765, 167321, 244143, 257386, 250204, 252500, 226269, 161299, 162720, 183399, 231173, 201700, 164097, 145257, 110179, 122019, 142533, 169729, 116020, 121643, 139116, 90655, 57423, 132811, 147222, 152280, 133772, 137816, 151961, 141759, 165412, 159603, 110656, 89069]
2318H9069K0401J0432L2726J855n3547p097J505R296j342N7663J0717n1251m5536
2305G4891K9374N076K4881K6301K5636M689k2833m965M8207J5720n7238j7590
2293A52149j8233j0744P257J6012L749P463l4397J2547L1340p869p0004k3714
2281F5556M9593K3447k2162K9799N683L5159K069m1430k8423J239K4208r016K273
2268A37995L6113M9097k8991k257j9568k2955j0180k816K9327Q095L389n6319
2256A20930K8644N4006k1117K85m0641n2027j6692N2545P0752o1362j640n1085
2244H2598M0859L9686J2565l2655K0550K0478Q082l9409r687L6906n002k2263
2232A52708j7711P2942J0280j8191j2675k6594J2380M3202K5941n2936L7950j4010
$$ y = [89069, 109470, 119902, 152628, 154483, 100936, 93839, 95344, 104640, 103298, 160961, 171678, 120427, 74891, 104265, 109341, 134222, 160523, 186159, 190848, 168015, 163050, 211257, 226977, 169739, 152149, 133916, 123172, 130429, 146441, 150190, 157653, 123256, 135803, 167143, 159274, 89270, 65556, 115149, 138596, 116434, 146233, 151916, 187075, 189144, 147714, 119291, 120530, 144738, 135722, 137995, 174108, 223205, 194214, 191957, 172389, 149434, 139254, 136438, 165765, 173860, 177249, 120930, 149574, 203580, 182463, 182748, 142107, 90080, 73388, 125933, 196685, 135323, 133683, 82598, 123457, 163143, 175708, 143053, 163603, 184081, 192163, 152754, 143067, 179973, 174971, 152708, 134997, 207939, 218219, 200028, 187353, 160759, 173139, 216341, 242282, 189346, 227296, 213286]
2220B13286k0684O297j4782q040J5169J5473m3187l6323P8457L395n103j2989
2208A90969l8131L3694N2897Q381l4689k6103J1290L3659J1208L3382l3460l4030
2196B09067PJ2105j0924K9869L6932M22n5193K4316M0356K7404K2277R722k1800
2183C24560j509J4645j1721l0803J9415N3308o0211K6551K6784N3643j3476l2491
2171C68695M7361N6070k8472m6573N2010o606J9732M19M2291K7478k4353L8705
2159E46757M6795L8495k1749M1112l1456K2840O472P611N365j3360L9611j7870
2147F70623J5672K9016K3107l2111Q1300N000K0927O3972J3857L851k0620J9663
2135H94257L8053J3641P9694j1636K6232O9314l1342M6168Q9855O961L3400J9385
$$ y = [213286, 192602, 198899, 184117, 176077, 191246, 206719, 163532, 127209, 205666, 209061, 203958, 190969, 152838, 186532, 239429, 247810, 213121, 187018, 198308, 231967, 243175, 276557, 243097, 209067, 209074, 221179, 210255, 240124, 277056, 277478, 222285, 246601, 286957, 314361, 336638, 346360, 324560, 323051, 337696, 325975, 295172, 314587, 367895, 307684, 334235, 361019, 414662, 401186, 368695, 416056, 472126, 443654, 397081, 449091, 442485, 462217, 462636, 504927, 532405, 508052, 546757, 593552, 632047, 610298, 651410, 619954, 642794, 649266, 656877, 662242, 648882, 688493, 670623, 686295, 715311, 738418, 706307, 787607, 792607, 813534, 877506, 891363, 895214, 874594, 894257, 932310, 945951, 1025645, 1014009, 1040241, 1109555, 1078213, 1124381, 1214236, 1221197, 1254597, 1273982]
2123A273982M6812O7965N5055O203P3553L4650M8669N6325O9370O4679O2245q071
2111A851437N1157L0913J15222N0393J49195J16336J20433P6876J40589J62837
2101B865388J88496J95241K32415J74276K79771L56860L94411K79025L53133L72518
2091E691534O04744P40138J023719J053654J424997J546818J784074J634336K253857
2082A7757871K657310M124045K215347q74383k413605n576531m051735k763220
2074A1075099j856832j412491j008909q50938n40522n06664k95115l49768k10221
2065D043639k34077k95244k70173k21404k88706j91620j81829r8680n1735j53024
2055B057147j19355p0105j09678q0313k8532p3702r4194j15006n1642k6856m5047
$$ y = [1273982, 1320794, 1388759, 1443814, 1450017, 1523570, 1558220, 1606889, 1663214, 1732584, 1797263, 1859508, 1851437, 1902594, 1933507, 2048729, 2099122, 2248317, 2364653, 2485086, 2561962, 2702551, 2865388, 3053884, 3249125, 3481540, 3655816, 3935587, 4292447, 4686858, 4965883, 5319016, 5691534, 6296278, 7036416, 8060135, 9113789, 10538786, 12085604, 13869678, 15504014, 17757871, 20415181, 24539226, 26754573, 25880190, 23466585, 17890054, 13838319, 11075099, 9218267, 7805776, 6796867, 5945929, 5405407, 4898743, 4603628, 4253860, 4043639, 3809562, 3514318, 3244145, 3022741, 2734035, 2542415, 2360586, 2261906, 2210171, 2057147, 1937792, 1867687, 1758009, 1677696, 1649164, 1575462, 1481268, 1366262, 1314620, 1287764, 1242717]
2044A242717j8502m8982k8302n3367l0005L2578l9702k3168q7061o1914l7880
2033H46412K7959m1776m0535k3050o824p1215m3710J7403j4743m1387k9613k8456
2021E50465j5710L7075N8470k6563l0703o4998K78k2617M90k2636N0201l8189
2009D75563R582j4921k9663L6616j0214J0859k5253o9304l1710N4430k3298o4955
1997C17732L1330Q662J4728l3160n029k9531J5382m411J3750J0259l1099l2342
1985B76271M6300k1769l3059L2196j3657M116J6848k0323m5373l0248l5714n7062
1973A18526L7091J5936j365K3447pL1142K6849K1513m5274k8993J0415q2323L4195
1960A61152N9641K7034l5125K3590m1236l6801j2229j9632N6078l2563m5241L3539
$$ y = [1242717, 1224215, 1175233, 1146931, 1093564, 1063559, 1096137, 1056435, 1033267, 946206, 884292, 846412, 874371, 832595, 792060, 769010, 762186, 690971, 647261, 664664, 649921, 608534, 578921, 550465, 534755, 571830, 630300, 603737, 573034, 508036, 508314, 485697, 486187, 463551, 513752, 475563, 485145, 470224, 440561, 477177, 466963, 477822, 452569, 383265, 351555, 405985, 382687, 317732, 349062, 357724, 372452, 339292, 334263, 304732, 320114, 315703, 329453, 339712, 308613, 276271, 322571, 300802, 267743, 299939, 286282, 290398, 307246, 286923, 241550, 211302, 175588, 118526, 155617, 171553, 170188, 193635, 193628, 224770, 251619, 273132, 227858, 198865, 209280, 126957, 161152, 220793, 247827, 212702, 236292, 195056, 158255, 146026, 126394, 182472, 149909, 104668, 138207]
1948A38207J5257l6458L9499j1799k4416j0073M7685K8301j9187R84k056m995
1936A60949q492k2762j585L3421n3299j0163K1356Q0454l9536J3924K3684l8302
1924A59649j9797K509r638m7862L7498k9575k2391K9775M5392m2027R080o8968
1912D3645N5781j945l4587J4432K3320J3009m1978l803j4478J1342m519J3958
1900G4177k4235k443l500k3819J6070M0604Q558j7865J6836o878O207P075r068
1887H1719R565r156K2109l4617L608M629P488J7276l7227K2185M3054k3209m6067
1874F1357J705k560O157J1387M251r830p030M3146K3452K3812m6376j083l8202
1861G0186m0809P0945J3054k0446j441J4632m5684l8822L7258K1738l4820l906
$$ y = [138207, 153464, 117006, 156505, 144706, 120290, 110217, 157902, 186203, 167016, 168000, 165944, 160949, 152457, 129695, 128110, 161531, 108232, 98069, 119425, 199879, 160343, 174267, 197951, 159649, 139852, 142361, 132723, 84861, 122359, 92784, 70393, 100168, 145560, 103533, 112613, 43645, 99426, 97481, 62894, 77326, 100646, 113655, 71677, 67874, 53396, 64738, 60219, 74177, 49942, 47499, 43999, 20180, 36250, 76854, 85412, 67547, 84383, 77505, 83712, 90787, 81719, 91284, 82128, 104237, 69620, 73228, 77857, 85345, 102621, 65394, 87579, 130633, 107424, 61357, 63062, 60502, 66659, 78046, 82297, 72467, 65437, 108583, 132035, 155847, 109471, 108388, 70186, 29377, 100322, 113376, 92930, 91489, 106121, 60437, 21615, 58873, 80611, 45791, 41885]
1849D1885J3935P2879m4109J4999j7269n6395N1194q518q450j6628L129r390K9312
1836F6574J2579o239k119L0302K397P744K646o064J5076o1933J7422j6966j9033
1823D2386M3674R628l2020Q464L5968L7310o220m7376l0607K3193N5920N2873
1811A93193k1160J0928k6377k2036k3635l0374K8989j9436m1990K9688L392K8318
1799A09500k6147K3328n0453j0838L3621p3074L5501J8772N579l2369m2729K2950
1787A3641M667L0425J534O7191l2588l5604J0984k448j5599K4540n0059k8100
1775a1416L7890L0972K6854q529k5743j7194q409p918O7980m1461l1790j7856
1763f620J9289L365L2755k6932K4520k1636l7892K4137J1198K9294j6181j1879
$$ y = [41885, 55820, 128699, 84590, 99589, 82320, 25925, 77119, 68601, 60151, 43523, 46652, 37262, 66574, 79153, 72914, 70795, 101097, 103494, 111238, 113884, 107820, 122896, 60963, 78385, 61419, 42386, 86060, 95688, 63668, 72132, 108100, 145410, 139190, 91814, 61207, 84400, 140320, 193193, 172033, 182961, 156584, 134548, 110913, 80539, 109528, 90092, 48102, 77790, 81182, 109500, 83353, 106681, 56228, 45390, 79011, 5937, 41438, 60210, 65789, 33420, -9309, 13641, 18308, 48733, 50267, 117458, 84870, 49266, 60250, 57802, 42203, 66743, 16684, -11416, 26474, 57446, 84300, 75771, 50028, 32834, 24425, 16507, 84487, 43026, 11236, -6620, 12669, 16034, 48789, 21857, 46377, 24741, -13151, 10986, 22184, 51478, 35297, 23418]
1751B3418l4717P42J8687L6211L688l542l0478j491K7309o3621J4607M3179j2645
1738B1347l8011L8633P66L8874J748m0353J7122j2438p681J9930k0066j4199J0637
1725A6309L9011o1817j815K2548O99k0981K0979L9277J3830m3418K1798J4969
1713F1389j3949k4216L0182n3187J437Q2608P22n9743J7200n441j7491m3235K5090
1700A366j1974j4377K3376K0910n7662j8464J01651N146k1852j0646o854j9844
1688i224j7733M6609J3429l8308k932j456Q653j1788K8090L5972J4347m9764K8067
1675D3962m5855K6500K7706m8824L3306L037m510m773J055j9320L339l7247k2433
1662d4057M2300q504K9223j1384J3574j3099N095k4215N4221k4039K2218k3123
$$ y = [23418, -11299, -10557, 8130, 44341, 48029, 44487, 14009, 12518, 39827, -23794, -9187, 33992, 21347, -16664, 21969, 22735, 61609, 63357, 23004, 40126, 27688, 20007, 39937, 19871, 5672, 16309, 55320, -6497, -8312, 14236, 14935, -6046, 14933, 54210, 68040, 24622, 46420, 61389, 47440, 23224, 53406, 219, 1656, 84264, 84986, 25243, 42443, 37002, 19511, -23724, 1366, -10608, -24985, -1609, 19301, -38361, -56825, 44826, 49972, 28120, 17474, 10620, -9224, -26957, 19652, 33081, -5227, -8159, -9615, -962, -12750, 15340, 51312, 65659, 15895, 43962, -1893, 24607, 52313, 3489, 36795, 39832, 35322, 30549, 31604, 12284, 15623, -21624, -44057, -1757, -10261, 18962, 7578, 21152, 8053, 13148, -11067, 43154, 19115, 41333, 18210]
1650A8210L4015J9352l1744m8698j0007m323j4577M7761J2362K403K592n562K8125
1637D9909l7972q286K2998Q641q5307L2376Q1498k7561n9389k4665L5245J0643
1625a870j1289L4072P074j6660J1720o070j3825k8629J6762K4111l4348m908O9946
1612D6086M870N278k7005j4427J310j0564L3475K3413l8445q627k7373j2524K2959
1599a574Q503L2447m687M218k7366o5323L6345j5876o72P7555j0087p8330m020
1586d8867N2286j0251l1997Q6293J4966n5556k1857m4243L3047m007N3359K1537
$$ y = [18210, 52225, 71577, 39833, -8865, -18872, -23195, -37772, 9989, 22351, 24754, 27346, 21784, 49909, 11937, 3651, 26649, 35290, -50017, -17641, 63857, 36296, -23093, -47758, -12513, -1870, -13159, 20913, 27987, 11327, 23047, 16977, 3152, -25477, -8715, 15396, -18952, -23860, 46086, 50956, 56234, 29229, 14802, 16112, 5548, 39023, 62436, 23991, 15364, -12009, -24533, -1574, 6929, 39376, 34689, 38907, 11541, -53782, -17437, -33313, -33985, 43570, 33483, -44847, -48867, 3419, -6832, -38829, 47464, 62430, 6874, -14983, -59226, -26179, -30186, 23173, 44710]
$$ [...]
##END NTUPLES=NMR SPECTRUM
##END=
