##TITLE=1H_CA-8980-4
 CDCl3
 8 sc, 
 15.03.2022
##JCAMPDX= 6.0         $$ Bruker NMR JCAMP-DX V2.0
##DATA TYPE= NMR SPECTRUM
##DATA CLASS= NTUPLES
##ORIGIN= UXNMR, Bruker Analytische Messtechnik GmbH
##OWNER= root
$$ XWIN-NMR		Version 3.5
$$ Tue Mar 15 11:40:05 2022 Russian Standard Time (UT+4h)  she@DPX200
##.OBSERVE FREQUENCY= 200.131346
##.OBSERVE NUCLEUS= ^1H
##.ACQUISITION MODE= SIMULTANEOUS
##.ACQUISITION SCHEME= undefined
##.AVERAGES= 8
##.DIGITISER RES= 18
##SPECTROMETER/DATA SYSTEM= spect
##.PULSE SEQUENCE= zg30
##.SOLVENT NAME= CDCl3
##.SHIFT REFERENCE= (INTERNAL, CDCl3, 0, 15.7094)
##AUDIT TRAIL= $$ (NUMBER, WHEN, WHO, WHERE, WHAT)
$$ ##TITLE= Audit trail, XWIN-NMR		Version 3.5
$$ ##JCAMPDX= 5.01
$$ ##ORIGIN= Bruker BioSpin GmbH
$$ ##OWNER= she
$$ F:/spectra/data/she/nmr/H-F/1/pdata/1/auditp.txt
$$ ##AUDIT TRAIL=  $$ (NUMBER, WHEN, WHO, WHERE, WHAT)
(   1,<2022-03-15 11:38:20.71 +0400>,<she>,<DPX200>,
      <created by zg, POWCHK disabled, PULCHK disabled
       configuration hash MD5:
       00 E9 B6 7A A2 85 ED C7 34 08 36 98 17 FE 4E 26
       data hash MD5: 16K
       A6 00 1B 63 A5 E1 A6 8C A6 5B 6E 85 8C 09 69 8A>)
(   2,<2022-03-15 11:38:24.70 +0400>,<she>,<DPX200>,
      <Start of raw data processing
       efp BC_mod = 2 LB = 0.24 FT_mod = 6 PKNL = 1 PHC0 = -16953.36 PHC1 = 15.40078 SI = 16K 
       data hash MD5: 16K
       00 7E 6B 0D 45 A4 D8 EA A5 5A 96 C9 D0 0E 72 56>)
(   3,<2022-03-15 11:38:46.28 +0400>,<she>,<DPX200>,
      <pk PHC0 = 3.139974 PHC1 = -2.2 
       data hash MD5: 16K
       91 8F 05 02 5C 6A 2D 06 0D 53 83 C9 AB F0 10 C1>)
(   4,<2022-03-15 11:38:50.73 +0400>,<she>,<DPX200>,
      <abs ABSG = 5 
       data hash MD5: 16K
       7C 01 ED 6C 7C EA B2 6C D9 3C B9 62 A8 D6 B7 10>)
$$ ##END=
$$ 
$$ hash MD5
$$ 78 A5 70 D9 50 84 EB 02 5E A4 5B 3A 99 BC 86 42
##$RELAX= 
##$RELAX= 
##$RELAX= 
##$RELAX= 
##$RELAX= 
##$RELAX= 
$$ Bruker specific parameters
$$ --------------------------
##$DU= <F:/spectra>
##$EXPNO= 1
##$NAME= <H-F>
##$PROCNO= 1
##$TYPE= <nmr>
##$USER= <she>
##$AMP= (0..31)
100 100 100 100 100 100 100 100 100 100 100 100 100 100 100 100 100 100 
100 100 100 100 100 100 100 100 100 100 100 100 100 100 
##$AQSEQ= 0
##$AQ_mod= 1
##$AUNM= <au_zg>
##$AUTOPOS= <>
##$BF1= 200.13
##$BF2= 200.13
##$BF3= 200.13
##$BF4= 200.13
##$BF5= 200.13
##$BF6= 200.13
##$BF7= 200.13
##$BF8= 200.13
##$BYTORDA= 1
##$CFDGTYP= 0
##$CFRGTYP= 5
##$CHEMSTR= <none>
##$CNST= (0..31)
1 1 145 1 1 1 1 1 1 1 1 1 1 1 1 1 1 1 1 1 1 1 1 1 1 1 1 1 1 1 1 1 
##$CPDPRG= <>
##$CPDPRG1= <>
##$CPDPRG2= <>
##$CPDPRG3= <>
##$CPDPRG4= <mlev>
##$CPDPRG5= <mlev>
##$CPDPRG6= <mlev>
##$CPDPRG7= <mlev>
##$CPDPRG8= <mlev>
##$CPDPRGB= <>
##$CPDPRGT= <>
##$D= (0..31)
0 1.2 0 0 0 0 0 0 0 0.06 0 0.03 0 0 0 0 0.0002 0 0 0 0 0 0 0 0 0 0 0 0 
0 0 0 
##$DATE= 1647329900
##$DBL= (0..7)
120 120 120 120 120 120 120 120 
##$DBP= (0..7)
150 150 150 150 150 150 150 150 
##$DBP07= 0
##$DBPNAM0= <>
##$DBPNAM1= <>
##$DBPNAM2= <>
##$DBPNAM3= <>
##$DBPNAM4= <>
$$ [...]
##$SUBNAM2= <"">
##$SUBNAM3= <"">
##$SUBNAM4= <"">
##$SUBNAM5= <"">
##$SUBNAM6= <"">
##$SUBNAM7= <"">
##$SUBNAM8= <"">
##$SUBNAM9= <"">
##$SW= 18.0517287032376
##$SWIBOX= (0..15)
0 0 2 0 0 0 0 0 0 0 0 0 0 0 0 0 
##$SW_h= 3612.71676300578
##$TD= 16384
##$TD0= 1
##$TE= 0
##$TE2= 300
##$TE3= 300
##$TEG= 300
##$TL= (0..7)
0 120 120 120 120 120 120 120 
##$TP= (0..7)
150 150 150 150 150 150 150 150 
##$TP07= 0
##$TPNAME0= <>
##$TPNAME1= <>
##$TPNAME2= <>
##$TPNAME3= <>
##$TPNAME4= <>
##$TPNAME5= <>
##$TPNAME6= <>
##$TPNAME7= <>
##$TPOAL= (0..7)
0.5 0.5 0.5 0.5 0.5 0.5 0.5 0.5 
##$TPOFFS= (0..7)
0 0 0 0 0 0 0 0 
##$TUNHIN= 0
##$TUNHOUT= 0
##$TUNXOUT= 0
##$USERA1= <user>
##$USERA2= <user>
##$USERA3= <user>
##$USERA4= <user>
##$USERA5= <user>
##$V9= 5
##$VALIST= <valist>
##$VCLIST= <CCCCCCCCCCCCCCC>
##$VD= 0
##$VDLIST= <DDDDDDDDDDDDDDD>
##$VPLIST= <PPPPPPPPPPPPPPP>
##$VTLIST= <TTTTTTTTTTTTTTT>
##$WBST= 1024
##$WBSW= 4
##$XGAIN= (0..3)
0 0 0 0 
##$XL= 0
##$YL= 0
##$YMAX_a= 119114
##$YMIN_a= -230046
##$ZGOPTNS= <>
##$ZL1= 120
##$ZL2= 120
##$ZL3= 120
##$ZL4= 120
##$ABSF1= 15.73037
##$ABSF2= -2.32148
##$ABSG= 5
##$ABSL= 3
##$ALPHA= 0
##$AQORDER= 0
##$ASSFAC= 0
##$ASSFACI= 0
##$ASSFACX= 0
##$ASSWID= 0
##$AUNMP= <proc_1d>
##$AZFE= 0.1
##$AZFW= 0.1
##$BCFW= 0
##$BC_mod= 2
##$BYTORDP= 0
##$COROFFS= 0
##$CY= -3
##$DATMOD= 1
##$DC= 0
##$DFILT= <>
##$DTYPP= 0
##$F1P= 0
##$F2P= 0
##$FCOR= 1
##$FTSIZE= 16384
##$FT_mod= 6
##$GAMMA= 0
##$GB= 0
##$INTBC= 1
##$INTSCL= 0
##$ISEN= 128
##$LB= 0.24
##$LEV0= 0
##$LPBIN= 0
##$MAXI= 10000
##$MC2= 0
##$MEAN= 0
##$ME_mod= 0
##$MI= 1.114404
##$NCOEF= 0
##$NC_proc= -9
##$NLEV= 6
##$NOISF1= 3.799351
##$NOISF2= 2.8
##$NSP= 0
##$NTH_PI= 0
##$NZP= 0
##$OFFSET= 15.70943
##$PC= 1
##$PHC0= -16950.22
##$PHC1= 13.20078
##$PH_mod= 1
##$PKNL= yes
##$PPARMOD= 0
##$PSCAL= 0
##$PSIGN= 0
##$REVERSE= no
##$SF= 200.130008431014
##$SI= 16384
##$SIGF1= 3
##$SIGF2= 2
##$SINO= 5.538805
##$SIOLD= 16384
##$SREGLST= <1H.CDCl3>
##$SSB= 0
##$STSI= 16384
##$STSR= 0
##$SW_p= 3612.71676300578
##$SYMM= 0
##$S_DEV= 0
##$TDeff= 16384
##$TDoff= 0
##$TI= <>
##$TILT= no
##$TM1= 0
##$TM2= 0
##$TOPLEV= 0
##$USERP1= <user>
##$USERP2= <user>
##$USERP3= <user>
##$USERP4= <user>
##$USERP5= <user>
##$WDW= 1
##$XDIM= 16384
##$YMAX_p= 535017724
##$YMIN_p= -2600847
$$ End of Bruker specific parameters
$$ ---------------------------------
##NTUPLES= NMR SPECTRUM
##VAR_NAME=  FREQUENCY,     SPECTRUM/REAL,   SPECTRUM/IMAG
##SYMBOL=    X,             R,               I
##VAR_TYPE=  INDEPENDENT,   DEPENDENT,       DEPENDENT
##VAR_FORM=  AFFN,          ASDF,            ASDF
##VAR_DIM=   16384,         16384,           16384
##UNITS=     HZ,            ARBITRARY UNITS, ARBITRARY UNITS
##FACTOR=    0.220516191357247, 1,           1
##FIRST=     3143.92830649389, 0,            0
##LAST=      -468.788456511888, 0,           0
##MIN=       -468.788456511888, -2600847,    0
##MAX=       3143.92830649389, 535017724,    0
$$ Real data points
##PAGE= N=1
##DATA TABLE= (X++(R..R)), XYDATA
$$ [...]
5504A3529333Q25081k52261m73845q4665n27515J006789N3739j016505N64381
5495A3624532L66643M5499L42554j46296L99504l12908n15646j5818J1066N11354
5485A4310484j88863K28640K64396k14502N01967m7483M86209J96481J36267k99676
5475A5373920l36072L25740K01859q2315p11290j15256M35143l49569Q9881p49255
5465A4082786M47727N17565J1582p9186l52810l47102J4308q14253L52352O58991
5455A4491960M75905j44522l99976M95631j32532l08276o24823l413P9653q03039
5445A3126568j83858L59425M29971L85457m60998l9175j23624P75724k46769L41263
5435A4363984M53514j05198K98412n09003K45183K31910o1713L56645K96477J97338
$$ y = [13529333, 14354414, 14102153, 13628308, 13543643, 13016128, 14022917, 14076656, 13060151, 13624532, 13991175, 14036674, 14379228, 14232932, 14632436, 14319528, 13803882, 13788064, 13799130, 14310484, 14121621, 14350261, 14614657, 14400155, 14902122, 14854639, 15340848, 15537329, 15673596, 15373920, 15037848, 15363588, 15565447, 15483132, 14771842, 14656586, 15091729, 14742160, 14832041, 14082786, 14530513, 15048078, 15059660, 14980474, 14627664, 14280562, 14294870, 13480617, 13832969, 14491960, 14967865, 14823343, 14423367, 14918998, 14786466, 14478190, 13853367, 13849954, 13929607, 13126568, 12942710, 13302135, 13732106, 14117563, 13656565, 13617390, 13493766, 14269490, 14022721, 14363984, 14817498, 14712300, 15010712, 14501709, 14746892, 14978802, 14917089, 15273734, 15570211, 15767549]
5425A5767549P58185j38814M55199o83984r32982O88877M61495q7941J04844J180650
5415A7573078k34743m77541N37614p45121k42151k23310M32323l63235m95150
5406A5761764J36601J068746J36284k83639O62740N24488m58076j03241J18636
5397A7564303K25398j15981R1564o61985J82744P56718m06354n47070l19775M68275
5387A7237837L81478M01686k79757o45338n17309j07393m13672J50015k30907
5378A5976640L93170o53630P62753N81576j043453O8126j59454n87195N11615
5369A5850148N63137m28106K5827N93641M33527N35876K82641O71808J038715
5360A9567214N87477o3972q78393j064665p13542o83192P58179m10700q00446
$$ y = [15767549, 16525734, 16386920, 16842119, 16158135, 15225153, 15914030, 16375525, 16287584, 16392428, 17573078, 17338335, 16860794, 17398408, 16653287, 16411136, 16187826, 16620149, 16256914, 15761764, 15898365, 16967111, 17103395, 16819756, 17482496, 18006984, 17548908, 17445667, 17564303, 17789701, 17673720, 17765284, 17103299, 17286043, 18042761, 17636407, 17089337, 16769562, 17237837, 17619315, 18021001, 17741244, 17095906, 16578597, 16471204, 16057532, 16207547, 15976640, 16369810, 15716180, 16478933, 17060509, 16017056, 16085182, 15925728, 15338533, 15850148, 16413285, 15985179, 16011006, 16604647, 17038174, 17574050, 17856691, 18528499, 19567214, 20154691, 20090719, 19212326, 18147661, 17434119, 16750927, 17509106, 17098406, 16297960]
5351A6297960j10073N15675M37976n27642k55469P9624p8272l11867j78916j17366
5341A5751630P81337n23050J55321p76560n29191J529189k50474L80390L07968
5332A6826560o7303n22475l45125K15034r0054k45789Q62636m71962l23482M22298
5322A6260338k8715m68320J20367O78109k1383J62139R55338J267k31946L9304
5312A7466498n3406J39119L35055o86118n05894J97930r68653j281335M9561l18409
5302A4374348m10118J84081J98003J585705n72946p64690j37895o08915J49618
5293A3997191K29244J32385J05122J50026K10398L11729N66573N38634R27939
5284A7169241l74666J239957O2819K05585P23395O3617j16110J11147l46907q30486
$$ y = [16297960, 16187887, 16703562, 17141538, 16613896, 16358427, 16438051, 16359779, 16047912, 15868996, 15751630, 16532967, 16009917, 16165238, 15388678, 14859487, 16388676, 16138202, 16518592, 16826560, 16759257, 16236782, 15891657, 16106691, 16016637, 15770848, 16633484, 16161522, 15838040, 16260338, 16231623, 15763303, 15883670, 16561779, 16540396, 16702535, 17657873, 17659140, 17427194, 17466498, 17413092, 17552211, 17887266, 17201148, 16695254, 16893184, 15924531, 14643196, 14692757, 14374348, 13964230, 14148311, 14346314, 15932019, 15359073, 14594383, 14456488, 13847573, 13997191, 14226435, 14358820, 14463942, 14613968, 14824366, 15136095, 15702668, 16241302, 17169241, 16794575, 18034532, 18097351, 18302936, 19026331, 19089948, 18973838, 19084985, 18738078, 17907592]
5274A7907592n55935l56012m3501j247145j75883R2768J72085k69146O5328J15929
5264A5706080j487641j24954p23014P58571j30744L21329O53014j046289k82758
5255A3643594P87234J244292r11639K38451J284176n03339N8570K31350J95420
5246A6268109M33238K01942l25360l22674O3096q63289N39526M04970l16099k86435
5236A5797024k83755l99029k38285q18064j48843L75601m32181L15812n03210
5227A3665070k49692n3344N27401O02659m75162p86174p96174Q06684j96312N89626
5217A3634582Q0958r7986j55357k25815p94636l734O2633O52581k89798q37539
5207A2025889L87202P8551K43814K46133j63284k59183p12524L20914K70842J27424
$$ y = [17907592, 17351657, 16995645, 16952144, 15704999, 15529116, 15621884, 15793969, 15524823, 15590151, 15706080, 14218439, 14093485, 13370471, 14129042, 13998298, 14319627, 14972641, 13926352, 13643594, 14430828, 15675120, 14763481, 15001932, 16286108, 15782769, 15841339, 16072689, 16268109, 16701347, 16903289, 16577929, 16255255, 16318351, 15455062, 15994588, 16399558, 16083459, 15797024, 15513269, 15114240, 14875955, 14057891, 13909048, 14284649, 13852468, 14168280, 13665070, 13415378, 13362034, 13889435, 14492094, 14016932, 13230758, 12434584, 13241268, 13044956, 13634582, 13715540, 13617554, 13462197, 13236382, 12441746, 12438012, 12500645, 13153226, 12863428, 12025889, 12413091, 12491642, 12735456, 12981589, 12818305, 12559122, 11846598, 12167512, 12438354, 12565778]
5197A2565778N73523J59628q70669J31171K76455k15642J82926l77950o61995
5188A1763225J12983K86850q98716p92436O37482P3672k09763L60657o81028R05444
5178A1558370J030380j23026p88299R9663o67798O26898L6423m53102N83371M97620
5168A2400500k90014L77564j122204L21010P06423l82424j61081j96413k19956
5159A1433405n1516O62459j31400l57860O7056K50787K76352m29837k78892k27555
5149A1212999j36751j026J83653M4164k39448j7696N68459p60556L27134M44994
5139A1625926M81092K67459j87662k53376q31539K0649j00699P64156m42965o88731
5129A0654310N04306J059145J56310l12905J68314P0226K80176K64647j22325
$$ y = [12565778, 13139301, 13298929, 12428260, 12559431, 12835886, 12620244, 12803170, 12425220, 11763225, 11876208, 12163058, 11264342, 10471906, 11109388, 11183060, 10973297, 11333954, 10652926, 11558370, 12588750, 12465724, 11677425, 11777088, 11109290, 11736188, 11772611, 11319509, 11902880, 12400500, 12110486, 12488050, 11365846, 11686856, 12393279, 12010855, 11849774, 11653361, 11433405, 11381889, 12044348, 11912948, 11555088, 11622144, 11872931, 12149283, 11719446, 11440554, 11212999, 11076248, 11075222, 11258875, 11303039, 11063591, 11045895, 11614354, 10853798, 11180932, 11625926, 12107018, 12374477, 12186815, 11933439, 11101900, 11122549, 11021850, 11786006, 11343041, 10654310, 11158616, 12217761, 12374071, 12061166, 12229480, 12299706, 12579882, 12844529, 12722204]
5120A2722204L91591k64154J02834j98861q82801O41335M83960L57054L10437
5111A3663599J64432K00369m32087O8501L85081k00421Q75163M30679L69085N12617
5101A6037018j64141N9322Q72632P67493O22227L81608j029126n59181N29755
5092A7517607P3965k33961J254500M25239K63166r13628j232248j338341P66374
5083A6582673P70277q42946j165030J49505o07664m94979j029057Q47131Q84392
5074A5094302k83218n36701J06115M53437k47320m95867l59425n94207K23974
5065A3361090K69897m25896J09321J388398J169948j176661n63194J03966l84949
5056A3851920j70635J20194m36869K73813R67103m60096p46442n66637J30897
$$ y = [12722204, 13113795, 12849641, 12952475, 12753614, 11870813, 12512148, 12996108, 13353162, 13663599, 13828031, 14028400, 13596313, 13664814, 14049895, 13849474, 14724637, 15155316, 15524401, 16037018, 15872877, 15932199, 16804831, 17572324, 18194551, 18576159, 17547033, 16987852, 17517607, 17591572, 17357611, 18612111, 19037350, 19300516, 18386888, 17154640, 15816299, 16582673, 17352950, 16510004, 15344974, 15494479, 14886815, 14391836, 13362779, 14209910, 15094302, 14811084, 14274383, 14380498, 14833935, 14586615, 14090748, 13731323, 13137116, 13361090, 13630987, 13205091, 13314412, 14702810, 15872758, 14696097, 14132903, 14236869, 13851920, 13681285, 13801479, 13364610, 13638423, 14605526, 14145430, 13398988, 12832351, 12963248]
5047A2963248j14385N83672M88083j00240O87874n15855J035657J79209j14531
5038A5092732l27423J77844k32389M50696j31521K20404J154466Q5986j35288
5029A6355507l37776l61490M94144Q95364j64592o44576M29578N2856M02429j41537
5019A6979907q55245p99578p80192J91074P43567K07721L86589l73420J13701
5010A5814124L24054L01605q3185o9140L51833n98583p84038l73693k63724R32686
5000A5551939J081105l72610p75320M47159K55353m59316m73442K21119O75053
4991A6151040L55749o91793j07275M17293Q0471N396K84326O6015n211K95196
4981A6851207N90407P18946j347633p86780R36236J401910p76883K57572O15838
$$ y = [12963248, 12848863, 13432535, 13920618, 13820378, 14508252, 13992397, 15028054, 15207263, 15092732, 14765309, 14943153, 14710764, 15161460, 15029939, 15250343, 16404809, 16490795, 16355507, 16017731, 15656241, 16150385, 17045749, 16881157, 16236581, 16666159, 16719015, 17121444, 16979907, 16124662, 15325084, 14544892, 14735966, 15479533, 15687254, 16073843, 15700423, 15814124, 16138178, 16439783, 16356598, 16287458, 16639291, 16040708, 15256670, 14882977, 14619253, 15551939, 16633044, 16260434, 15485114, 15932273, 16187626, 15728310, 15254868, 15475987, 16151040, 16506789, 15814996, 15707721, 16125014, 16205485, 16210881, 16495207, 16561222, 16556011, 16851207, 17441614, 18160560, 16812927, 16026147, 16962383, 18364293, 17587410, 17844982, 18460820]
4972A8460820K28957j67632K8952K40672j73131J32897N63532k26536P08351N12726
4962B0309608j14880M67561J54628O1262N60840Q98920j242708l93215J099484
4953B1801500N2796L95777l55679j36892L46477j74238k57446J12090K39132r33449
4943B1090068m96614O14579K29453k92133m01326P0742r8602K61180M69815r7733
4933B1349429j88577K16367K87402K52072o08237k51721l23830N2819J298102
4924B2083826k19921R7996n7768l42526r5475L52234j06619M87599n23796J39590
4914B1815140K01032o76033R80772Q78950o63242P91411Q05175n41788m38463
4905B3152954R46277L01534j89229K93321N78781K42997J002372J32310m44324
$$ y = [18460820, 18689777, 18522145, 18551097, 18791769, 18618638, 18751535, 19315067, 19088531, 19796882, 20309608, 20194728, 20662289, 20816917, 20878179, 21439019, 22337939, 21095231, 20702016, 21801500, 21854296, 22250073, 21894394, 21757502, 22103979, 21929741, 21672295, 21784385, 22023517, 21090068, 20593454, 21208033, 21437486, 21145353, 20744027, 20814769, 20716167, 20977347, 21447162, 21349429, 21160852, 21377219, 21664621, 21916693, 21308456, 21056735, 20732905, 20785724, 22083826, 21863905, 21961901, 21904133, 21561607, 21466132, 21818366, 21711747, 22199346, 21675550, 21815140, 22016172, 21340139, 22320911, 23199861, 22536619, 23328030, 24133205, 23591417, 23152954, 24099231, 24400765, 24211536, 24504857, 25083638, 25326635, 26329007, 26461317, 26016993]
4896B6016993J74481K92094K1720P36909j62413P6980P43952j168954J71747M8600
4886B6952109j3508P43094M41787j02289O50269M44315J79417K98895Q57959K87032
4876C0739080l00652K87503M30407J093860K91263N87960J482392r4854N0850
4867C4567809n41094L29178J381597J603503k87892K64354L56676J149454N03508
4858C9327093o56971n554P31515m3647m7775j56303N45367N22172P55838K37864
4848D1209599l32303j05673M6117M81971Q3107J40984J361201k66599j6133M53792
4838D3056063N63072N72128P88278j25345k28510J512624L19528N35442P15241
4829D7708521Q03295M23341J226647J446749M47301K48547J127172J54450O91567
$$ y = [26016993, 26191474, 26483568, 26505288, 27242197, 27079784, 27156764, 27900716, 26731762, 26903509, 26952109, 26938601, 27681695, 28123482, 28021193, 28671462, 29115777, 29295194, 29594089, 30452048, 30739080, 30438428, 30725931, 31156338, 32250198, 32541461, 33129421, 34611813, 34516959, 34567809, 34026715, 34355893, 35737490, 37340993, 37053101, 37317455, 37674131, 38823585, 39327093, 38670122, 38664568, 39396083, 39352436, 39304661, 39148358, 39693725, 40215897, 40971735, 41209599, 40877296, 40771623, 40817740, 41299711, 41382818, 41523802, 42885003, 42618404, 42602271, 43056063, 43619135, 44191263, 44979541, 44854196, 44625686, 46138310, 46457838, 46993280, 47708521, 48511816, 48935157, 50161804, 51608553, 52055854, 52304401, 53431573, 53586023, 54277590]
4820E4277590M21138Q67804J313882J744644J037286M19307n25942Q94145Q10587
4811F1260441l10974J131662J614716J440528P91358J379113J769934J683763
4803G0760541J959375J937631J299760K732P8493K4639n14695O07260J113797
4794G7269533J59210N5377L08589J053261P61939R27953j52173R23595J267777
4785H2575061J871807K534414J512158J024892J739966J368914J374717J927555
4777I5929484J418747Q95433J792641K119270K029827K955714K563332K826298
4769A12530746K732891K877845J894239L197294K589682J981072K270531K147147
4761A32221447L354023K844962M751789N751156N722576N296444N897661L713349
$$ y = [54277590, 54698728, 55566532, 56880414, 58625058, 59662344, 60081651, 59555709, 60449854, 61260441, 60949467, 62081129, 63695845, 65136373, 65927731, 67306844, 69076778, 70760541, 72719916, 74657547, 75957307, 75960039, 76038532, 76063171, 75548476, 76155736, 77269533, 77428743, 77484120, 77792709, 78845970, 79607909, 80535862, 80383689, 81307284, 82575061, 84446868, 86981282, 88493440, 89518332, 91258298, 92627212, 94001929, 95929484, 97348231, 98243664, 100036305, 102155575, 104185402, 107141116, 109704448, 112530746, 115263637, 118141482, 120035721, 123233015, 125822697, 127803769, 130074300, 132221447, 135575470, 138420432, 143172221, 148923377, 154645953, 159942397, 165840058, 169553407]
4753A69553407K923172K011905K45853J45378j133459l35295K14663j178639j27112
4744A72319873N22887K16711J791836J842511K007467Q87620J167686N21818o77501
4735A80600908j465400j984876k557046j807424k303647j715635j27548j217628
4727A67421704o9245Q09000O50288K056646P50568J392802J265254R34472m78870
4718A74732619j089002j769591k950111k186721r29252j802268j946936o9885
4710A61988853o00472p0447M46181J090102J580136K466375J532870J790051K309307
4701A72532956J619154J241726Q95185L80572q3485L9271j174078p82212j672052
4692A72997037j163080j987486j721190j861451l325873k656980k613935k914379
$$ y = [169553407, 172476579, 174488484, 174734337, 174879715, 173746256, 173410961, 173625624, 172446985, 172319873, 172842760, 173059471, 174851307, 176693818, 178701285, 179588905, 180756591, 181278409, 180600908, 179135508, 177150632, 174593586, 172786162, 170482515, 168766880, 168639332, 167421704, 167352459, 168161459, 168811747, 170868393, 171618961, 173011763, 174277017, 175211489, 174732619, 173643617, 171874026, 168923915, 166737194, 165807942, 164005674, 162058738, 161988853, 161388381, 161317934, 161764115, 162854217, 164434353, 166900728, 168433598, 170223649, 172532956, 174152110, 175393836, 176289021, 176669593, 176586108, 176625379, 175451301, 174669089, 172997037, 171833957, 169846471, 168125281, 166263830, 162937957, 160280977, 157667042, 154752663]
4684A54752663k999880k464960k139943k218138j673586j410504p48894o93700
4676A40403058j434927p58171j041869j248057k028288j183817j690477j566791
4668A29450661k083683j721645k389840j283047k195273j628495j368865j368212
4660A15411601j134741k828436j390974j586309k081628j382997r91689l268936
4652A00745891j226694n83354j305027j969343j803651q66281j186627m06661
4644I1398253n06085j582626j023023k68833j385087j099554j290693k62697j341836
4635H2637819n52608p69041o90926p47170j189707q73791j789044q9693k62736
4626G5673103l60303o24254n14799j403702o42018n83214p59188l71547l05812
$$ y = [154752663, 151752783, 149287823, 147147880, 144929742, 143256156, 141845652, 141096758, 140403058, 138968131, 138209960, 137168091, 135920034, 133891746, 132707929, 131017452, 129450661, 127366978, 125645333, 123255493, 121972446, 119777173, 118148678, 116779813, 115411601, 114276860, 111448424, 110057450, 108471141, 106389513, 105006516, 104014827, 100745891, 99519197, 98935843, 97630816, 95661473, 93857822, 92991541, 91804914, 91398253, 90892168, 89309542, 88286519, 88017686, 86632599, 85533045, 84242352, 83979655, 82637819, 82085211, 81316170, 80625244, 79878074, 78688367, 77814576, 76025532, 75935839, 75673103, 75312800, 74688546, 74173747, 72770045, 72128027, 71544813, 70785625, 70414078, 70108266]
4617G0108266k76413p81731j456604m1187p62853q97556K71105q43072n64832
4608F4755123Q87456m81307o11940M0964m51663L9092N12978M43974k4790j6146
4598F5093741l10285l7445J30011n44187n8658N11891M30851j30679j95927J365740
4588F6255053L45288l33072K05941O65386K16382l41492r08284l5381l88630L16262
4578F5997453o82755K00472K5609j350198o5339K49142p8203n41642n33864L97039
4568F3617714M39285m72688J5264o98431o47009k5297Q76574N5860l30725N8728
4558F2889275l01651M50411M18530R59386O00922j72604P15315n05233k42767
4549F4811584l78102j83473N26991L62251J68437J68895L0981K92596p79190l97282
$$ y = [70108266, 69831853, 69050122, 67593518, 67552331, 66789478, 65891922, 66163027, 65319955, 64755123, 65642579, 65161272, 64549332, 64590296, 64138633, 64177725, 64690703, 65134677, 65109887, 65093741, 64783456, 64746011, 64876022, 64331835, 64273177, 64785068, 65215919, 65085240, 64889313, 66255053, 66600341, 66267269, 66473210, 67138596, 67354978, 67013486, 66105202, 66069821, 65681191, 65997453, 65314698, 65515170, 65540779, 64190581, 64125242, 64374384, 64296181, 63754539, 63220675, 63617714, 64056999, 63584311, 63599575, 62901144, 62254135, 62228838, 63105412, 63161272, 62830547, 62889275, 62587624, 63038035, 63456565, 64415951, 65016873, 64844269, 65559584, 65054351, 64811584, 64433482, 64250009, 64777000, 65139251, 65307688, 65476583, 65507564, 65800160, 65020970, 64623688]
4539F4623688J14399R870N70596n5786j55433j4236K34648P69053Q98310n03088
4529F6492021j26873l58834j9226n00814m08587l40294n45137j64744K6376K70166
4519F4324054K56017j14235o60824O18858P50058Q306m68597R76162O6181N65091
4509F6321071M54110K76111J060630P65973J087704J083079M88783L78088J289311
4500G3204860L84581R3837P45087L80052n69115O90220J072126j9434J011710
4491G6993924O14515q15787j448497j238338M14305r83070m25437k19485M96166
4482G3388296l010K89809J95294J60008J144142J39245O88976K41668R88594L72262
4472G7605284J597850J627339J134056J20079P71681J249190Q44231O38765R92467
$$ y = [64623688, 64738087, 64747957, 65318553, 65262767, 65107334, 65093098, 65327746, 66096799, 66995109, 66492021, 66365148, 66006314, 65987088, 65486274, 65077687, 64737393, 64192256, 64027512, 64053888, 64324054, 64580071, 64465836, 63805012, 64423870, 65173928, 65182234, 64713637, 65689799, 65755980, 66321071, 66775181, 67051292, 68111922, 68877895, 69965599, 71048678, 71537461, 71915549, 73204860, 73589441, 73683278, 74428365, 74808417, 74239302, 74929522, 76001648, 75982214, 76993924, 77608439, 76792652, 75344155, 74105817, 74520122, 73537052, 73111615, 72892130, 73388296, 73385286, 73675095, 73870389, 74030397, 75174539, 75313784, 76002760, 76244428, 77233022, 77605284, 79203134, 80830473, 81964529, 82084608, 82856289, 84105479, 84949710, 85588475, 86580942]
4463H6580942J446301J18431J115897J609169J464196Q75656J197689O87049K468678
4454I7564008K198175J706655K473709K869592L015552K940867L795808L487808
4446A20052174M236233N385812N718583O906960P838379Q069136R290560J1092548
4438A78590385J2321375J3028851J3499488J3672101J3679906J1649456Q476228
4431B64917790L774089L759290O837068P501459M046816l649256j2554037j4315721
4423B60317498j2139873r453663o823830o367543p025608r542317j1309119j2705323
4415A84950222j2160741j0854487q196696o256868n139353m781584l617740m375223
4407A29567530l251058k323716j803924j926625k223192k508476j821274j930895
$$ y = [86580942, 88027243, 88145674, 89261571, 90870740, 92334936, 93210592, 94408281, 95095330, 97564008, 99762183, 101468838, 103942547, 106812139, 109827691, 112768558, 116564366, 120052174, 124288407, 129674219, 135392802, 142299762, 150138141, 158207277, 167497837, 178590385, 190911760, 203940611, 217440099, 231112200, 244792106, 256441562, 264917790, 268691879, 272451169, 279288237, 286789696, 290836512, 287187256, 274633219, 260317498, 248177625, 238723962, 231900132, 225532589, 218506981, 208964664, 197655545, 184950222, 172789481, 161934994, 153738298, 147481430, 142342077, 137560493, 133942753, 129567530, 126316472, 123992756, 122188832, 120262207, 118039015, 115530539, 113709265, 111778370]
4399A11778370k643758j438013j282988j185338j497547k482089j633127k305390
4391I7310120l308923k882875k582379o15408k394298j276416j014678j663447
4383H1571696r30886r57759n55031r26913j681986o59104m80184k021733j230472
4374G2127628m21109j309194j028952o26871j938278J58859j77908p97864R0049
4365F6076360q99145N19713j215395m65565P51260K5073m33654K73219r72533
4356F3659333j978177l80257o67449n15345L36567r58408K98424J75878k83833
4347E9686733P21129J8454j258643J20917R26639J0722L34211N04179Q23945J450068
4337F3338354J225214M13283J7685L18873Q31226L44166J78377R88447M06374
$$ y = [111778370, 109134612, 107696599, 106413611, 105228273, 103730726, 101248637, 99615510, 97310120, 94001197, 91118322, 88535943, 87920535, 85526237, 84249821, 83235143, 81571696, 80640810, 79683051, 79128020, 78201107, 76519121, 75860017, 75379833, 73358100, 72127628, 71706519, 70397325, 69368373, 68741502, 66803224, 66962083, 66784175, 65986311, 66076360, 65177215, 65696928, 64481533, 64015968, 64767228, 64792301, 64358647, 64631866, 63659333, 61681156, 61300899, 60633450, 60118105, 60454672, 59496264, 59794688, 59970566, 59686733, 60407862, 60426316, 59167673, 59288590, 60215229, 60225951, 60560162, 61064341, 61888286, 63338354, 64563568, 64976851, 64994536, 65313409, 66144635, 66488801, 66667178, 67655625, 68061999]
4328F8061999n51849j218840n71674L91412p8633l887p05642j53497M00406k56705
4318F5313090K76816J08444l31200J17709L06095m49858q99536O46175K14354
4309F5302089O54465j12339O94048Q98352M74406O91173M79623q7415j89475L78284
4299F9183211J49274R30324o54765M6077J591105N97265P33807r1666O8756J367532
4289G3920920J86493K0234m32700N84128o39649K88510Q96500N26385P36909P08795
4279G6796525J694694K20960J055971J163867J617458J503277R05186R73499J276915
4270H7208352J57206Q53068j0819Q29927P62950K57504L69099l24185n78955j499134
4260H8025013j114053j533502L27994j1959k35889n92752p34334P81164q74753
$$ y = [68061999, 67510150, 66291310, 65719636, 66111048, 66032415, 66028528, 65322886, 65169389, 65569795, 65313090, 65589906, 65698350, 65367150, 65484859, 65790954, 65341096, 64441560, 65087735, 65302089, 65956554, 65844215, 66538263, 67436615, 67911021, 68602194, 69081817, 68994402, 68804927, 69183211, 69332485, 70262809, 69608044, 69654121, 71245226, 71842491, 72576298, 72484632, 72553388, 73920920, 74107413, 74127647, 73694947, 74279075, 73639426, 73927936, 74824436, 75350821, 76087730, 76796525, 78491219, 78712179, 79768150, 80932017, 82549475, 84052752, 84957938, 85931437, 87208352, 87365558, 88218626, 88207807, 89037734, 89800684, 90058188, 90427287, 90103102, 89524147, 88025013, 86910960, 85377458, 85705452, 85693493, 85457604, 84864852, 84130518, 84911682, 84036929]
4251H4036929l55909j016012l34045n71203K14744p38230q33132L4742r06733
4242G9531151k6620M56781j28846o2415L3470m6627R02706J13177J037442N87983
4232H2398202l61481L21031k72483J12757N07778j94165k90949l1793n67022L4501
4222H1656376J273871J383430N03050J848324J953255J521462J968189Q70166
4214I2978123K941097K494989K799780L020659K419312M046302L526187J369238
4206A15595687j04214l918021n315642m008505m543486l619814k628270k181741
4198H9275994j685632j918841j185902m74976j468436p18455m31003r06574O06426
4189H1092601K69238J045833K57735N55074J25468Q52929J793204K312938J621637
$$ y = [84036929, 83681020, 82665008, 82330963, 81759760, 81974504, 81236274, 80403142, 80437884, 79531151, 79504531, 79961312, 79832466, 79770051, 79803521, 79756894, 80659600, 80772777, 81810219, 82398202, 82036721, 82357752, 82085269, 82198026, 82705804, 82511639, 82220690, 82188897, 81621875, 81656376, 82930247, 84313677, 84816727, 86665051, 88618306, 90139768, 92107957, 92978123, 95919220, 98414209, 101213989, 104234648, 106653960, 110700262, 114226449, 115595687, 115491473, 111573452, 106257810, 102249305, 97705819, 94086005, 91457735, 89275994, 87590362, 85671521, 84485619, 84010643, 82542207, 81823752, 81392749, 80486175, 81092601, 81361839, 82407672, 82665407, 83220481, 83345949, 84198878, 85992082, 88305020, 89926657]
4180H9926657J605956K430563J986008J176346P43416m50217j268402m47507j880982
4171I3821838j642260j177249r59021r70481j84367J49608M78487K88827M84670
4162I0290052R4393k71160J77288k41766o93888o84324l14393q25646m13880J52723
4152H7269399M15136J124931M04799J278328J670353Q15308N91722M92561J14686
4143I4177223j525582j207036j256440r57708n38750l49749m9744j06402o47551
4134H7538261L17876K77348K38155k2714R89503P90328O10735O26853J472206
4125I2838551K662609K774050L009084K259764L365337L865526L732483N286526
4117A19793930M753977N191783O590007M526283L703778K683373J9912k747875
$$ y = [89926657, 91532613, 93963176, 95949184, 97125530, 97868946, 97418729, 96150327, 95702820, 93821838, 92179578, 91002329, 90043308, 89072827, 88888460, 89038068, 89516555, 89805382, 90290052, 90384445, 90113285, 90290573, 90048807, 89354919, 88670595, 88356202, 87530556, 87116676, 87269399, 87684535, 88809466, 89214265, 90492593, 92162946, 92978254, 93569976, 94062537, 94177223, 92651641, 91444605, 90188165, 89230457, 88691707, 88341958, 88292214, 88185812, 87538261, 87856137, 88133485, 88371640, 88348926, 89338429, 90128757, 90739492, 91366345, 92838551, 95501160, 98275210, 101284294, 103544058, 106909395, 110774921, 114507404, 119793930, 124547907, 129739690, 136329697, 140855980, 144559758, 147243131, 147263043, 144515168]
4109A44515168m473308n719234n516427l336071l525233k797963k273399j657794
4101A15215739n95649Q6409Q39478K088572M200427K678566k573560r216518q493381
4092A04230083o054034n077800l489217j774323j342736j179568j020062p20749
4084H3571594l69108q85337j052583o53607o31205J61544r98265l87723o70297
4075G8085013o74473j075340j019650m8291n70610l57248k95756k05504m7021
4066G3791120p51003j135094n41238r35844q36073o53715p57155n39235m1282
4057F7600481k78135j202064j200259k78695q74780r65897l30439n59004o63535
4048F1247673j369558j20998j301349o05899M32477P39648M4009p2022j39918
$$ y = [144515168, 140041860, 134322626, 128806199, 125470128, 121944895, 119146932, 116873533, 115215739, 114620090, 114706499, 115545977, 117634549, 121834976, 124513542, 121939982, 112723464, 104230083, 98176049, 93098249, 89609032, 87834709, 86491973, 85312405, 84292343, 83571594, 83202486, 82317149, 81264566, 80610959, 79979754, 80141298, 79143033, 78755310, 78085013, 77410540, 76335200, 75315550, 75267259, 74696649, 74339401, 74043645, 73838141, 73791120, 73040117, 71905023, 71363785, 70427941, 69591868, 68938153, 68180998, 67641763, 67600481, 67322346, 66120282, 64920023, 64641328, 63766548, 62800651, 62470212, 61911208, 61247673, 59878115, 59757117, 58455768, 57849869, 58282346, 59021994, 59066003, 58993981, 58854063]
4039E8854063q35597l62510m60340q46406j870655n63883o15944j479643j815320
4030E0003765m81782l4708j53331o76153o98289j065703r84542j316135p94545
4021D3798577p35904L4618q46323j298736M19352n49714j259839j195150l21362
4012C8045519N03606j64883J21325L42214j563697j22535m43436l76558m59123
4003C5882432N37248o20607m76398O26834p25786J46924J03194k98332m82111
3994C4693398l01917K13431N79664q5318l54652K19923M40824n28619m83971l3829
3984C4358934K34450r7060m89289M84781K94254n06758l86089P8901r801j382736
3974C2579587o60964k15836l25335j78666M2474o59660l58700L3571n75715l19620
$$ y = [58854063, 58018466, 57655956, 57195616, 56349210, 54478555, 53914672, 53298728, 51819085, 50003765, 49521983, 49487275, 49333944, 48657791, 47959502, 46893799, 45909257, 44593122, 43798577, 43062673, 43097291, 42250968, 40952232, 41371584, 40821870, 39562031, 38366881, 38045519, 38549125, 38384242, 38505567, 38847781, 37284084, 37161549, 36718113, 36341555, 35882432, 36419680, 35799073, 35322675, 35949509, 35223723, 35370647, 35473841, 35175509, 34693398, 34391481, 34604912, 35184576, 35099258, 34744606, 34964529, 35405353, 34876734, 34392763, 34358934, 34593384, 34496324, 34007035, 34491816, 34786070, 34279312, 33893223, 33972124, 33962323, 32579587, 31918623, 31702787, 31377452, 31198786, 31241260, 30581600, 30222900, 30256471, 29680756, 29361136]
3964B9361136p14101p70001L4228l71330k84435p64588r51056J48875L61760r2387
3954B5958101j057736o11364L68846k81692k14166M6012l59933q25387k0635n694
3944B2996352K65325L18418l59369j233148N79491m02925j313508o22303k70871
3935A9957462J36837j025396m33502k56523q09642L41925j9322Q4788o84051O176
3925A7298752q38011k82040o7970l02980R3641Q9504p67522J6931N76733j37770
3915A5679268k6112j25458j018743k28360P2380J4951L21029J97027k65047p46941
3905A3873994L33127P7091l7476j038379j17162p01535L26031k4550k68746p8176
3895A2344219k82132M84070M95127k76541J6825o83701n46976k7543K26723O86833
$$ y = [29361136, 28647035, 27877034, 27911262, 27539932, 27255497, 26490909, 25539853, 25688728, 26050488, 25958101, 24900365, 24289001, 24657847, 24376155, 24161989, 24208001, 23848068, 23022681, 23002046, 22996352, 23261677, 23580095, 23220726, 21987578, 22567069, 22164144, 20850636, 20228333, 19957462, 20094299, 19068903, 18635401, 18378878, 17569236, 17911161, 17891839, 17976627, 17292576, 17298752, 16460741, 16178701, 16110731, 15807751, 15901392, 15990896, 15223374, 15240305, 15817038, 15679268, 15653156, 15527698, 14508955, 14280595, 14352975, 14367926, 14688955, 14885982, 14620935, 13873994, 14207121, 14284212, 14246736, 13208357, 13091195, 12389660, 12715691, 12691141, 12422395, 12344219, 12062087, 12546157, 13041284, 12764743, 12781568, 12097867, 11550891, 11523348, 11750071, 12436904]
3885A2436904l57451j076382N87644K02644l61327L02295l96907p82236Q61807
3876A1416991j55774j04326m74895K57248p9290N23242r4020J93868J19204j030086
3866A0572162L74609M12167M00336k67294r974N19783n49710o62386R3727k60140
3856A0623280m92445J171j40937M80990N08300P05136j63766l55868k64666j025181
3846I876014P10082R37624j59129j35067p34673M62436O8269o05319L63406J01351
3836A0884994N11443M99873j48312q5129P55528o8214j036299L88029L91669k46438
3826A1847144j042966K36305j74471O04241P37712j26364N83098P3748k36445
3817A2502002p47594j74495O48594J113202j56288J86867k86280K2268K15766
$$ y = [12436904, 12079453, 11003071, 11590715, 11793359, 11432032, 11734327, 11337420, 10555184, 11416991, 11261217, 11156891, 10681996, 10939244, 10859954, 11383196, 11289176, 11483044, 11602248, 10572162, 10946771, 11358938, 11759274, 11491980, 11482006, 12001789, 11452079, 10789693, 10883420, 10623280, 10130835, 10132006, 9991069, 10472059, 10980359, 11685495, 11521729, 11165861, 10901195, 9876014, 10586096, 11523720, 11364591, 11229524, 10494851, 10957287, 11025556, 10420237, 10783643, 10884994, 11396437, 11896310, 11747998, 11662869, 12418397, 12350183, 11313884, 11701913, 12093582, 11847144, 10804178, 11040483, 10866012, 11470253, 12207965, 12081601, 12664699, 12738447, 12502002, 11754408, 11579913, 12228507, 13341709, 13185421, 13372288, 13086008, 13108276, 13324042]
3808A3324042m8614M61635Q2722j168408L26169Q41606o92669n43776K24457m91215
3798A2315949J163268J02919J53872M57263o08446o41656L89425L49387J31925
3789A3813906M92787L09487p14332Q20043J070158J82777l96903O17137n19540
3780A5675520N9093P77607j61095R4529J11746m5191r14067M30150P74934O09841
3770A7413067k28432L5351J008319j38453L1365P27173k92317K59719L83014N86975
3760A9785781L02182J34780Q69475k12556o0009L8750J23340M86660M37688R0593
3750B1996684N65828Q21828N41523J01921k92528L3365M84221l34345L34824J760747
3740B6014068p98928L66092J21843L21745N36614N86494N44985M7279m41057k35803
$$ y = [13324042, 13275428, 13737063, 13819785, 12651377, 12977546, 13819152, 13126483, 12582707, 12807164, 12315949, 13479217, 13582136, 13736008, 14193271, 13584825, 12943169, 13332594, 13681981, 13813906, 14306693, 14616180, 13901848, 14721891, 15792049, 15974826, 15577923, 16195060, 15675520, 15734613, 16512220, 16351125, 16445654, 16557400, 16512209, 15598142, 16028292, 16803226, 17413067, 17184635, 17219986, 18228305, 18089852, 18121217, 18848390, 18556073, 18815792, 19198806, 19785781, 20087963, 20222743, 21092218, 20879662, 20819653, 20858403, 20981743, 21468403, 21906091, 21996684, 22562512, 23384340, 23925863, 24027784, 23735256, 23768621, 24252842, 23918497, 24253321, 26014068, 25215140, 25581232, 25703075, 26024820, 26561434, 27147928, 27692913, 27740192, 27299135, 27063332]
3730B7063332P62873K83306L00714P81158j00609N74451j15104r92160K41444
3721B8799405K73941j945M58567n00099n99983N73185m7248R60768M71679K06096
3711C0594366n2976n74363P7613O88525N16610M8358l38867p38336M15970N83666
3701C1220566N676k91466j53999M67918k23119J136530k72367j854O15505n80509
3691C1922881j12394J37330k54183L13800o53580m91939j59848m8094L38820l74319
3681C0618474L56327P2359P9090O77461M51578j005257M01247N95527J33026n18378
3671C1861454n6613J49096l1595Q13914M50169L08705J35223k60411k81111M09346
3661C3498177J150469N91201N91702R67337l44994J76854O62036o43558P23319
$$ y = [27063332, 27826205, 28109511, 28410225, 29191383, 29090774, 29665225, 29550121, 28557961, 28799405, 29073346, 29071401, 29529968, 29029869, 28429886, 29003071, 28955823, 29916591, 30388270, 30594366, 30541390, 29967027, 30044640, 30733165, 31249775, 31298133, 30959266, 30220930, 30636900, 31220566, 31226242, 30934776, 30780777, 31248695, 31025576, 32162106, 31889739, 31887885, 32503390, 31922881, 31810487, 31947817, 31693634, 32007434, 31353854, 30861915, 30702067, 30653973, 30992793, 30618474, 30974801, 31047160, 31126250, 31803711, 32255289, 31250032, 31651279, 32246806, 32379832, 31861454, 31804841, 31953937, 31922342, 32736256, 33186425, 33495130, 33630353, 33369942, 33088831, 33498177, 34648646, 35239847, 35831549, 36798886, 36453892, 36630746, 37292782, 36649224, 37372543]
3652C7372543N52742K20248j35050M8769O25491J71696k56064j7773k10753R45270
3642C9317119N54746o43199J12244P73565j258328k15149Q94655p8910l38828
3633C9117915O13475j7581L03814J44317n4944R73413J57441L56286J99541O19383
3623D2413060J40664R50559J028002Q39388M70121Q66760J423273l91937N46949
3614D8286839J896247J337722J403912Q11092Q06315J492781J271989J521780
3606E8828677K013355Q28434P60829L70316J358594J571336N68272J49513J063894
3597F7513220J295752R11787M84668Q70013N88471M60392M90397L6948J66217
3588G2817865j03367n92702j19350j80406N68200P15725m20145P1109j027340
$$ y = [37372543, 37925285, 38145533, 38010483, 38059252, 38684743, 38856439, 38600375, 38582602, 38371849, 39317119, 39871865, 39228666, 39340910, 40114475, 38856147, 38640998, 39535653, 39456743, 39117915, 39731390, 39713809, 40017623, 40161940, 40106996, 41080409, 41237850, 41594136, 41793677, 42413060, 42553724, 43504283, 44532285, 45371673, 45841794, 46708554, 48131827, 47739890, 48286839, 50183086, 51520808, 52924720, 53735812, 54542127, 56034908, 57306897, 58828677, 60842032, 61670466, 62431295, 62801611, 64160205, 65731541, 66299813, 66449326, 67513220, 68808972, 69720759, 70205427, 71075440, 71663911, 72124303, 72614700, 72651648, 72817865, 72714498, 72121796, 72002446, 71822040, 72390240, 73105965, 72685820, 72756929, 71729589]
3579G1729589M50110j27011M3112L67297l26481O85138n2572j29660m09117l30565
3569G1899840j35326k81329l28653J125643J97912L38269M34216J189958P41534
3560G5182064j21009j01727M81763J267698J138202J921N11016R30123R19711
3551H0209762J024999L10830O75815R06162M05741R82088P87060l09286J626060
3542H6619231O62879M99839p2364J78348J432328N26561J34247N28809L74053
3533I0883931O96735M95797J144972P86119J356240n67469P56544J310191n81243
3524I6281817R43568J431089O48441O99619J591714P23771k90711k2916m62460
3515A01543932J68843J089903M9078L91155j51265j290088m84279o81345j081209
$$ y = [71729589, 72179699, 72052688, 72095800, 72463097, 72136616, 72821754, 72769182, 72639522, 72230405, 71899840, 71764514, 71483185, 71154532, 72280175, 72478087, 72816356, 73250572, 74440530, 75182064, 75061055, 74959328, 75441091, 76708789, 77846991, 77848912, 78359928, 79290051, 80209762, 81234761, 81545591, 82221406, 83127568, 83533309, 84515397, 85302457, 84993171, 86619231, 87282110, 87781949, 87709585, 87887933, 89320261, 89846822, 89981069, 90509878, 90883931, 91580666, 92076463, 93221435, 94007554, 95363794, 94796325, 95552869, 96863060, 96281817, 97225385, 98656474, 99304915, 100004534, 101596248, 102320019, 102029308, 102006392, 101543932, 101712775, 102802678, 102851756, 103242911, 103091646, 101801558, 101317279, 100635934, 99554725]
3506I9554725q7645j032181J74663q50320J6708L57229l75309k33966m04372N12868
3496I7632400J246527r52079n71090J17372o51649j0484L87605O9858L39162L12014
3486I7919636j83733l65484k1615k30910j53159j18331q06993m53882k12222O595
3476I5379902k68345j053959j40768m78503n08705k94785r97077Q2716m98999
3467I1221477j017846p20924n20839q37150j043956j06834q0432J28495N3298
3458H7075289j407284O89688l11601L2985J136996K62414M66613K471738R44367
3449I1361205m77376K08921O80562K67775j95239k7886O29345L95948Q76906L48509
3439I4068670M84951P47898R2295j56014m27248J65797O05446J495027N94076
$$ y = [99554725, 99467080, 98434899, 98609562, 97759242, 97775950, 98133179, 97757870, 97523904, 97119532, 97632400, 98878927, 97926848, 97355758, 97473130, 96821481, 96810997, 97198602, 97268460, 97607622, 97919636, 97735903, 97370419, 97348804, 97117894, 96964735, 96846404, 96039411, 95585529, 95373307, 95379902, 95111557, 94057598, 93916830, 93438327, 92929622, 92634837, 91637760, 91720476, 91221477, 90203631, 89482707, 88961868, 88124718, 87080762, 86973928, 86893496, 87021991, 87075289, 85668005, 86357693, 86046092, 86079077, 87216073, 87478487, 87945100, 90416838, 91361205, 90883829, 91092750, 91773312, 92041087, 91845848, 91817962, 92447307, 92843255, 93720161, 94068670, 94553621, 95301519, 95393814, 95237800, 94810552, 94976349, 95581795, 97076822, 97670898]
3430I7670898J23370J67127K11240L34030J606201J426632n95186O36768J649144
3421A03230224J029612J539810J212010J677744K072456J21510J78454J677367
3413A12739187J362665O90205P57526J468996J626129J872905O36973R89603J460764
3404A23604953R28544J479834N41986N29578J685432J426392N31230M54086Q8438
3395A31270473Q89450k72676k32874L06810n97043m10886l94856r7929j187239
3386A29273230L5612O88643j44574m619l40684j07513K1685L02218P37637P66600
3376A31228235N69351L76426l2255K15382P37229R59229Q30250P89257q352O16440
3366A36281192J253151J401047J039722J481606J184182K155615K374032J768976
$$ y = [97670898, 97794268, 97961395, 98172635, 98506665, 100112866, 101539498, 100944312, 101581080, 103230224, 104259836, 105799646, 107011656, 108689400, 110761856, 110883366, 111061820, 112739187, 114101852, 114792057, 115549583, 117018579, 118644708, 120517613, 121154586, 122144189, 123604953, 124533497, 126013331, 126555317, 127084895, 128770327, 130196719, 130727949, 131182035, 131270473, 132159923, 131887247, 131654373, 131961183, 131364140, 130953254, 130558398, 130460469, 129273230, 129308842, 129997485, 129852911, 129848292, 129507608, 129400095, 129421780, 129723998, 130461635, 131228235, 131797586, 132174012, 132141757, 132357139, 133094368, 134053597, 134883847, 135673104, 135664752, 136281192, 137534343, 138935390, 139975112, 141456718, 142640900, 144796515, 147170547, 148939523]
3358A48939523K180610K074251K384408J473389K412518K383185K788188K538671
3350A67174743K744256L328805K966501K006793K705708K530319K319402K601472
3342A88377999K484801J876488K981718L272251L207985K593789K719313K328025
3334B09842369L349628K949461L026455K625621J717402L203068K115383K653390
3326B31482777K106552L036425K859460L608844L264713L018409M128313L619833
3318B57125326L928252L916074M388706L731560L784953M058237M003327L026338
3310B87962773K847644J709134K758170J679127J754763N94968k27709J52257
3302B99231127j34580O82817p07636p83933p00431j532012j881656k060760R9848
$$ y = [148939523, 151120133, 153194384, 155578792, 157052181, 159464699, 161847884, 164636072, 167174743, 169918999, 173247804, 176214305, 178221098, 180926806, 183457125, 185776527, 188377999, 190862800, 192739288, 195721006, 198993257, 202201242, 204795031, 207514344, 209842369, 213191997, 216141458, 219167913, 221793534, 223510936, 226714004, 228829387, 231482777, 233589329, 236625754, 239485214, 243094058, 246358771, 249377180, 253505493, 257125326, 261053578, 264969652, 269358358, 273089918, 276874871, 280933108, 284936435, 287962773, 290810417, 292519551, 295277721, 296956848, 298711611, 299306579, 299078870, 299231127, 299096547, 299779364, 299071728, 298287795, 297587364, 296055352, 294173696, 292112936, 292212784]
3293B92212784j205528k339388k109953r43333j903935l075097j587636k067445
3285B76980469j803326k405862j367875j694934k595048l104715k083166k045979
3277B59879564j626278k155815j807815k359467j379464k002722j336839k364878
3269B44846286j692737j478951k159020k860242k490498k088383l408319l953051
3261B24715085l240199l317964l134630k942360l115852l421068l085205k505436
3253A99952371l467134k445035k022636l531489k934746k472093k486008k419064
3245A78174166j612806j343603k824085k913069k134114j103959j885067j390515
3237A62966948j287064j351061p74562j81308j004841o27970q19878m71789K54787
$$ y = [292212784, 291007256, 288667868, 286557915, 285614582, 283710647, 280635550, 279047914, 276980469, 275177143, 272771281, 271403406, 269708472, 267113424, 264008709, 261925543, 259879564, 258253286, 256097471, 254289656, 251930189, 250550725, 248548003, 247211164, 244846286, 243153549, 241674598, 239515578, 236655336, 234164838, 232076455, 228668136, 224715085, 221474886, 218156922, 215022292, 212079932, 208964080, 205543012, 202457807, 199952371, 196485237, 194040202, 192017566, 188486077, 185551331, 183079238, 180593230, 178174166, 176561360, 175217757, 172393672, 169480603, 167346489, 166242530, 164357463, 162966948, 161679884, 160328823, 159554261, 159372953, 158368112, 157740142, 156920264, 156448475, 156703262]
3228A56703262M97609m27566j54666P87106J97581R26326N05700L39517J491782
3219A60866651K61097J9588J99143J291259L85425O17778P21426M0579O41353
3210A65044299J030506O3493q64725j059291q71459m6757o37903o39919j598431
3201A60419813q50696j662541j537832j142511r61206k261620k031937j718259
3193A48253211j937897k085881j963953p88685k683957k821814k100755j706751
3185A32163518j141001k322793k609350j518323j748913j674114j148060j647875
3177A18353089j372961o27407j276377j376468p60504K9123j783761o05181j41514
3168A10438039M97920q08903k45778J46405j97946Q46595P41058O83083J056443
$$ y = [156703262, 157200871, 156773305, 156618639, 157405745, 157603326, 158529652, 159035352, 159374869, 160866651, 161127748, 161147336, 161346479, 162637738, 163023163, 163640941, 164362367, 164402946, 165044299, 166074805, 166138298, 165273573, 164214282, 163342823, 163296066, 162658163, 162018244, 160419813, 159569117, 157906576, 156368744, 155226233, 154265027, 152003407, 149971470, 148253211, 146315314, 144229433, 142265480, 141476795, 138792838, 135971024, 133870269, 132163518, 131022517, 128699724, 126090374, 124572051, 122823138, 121149024, 120000964, 118353089, 116980128, 116352721, 115076344, 113699876, 112939372, 112968495, 111184734, 110579553, 110438039, 110935959, 110127056, 109881278, 110027683, 109829737, 110676332, 111417390, 112100473, 113156916]
3159A13156916K008470J390986J527128R40883Q28533J417052J029123N90764
3151A22889855P37098M39135K89174m25389m95939m70547n388J44962r87468p78548
3141A21336945M66777O15795l98014J57180L82527k88341J501198Q33712o84030
3132A23923749l63827j48455l37573j442103o10848o12837j296903k6173m85411
3123A18599619j191589j436214o15615j271393j777935j689198j246894j715269
3115A07655512k487266r31706j081708k048260j304975j501971p37695j628818
3107I5933113j326646j227411r32809p70656j539029j443744j116929k71754m97093
3098H6807042j209653j249518q61825j217281j595514r43006o67462j479477j779292
$$ y = [113156916, 115165386, 116556372, 118083500, 119024383, 119852916, 121269968, 122299091, 122889855, 123626953, 124066088, 124355262, 123929873, 123433934, 122963387, 122957999, 123102961, 122115493, 121336945, 121803722, 122419517, 122021503, 122178683, 122561210, 122272869, 123774067, 124607779, 123923749, 123559922, 123411467, 123073894, 121631791, 121020943, 120408106, 119111203, 119085030, 118599619, 117408030, 115971816, 115356201, 114084808, 112306873, 110617675, 109370781, 107655512, 105168246, 104236540, 103154832, 101106572, 99801597, 98299626, 97561931, 95933113, 94606467, 93379056, 92446247, 91675591, 90136562, 88692818, 87575889, 87304135, 86807042, 85597389, 84347871, 83486046, 82268765, 80673251, 79730245, 79062783, 77583306, 75804014]
3089G5804014m30608j242408j428551l92529o71366j054998n44756k20722j291770
3080F8526306J17977r22800j51641j136813j85434N00660K02461j30067j6229
3071F6804420p67595n8820M94692K0309L99718N63809J450270n47177k52860N96066
3061F8702832j305147j072795j388469Q1196l63848q76749r21167j137980j40675
3052F1577198p95027j15564j458676p34786o06469l88374N4687p70472l78463
3043E6384054J69823R3828j44592M22439j21195K60232R12065l48220j49259o49258
3033E6829917l19811r51472m67087l64161m63279r2704q71436j951937q82445
3024E0465585k65729n57246j005745p79699j043469q04256k59943L11178o47111
$$ y = [75804014, 75373406, 74130998, 72702447, 72309918, 71638552, 70583554, 70038798, 69818076, 68526306, 68644283, 67721483, 67569842, 66433029, 66247595, 66748255, 66950716, 66820649, 66804420, 66036825, 65978005, 66472697, 66493006, 66892724, 67456533, 68906803, 68359626, 68106766, 68702832, 67397685, 66324890, 64936421, 65017617, 64653769, 63777020, 62855853, 61717873, 61577198, 60782171, 60666607, 59207931, 58473145, 57866676, 57478302, 57532989, 56762517, 56384054, 56553877, 56647705, 56503113, 56925552, 56804357, 57064589, 57976654, 57628434, 57479175, 56829917, 56510106, 55558634, 55091547, 54727386, 54264107, 54171403, 53299967, 51348030, 50465585, 50199856, 49642610, 48636865, 47857166, 46813697, 46009441, 45749498, 46060676, 45413565]
3015D5413565r38690n53423l86004m07272q8230Q65511J60415n3648Q2777q38838
3005D3256163L71979Q47414J66740M964l86713J84336J37004K58699L36065n2217
2995D5124434K46446Q25433o67534j16379Q91953O95960N33390P64847K34031
2986D8532581J235229J94911O07706O28363R18208K95797M69445M82073J040912
2977E4405225J284356J539513L61439j90884J414417J062340J952107J058252
2969F2886765P80734P73538O63815K01121J235045J608313K272687J600997J729101
2960G3752116J279315J323481J997737J814622K507252K626689K882982K493715
2952I0677909M129091L451469K515170L892294M328729M060400N031138O569932
$$ y = [45413565, 44474875, 43921452, 43535448, 43128176, 43039946, 43905457, 44065872, 44012224, 44095001, 43256163, 43628142, 44475556, 44642296, 44647260, 44260547, 44444883, 44581887, 44840586, 45176651, 45124434, 45370880, 46196313, 45528779, 45412400, 46304353, 47000313, 47533703, 48298550, 48532581, 49767810, 49962721, 50570427, 51198790, 52116998, 52412795, 52882240, 53364313, 54405225, 55689581, 57229094, 57590533, 57399649, 58814066, 59876406, 61828513, 62886765, 63667499, 64441037, 65104852, 65305973, 66541018, 68149331, 70422018, 72023015, 73752116, 75031431, 76354912, 78352649, 80167271, 82674523, 85301212, 88184194, 90677909, 94807000, 98258469, 100773639, 104665933, 108994662, 113055062, 118086200, 124656132]
2944A24656132O775287P045851Q146578Q382303J0014149J2019857J1012961J0502033
2936A98555151Q486382N677901M176676L528471K585240K330496Q16040p11236
2928B25445121n49271P20105K039973K155403L617751N152770N871583P275502
2920B51728937P973376M790633M98184n681349r553276r231503q652088o971271
2912B24901643l880479j544142O89331K512750L370180N585838O354492Q233289
2904B46222902R327015J1327368J2919862J4614404J4878661J3829544J2206067
2897C35325823J0462979J0254367J1061301J2228213J2951545J3023011J1392777
2890D16700016Q964097M397155j347074o347770r768502j1584583j3018653j3037453
$$ y = [124656132, 131431419, 138477270, 146623848, 155006151, 165020300, 177040157, 188053118, 198555151, 207041533, 212719434, 216896110, 220424581, 223009821, 225340317, 226156357, 225445121, 224895850, 225615955, 227655928, 229811331, 233429082, 238581852, 244453435, 251728937, 259702313, 264492946, 264991130, 259309781, 249756505, 240525002, 231872914, 224901643, 221021164, 219477022, 220166353, 222679103, 226049283, 231635121, 237989613, 246222902, 255549917, 266877285, 279797147, 294411551, 309290212, 323119756, 335325823, 345788802, 356043169, 367104470, 379332683, 392284228, 405307239, 416700016, 425664113, 430061268, 428714194, 422366424, 412597922, 401013339, 387994686, 374957233]
2882C74957233j3864315j5176652j3735872j2814967j0310742r405119q446911
2875B91202655p410146o056032n169502m789557m448125m922490m046714m259934
2867B50100155m559868l285893l168794k976147k317240l524448k649408k312837
2859B25305520k478433k608048m244763m433154n871976n928170p201356p343610
2851A85196010p008592o920509o959059o410246o361990o331659o240450m591111
2843A34372394l715484m635992m772907m143808k292877k985361m092288k737530
2835A04996147k625184k380578k536780k410338k635430j794583j571140j488373
2827H7553741j517029k416358j700643j803511j161001p74964r70200j293351
$$ y = [374957233, 361092918, 345916266, 332180394, 319365427, 309054685, 299649566, 291202655, 283792509, 277736477, 272566975, 267777418, 263329293, 258406803, 254360089, 250100155, 245540287, 242254394, 239085600, 236109453, 233792213, 230267765, 227618357, 225305520, 222827087, 220219039, 215974276, 211541122, 205669146, 199740976, 192539620, 185196010, 178187418, 171266909, 164307850, 157897604, 151535614, 145203955, 138963505, 134372394, 130656910, 126020918, 121248011, 117104203, 114811326, 111825965, 107733677, 104996147, 102370963, 99990385, 97453605, 95043267, 92407837, 90613254, 89042114, 87553741, 86036712, 83620354, 81919711, 80116200, 78955199, 78180235, 77210035, 75916684]
2819G5916684j353507o58150o54677j717308j70576q63901o55025o95383K7970
2810F9176127K60789k7q4268j824J19103Q83550O04738P45438K58376P01846J401810
2799G4065658J505043M31448k68501J178530R63490J48508M77569Q93771J280537
2790H0676053R61286J118368N86240J753809J787039K556188K197271K777333
2782I4413587M195877L916024M493554N195239P107652Q140010P769964Q106939
2774A43338846Q621927Q133837P807456M546070L036433p88611n330367q354663
2766A61010928j0105912j0696544j0835363r868178q763370p472945p173350n740413
2758I0354853n014923n408440m242946m048673l820393l624682k961042k578550
$$ y = [75916684, 74563177, 73905027, 73250350, 71533042, 71362466, 70498565, 69843540, 69148157, 69176127, 69436916, 69436889, 69352621, 69350797, 69469900, 70353450, 70958188, 71703626, 71962002, 72663848, 74065658, 75570701, 76002149, 75733648, 76912178, 77875668, 78024176, 78501745, 79395516, 80676053, 81637339, 82755707, 83341947, 85095756, 86882795, 89438983, 91636254, 94413587, 98609464, 102525488, 107019042, 112214281, 119321933, 127461943, 135231907, 143338846, 151960773, 160094610, 167902066, 172448136, 175484569, 174695958, 169365591, 161010928, 150905016, 140208472, 129373109, 119504931, 110741561, 103268616, 96095266, 90354853, 85339930, 79931490, 75688544, 71639871, 67819478, 64194796, 61233754, 58655204]
2750E8655204l105319k646693j721330j781067j417807j629184j333440j321438
2742D3698926j408661k100477n18141n01448j407954r16906r67416j980107j418382
2733C2479434r36017k93916o37051q49092l5341j26385p14682j527594p76778
2724B6582578n75408L44510p73486o91808k61806j223901p54392j35647m46692
2715B2063948m24644m33875L64176m78368j092095M1357J37347l88579m28879
2706A9360388J37404k88482l30709l71005r40323n98474J96888l05312n18500
2697A6341875n21746p42563j09140J80446k62591o85341j274475k96230M10367
2688A3040602o47534J33022J63408j89108m89747k3150N29126o13722m78809J51822
$$ y = [58655204, 55549885, 52903192, 51181862, 49400795, 47982988, 46353804, 45020364, 43698926, 42290265, 40189788, 39671647, 39170199, 37762245, 36845339, 35877923, 33897816, 32479434, 31543417, 31249501, 30612450, 29763358, 29728017, 29601632, 28886950, 27359356, 26582578, 26007170, 26351680, 25578194, 24886386, 24624580, 23400679, 22646287, 22510640, 22063948, 21639304, 21205429, 21569605, 21091237, 19999142, 20040499, 20177846, 19789267, 19360388, 19497792, 19209310, 18878601, 18507596, 17567273, 16968799, 17165687, 16860375, 16341875, 15820129, 15077566, 14968426, 15148872, 14886281, 14200940, 12926465, 12630235, 13040602, 12393068, 12526090, 12689498, 12500390, 12010643, 11987493, 12516619, 11902897, 11424088, 11575910]
2678A1575910J29717j81438K21316n47148n1175o38113n8893m07557P78271J60588
2668A0981478q73809N22475l33202l10480m57097m05049k79215k1926m94454L95645
2658H724366R38051M15719r62934M3798M22725m24629j89084k02902k24442K06769
2648H747437J90782Q1532j083541R18975M8948j308043k43M05500q23495l51968
2638F825884P31747m3912L03018L26564m01710p76915P6110O60679M86722l62230
2628G825957q64851q1010P90188m71591J0245L34200o27443m51307K05845L43932
2618G014165m08568j01329k26435r8831N34656K62526J79558k46339j490j88956
2608F718957k14058M68684o77878m527K27353j8938k64104p01882M82232J46451
$$ y = [11575910, 11705627, 11524189, 11745505, 11198357, 11147182, 10509069, 10450176, 10042619, 10820890, 10981478, 10107669, 10630144, 10296942, 9986462, 9529365, 9124316, 8845101, 8823175, 8328721, 8724366, 9662417, 10078136, 9115202, 9159000, 9581725, 9157096, 8968012, 8765110, 8540668, 8747437, 8938219, 9019751, 7936210, 8855185, 8904133, 7596090, 7595847, 8001347, 7177852, 6825884, 7557631, 7513719, 7816737, 8143301, 7741591, 6964676, 7040786, 7701465, 8188187, 7825957, 6961106, 6880096, 7670284, 7198693, 7208938, 7543138, 6915695, 6464388, 6670233, 7014165, 6605597, 6504268, 6277833, 6179002, 6713658, 6976184, 7155742, 6909403, 6907913, 6718957, 6504899, 6973583, 6295705, 6291178, 6518531, 6499593, 6235489, 5533607, 6015839, 6162290]
2598F162290k65094j02521k24025n4496R04428J43340m37405p62853K44629k27058
2588E381235p3939Q93048j70995n59110j63936l13666J34085L48616K08800q10129
2578D874009r3256O09245l2038L30764j438683j38039L01834O3142O35324q58897
2568D253405l70238m04630k30358O79732M07526L1222J75015j58182r56965J5568
2558C442095K19721j71989J9065N14215q7641J52950j70429j41099j15061l68032
2548C293795J43074N84370n13505Q9377m09757l94461J05439k80967J001706n67067
2538C052004R62470M25383r66174l1459k14430k02K94366O38702n58992l29772
2528C271896n10122k9128j93865p9354L28466o5221o4641l07593K00909j4179
$$ y = [6162290, 5897196, 5794675, 5570650, 5516154, 6420582, 6563922, 6126517, 5363664, 5608293, 5381235, 5307296, 6200344, 6029349, 5470239, 5306303, 4992637, 5126722, 5475338, 5684138, 4874009, 4780753, 5389998, 5357960, 5688724, 4250041, 4112002, 4413836, 4476978, 5112302, 4253405, 3883167, 3478537, 3248179, 3927911, 4335437, 4366659, 4541674, 4383492, 3426527, 3442095, 3661816, 3489827, 3508892, 4023107, 3935466, 4088416, 3917987, 3776888, 3661827, 3293795, 3436869, 4021239, 3507734, 3597111, 3187354, 2792893, 2898332, 2617365, 3619071, 3052004, 4014474, 4439857, 3473683, 3442224, 3227794, 3227592, 3521958, 4160660, 3601668, 3271896, 2761774, 2732646, 2538781, 2459427, 2787893, 2722672, 2658031, 2350438, 2551347, 2537168]
2518B537168J60300m09450k09025N4034J88589N59110k40855M279J17463q30816
2508A930797J56165n15208n1308k25432J231067j9445k07892j98009m85131L96278
2498B011882M3835J74335L95167p6533L99367j90757m87246L6333m21878N85589
2488B470094j8803L85636L96083p40562r7193k91355J187407m14703r78232k10999
2478A687373L51519K40288j06156m18561m56497P74474q48561O95243J44026J968
2468B065116L85157k36247j071563O99356j04420J23197j1444j15131J22128N66316
2458B422465K98284m74479n69149n1382j89839Q3498j41138l12110N19120O90390
2448B275660j14194k6683K82757k50976q07264q6386J073898r0398j48436m10230
$$ y = [2537168, 2697468, 2288018, 2078993, 2133027, 2321616, 2880726, 2639871, 2644150, 2761613, 1930797, 2086962, 1571754, 1520446, 1295014, 2526081, 2506636, 2298744, 2100735, 1615604, 2011882, 2055717, 2230052, 2625219, 2548686, 2948053, 2757296, 2270050, 2306383, 1884505, 2470094, 2451291, 2836927, 3233010, 2492448, 2395255, 2103900, 3291307, 2876604, 1898372, 1687373, 2038892, 2279180, 2173024, 1754463, 1297966, 2072440, 1223879, 1919122, 2063148, 2065116, 2450273, 2214026, 1142463, 1841819, 1737399, 1860596, 1849152, 1734021, 1856149, 2422465, 2720749, 2246270, 1677121, 1625739, 1435900, 1519398, 1378260, 1066150, 1585270, 2275660, 2161466, 2134783, 2417540, 2166564, 1359300, 1272914, 2346812, 2256414, 2107978, 1697748]
2438A697748j57514M22281M91155m73155j162594L04357M32756j49359o70841
2429G34834N07476M66931m06059k46221p31771P42595J214732m31075m82412K8343
2419A397373K6642j142807l31329M86185l75983l21413O10396P32668N75877J14710
2409A772319k29024p68050M41900J137962J17552m64052m83523M34915o2245k5252
2399A872502K37875L25894Q4751N86242k0824p3441p6553M05462m41429r31319
2389A969160j99753m98192Q7625L32758m45435o33582k78231O84440L74455j4353
2379A378892R0419R62766p67717o99200n23796M74016J69169k87307N9562J67909
2369A024713j91423L61830o19590r4990P36785j79364K59360k19058M09174R55474
$$ y = [1697748, 1540234, 1962515, 2453670, 1980515, 817921, 1122278, 1555034, 1405675, 734834, 1242310, 1709241, 1303182, 1056961, 325190, 1067785, 2282517, 1851442, 1369030, 1397373, 1424015, 281208, -50121, 436064, 60081, -261332, 349064, 1081732, 1657609, 1772319, 1543295, 775245, 1217145, 2355107, 2472659, 2008607, 1525084, 1959999, 1897754, 1872502, 2110377, 2436271, 2521022, 3107264, 3086440, 3012999, 2936446, 3341908, 2900479, 1969160, 1769407, 1271215, 1358840, 1691598, 1246163, 612581, 334350, 1018790, 1393245, 1378892, 1469311, 2432077, 1664360, 965160, 441364, 915380, 1084549, 797242, 856804, 1024713, 833290, 1195120, 575530, 480540, 1217325, 1037961, 1297321, 1078263, 1487437, 2442911]
2359B442911o11579j042418q4645n21054l67529M24219J263308K3952q8997O03835
2349B042003k83132J49184j8945o17847O34958k09192p45860m55592Q2407L41417
2339I19401q75954N36443O49999p41041M37420l18424l87855M41790M68391L8155
2329A168325m23302N5822P84759M13111r00860o35764O85707J465434r60604j87217
2319A465411L51028K63533p71594O9747l7387O6111K85165m00668J57159k5637
2309A422868L14506m27560m98983l98026J60204j80805N93831M12792J6373M77053
2299A892253m25255p35611K33258j75124K60598M75608N2446m29835m55253P42174
2289A435259J32814n17431k21243m22583N67507L82014P91785n60867M81644O7072
$$ y = [2442911, 1831332, 788914, 704269, 183215, -184314, 239905, 1503213, 1527165, 1438168, 2042003, 1758871, 1908055, 1889110, 1271263, 1906221, 1697029, 951169, 495577, 577984, 919401, 43447, 579890, 1229889, 488848, 926268, 607844, 219989, 661779, 1130170, 1168325, 745023, 800845, 1585604, 1998715, 1097855, 462091, 1147798, 2613232, 1652628, 1465411, 1816439, 2079972, 1308378, 1378125, 1340738, 1406849, 1692014, 1291346, 1448505, 1422868, 1737374, 1309814, 810831, 412805, 573009, 392204, 986035, 1398827, 1415200, 1892253, 1466998, 731387, 964645, 789521, 1050119, 1525727, 1578173, 1148338, 693085, 1435259, 1568073, 1050642, 829399, 406816, 974323, 1356337, 2148122, 1587255, 2068899, 2135971]
2279B135971n48796o36543O14125j95083L1736k24256M37371l47249N14679J98909
2269A980864p92838n9821l49286L13975j7354O00622M7722o70649M52226Q19102
2259B324563O9604j97568m62674K55710N61821l4181n53374o38419K59884J251981
2249B837347R8970q08529M73025j15911j90142R59460j43339m58697N08329l138
2239C157375k5340k70928O95336k97240m21140O20812O39130K24998p85675L22545
2229C859873k76943O4367K79822J02801K1356j41799n8528L84048J030950j53118
2219E112829J34840K74274J51710n4276m76612J45801j97388R11835j82366k13192
2209E607455O4118Q37628M64945M72485n42416K04737Q53873J023033k23712J9729
$$ y = [2135971, 1587175, 950632, 1564757, 1369674, 1401410, 1177154, 1614525, 1267276, 1781955, 1980864, 1188026, 1128205, 778919, 1092894, 1075540, 1676162, 1723884, 1053235, 1505461, 2324563, 2394167, 2196599, 1733925, 1989635, 2551456, 2517275, 1963901, 1325482, 1585366, 2837347, 2936317, 2127788, 2600813, 2484902, 2294760, 3254220, 3110881, 2652184, 3160513, 3157375, 3132035, 2861107, 3556443, 3259203, 2838063, 3458875, 4098005, 4323003, 3537328, 3859873, 3582930, 3647297, 3927119, 4029920, 4051276, 3909477, 3850949, 4234997, 5265947, 5112829, 5247669, 5521943, 5673653, 5619377, 5142765, 5288566, 5091178, 6003013, 5820647, 5607455, 5671573, 6509201, 6974146, 7446631, 6904215, 7108952, 7962825, 8985858, 8762146, 8781875]
2199H781875M50705m35793L81922N27711L09125M24530m96300L32198Q78713P88788
2189A1943474j42091N98214n65738Q83659p17714J80726O31986J278634L01625
2180A4392775L7937N55470L87312J142710k49744J336699Q98303L64232M68643
2171A9334337L31790k82386M27534R39055J026677N49942P58844R0354R90123
2162B4166270J221386P20961J041761J548859M30356Q56873J524508J507032J374349
2153C4392355J358456J316466K035539K405103K367685K501881K881029L025296
2145E2283810L670387L947381M597112O505957O202358N532029K933942N516032
2137I1189008O512593J0513078J1863910J6351179K1718027L0440891L4231810
$$ y = [8781875, 9232580, 8796787, 9178709, 9706420, 10015545, 10440075, 9943775, 10275973, 11154686, 11943474, 11801383, 12399597, 11833859, 12717518, 11999804, 12180530, 12812516, 14091150, 14392775, 14430712, 14986182, 15373494, 16516204, 16266460, 17603159, 18501462, 18865694, 19334337, 19666127, 19383741, 19811275, 20750330, 21777007, 22326949, 23085793, 23176147, 24166270, 25387656, 26108617, 27150378, 28699237, 29129593, 29986466, 31510974, 33018006, 34392355, 35750811, 37067277, 39102816, 41507919, 43875604, 46377485, 49258514, 52283810, 55954197, 59901578, 64498690, 71004647, 77207005, 82739034, 85672976, 91189008, 97701601, 108214679, 120078589, 136429768, 158147795, 188588686, 222820496]
2130B22820496M0366034M9290837O8631368Q5351380O8557609k2765911j18709095
2123C93542718j02762112o5819977m0942492k9837368k2262923j6754504j2836745
2116A02326597j0153632q692873o616068m474287k771852k789452m426446o322827
2108E6079160m957366l064691l763597k961890k232588j764153j752253j266020
2100C4316602j280096r38230j769138j437415o14014q77529j071111q69469j144411
2091B4315189j161250j098969j057084j21203j314089j133134n04947j058566
2083A6865947j040673j026571o7682l54901l39406o86557J33352l90344j865463
2074A1227702n16545k71126L12857l46326M67716j42082o68164l12347N3777k32756
$$ y = [222820496, 263186530, 312477367, 381108735, 466460115, 535017724, 512251813, 393542718, 290780606, 224960629, 184018137, 154180769, 131917846, 115163342, 102326597, 92172965, 83480092, 76864024, 72389737, 69617885, 66828433, 62401987, 56079160, 51121794, 48057103, 44293506, 41331616, 39099028, 37334875, 35582622, 34316602, 33036506, 32098276, 30329138, 28891723, 28277709, 27400180, 26329069, 25459600, 24315189, 23153939, 22054970, 20997886, 20876683, 19562594, 18429460, 17924513, 16865947, 15825274, 14798703, 14731021, 14376120, 14036714, 13350157, 13483509, 13093165, 11227702, 10711157, 10440031, 10752888, 10406562, 10874278, 10732196, 10064032, 9751685, 9805462, 9572706]
2064I572706k68979m96421J1280n9433N9982l97604m41238r3661M05912p00210
2054G592334n73697k79319n8604j69775n2601n23159k42654M79241O40828q71591
2044E941003L1016J23532M01346j064432m14561J54962L07300n97901N38271K20978
2034E641514k50475j16086l53222m27451r361k63687J8186N77118p44554l46141
2024C725841J7583O29296m32877J91872L9647r01966k68138L66660m28786r72359
2014A966773M65644j45897O62660J634319m89616j101410l56746L35718K32739
2005C204184l95847o53102N4938Q13204K13482l84837j40226p28881J41354N86661
1995B710930j34269R244J48303n08246j85540K23965q06666j32604l16622O59602
$$ y = [9572706, 9303727, 8807306, 8818586, 8759153, 8819135, 8421531, 7980293, 7886632, 8292544, 7592334, 7018637, 6739318, 6680714, 6510939, 6458338, 5935179, 5692525, 6171766, 6812594, 5941003, 5972019, 6095551, 6496897, 5432465, 5017904, 5172866, 5480166, 4882265, 5420536, 5641514, 5391039, 5274953, 4921731, 4494280, 4484919, 4221232, 4239418, 4816536, 4071982, 3725841, 3743424, 4372720, 3939843, 4131715, 4171362, 3269396, 3001258, 3367918, 2939132, 1966773, 2432417, 2286520, 2949180, 4583499, 4093883, 2992473, 2635727, 2971445, 3204184, 2808337, 2155235, 2210173, 3023377, 3236859, 2852022, 2711796, 1982915, 2124269, 2710930, 2576661, 2585905, 2734208, 2225962, 2040422, 2264387, 1457721, 1325117, 1008495, 1668097]
1985A668097J101878K09389m29696j066980l3485R31019J77983l28097n52622
1976A677486n79567K62235m04508L30725k18560M7659M0964j51205J3975k41303
1966G77901K60531P53665M14855o44670p79184N09784n24873q37456P53997J94081
1956H78631k69404k18804J14309J30830J35721Q37421k5295l10862J28049r17953
1946D82643k95898j71208P9451J040861M98117k69046o2767r20145L24402M26613
1936A133023L91208j3028l76284o97094m53254Q0708o4250j81324m13104J190053
1926E96654J49596j96000J76386p1864m98045J43235j48008L11667R34990p2094
1916A326517o57485m95972O9824K67740q10690j38615Q02729J17242j620635P41155
$$ y = [1668097, 2769975, 2979364, 2549668, 1482688, 1449203, 2380222, 2558205, 2230108, 1677486, 1097919, 1360154, 955646, 1286371, 1067811, 1115470, 1156434, 1005229, 1019204, 777901, 1038432, 1792097, 2206952, 1562282, 783098, 1292882, 768009, -69447, 684550, 878631, 609227, 390423, 504732, 635562, 771283, 1608704, 1583409, 1272547, 1400596, 482643, 186745, 15537, 94988, 1135849, 1633966, 1364920, 1302153, 382008, 706410, 1133023, 1524231, 1511203, 1134919, 437825, -15429, 65279, 1029, -180295, -593399, 596654, 746250, 550250, 726636, 654772, 156727, 299962, 151954, 463621, 1398611, 1326517, 669032, 173060, 242884, 510624, -300066, -438681, 364048, 481290, -1139345, -398190]
1906c98190M14383M59589j61535m60868Q061J74696J002506q0991p40157N11341
1896G28835j430580P1735P85451l55873j73L8815R02423K60069k49464p24112
1886B7126J2939l18301j65851L56715M92193P44196n07215m64875J66544j06994
1876B36477q0379k56253R6893M51151J86880N61620m15585J7956p357J57156J77187
1865A125746j96190l7480Q94941L0534l83652O9828J22104J8209P28248M23593
1855B795881l91701l89361r55531j001461o51778J128428r6425M25424p19032
1846A44444Q4747m07817P92608m56964N03035N68762j56428m57372J92030j59586
1836F47459R3717k2655j04304L18519r14041l38479k3796R5488n74737J70237
$$ y = [-398190, 16193, 475782, 314247, -146621, -138560, 36136, 1038642, 957651, 217494, 728835, -701745, -630010, 155441, -200432, -200605, -161790, 740633, 1000702, 751238, 27126, 40065, -278236, -444087, -87372, 404821, 1149017, 641802, 176927, 343471, 236477, 156098, -100155, -3262, 447889, 634769, 1196389, 780804, 798760, 791403, 948559, 1125746, 929556, 892076, 1787017, 1817551, 1433899, 1503727, 1625831, 1644040, 2372288, 2795881, 2404180, 2014819, 1059288, 57827, -593951, 534477, 438052, 863476, 144444, 229191, -178626, 613982, 157018, 660053, 1228815, 1072387, 615015, 807045, 647459, 741176, 718521, 614217, 932736, 18695, -319784, -343580, -248092, -822829, -652592]
1826f52592O2653o21745O64260Q7715k18481M49407N57947l802k14067N60301
1816F71596R7537q22945J03058o3329j441579J092746J278935L49373J60972j2031
1806A414333l12604j95409O48174q10743q72917K13169n4191J38067l39617L44147
1796A72409n8064n64027m36493r8377J205136J50429n86238N75066J57939N11219
1786A028999m85272j114365K34348l95685J87103Q38884N39246p18821o64393
1777e49956J55468J36730K36835k47490N75151P28948kn02281o23357l59390k04667
1766f54011N9844J55970l07201m9165R30331q889j22075J92040J35344O34851
1756I67039o53919n8927N54637J95529k79564j601100O18221M46372N7952m77952
$$ y = [-652592, -589939, -1211684, -547424, -459709, -678190, -228783, 329164, 325362, 111295, 671596, 769133, -53812, 49246, -14083, -1455662, -362916, 916019, 1265392, 1426364, 1414333, 1101729, 906320, 1554494, 743751, -129166, 84003, 29812, 167879, -171738, 172409, 114345, -449682, -886175, -984552, 220584, 371013, -215225, 359841, 517780, 1028999, 543727, -570638, -336290, -731975, -544872, 294012, 833258, 114437, -549956, -394488, -257758, -20923, -268413, 306738, 1035686, 1035684, 533403, -89954, -449344, -654011, -594167, -438197, -745398, -794563, 135768, 126879, 4804, 196844, 332188, 967039, 313120, 254193, 808830, 1004359, 724795, -876305, -258084, 188288, 246240, -231712]
1746b31712N62311j00675j92390k16913K65635j29630l96990j24833K43632k77895
1736e99460J11433J055833o5223m72402o84628M87476o93341L03823p8314O752
1726f28051m26896R15436L45134J32634j71352l03317M0634l07941n3563J61259
1716b96023N22341L1221m4856N41855n82667O12603n49890n01677O29962K22953
1706E85822o52429n40880R5971O57476M48800l33924l36523R1750j9351l35639
1696c38927J47187N66719J01527L46670J90254m12538m72257o52082K9685L46114
1686a47648p91893k60258R07566n78561N19008J77099M12621j57775N3456P81637
1676I15252o38230k04440l69421K60589k08388l96680q33703j24841j65651Q49889
$$ y = [-231712, 330599, 229924, 37534, -179379, 86256, -43374, -440364, -565197, -321565, -599460, -488027, 567806, 502583, 30181, -654447, -166971, -860312, -556489, -634803, -628051, -1054947, -139511, 205623, 338257, 166905, -136412, -95778, -403719, -457282, -296023, 226318, 257539, 212683, 754538, 171871, 784474, 234584, -267093, 362869, 585822, -66607, -607487, -511516, 145960, 594760, 260836, -75687, 16063, -3288, -338927, -191740, 374979, 476506, 823176, 1013430, 600892, 128635, -523447, -493762, -147648, -939541, -1199799, -292233, -870794, -351786, -174687, 237934, 80159, 133615, 915252, 277022, 72582, -296839, -36250, -244638, -641318, -1475021, -1599862, -1765513, -915624]
1666i15624L83600m76150O27300L13038L61167O3909L26362r25179m76462K22508
1656d95531J33787N0709l11740P69228J10203p80911L91905Q48880k63488L6992
1646D90034J24682r4271k86074k34531m50437m83485N78782J917R76236j62038
1636D60815l07516l596K25463K99277l61453k36367M46458n33297m79083o46291
1626a135590P06553M96594O95927o09034j003962j05751n71978L40701j50678
1617a337218Q01824o73704J10057L08375M81508K54718l6753K44129K62334N22027
1607I37297r7350J5349j079546J87533o25827j42966L1733J066559j21700N38110
1597G09192m83460j44799r8333J034736l0111r23231L56984n74112K91975M051
$$ y = [-915624, -532024, -1008174, -380874, -67836, 293331, 357240, 683602, -241577, -718039, -495531, -361744, -311035, -622775, 146453, 256656, -524255, -132350, 716530, 453042, 490034, 614716, 520445, 234371, -160, -450597, -934082, -355300, -353383, 622853, 460815, 153299, 149703, 375166, 674443, 312990, 76623, 523081, -10216, -489299, -1135590, -429037, 67557, 763484, 154450, -849512, -955263, -1527241, -1186540, -1337218, -535394, -1209098, -1099041, -790666, -309158, -54440, -91193, 152936, 415270, 937297, 839947, 855296, -224250, -36717, -662544, -805510, -773777, 292782, 171082, 709192, 225732, 80933, -17400, 1017336, 987225, 63994, 420978, -153134, 138841, 142892]
1587A42892j55693O36385k3073l16759k46974K56604n18018n43061Q24555K6806
1577H3664o34688j32012L77441K76160J22926j80787K17845j175532r71566N12318
1567a504231J138196n72670R06336K92691o78700j312453J524703j4763o18610
1558h39501l01370N79173k2943p93062M22801j05169J008845O77686J27545m14919
1548C39086p5479k19390l65121K33240n63843N9661P29954K47106j17036K47478
1538E15656l35488K86139m9071l28907K40734j367278L04962O45226j50212j72632
1528d10871J07773J053069q03874n99911l17134O44551J117834m15766J87484
1519E63155l46054m27907K05106L44027j28587m42532j420j32103k38752K043
$$ y = [142892, -12801, 623584, 600511, 283752, 36778, 293382, -224636, -767697, 56858, 83664, -551024, -683036, -305595, -29435, 93491, -87296, 130549, -1044983, -2016549, -1504231, -366035, -938705, -32369, 260322, -418378, -1730831, -206128, -220891, -839501, -1140871, -561698, -584641, -1377703, -954902, -1060071, -51226, 626460, 754005, 339086, 263607, 44217, -320904, -87664, -651507, -591846, 138108, 385214, 268178, 515656, 180168, 466307, 417236, 88329, 329063, -1038215, -733253, -88027, -238239, -410871, -303098, 749971, -53903, -653814, -970948, -326397, 791437, 375671, 563155, 217101, -210806, -5700, 338327, 209740, -232792, -234212, -366315, -605067, -603024]
1509f03024L65596L47412l01333r6785j30484O19251j92001M9777q24k06002J95158
1498D6741J49307Q78188j023996m568Q4483m078n77228l2847O69937r4181J70582
1487B62340L04663k085j57533o72468K18914o4488N929Q7782j60159k46362M7790
1476c75677k7822K07258K68052j70889J002688j51641P0712N5107j11227j015251
1466b48690p78566K35239J8646l7434M68411M66802O14702l54933k42931m94972
1456c53726l48083j39717P81530M76693j55982q01224J099971L92141l81455r13126
1446c42978q53633P23212K72519O1703m3152K22233Q80632m97022n86677K38416
1436G5253m11240k20616k9237j45867o69882M80919M68627k8041n9797L0680Q15715
$$ y = [-603024, -237428, 109984, -191349, -288134, -418618, 200633, 8632, 58409, 57585, -148417, 46741, 196048, 1074236, 50240, 45672, 130155, 126077, -451151, -483998, 185939, 91758, 262340, 567003, 564918, 407385, -265083, -46169, -110657, -104728, -16946, -177105, -423467, -375677, -403499, -196241, 71811, -99078, 903610, 751969, 822681, 877788, 766561, -248690, -1027256, -792017, -773371, -810805, -342394, 124408, 739110, 384177, 141246, -353726, -701809, -841526, -59996, 416697, 260715, -540509, 559462, 951603, 570148, -342978, -1196611, -473399, -200880, -139177, -182329, 39904, 920536, 423514, -163163, 75253, -335987, -556603, -585840, -731707, -1401589, -920670, -452043, -480084, -539881, -509201, 306514]
1425C06514Q38129n29167J40580o83724r26982R8077J012665K11429o17490q11947
1415i61916l38862P32428P10907P31625m74280j85269l82221n30262M5100N36749
1405a16001K27663J84575r01117j13J065548l43629m3017o34999o2996M01580
1395b22506k48080k77419p55803N51980M51917M45921K41126k91126p81124n38681
1385a423795P59147Q75796M32737M2531l36480j442974J96769P95955k9824l12417
1375d42555K95491Q24197N65688m8633j87941k43637k36697p62858k39673K70860
1365b05758l35392j10412L59758q5066K59454J17289n33150m9202L47947M7140
1355a87392k60492J87683K90978J64500N98848k09593M1408l54808l60644O8081
$$ y = [306514, 1144643, 615476, 756056, 72332, -854650, -756573, 256092, 467521, -149969, -961916, -1300778, -568350, 142557, 874182, 399902, 214633, -167588, -697850, -652750, -116001, 111662, 296237, -604880, -604993, 460555, 116926, 73909, -561090, -624086, -222506, -470586, -748005, -1503808, -951828, -499911, -53990, 187136, -103990, -885114, -1423795, -664648, 211148, 643885, 686416, 349936, -1093038, -896269, -100314, -130138, -442555, -147064, 677133, 1242821, 1194188, 1006247, 762610, 525913, -236945, -476618, -205758, -541150, -651562, -291804, -376870, -117416, -127, -533277, -582479, -234532, -187392, -447884, -260201, 30777, 195277, 794125, 584532, 625940, 271132, -89512, -21431]
1345b1431m47994J6956K51343O32781p41906l78472j34143J42070J45687k26465
1335g61574J058078m59147m31095Q04847J10571M90723J17137r39672J28051J38359
1325B56278k83493o96172J54189Q71767n1580K11294j12364K85547K90123j234272
1315c08683p11524J71021M20179o5650J67843J61938M22103M68068o1547m16717
1305B47031k14117M72820P71551o33526j013846K32714L53413j17752m03310m75072
1295g80094N4485M93045J62604n66631O7219L57005L52840L50429o74991J00422
1285h3667p59893Q85288J94189p5091K87266j453852M46985M85042j73726O91587
1275D44128r95484K00797j67966M9343M16079p9645j65143J08678o7875J92030
$$ y = [-21431, -469425, -452469, -201126, 431655, -310251, -688723, -822866, -680796, -535109, -761574, 296504, -162643, -593738, 211109, 321680, 812403, 929540, -10132, 117919, 256278, -27215, -723387, -569198, 302569, 250989, 462283, 349919, 635466, 925589, -308683, -1020207, -849186, -429007, -494657, -326814, -164876, 257227, 725295, 663748, 247031, 32914, 505734, 1277285, 643759, -370087, -137373, 216040, 98288, -305022, -780094, -725609, -232564, -69960, -636591, -569372, -212367, 140473, 490902, -184089, -83667, -843560, 41728, 235917, 160826, 448092, -1005760, -558775, -73733, -247459, 444128, -551356, -350559, -518525, -469182, -53103, -132748, -297891, -189213, -257088, -65058]
1265f5058L94883j52056K3295j81216l40300J55880R0432N76700j47106r90972
1255f35518J24096p94698Q53914M44882l15024p82833N93804j64686J190499L79956
1245H94392p6835n72454k77081n43346n70814J48157L75486L91535k30196k33160
1235f94316M41599O73683n10623Q92954j097534k0234L74264l65961n4522Q7691
1225b72999L67325k9547r29020O42910L3883n90268K99590L96625Q83841l74286
1215D28054j182473r6061J79818J277063k77560r92602j25509J90238p27109Q10318
1205e15823L28488J32122J34583l4149K85253m90672M93301K12563K25595q35210
1195f3949R4960n1457K14761L44395q72656J35291q36640n9235O47848q47725
$$ y = [-65058, 329825, 177769, 201064, 19848, -320452, -164572, -74140, 502560, 355454, -635518, -511422, -1306120, -452206, -7324, -322348, -1105181, -511377, -676063, 514436, 894392, 817557, 245103, -31978, -575324, -1146138, -997981, -622495, -230960, -461156, -694316, -252717, 420966, -89657, 803297, -294237, -314471, 59793, -306168, -360690, -272999, 94326, 64779, -864241, -221331, -187448, -777716, -478126, -81501, 802340, 428054, -754419, -850480, -670662, 606401, 328841, -663761, -789270, -599032, -1326141, -515823, -187335, -55213, 79370, 45221, 330474, -160198, 333103, 545666, 771261, -63949, 31011, -20446, 194315, 538710, -333946, -198655, -1035295, -1094530, -446682, -1294407]
1185a294407M72069Q99462j3256o12533L58091L84277l68344j06830P3659M38528
1175B30716j37428p72201o62745K94380L82093l10125K11184O72470N85794j17852
1165C76286p7950k81070l15295L37413j96625l93719L53396j19030k95699R0563
1155e21730j34251j14845Q2104P46584j36347k15463l43236M31033J84815l31969
1145c53305o26182M45809O51745J07046M10130j17296n39465q56110K76423L85425
1135b15780J039922j128943J53859K88318N27847k89967J52768n36445o56206
1126f64627N00162J37873r5662N3042l29111Q3984k58515J58145Q9699R9562L84868
1115A59420n70339l97096J63770K16552k45387J94550o69799L66040J232217P2047
$$ y = [-1294407, -822338, 77124, 63868, -548665, -190574, 193703, -174641, -281471, -207812, 230716, 93288, -678913, -1341658, -1047278, -665185, -975310, -764126, -91656, 494138, 376286, 298336, 17266, -298029, 39384, -157241, -550960, -197564, -316594, -612293, -521730, -655981, -770826, -688722, 57862, -78485, -293948, -637184, -206151, -21336, -353305, -979487, -533678, 118067, 225113, 635243, 517947, -21518, -877628, -601205, -215780, 824142, -304801, -150942, 137376, 665223, 375256, 528024, -8421, -664627, -164465, -26592, -122254, -69212, -398323, -314339, -572854, -414709, -325010, -225448, 159420, -410919, -808015, -644245, -427693, -673080, -478530, -1148329, -782289, 449928, 521975]
1105E21975M31279j034673K28364P4340j14498K92745o56922r7260N6531N87154
1095B89035J45821J02075L34171m41667p03423J42592R045N56973j14756n09475
1085a89609K66416P32527r8116N04701n08930J91540k3639q8825l00969K5633
1075E10729m29047o64816k92824J62351R85852J36014q52347r8946J86091L45860
1065a1083M52913m63648m41464N71024n14073M66695K71738p34855q28402K52267
1055i78888P72577L47063L92032o13519L57591M07660L4731l518j003920m85355
1045g73546O44234j97831M37904j0324l2780M044p05957P11336q474j1818L1338
1034H8126k50343j48201l36970O6092L37360O03664j47864l25638m31198m27357
$$ y = [521975, 953254, -81419, 146945, 221285, 106787, 399532, -257390, -354650, -298119, 289035, 434856, 536931, 871102, 429435, -273988, -131396, -122351, 434622, 319866, -189609, 76807, 809334, 711218, 1215919, 706989, 898529, 874890, 786065, 485096, 510729, 81682, -583134, -875958, -713607, 272245, 408259, -444088, -543034, -356943, -11083, 441830, -21818, -463282, 107742, -406331, 60364, 332102, -402753, -1231155, -978888, -206311, 140752, 532784, -80735, 276856, 684516, 719247, 715729, -288191, -773546, -129312, -327143, 110761, 100437, 67657, 71701, -634256, 77080, 68606, 56788, 88126, -162217, -310418, -647388, -581296, -243936, 359728, 211864, -113774, -544972, -972329]
1024i72329J233816P65131o42949L35894L46522k15832j83437k74275L88461k1074
1014G59928n17972n21782M64575k11296K65462L26634l18936j01706J89110q5049
1004B48968M97833K01942k9537n81324j04606J64276O07625m37619j39175O1081
994D89464m58940J54415o3510K80670R6758j111487k16592P96538R5633R5308
984A58257o67651J16895j38648L24732n30928L56673K67947J37905L85351J2480
974D23013o39168N23326M16093L46584k05683m51766p79978R17998n56533j85755
964a91869r05924M67661K70421L08951L66198P0205K25859q0370K08651p37720
954B063m20470L9884K23469m04024j33074J297859j6234n67957N72478n49134
$$ y = [-972329, 261487, 1026618, 383669, 719563, 1066085, 850253, 666816, 392541, 781002, 759928, 241956, -279826, 184749, -26547, 238915, 565549, 246613, 144907, 334017, 248968, 746801, 948743, 919206, 337882, 233276, 397552, 1005177, 567558, 428383, 489464, 30524, 184939, 121429, 402099, 498857, -612630, -829222, -32684, 62949, 158257, -509394, -392499, -531147, -206415, -737343, -380670, -112723, 25182, 410533, 423013, -216155, 307171, 723264, 1069848, 864165, 412399, -367579, 550419, -6114, -191869, -1097793, -630132, -359711, -50760, 315438, 385643, 611502, 531132, 739783, 2063, -418407, -378523, -155054, -559078, -692152, 605707, 589473, 21516, 593994, 44860]
944D4860P96228L33105j049656j55252j42136M48988k75941j93000n66053K775
934g56082R24883j13860q58066j84577p405N67589J544648o58497n10567k27050
924b78984J74169l72444j44001K66523Q5950J80445o6429Q16742l83386j151959
914h73374M49853K28613j96512R7503l29381o32464N4210Q89356M52832m65199
904c24563n822K12222J01348k72341J72147K96854N19383n80982Q6020l11500
894a07234N41726K45213o25613k48402j05861K3410O99140n76506J49194K65835
884B60902M8646n1100j331033M025j12882O39555J00314L75300P30484q70693
874b06482k60958k03702L36412k26632J55388k95304O75093L27991R771j040137
$$ y = [44860, 841088, 1174193, 124537, -30715, -172851, 276137, 196, -192804, -758857, -756082, 168801, 54941, -803125, -987702, -995107, -427518, 1117130, 458633, -51934, -278984, -104815, -477259, -621260, -354737, -268787, -88342, -154771, 661971, 278585, -873374, -423521, -194908, -391420, -293917, -623298, -1255762, -1201552, -312196, 140636, -324563, -330385, -118163, -16815, -289156, -117009, 179845, 699228, 118246, 204266, -107234, 434492, 679705, 54092, -194310, -300171, -276761, 422379, -154127, -4933, 260902, 309548, 258448, -1072585, -1068560, -1181442, -541887, -441573, -66273, 664211, -206482, -467440, -671142, -334730, -561362, -405974, -701278, -26185, 301806, 311577, -728560]
864g28560K6314n72164O03060P69008k05038P8256J42554J4630J70716j2915j228499
853i42638L09062Q15191K48943m59203n7243m15892q5804j66884K21189K29787
843c03492P41726J52654n64393k52246L79275l28336j38543M01680l1189L49104
833D06240L5607k39006J26516P53186q87467r76417M65567m13698r8811L60712
823d67571M64285p17448O73727O18122n53337J007435k2911q42899m75857k10492
813e26946l11540N01072n18744M72938L76918p37114M25513J92793l08374q6856
803e20340L12819P55882k66216k8197K30021o95067O7931k21561R16513k37305
793C14480L87990m80196J22065o61975K05863j12105m46819N13237r4771K96302
$$ y = [-728560, -702246, -1274410, -671350, 97658, -107380, -29124, 113430, 128060, 298776, 285861, -942638, -633576, 181615, 430558, -28645, -85888, -501780, -587584, -754468, -533279, -303492, 438234, 590888, 26495, -225751, 153524, -174812, -313355, 88325, 57136, 406240, 441847, 202841, 329357, 1082543, 195076, -781341, -315774, -729472, -828283, -467571, -3286, -720734, -47007, 571115, 17778, 1025213, 1002302, 159403, -316454, -526946, -838486, -337414, -856158, -383220, -6302, -743416, -317903, -125110, -433484, -520340, -207521, 548361, 282145, 253948, 483969, -211098, -143167, -364728, 551785, 314480, 702470, 222274, 344339, -317636, -111773, -223878, -670697, -157460, -252231, 44071]
783D4071K99871J08826L24993o17168k85163K97810R27572j330693m42283j06966
773g79130n54158O09849L97237K92008Q02272k34949q61192n89950k0500Q82198
763e6315O43657m05003L9053l47638L61583j05156k3753j83280l22760q7903Q3062
752d04453l72695N07465L81259j79679N6676j93345L8820q25202L88333J93514
742d09307J03245n68338Q64837K75372N47753M97909o54634j104402K69947O57425
732D79807M42084j176571P11882K07605l05499m12243j41054l12549L73604k99651
722d32585M04116K99888L88795M62515q35148k16424P53800j724645K10671P56381
712F7364j043518O17603j89020p949J05995J055682k75507j039199L21653j18472
$$ y = [44071, 343942, 452768, 777761, 160593, -124570, 173240, 1100812, -229881, -672164, -779130, -1333288, -723439, -326202, -34194, 768078, 533129, -328063, -918013, -938513, -56315, 587342, 182339, 221392, -126246, 235337, 130181, 106428, -76852, -399612, -487515, -404453, -777148, -269683, 111576, -68103, -11427, -204772, -165952, -991154, -602821, -409307, -306062, -874400, -9563, 265809, 813562, 1311471, 656837, -447565, -177618, 479807, 921891, -254680, 457202, 664807, 359308, -52935, -193989, -506538, -132934, -432585, -28469, 271419, 660214, 1122729, 287581, 71157, 824957, -899688, -689017, 67364, -976154, -358551, -547571, -555520, -449525, 606157, 330650, -708549, -386896, -505368]
702e05368j88690R27299J31034l41027P3066J56589L1894j8889n27859L99945
692A37994L6797n15161k83530J87563K13725N4290N90328M9991n8797l14583J69678
681B68295M72256n46271k24092J50336R6567N30759j35153q16725m8193J26670
671a25551J32714J33547r5993N59820N19204o87860n59546n34042N45780K35667
661A23740k73441n2596j01289O55077r3829m31819K96789l45290r73357O89447
651e06568L04799K93181q56408p747M6989k40475K94165j61424O78218Q28077
641F72807o2015J9619r50870m89005M44465O29922J6331O0395Q4824l01781n2002
630G2690j21531l0246P52603Q21125j005615n31606j98883K27379n68606K73825
$$ y = [-505368, -694058, 233241, 364275, 23248, 96314, 252903, 284797, 265908, -261951, 137994, 174791, -340370, -623900, -436337, -222612, -168322, 422006, 471997, 413200, 98617, 268295, 740551, 194280, -29812, 120524, 217091, 747850, 612697, -204028, -252221, -125551, 7163, 140710, 44717, 604537, 1123741, 435881, -123665, -657707, -111927, 123740, -149701, -202297, -303586, 351491, 257662, -174157, 122632, -222658, -1196015, -506568, -201769, 91412, -764996, -772743, -725754, -966229, -672064, -833488, -155270, 672807, 610792, 630411, -320459, -809464, -364999, 264923, 281254, 341649, 426473, 124692, 72690, -48841, -79087, 673516, 1494641, 489026, -42580, -241463, -14084, -582690, -308865]
620c08865J225380R2383l15169j081341k57358L65618K20450L25050j64976L78171
610D79343K34613K12595p37619L47433m98444j17234m55078O38214o72045J282960
600G14738L83334j518821o12502l78762J573781p9741R2763j52162k03199j00003
590b80574M8908m7855n18127m18778J33409P43142k26975N84490Q7367q2050n04948
579d81991j6642N54359J38500L19046j6994K05484M54330p62881j40480K64735
569E17466p54053R8336l66037k56998J069539Q23925M3442p5715m18844m64542
559B16519J68783l69040l95823K13932J99171l4794o8975R95604q43168q9242
549g033O61317p95312j19042M90689n52402R02304r7611p07155L84278K31593
$$ y = [-308865, 916515, 1008898, 693729, -387612, -644970, -279352, -58902, 266148, 101172, 479343, 713956, 926551, 188932, 536365, 37921, -79313, -534391, 103823, -568222, 714738, 1098072, -420749, -1033251, -1412013, 161768, 82027, 174790, 22628, -180571, -280574, -231666, -279521, -797648, -1216426, -1083017, -339875, -566850, 17640, 105007, 22957, -481991, -498633, 55726, 194226, 513272, 496278, 701762, 1156092, 393211, 252731, 517466, -236587, -138251, -504288, -761286, 308253, 1132178, 1175620, 1099905, 681061, 216519, 385302, 16262, -379561, -165629, 33542, -1252, -70227, 925377, 82209, -7033, 654284, -141028, -260070, 230619, -321783, 580521, 482910, -224245, 160033, 391626]
539C91626l03895N73960j06682k24710N02035J39656o4670J38467l09716m39219
529B96852m822k96435J37901L03859l25472J58195J86064o26375K16899k45798
519a99132J10839k99017L2865Q86695m96098l26297l06302K37288r9211L40842
509a17528L95073K54025r12372P5828k76226o16537K62915N95943R08759j48994
499D20886n8013J02189k64594q52527Q39910k93833p17548L85517k31332K16042
489d53303j43799K62106j85793j07890O67477l25548O65045M94782n93444o94937
479d15304j04315k5050l7103K75748k66608l78230O34649Q55732k46024P6549
469C70044j30900P1678o55000J73544O04371n91446N30746Q886q5160j138055
$$ y = [391626, 87731, 661691, 555009, 330299, 832334, 971990, 907320, 1045787, 736071, 296852, 292030, -4405, 133496, 437355, 111883, 270078, 456142, -170233, 46666, -199132, -88293, -387310, -354445, 532250, 36152, -290145, -596447, -359159, -458370, -117528, 277545, 531570, -380802, -304974, -581200, -1197737, -934822, -338879, 569880, 420886, 362873, 465062, 200468, -652059, 187851, -105982, -823530, -438013, -669345, -453303, -597102, -334996, -520789, -628679, 38798, -286750, 378295, 873077, 279633, -415304, -519619, -544669, -581772, -306024, -572632, -950862, -316213, 539519, 293495, 370044, 239144, 310822, -344178, -170634, 433737, -157709, 373037, 381923, 296763, -841292]
459h41292O32685n8840r37292M10286N00923K78564M30590k4248k49027N70835
449G13184n34008n14334J032106J32684j16648p70446L73963N33181m23693K7939
439D53928p49139k31573J66308J72233L76228l02758l55407o5477K00926Q14118
429D79387j37968q2759K46312J64267j091726N18952N09243q52042L81746J06835
419B42247m75975k60171o7556K00387L1213J65659J31494k64575P89545J8065
409E10333o54920l5658K80557l50664j62836p24853N01259J02939r54446P33046
399g55243P13655o4037o73765n00465O22636K30804J69513K76229m25303p23988
389a129964n16760L10566N44313J099517j72897Q1631M65802j35801m35908L12885
$$ y = [-841292, -208607, -267447, -1204739, -794453, -293530, -14966, 415624, 391376, 142349, 713184, 179176, -335158, 696948, 829632, 712984, -57462, 316501, 849682, 425989, 453928, -295211, -526784, -360476, -188243, 187985, -114773, -470180, -535657, -334731, 479387, 341419, 258660, 504972, 669239, -422487, 96465, 605708, -246334, 135412, 242247, -233728, -493899, -561455, -361068, -329855, -164196, -32702, -297277, 492268, 510333, -144587, -180245, 100312, -250352, -413188, -1138041, -636782, -533843, -1488289, -755243, -41588, -105625, -779390, -1279855, -657219, -426415, -256902, 19327, -405976, -1129964, -1646724, -1336158, -791845, 307672, 134775, 216406, 682208, 546407, 110499, 423384]
379D23384n11902q06428j39641O19381L1431P632k55339L53383q4204m32523O58902
368a35924l3102m62445k88065l02614L85443J108206J81897J04144q06980N40652
358B91212j99644n89724m68442L98484Q52314o63001K21844J123641k90360j072748
348c96424J14791n5514J047823p48763k16790j64124o05551n87547P66624K57361
338e88114k55459k87954o46559J315935R46183j22056m48665L30410J22257m21566
328e5588q18872P4470J26546M92109l75376R18898m58457l33335N69002q9536
318D9861m92802L56331l96737M49816O79962l9891j257595j76702J259652m17288
308A4607m88330m10400M49878k91087m80753L65773Q09767M4465M61726k4092
$$ y = [423384, -88518, -894946, -1034587, -415206, -383775, -376143, -631482, -278099, -362303, -794826, -135924, -169026, -631471, -919536, -1222150, -836707, 271499, 453396, 557540, -249440, 291212, 91568, -498156, -966598, -568114, 284200, -378801, -156957, 966684, 676324, -396424, -281633, -337147, 710676, -38087, -254877, -419001, -1024552, -1612099, -845475, -588114, -843573, -1131527, -1778086, -462151, 484032, 361976, -86689, 243721, 365978, -55588, -874460, -799990, -673444, -181335, -556711, 362187, -96270, -429605, 139397, 49861, -442941, -86610, -483347, -33531, 646431, 606540, -651055, -827757, 431895, 14607, -473723, -884123, -434245, -725332, -1206085, -840312, -30545, 13920, 475646, 451554]
298D51554q83122p04697M7690M2303J67209p7449l49492K0717Q07425J83614m26485
287g20733M8936o77485R0604K49509J46830P33307n47602L554M76077N66137P5578
276D44712p30984J71770n47874o32937K71840K42697L73105M25421o78484r27455
266a588189J239074M43306l11995k1794N42922n04039J73612m66405k0804K44365
256b69947m13691K56916l52795N69657p65410k01957Q59336K02601M57311k84496
246E7525l9193q56599M24530l0873j32015O98704n45222L82223M23981p43351
236c60290j084962N84346q7808O05788j56404O87873L12014l42778l67631n2475
226b62327M03941l62772k5672o8296K07339O91580k26582m9250l8154k63998J15662
$$ y = [451554, -431568, -1136265, -1088575, -1046272, -879063, -956512, -1306004, -1285287, -477862, -294248, -720733, -671797, -1349282, -1258678, -1009169, -862339, -129032, -676634, -673080, -197003, 369134, 444712, -286272, -114502, -662376, -1295313, -1023473, -780776, -407671, 17750, -660734, -1588189, -349115, 94191, -217804, -239598, 303324, -200715, -27103, -493508, -514312, -269947, -683638, -426722, -779517, -209860, -975270, -1177227, -317891, -115290, 342021, 57525, 18332, -838267, -413737, -444610, -576625, 122079, -423143, -40920, 383061, -360290, -1445252, -860906, -948714, -342926, -499330, 188543, 500557, 157779, -209852, -262327, 141614, -221158, -246830, -315126, -107787, 583793, 357211, 307961, 269807, 5809, 121471]
215A21471k59701k94902o85944R5045L84425K08377m83883k75086N8859O5284
205a066055N64485Q6808N8915l98328O76463R8601l65178m58636M08734P37250
195C43059m81717q29300l27503M30212J13884K49537O18814K39236r94013L72426
185b65365O13058l46729l60871j03791L31622J71259o55297L15505j93265k86145
175g80019O81573j39842l62511L35529N03278j74874j4922m4831o69573O0019
165f06173J35164J30713J11491l76069k21168L37191L15456J08742k11850J046709
155G70206P8845m29314K12664n96109m33186L61230P1696k962k14523n60349j1256
144g53058k6343M43698J51564l91199q8734K52576k80312m48895O853J024683
$$ y = [121471, -138230, -433132, -1119076, -1024031, -639606, -431229, -915112, -1190198, -1131339, -1066055, -501570, -414762, -355847, -754175, -77712, 20889, -344289, -802925, -394191, 343059, -138658, -967958, -1295461, -865249, -751365, -501828, 116986, 356222, -637791, -265365, 347693, 964, -359907, -463698, -132076, 39183, -616114, -300609, -493874, -780019, -98446, -238288, -600799, -265270, 238008, 63134, 48212, 3381, -666192, -606173, -471009, -340296, -228805, -604874, -826042, -488851, -173395, -64653, -276503, 770206, 849051, 419737, 632401, 36292, -396894, -35664, 36032, 33070, -181453, -741802, -753058, -779401, -335703, -184139, -575338, -664072, -411496, -691808, -1140703, -1133850, -109167]
134a09167K39585K59475J44o40299m69825p15647L74998R95171q3029k80660R40923
123E11669q70995k4974K28217J23754K86784p60975k19959L85435o52141N50392
113d42793j94684k04864J06945j95117R66953M3178k69094r6193J57023n20234
103f48880P11843N85200r13837m02546Q0286N36558Q459o19745O77314l01741
93b87089o41672M50341L32876n81011P9710K31807l56363m48729K12163P07587
83c00380O08367J29044p9596k21794p6266k57378M81098p19604n28757O99208
73b66058l96151j55545O6519L16006P8933k19146J68574K98741l343o8553J62493
62a7530o37582q9988P6299L44973Q56898k82925L6640m80656q61524J65460K6399
$$ y = [-109167, 130418, 389893, 390037, -250262, -720087, -1435734, -1060736, -65565, -148594, -429254, 511669, -359326, -384300, -156083, -32329, 254455, -506520, -726479, -341044, -993185, -442793, -637477, -842341, -735396, -930513, 36440, 79618, -189476, -285669, -128646, -648880, 62963, 648163, -265674, -668220, -587934, -51376, -42917, -662662, 14652, -287089, -928761, -478420, -145544, -726555, -646845, -415038, -771401, -1220130, -1007967, -300380, 307987, 437031, 357435, 135641, 59375, -198003, 283095, -436509, -965266, -266058, -662209, -817754, -751235, -435229, -356296, -575442, -406868, -108127, -111470, -180023, -17530, -655112, -745100, -668801, -323828, 533070, 250145, 286785, -193871, -1055395, -889935, -863536]
$$ [...]
##END NTUPLES=NMR SPECTRUM
##END=
