##TITLE=1H_CA-8979-4
 CDCl3
 8 sc, 
 10.03.2022
##JCAMPDX= 6.0         $$ Bruker NMR JCAMP-DX V2.0
##DATA TYPE= NMR SPECTRUM
##DATA CLASS= NTUPLES
##ORIGIN= UXNMR, Bruker Analytische Messtechnik GmbH
##OWNER= root
$$ XWIN-NMR		Version 3.5
$$ Thu Mar 10 12:13:16 2022 Russian Standard Time (UT+4h)  she@DPX200
##.OBSERVE FREQUENCY= 200.131346
##.OBSERVE NUCLEUS= ^1H
##.ACQUISITION MODE= SIMULTANEOUS
##.ACQUISITION SCHEME= undefined
##.AVERAGES= 8
##.DIGITISER RES= 18
##SPECTROMETER/DATA SYSTEM= spect
##.PULSE SEQUENCE= zg30
##.SOLVENT NAME= CDCl3
##.SHIFT REFERENCE= (INTERNAL, CDCl3, 0, 15.7149)
##AUDIT TRAIL= $$ (NUMBER, WHEN, WHO, WHERE, WHAT)
$$ ##TITLE= Audit trail, XWIN-NMR		Version 3.5
$$ ##JCAMPDX= 5.01
$$ ##ORIGIN= Bruker BioSpin GmbH
$$ ##OWNER= she
$$ F:/spectra/data/she/nmr/H-F/1/pdata/1/auditp.txt
$$ ##AUDIT TRAIL=  $$ (NUMBER, WHEN, WHO, WHERE, WHAT)
(   1,<2022-03-10 12:11:58.65 +0400>,<she>,<DPX200>,
      <created by zg, POWCHK disabled, PULCHK disabled
       configuration hash MD5:
       00 E9 B6 7A A2 85 ED C7 34 08 36 98 17 FE 4E 26
       data hash MD5: 16K
       C6 74 36 ED B4 84 2C 51 BF 3E 82 D7 28 31 20 E2>)
(   2,<2022-03-10 12:12:01.01 +0400>,<she>,<DPX200>,
      <Start of raw data processing
       efp BC_mod = 2 LB = 0.24 FT_mod = 6 PKNL = 1 PHC0 = -16596.34 PHC1 = 22.80078 SI = 16K 
       data hash MD5: 16K
       B9 18 3C 27 75 B0 9D AE 1E 95 7D C2 11 61 79 EC>)
(   3,<2022-03-10 12:12:22.35 +0400>,<she>,<DPX200>,
      <pk PHC0 = 9.723925 PHC1 = -14.6 
       data hash MD5: 16K
       00 49 A6 5F D3 8F AE 18 D4 7C 34 38 22 D4 BF 52>)
(   4,<2022-03-10 12:12:25.67 +0400>,<she>,<DPX200>,
      <abs ABSG = 5 
       data hash MD5: 16K
       1D 09 F6 78 41 95 21 C2 2B 9F 8D E0 E1 6F 19 F2>)
$$ ##END=
$$ 
$$ hash MD5
$$ F8 35 53 0A 0F C6 FA E8 F3 3E A8 AC F3 A6 0E BC
##$RELAX= 
##$RELAX= 
##$RELAX= 
##$RELAX= 
##$RELAX= 
##$RELAX= 
$$ Bruker specific parameters
$$ --------------------------
##$DU= <F:/spectra>
##$EXPNO= 1
##$NAME= <H-F>
##$PROCNO= 1
##$TYPE= <nmr>
##$USER= <she>
##$AMP= (0..31)
100 100 100 100 100 100 100 100 100 100 100 100 100 100 100 100 100 100 
100 100 100 100 100 100 100 100 100 100 100 100 100 100 
##$AQSEQ= 0
##$AQ_mod= 1
##$AUNM= <au_zg>
##$AUTOPOS= <>
##$BF1= 200.13
##$BF2= 200.13
##$BF3= 200.13
##$BF4= 200.13
##$BF5= 200.13
##$BF6= 200.13
##$BF7= 200.13
##$BF8= 200.13
##$BYTORDA= 1
##$CFDGTYP= 0
##$CFRGTYP= 5
##$CHEMSTR= <none>
##$CNST= (0..31)
1 1 145 1 1 1 1 1 1 1 1 1 1 1 1 1 1 1 1 1 1 1 1 1 1 1 1 1 1 1 1 1 
##$CPDPRG= <>
##$CPDPRG1= <>
##$CPDPRG2= <>
##$CPDPRG3= <>
##$CPDPRG4= <mlev>
##$CPDPRG5= <mlev>
##$CPDPRG6= <mlev>
##$CPDPRG7= <mlev>
##$CPDPRG8= <mlev>
##$CPDPRGB= <>
##$CPDPRGT= <>
##$D= (0..31)
0 1.2 0 0 0 0 0 0 0 0.06 0 0.03 0 0 0 0 0.0002 0 0 0 0 0 0 0 0 0 0 0 0 
0 0 0 
##$DATE= 1646899918
##$DBL= (0..7)
120 120 120 120 120 120 120 120 
##$DBP= (0..7)
150 150 150 150 150 150 150 150 
##$DBP07= 0
##$DBPNAM0= <>
##$DBPNAM1= <>
##$DBPNAM2= <>
##$DBPNAM3= <>
##$DBPNAM4= <>
$$ [...]
##$SUBNAM2= <"">
##$SUBNAM3= <"">
##$SUBNAM4= <"">
##$SUBNAM5= <"">
##$SUBNAM6= <"">
##$SUBNAM7= <"">
##$SUBNAM8= <"">
##$SUBNAM9= <"">
##$SW= 18.0517287032376
##$SWIBOX= (0..15)
0 0 2 0 0 0 0 0 0 0 0 0 0 0 0 0 
##$SW_h= 3612.71676300578
##$TD= 16384
##$TD0= 1
##$TE= 0
##$TE2= 300
##$TE3= 300
##$TEG= 300
##$TL= (0..7)
0 120 120 120 120 120 120 120 
##$TP= (0..7)
150 150 150 150 150 150 150 150 
##$TP07= 0
##$TPNAME0= <>
##$TPNAME1= <>
##$TPNAME2= <>
##$TPNAME3= <>
##$TPNAME4= <>
##$TPNAME5= <>
##$TPNAME6= <>
##$TPNAME7= <>
##$TPOAL= (0..7)
0.5 0.5 0.5 0.5 0.5 0.5 0.5 0.5 
##$TPOFFS= (0..7)
0 0 0 0 0 0 0 0 
##$TUNHIN= 0
##$TUNHOUT= 0
##$TUNXOUT= 0
##$USERA1= <user>
##$USERA2= <user>
##$USERA3= <user>
##$USERA4= <user>
##$USERA5= <user>
##$V9= 5
##$VALIST= <valist>
##$VCLIST= <CCCCCCCCCCCCCCC>
##$VD= 0
##$VDLIST= <DDDDDDDDDDDDDDD>
##$VPLIST= <PPPPPPPPPPPPPPP>
##$VTLIST= <TTTTTTTTTTTTTTT>
##$WBST= 1024
##$WBSW= 4
##$XGAIN= (0..3)
0 0 0 0 
##$XL= 0
##$YL= 0
##$YMAX_a= 95804
##$YMIN_a= -97345
##$ZGOPTNS= <>
##$ZL1= 120
##$ZL2= 120
##$ZL3= 120
##$ZL4= 120
##$ABSF1= 15.64552
##$ABSF2= -2.406327
##$ABSG= 5
##$ABSL= 3
##$ALPHA= 0
##$AQORDER= 0
##$ASSFAC= 0
##$ASSFACI= 0
##$ASSFACX= 0
##$ASSWID= 0
##$AUNMP= <proc_1d>
##$AZFE= 0.1
##$AZFW= 0.1
##$BCFW= 0
##$BC_mod= 2
##$BYTORDP= 0
##$COROFFS= 0
##$CY= -3
##$DATMOD= 1
##$DC= 0
##$DFILT= <>
##$DTYPP= 0
##$F1P= 0
##$F2P= 0
##$FCOR= 1
##$FTSIZE= 16384
##$FT_mod= 6
##$GAMMA= 0
##$GB= 0
##$INTBC= 1
##$INTSCL= 0
##$ISEN= 128
##$LB= 0.24
##$LEV0= 0
##$LPBIN= 0
##$MAXI= 10000
##$MC2= 0
##$MEAN= 0
##$ME_mod= 0
##$MI= 1.114404
##$NCOEF= 0
##$NC_proc= -7
##$NLEV= 6
##$NOISF1= 3.799351
##$NOISF2= 2.8
##$NSP= 0
##$NTH_PI= 0
##$NZP= 0
##$OFFSET= 15.71494
##$PC= 1
##$PHC0= -16586.62
##$PHC1= 8.200779
##$PH_mod= 1
##$PKNL= yes
##$PPARMOD= 0
##$PSCAL= 0
##$PSIGN= 0
##$REVERSE= no
##$SF= 200.130007327342
##$SI= 16384
##$SIGF1= 3
##$SIGF2= 2
##$SINO= 5.538805
##$SIOLD= 16384
##$SREGLST= <1H.CDCl3>
##$SSB= 0
##$STSI= 16384
##$STSR= 0
##$SW_p= 3612.71676300578
##$SYMM= 0
##$S_DEV= 0
##$TDeff= 16384
##$TDoff= 0
##$TI= <>
##$TILT= no
##$TM1= 0
##$TM2= 0
##$TOPLEV= 0
##$USERP1= <user>
##$USERP2= <user>
##$USERP3= <user>
##$USERP4= <user>
##$USERP5= <user>
##$WDW= 1
##$XDIM= 16384
##$YMAX_p= 496271357
##$YMIN_p= -571524
$$ End of Bruker specific parameters
$$ ---------------------------------
##NTUPLES= NMR SPECTRUM
##VAR_NAME=  FREQUENCY,     SPECTRUM/REAL,   SPECTRUM/IMAG
##SYMBOL=    X,             R,               I
##VAR_TYPE=  INDEPENDENT,   DEPENDENT,       DEPENDENT
##VAR_FORM=  AFFN,          ASDF,            ASDF
##VAR_DIM=   16384,         16384,           16384
##UNITS=     HZ,            ARBITRARY UNITS, ARBITRARY UNITS
##FACTOR=    0.220516191357247, 1,           1
##FIRST=     3145.03107157918, 0,            0
##LAST=      -467.685691426605, 0,           0
##MIN=       -467.685691426605, -571524,     0
##MAX=       3145.03107157918, 496271357,    0
$$ Real data points
##PAGE= N=1
##DATA TABLE= (X++(R..R)), XYDATA
$$ [...]
7221F2070m8119o5802L1355P8902j70681j6824J44149k43264n7224J48776N8551
7210g8111P558p7657K4942m1971Q734K70530O2056k15936o0259k2084n8768q4503
7198b65469J52537K33656k03623k495L9891K0136m9501P5877J8972j65548J82766
7187C7199l8386j74413j10083o5861k2651J20928L0553J06837N1804j24419m1477
7176b29969j41834K09200N2723J8709q5796j36871Q6441J29549N1992n0943k0023
7165a16822J6696Q2459j32215J22506L8398q9159K6828k82909L03923j830o033
7154c8158j05722j26666J96070k5794j74837j65692J73798l2318J14369K48845
7144F3895Q9975j5108R9282k80586r38L9520o2022J19217N4650k4297j29405k14871
$$ y = [62070, 13951, -51851, -20496, 58406, -112275, -129099, 15050, -228214, -285438, -136662, -78111, -70553, -148210, -123268, -165239, -156505, 114025, 176081, -39855, -100114, -122198, -180966, -265469, -112932, 120724, -82899, -85394, -45503, -25367, -74868, 1009, 19981, -145567, 37199, -1187, -175600, -285683, -351544, -374195, -253267, -222714, -115877, -64073, -188492, -229969, -371803, -162603, -109880, -91171, -176967, -313838, -227397, -97848, -45856, -96799, -116822, -100126, -17667, -149882, -27376, 11022, -78137, -51309, -334218, -30295, -32125, -38158, -143880, -270546, -74476, -100270, -275107, -440799, -267001, -299319, -184950, 63895, 153870, 138762, 238044, -42542, -43480, -3960, -65982, 53235, 107885, 83588, -45817, -260688]
7132b60688J01344l9760K2787J03755n9575J43111m7320j10523K07158j01575
7122d1286J9699J9035j14106J02574J14280p8177j05736J52042O3267j35724O2964
7111E8832j43848L0712J49837L8039n3328j33013O4917J41543l7155p4375n4659
7100a2498M0435j78632N2409J45742k5495k4160J0681J90701k7471J8774P8197
7089B68683j32589K4869J46743m0240R3747J37839P9494J6270j48370j15909P3594
7078D04131j21410o2269N0727J1473m6694l4336j29527R8805p0250N9751K5942
7067A86343j0261j30777L1364j62061J32773j9840K4720N021o5478j67234l1911
7056b07341J50831j30787P7337K92701r5344p1514J2J3625J5399P987j70920R6865
$$ y = [-260688, -159344, -199104, -176317, -72562, -132137, 10974, -36346, -146869, 60289, -41286, -21587, -2552, -116658, -14084, 100196, 22019, -83717, 68325, 131592, -4132, 58832, -85016, -54304, 95533, 133572, 80244, -52769, 12148, 153691, 116536, 42161, -12498, 27937, -150695, -98286, 47456, 21961, -2199, 8482, 199183, 171712, 190486, 268683, 136094, 160963, 307706, 267466, 361213, 499052, 578546, 594816, 446446, 330537, 404131, 282721, 220452, 271179, 282652, 235958, 201622, 72095, 170900, 100650, 160401, 186343, 176082, 45305, 76669, -85392, 47381, 27541, 52261, 57282, -8196, -175430, -207341, -56510, -187297, -109960, 182741, 87397, 15883, 15895, 29520, 44919, 52906, -118014, -21149]
7044b1149K12390k6954n8405j44192Q6669j45367r5775J29515O2702J2829o536
7033E727q5593k4567j54295j17313M01511K00648l3396J01919n6884j01931Q894
7022A44720j41164j51174p5164J1817J33372J08542Q5200k60094l8765N6749J9411
7011a06550o685J37029n8377k7904P0441O3592k3482Q343j25564j32518K30739
7000B9064K04936o1227j41977j00147q079m58j17603k5330R3573J06982J09103
6989H8837j73632J18725j04199J4846n3764K8336l2791J5987j66541o5054J02943
6978b26307Q2006O3642m0423R3356j52618k914O9651P5512J68344o2565j5915
6967E1769r407m1215J50836k01990m093r29n3926Q3182m0022K9932p9269j90729
$$ y = [-21149, 191241, 164287, 105882, -38310, 48359, -97008, -192783, -63268, -566, 12263, 5727, -79866, -104433, -258728, -376041, 25470, 226118, 192722, 294641, 237757, 135826, 144720, 3556, -147618, -222782, -210965, -77593, 30949, 116149, -143945, -182710, -125961, -106550, -113235, 23794, -34583, -62487, 7954, 71546, 48064, 56407, -69157, -201675, 29064, 234000, 172773, 30796, -69351, -77430, -77888, -195491, -220821, -127248, -20266, 88837, -84795, 33930, -70269, -55423, -109187, -80851, -113642, -97655, -264196, -329250, -226307, -144301, -80659, -121082, -27726, -180344, -183258, -113607, -38095, 130249, 67684, 51769, 42362, 1147, 151983, -50007, -54100, -55029, -108955, -25773, -65795, -35863, -115132, -305861]
6955c05861K6421J91785J22979p0003n0427J00948J34157J30612k11622j90002
6945a21013J56716J30589j09682N518p1933j63077J2883K01812K8902N7055k08426
6934h0656L604p9475o684Q1979p9291N3425K67614J35296k35791j08496n21P7943
6922B8947J26915R8484k57773n5465j9519R6170M8281p7679k66145j48924J21089
6911c05619J07669j13425K29589m0258Q3912k9953j31045P791Q5434j4914r3622
6900b14441J04663m6174j6250M0873j2057L4129J34495o6756O5543L2073o2287
6889f189J12654j02241k32898j43150Q1958O1559R1558L7609r5690j3086L3133
6878a74783K584N3609Q9735o6141L3406m8162n4904p8301k1619j388k5420P5324
$$ y = [-305861, -279440, -87655, 35324, -34679, -85106, 15842, 149999, 280611, 68989, -121013, 35703, 166292, 56610, 62128, -9805, -172882, -159999, 41813, 70715, 127770, -80656, -77052, -156527, -163211, -81232, -160523, -107098, 160516, 295812, 60021, -48475, -48996, 28947, 155862, 254346, -3427, -58892, -78411, 17759, 66040, -11639, -277784, -426708, -305619, -197950, -311375, -81786, -122044, -38132, -68085, -199130, -191339, -105905, -120819, -214441, -109778, -155952, -172202, -131329, -143386, -109257, 25238, -41518, 24025, 56098, -6189, 106465, 4224, -228674, -371824, -289866, -228307, -136749, -99140, -194830, -207916, -174783, -172199, -118590, -28855, -94996, -61590, -109752, -164656, -242957, -264576, -265964, -291384, -216060]
6866b16060K29303Q3924n8694N4540k53362K72526l3442r2904J4775m0973j76247
6855b16614O7821J27054p386j36405N6916m9027Q5617Q5195k974l54909J12680
6844b32032O4394K8620K45503j92077J6665q0174Q071J72550n9483j76722N2135
6833a52550j31355N9018R1853j77475P603R9426j2066K28406n2327j04807Q8994
6822e5280R4124j87421K07045o5781j6317l3354j16646J58895J55935j78573j00131
6811a37504M9814Q5013Q837J44259r4827j64920P6308N1446K31435k2779k34867
6800g785P6134o1295j06009K4003n575q5807k475j01916K35390J33356o3676J4604
6788D8949j33395j740j37724J39709R1851j88938J30688j8694q5154j7226L2621
$$ y = [-216060, 13243, 97167, 38473, 93013, -160349, 112177, 78735, -14169, 606, -40367, -216614, -148793, -21739, -29125, -165530, -108614, -157641, -72024, 13171, 10197, -344712, -232032, -167638, -139018, 106485, -85592, -68927, -149101, -141030, 31520, -27963, -204685, -152550, -283905, -224887, -133034, -310509, -302906, -203480, -215546, 12860, -39467, -144274, -55280, 38844, -148577, 58468, -7313, -23630, -56984, -173630, -14735, 141200, -37373, -137504, -87690, -2677, 6160, 150419, 55592, -109328, -33020, 18426, 249861, 227082, -7785, 68349, 7054, -98955, -74952, -80527, -166334, -168809, -270725, -35335, 98021, 34345, 48949, -84446, -86186, -223910, -84201, 7650, -181288, -50600, -69294, -154448, -171674, -139053]
6777a39053k241M28J94740L1691p0867k827o9881o4542L445R7401O5296l6227
6765G363m010J11653J13405P9023k66909J04472k46388j44160J42776j44536o1709
6754c09020R5761P9374n3537R7792M3345j49869J50268q0686J50763l440j44877
6743a24126P9870J1721M5677k7277O7276J12813j2232q2918J06464j10104j01241
6732c4077j85169J38055P1898J90828R1805j47929j24821N0166o513k4110J15531
6721A35664j62556m1415p6856j23652K09377j3132j07882J9338m792j00232O0663
6710b05475J17917j29434O528K37712p2451p5505q4096L0912N9486J834k91690
6699d04262R6580J53768K03950J3032l0842n4632k706K23615J2583J9636n7121
$$ y = [-139053, -141294, -140866, 53874, 85565, 14698, 11871, -58010, -122552, -119107, -21706, 43590, 7363, 3353, 115006, 228411, 307434, 40525, 144997, -101391, -245551, -102775, -247311, -309020, -213259, -133885, -187422, -89630, -46285, -196154, -45886, -126572, 24191, 20751, -124126, -44256, -32535, 13142, -14135, 53141, 165954, 153722, 70804, 177268, 67164, -34077, -219246, -81191, -9293, 181535, 273340, 125411, 590, 50756, 44243, 20133, 135664, -26892, -68307, -145163, -268815, -59438, -72570, -180452, -161114, -165906, -266138, -205475, -87558, -216992, -210464, 27248, -45203, -120708, -204804, -173892, -114406, -112572, -404262, -307682, -153914, 50036, 63068, 32226, -22406, -25112, 198503, 211086, 230722, 173601]
6688A73601k96278m6022J13420L5109m6557j6989J10101r2948M0591L5780q3427
6677g3619J01298o0586m0590j58527J68546j1265J2512M1098J7515m9770J20918
6666F7530r6967k42320J38856N132L54J6128n8141J4605K9615M9912m3335Q6826
6654c1805R8829J03532j55658n3256J39536j34774n3096o5592N6479L5498J1125
6643d9182k30093k7963j2761j21591L61738p0145Q6002J99518j82032k5670j00921
6632a73100q5315J70365J84070j77083J7923J72211J02903k16484K7731O3532
6622H6753o2911L4802j09496k00391J3891L02755K4678k23876J53890j75293k424
6611a57622o2516J88896j4295n9624r7683K4902o2320P6982M5355J04730k00221
$$ y = [173601, -122677, -168699, -55279, -20170, -66727, -83716, 26385, -66563, -25972, 9808, -73619, 27679, -32907, -73497, -232024, -63478, -74743, -62231, -21133, -3618, -53388, 67530, -29437, -271757, -132901, -127769, -127415, -111287, -169428, -154823, -125208, -75296, -118631, -31805, 67024, 170556, 14898, -38358, 101178, -33596, -86692, -152284, -95805, -60307, -49182, -279275, -307238, -319999, -441590, -79852, -149997, -63995, 135523, -46509, -72179, -173100, -258415, -88050, 96020, -81063, -63140, 109071, 211974, -4510, 23221, 86753, 23842, 58644, -50852, -251243, -237352, 65403, 90081, -133795, 20095, -155198, -157622, -220138, -31242, -45537, -105161, -202844, -177942, -240262, -163280, -117925, -13195, -213416]
6600b13416l9136q811M3163k44112J50504K08487J38590J4789j11891J82221j88555
6589f8167j21112L3510j83542K3408J24966Q8233K7678R540M3486O8702j56284
6578a09582j78673J28849m8555j7327K9048N8889J1580j71895P4721P8815j5999
6567a60129Q8252j80072o557j22550O0129J96308K50477l0356j02213j64713J1425
6556a59999j54567K3011M430N5455M8557n1803o4214M11718j33019j98191J39628
6545g8994J40271J789J6j02209l2604J12846n3859L395P7760j43635K21151P6901
6533B22828k49504j07513N8968j26649j0917J08215M6170j8319r005k5833J9670
6522i1889N9551j9741L0070m8902l9515L9339K24735j62148J5986l19645l1215
$$ y = [-213416, -252552, -261363, -218200, -462312, -311808, -103321, 35269, 50058, -61833, 120388, -68167, -189279, -155769, -339311, -315903, -190937, -102704, -75026, -65486, -22000, 46702, -109582, -288255, -159406, -207961, -225288, -196240, -137351, -125771, -297666, -222945, -144130, -160129, -71877, -251949, -258506, -381056, -320927, -124619, 125858, 95502, -6711, -171424, -159999, -314566, -291555, -287125, -231670, -183113, -234916, -299130, 112588, -20431, -218622, -78994, 61277, 63066, 63082, -39127, -71731, 41115, -12744, -9349, 68411, -75224, 145927, 222828, -26676, -134189, -75221, -201870, -212787, -104572, -58402, -76721, -85726, -111559, -91889, -32338, -52079, -22009, -70911, -110426, -71087, 153648, -8500, 7486, -312159, -343374]
6511c43374J13050L15683J07116k34236j7848M1109j73033j7576n8769L1419J54756
6500h1703p6888R6634j2098R589p5839R0961K9189J38784p9176k68662r6677J49591
6488a76295l2841j16180J57258P8128m3142J02162K9316M1367j46537L7699j61365
6477b30430Q1844J30801j08470K01328j63659j13756o3972K41854K13487N6757
6467B45784j89702j3608j45471R5459J04156k00740l2684J27713Q0299J731q7138
6456a4201R7487j98937q9895J31083P7531J25446J991k39313p8750l3809j39348
6445c60715L01388N5215j07996j87806K3397J85184P8641K9509J9925q0902l4159
6434g8319r2070o1278M7172J98024J7044p0265J50985j59939p008P2320l39178
$$ y = [-343374, -230324, 85359, 192475, -41761, -59609, -18500, -191533, -209109, -267878, -236459, -81703, -158591, -61957, -74055, -64466, -140305, -49344, -20155, 118629, 39453, -229209, -325886, -176295, -209136, -325316, -168058, -89930, -133072, -30910, -1594, 39773, -106764, -69065, -230430, -148586, -17785, -126255, 75073, -88586, -202342, -266314, -24460, 189027, 245784, 56082, 42474, -102997, -7538, 96618, -104122, -136806, -9093, 71206, 72937, -14201, 83286, -115651, -205546, -74463, 3068, 128514, 130505, -108808, -187558, -221367, -360715, -59327, -4112, -112108, -299914, -276517, -91333, -12692, 16817, 36742, -44160, -78319, -170389, -231667, -184495, 13529, 30573, -39692, 111293, -48646, -55654, 16666, -322512]
6423c22512K09039J70139J1397j30292k14721l8816j07051K75879J64619J9908
6413C7589l4376j30830k7545J25248N8940j14367j85919J80263J68290j93193
6403a15900q3378J17329n9750j56343O9362m2170J7341J4179P9502n8355J52682
6392f5501k9113j95984R8665J01218k5056N764K56511j89809K2798J09137m51969
6381c63339q6243K09404K49334J32036q9021j60514j95512N5384L7368N6136J1839
6370a43128K0044n5299j89735J05660J00049m0135Q4003J04313n4770M1015K33835
6359B05852j24653j53971J49117p1064P8541o7485N7150J66873k19294j0021j16714
6348a05669l8625j8214P4016Q8846P8384k0640k76941K29283L5810j31357j7271
$$ y = [-322512, -113473, 56666, 68063, -62229, -276950, -315766, -422817, -146938, 17681, 37589, 3213, -127617, -155162, -29914, 29026, -85341, -271260, -90997, 77293, -115900, -199278, -81949, -141699, -298042, -228680, -270850, -253509, -239330, -159828, -218183, -65501, -94614, -290598, -191933, -90715, -115771, -110007, 146504, -43305, -20507, 88630, -363339, -449582, -240178, 9156, 141192, 52171, -108343, -303855, -248471, -211103, -154967, -143128, -123084, -178383, -368118, -262458, -162409, -202544, -118541, -14228, -68998, -27983, 205852, 81199, -72772, 76345, 5281, 83822, 16337, 73487, 240360, 21066, 11045, -105669, -144294, -162508, -88492, 354, 78738, 58098, -218843, 10440, 46250, -85107, -102378]
6337a02378o3422K88874j52128j36126j89824K11957k04479J51007K83675m770
6327H2386j21416j26405j29742K0828M8103J06903J87964q7506q1741m3253M2035
6316a01844r7591J77570k14796J03233K33595L3447j32122l06346j36845J01475
6306c40224L52560J02614k03716M3432J22165j21159j25760J27106P8593M1045
6296G6656p6007m8280p68J3041p3481j23602m2126j5836K7436J19729J91121q1174
6284c3291k0493O8992j709n3980k58062P138K37363J57075p4045j42336o5296
6273a78644M3599m5136J88056j76717l38l8482J61851k2856K8762p7726q7411
6262b05042J21074J6919J0922Q945K09386j66071O5401L7285j37100j764K8844
$$ y = [-102378, -165800, 123074, -29054, -165180, -355004, -143047, -347526, -196519, 87156, 82386, -39030, -165435, -295177, -274349, -226246, -119343, 68621, -18885, -100626, -143879, -101844, -199435, -21865, -236661, -133428, 100167, 133614, 1492, -304854, -441699, -340224, 12336, 114950, -88766, -45334, 76831, -44328, -170088, -42982, 35611, 76656, 649, -47631, -48399, -35358, -108839, -232441, -274567, -290403, -262967, -143238, 47883, -33291, -53784, 15208, 13499, -40481, -298543, -291405, -54042, 103033, 28988, -113348, -178644, -135045, -180181, 7875, -168842, -169180, -207662, -45811, -68667, -39905, -117631, -205042, -83968, -67049, -56127, -47182, 162204, -3867, 61534, 98819, -38281, -40045, -11201]
6251a1201Q811r7639O2965R582n7666m8495L4793J61793J8542P2247j27967j62854
6239a37089J34243Q2047J18001q3591j97904J26627R0353p8229j39516j0836j03143
6228a99037K0919R4339j05837J45383J05189Q456J15862l7896q3074k59136R0018
6217a04814J64312r5319N5191K5027j08494n7812R8028N5545K3924o9155K2181
6206H614L1955j17379N602n8393J01660J85287L0879l30537J57205k53659j25050
6195c63816O2449p5229K97744o8n1875n5858P7777m4066k526l7468J12903N1503
6183b8530j55551M6232j26069K27990K0814j95595J3612J14452j18639J19582
6173h1702M1584N6092M7687j61423J2896P0597m8464j85564j30075m7586Q2690
$$ y = [-11201, -2390, -100029, -37064, -27482, -85148, -133643, -98850, 62943, 81485, 153732, 25765, -137089, -2846, 79201, 197202, 113611, -84293, 42334, 132687, 54458, -85058, -95894, -199037, -178118, -83779, -189616, -44233, 60956, 69412, 185274, 147378, 64304, -194832, -104814, 59498, -35821, 19370, 44397, -64097, -121909, -23881, 31664, 55588, -13567, 8614, 40569, -76810, -71208, -129601, -27941, 157346, 188225, -142312, 14893, -238766, -363816, -301367, -376596, -78852, -78920, -130795, -186653, -108876, -152942, -155468, -192936, -80033, -28530, -184081, -137849, -263918, -35928, -15114, -210709, -197097, -82645, -201284, -81702, -40118, 15974, 63661, -97762, -84866, -14269, -62733, -248297, -378372, -425958, -343268]
6162c43268m6317K14307o0421j16203Q7876q0336O1529Q1299J38253m5448m1717
6151a50446J37565j54855J11206O3666l7255j19086L8996l5580p0870P5809k17323
6140c58173k3099J49819M5562J84637K7317j95013m2948J66382j43981l2778O9269
6129a53006J97180m049N103J83401j36314R1558j1912q5746r0773j75352J07075
6118g2835J58658N3381l816o3413l1364P7446m6672k10889Q9645J81666M5312
6107A77119q3358r7421j7239N8308j51308l226O5882J27263K303L2092J96126
6096C06541k77744q0215J97140j47779M7948o3434O2448n443O0150M9214l6298
6085A12528O093o117p1381j64536M9090j13326m2163o0463J64368J95307N033
$$ y = [-343268, -389585, -175278, -235699, -351902, -264026, -344362, -282833, -201534, -63281, -108729, -150446, -12881, -167736, -56530, 7136, -30119, -149205, -110209, -145789, -216659, -140850, -358173, -381272, -231453, -185891, -1254, 26063, -168950, -211898, -45516, -189497, -222275, -153006, 44174, 40125, 45228, 228629, 92315, 183873, 171961, 86215, -4558, -179910, -72835, 85823, 139204, 135388, 71975, 40611, 118057, 71385, -139504, -49859, 131807, 177119, 93761, -3660, -20899, 37409, -113899, -117125, -51243, 76020, 78323, 110415, 306541, 28797, -51418, 145722, -2057, 45891, -17543, 44905, 39462, 99612, 148826, 112528, 118621, 112504, 41123, -123413, -74323, -187649, -229812, -290275, -125907, 69400, 74433]
6074G4433k136j03870m1049p8651M7161K1795M679O1500K4998j55226o9885K15092
6062a159O5748k9671j15713K8015J37466J2462M0396l3551j20954K942n3011N8776
6050h254n4451J11893P275M9205J20425L1264k61823k5119N9935j15869O1962
6039b3557O4356m5989r1126J22731J14009j02633j62976p2930K23536n2192J09376
6028H2605o3132n5784P6479J16682j59225k3755J68279m1040L4200j03553M1514
6017G3270k9958o8254J28779l2355j9511R4657j49579j715p7387K3577j46408
6006b04884M8551K11563j1816J13197J63924k15506k1201J14043o1588N3762J37509
5995C27554j58769n9306m6020j45344J76351J01212m7286J30677l6671j4557L3017
$$ y = [74433, 72297, -31573, -72622, -151273, -104112, -82317, -77638, -16138, 8860, -146366, -216251, -1159, 64589, 34918, -80795, -52780, 84686, 97148, 137544, 103993, -16961, -14019, -67030, -8254, -62705, 49188, 56463, 105668, 226093, 257357, -4466, -29585, 30350, -85519, -23557, 40799, -5190, -96316, 26415, 140424, 37791, -125185, -198115, 25421, -26771, 82605, 19473, -36311, 40168, 156850, -2375, -26130, 142149, 101109, 135309, 31756, 73270, 43312, -24942, 103837, 71482, 51971, 146628, -2951, -4666, -82053, -58476, -204884, -156333, 55230, 43414, 156611, 320535, 105029, 83828, 197871, 136283, 190045, 327554, 168785, 109479, 63459, -81885, 94466, 195678, 148392, 279069, 242398, 227841, 260858]
5984B60858J08689n2333Q6461P2436O4045k3610j72462J23215P7923J41190J53451
5973H39863Q357j12341j9372l6177K4420j25618O8109J17884l2907n6251n069
5962F70898J03328p5816J32467k10678J03793J88744r771O4917j12016J18769
5952I74635R0602P7342Q8417q9712J10815K40663J21343J82321j0073o6090Q7740
5941A808003J49587K09290J38994N3828K53943R9511k4652l47140l02880k61661
5931A776823k76929j34580p1103o4364j37770k4734o6628J1760R1423m2289j4738
5920A046871j14908P8034K8114P7653J72453O1342Q1860J30389k3302k87760r1809
5909A158937K7367o6587j74376r375j02388j28897j22619N4176L3185j09332M2967
$$ y = [260858, 369547, 317214, 403675, 476111, 540156, 516546, 344084, 467299, 545222, 686412, 839863, 848220, 735879, 716507, 680330, 704750, 579132, 647241, 765125, 732218, 675967, 670898, 774226, 698410, 830877, 620199, 723992, 912736, 902965, 967882, 855866, 974635, 1065237, 1142579, 1230996, 1141284, 1252099, 1492762, 1614105, 1796426, 1786353, 1720263, 1808003, 1957590, 2166880, 2305874, 2359702, 2613645, 2713156, 2688504, 2341364, 2038484, 1776823, 1499894, 1365314, 1294211, 1229847, 1092077, 1067343, 1000715, 1012475, 1103898, 1061609, 1046871, 931963, 1009997, 1038111, 1115764, 1288217, 1349559, 1431419, 1561808, 1538506, 1250746, 1158937, 1186304, 1119717, 945341, 935966, 833578, 704681, 582062, 636238, 669423, 560091, 603058]
5898F03058R2571p0738K49326J0409m8864q2742P5195k65418Q6737R6733j1407
5887G34860L2848L8578K03150K75473k5712k08660r2242o0188j03397j40316P1229
5876G25623j34220j4348j89917Q1947r997J71189j20715k25283j97325J43258
5866B30212K72914N8675j77353l2852m2809m1008J3961K69944J23713j29895k7887
5855E17615J78572J90000N4235J04122L2090k05981q8016r5657j44037j38983
5845D03960j15384K2622p6391K2651m3287K4597K87194Q84j58317J52022j31561
5834C88990J1124j34756p5960j3797J4026j5298J29157J28808j79699q4006J66601
5823C35190K13465J04421j13424j26407j198q4532J25852n3847j69988l6230K2885
$$ y = [603058, 695629, 624891, 874217, 884626, 835762, 753020, 828215, 562797, 649534, 746267, 734860, 767708, 806286, 1009436, 1284909, 1259197, 1050537, 958295, 898107, 794710, 654394, 725623, 591403, 577055, 387138, 469085, 459088, 630277, 509562, 284279, 86954, 230212, 503126, 561801, 384448, 351596, 308787, 267779, 281740, 551684, 675397, 545502, 517615, 696187, 886187, 940422, 1044544, 1076634, 870653, 782637, 686980, 542943, 403960, 288576, 311198, 234807, 257458, 214171, 238768, 525962, 526846, 368529, 520551, 388990, 400114, 265358, 189398, 175601, 189627, 174329, 303486, 432294, 252595, 168589, 335190, 548655, 653076, 539652, 413245, 412047, 327515, 453367, 399520, 229532, 193302, 216187]
5812B16187Q9629j7479j34925l2478J72195J26960j87522p5782J93314O262j75173
5801A81188J57238J47276j4482M8578m2961j62663j26464N7909L285j68718R3029
5790A73215J84514j17627L8833P3597k03279p9898q2250Q0883l4463P4276r530
5779I8271P40J67768j26045o276J19164r0745J07286J21337k47100q7986P3113
5768A29527Q9243P6949k0597k3012O7299k6109J07730l2125k35771K13643j74354
5757A72423j79250J36246N9199L6598J99303r013l48969n5348J22536P6252m88322
5746b78345k926K07223J30741o6179j5811J10900P3811r1509k12724O2947P8908
5735b964K0668J01157q6065K6728J2858J89373j57883k4381N027o920N7854j10737
$$ y = [216187, 305816, 288337, 153412, 120934, 293129, 420089, 232567, 156785, 350099, 356361, 181188, 338426, 485702, 471220, 519798, 476837, 314174, 187710, 245619, 248904, 80186, 173215, 357729, 240102, 278935, 352532, 149253, 69355, -12895, 67988, 33525, 107801, 98271, 99011, 266779, 140734, 134458, 253622, 162877, 270163, 391500, 144400, 56414, 129527, 218770, 295719, 275122, 252110, 319409, 293300, 401030, 368905, 133134, 346777, 172423, -6827, 129419, 188618, 225216, 424519, 415506, 66537, 11189, 133725, 209977, -278345, -281271, -74048, 56693, -9486, -25297, 85603, 159414, 67905, -144819, -81872, -2964, 17704, 118861, 32796, 59524, 72382, 261755, 103872, 79491, 84518, 77598, 135452, 24715]
5723B4715O4697j39195k1729L47821M0194o2744l6511J88164m6656J15511k2135
5712D52132l45660K1608j09323Q4459M1620L5592p6120j0256R1459L9549j81759
5701D3301J16515J34247j20230J02907p474q2429j7300J5463j12993p2767P9792
5690G9032J51040k071M2029O2389k22658j38798j2530m9666L7646J79928l3678
5679I2663j23970n5205K52936j26999L7786L3069J00127j68182J50562j57052
5669C5735r6046n8876K67243P3024N2315J25370j17373j64860j35980J69967N3874
5658B04393l8124k27454J13419K4307Q6178K33018r507m6224M1788j64310q5104
5647A32380R281J36294J94303k7371j52417n1603k66768J98228K72375q3190k65628
$$ y = [24715, 89412, -49783, -71512, 276309, 316503, 253759, 217248, 405412, 358756, 474267, 452132, 106472, 128080, 18757, 103216, 144836, 180428, 104308, 94052, 185511, 225060, 43301, 159816, 294063, 173833, 276740, 269266, 186837, 169537, 185000, 72007, -760, 79032, 230072, 228001, 270030, 332419, 109761, -29037, -41567, -91233, -53587, 126341, 92663, -31307, -86512, 166424, 39425, 77211, 110280, 210407, 42225, 192787, 35735, -60311, -119187, 148056, 221080, 273395, 398765, 281392, 116532, -19448, 150519, 204393, 166269, -61185, 52234, 76541, 162719, 395737, 386230, 340006, 381794, 217484, 132380, 141661, 277955, 472258, 444887, 292470, 240867, -25901, 172327, 444702, 361512, 95884]
5636I5884L2654J55752j63915j60036J88915J2639m6314r4440R4961J47453l0588
5625B32965o3228M2155l4951L5996k7054l1751l6235J97353R5431j76622L6032
5614B70091j29895j21976J90784M3806L5857q8972j45800J26111P1323O9737q1963
5603B39103l9705K02061j62694j4227P8076j28087K0901J30860R6850M2989l8485
5592D27642q6653J25950l1210k03988j72621L90675j9141Q6996K9145K0630j56741
5581D10684O4076K4260J25044J30513k59095N7322J04200j39557j18302K544K04806
5570F06495j1968P306r4420p1987k0773M5383J40938J88287k7283k53985J12318
5559F20311q7163K13293q0235Q725o0985K2007J8458K23661l1187l7572K2208
$$ y = [95884, 128538, 284290, 120375, -39661, 149254, 161893, 115579, 21139, 116100, 263553, 232965, 169737, 211892, 176941, 212937, 185883, 154132, 117897, 315250, 410681, 234059, 270091, 140196, 18220, 209004, 252810, 288667, 199695, 53895, 180006, 251329, 321066, 239103, 199398, 401459, 238765, 224538, 302614, 174527, 195428, 326288, 423138, 466127, 427642, 340989, 466939, 435729, 231741, 59120, 449795, 430654, 517650, 546795, 567425, 410684, 474760, 499020, 624064, 754577, 495482, 552804, 657004, 517447, 399145, 401689, 606495, 594527, 601833, 507413, 435426, 414653, 460036, 600974, 789261, 761978, 507993, 620311, 533148, 746441, 666206, 674931, 613946, 635953, 654411, 878072, 846885, 809313, 831521]
5548H31521L1713L9357Q8166l9240R3532L72215L9945j3172K45167L02879J99078
5537B191161R3222q2562n745J33851J2688k4175o5037j27009k97041p8658l6633
5526A714062j43422M4612j70851k33031j86506L10499l0298k4446q7498J6875
5516A209996K272n9090K87900q9797o829o5694K65967J62457J72056L15435k46494
5505A948179q8103l01703k58667Q3730J35804n3789j86295J06171M9171k05497
5495A229001n7088J69624q9561j39281O63K35181R4448k89446n5936K06990k9427
5484A275168n9851O5661j76360M29930J35187p435M1036M78132M41750l03595
5474B319623k52808o2769P29k37335j11759q8190P260j30393j81897J287j00637
$$ y = [831521, 863234, 902591, 990757, 951517, 1045049, 1417264, 1457209, 1444037, 1689204, 1992083, 2191161, 2284383, 2201821, 2196076, 2329927, 2342615, 2318440, 2253403, 2126394, 1829353, 1750695, 1714062, 1570640, 1615252, 1444401, 1211370, 1024864, 1335363, 1305065, 1280619, 1193121, 1209996, 1212268, 1153178, 1441078, 1351281, 1344452, 1278758, 1544725, 1707182, 1879238, 2194673, 1948179, 1860076, 1558373, 1299706, 1383436, 1519240, 1465451, 1279156, 1385327, 1434498, 1229001, 1171913, 1341537, 1251976, 1112695, 1113358, 1348539, 1442987, 1153541, 1097605, 1304595, 1275168, 1215317, 1280978, 1104618, 1534548, 1669735, 1662300, 1703336, 2181468, 2623218, 2319623, 2066815, 2004046, 2004775, 1767440, 1655681, 1567491, 1574751, 1444358, 1262461, 1263748, 1163111]
5463A163111K5709J86230O0917q814m7819O5431J89451J70785j82086M0587K03601
5452A867103Q6394j56803L4091p8451O4484k0849k9074k24625M4631M0712R4315
5441A721928R2431l54567k9358o2287J78058l7700O4959l18946Q9028l18j30557
5430A212671J2105J21208k5976k11918N6720n5757P3376l1716O1127J22660L1637
5419A366137O8152o0622q431Q6229K5273Q6810J3613r1118J7670J07086M9487
5408A660286L0186J49061p8219N4384J00291N5642j77803R2792O838j97536K21217
5397A917139K61815j34023p6727P3186Q2415j41260J3206M9122O6830k2809j82126
5386A906768L7804n076P1052P5264J82303p1893k8885J16852N2246j23568J82178
$$ y = [1163111, 1188820, 1375050, 1435967, 1427153, 1379334, 1444765, 1634216, 1805001, 1622915, 1663502, 1867103, 1953497, 1796694, 1830785, 1752334, 1816818, 1795969, 1766895, 1542270, 1586901, 1627613, 1721928, 1814359, 1459792, 1430434, 1368147, 1546205, 1508505, 1573464, 1254518, 1343546, 1343228, 1212671, 1224776, 1345984, 1320008, 1108090, 1164810, 1109053, 1182429, 1150713, 1211840, 1334500, 1366137, 1434289, 1373667, 1365236, 1451465, 1476738, 1563548, 1577161, 1486043, 1503713, 1610799, 1660286, 1690472, 1839533, 1761314, 1815698, 1915989, 1971631, 1793828, 1886620, 1893458, 1695922, 1917139, 2178954, 2044931, 1968204, 2041390, 2123805, 1982545, 1995751, 2044873, 2111703, 2088894, 1906768, 1944572, 1939496, 2010548, 2085812, 2268115, 2196222, 2167337, 2284189, 2336435, 2212867, 2395045]
5375B395045J01616q5836m1181K0600J76294J63006j36555J3007J08247Q3914
5365B798157j87916j58O8225K2919J18430K479n3084R2490j5212J24185k8569
5354B941946o8377K04621L1062j13217L42368L1604j36116o7086Q7683K80421
5344C534909J30203J32833k74607O1003K7180K00055R7731j66071O6494O7003
5334C876733J71879J57267P6731J45956J922J33413J56023m283L01528J43592
5324E160761l6108K62133J91355K11J15246J22193K12734K11020J60388m079Q8986
5313F484840R1746K41352K06118P6996N4463L38770J63192J37009M5510J89803
5303H029799J78658J58563M30151K87930J94702R2663M05360L08064K51097M41444
$$ y = [2395045, 2496661, 2410825, 2369644, 2390244, 2566538, 2729544, 2592989, 2605996, 2714243, 2798157, 2610241, 2610083, 2678308, 2701227, 2819657, 2822136, 2769052, 2861542, 2846330, 2970515, 2941946, 2873569, 3078190, 3109252, 2996035, 3338403, 3370007, 3233891, 3166805, 3254488, 3534909, 3665112, 3797945, 3523338, 3584341, 3611521, 3811576, 3909307, 3743236, 3809730, 3876733, 4048612, 4205879, 4282610, 4428566, 4430488, 4563901, 4719924, 4715641, 5017169, 5160761, 5124653, 5386786, 5578141, 5578352, 5693598, 5815791, 6028525, 6239545, 6399933, 6395854, 6484840, 6576586, 6817938, 7024056, 7101052, 7155515, 7494285, 7657477, 7794486, 7839996, 8029799, 8208457, 8367020, 8797171, 9085101, 9279803, 9372466, 9777826, 10085890, 10336987, 10778431]
5293A0778431N36344L7315J78783J82160J94476J26000K62894N55226J25900L88124
5283A3365653O48496K20390P32727N85741K56940N22854N49434N44473N77355
5274A8004063N36750N69187N51915O12293N02292O28100Q21707Q03980Q62885
5265B3893172J108753J066437J285699J122406J164401J292904J473963J757368
5257C4165103J857458J726072J934472K178065K335976K734146K828556L188768
5249E2948616L789120M283156N171149N990383O870143P921686R237767J0957240
5241A07169260J2599197J5028921J7478266J9476414K1369886K1507478K0878548
5234B35507970J8887116J3498659N559132j656189p746060j5297911k1450626
$$ y = [10778431, 11314775, 11352090, 11530873, 11713033, 11907509, 12033509, 12296403, 12851629, 12977529, 13365653, 14014149, 14234539, 14967266, 15553007, 15809947, 16332801, 16882235, 17426708, 18004063, 18540813, 19110000, 19661915, 20274208, 20776500, 21404600, 22226307, 23030287, 23893172, 25001925, 26068362, 27354061, 28476467, 29640868, 30933772, 32407735, 34165103, 36022561, 37748633, 39683105, 41861170, 44197146, 46931292, 49759848, 52948616, 56737736, 61020892, 66192041, 72182424, 79052567, 86974253, 96212020, 107169260, 119768457, 134797378, 152275644, 171752058, 193121944, 214629422, 235507970, 254395086, 267893745, 273452877, 271796688, 264050628, 248752717, 227302091]
5227B27302091k4159728k4298318k3299678k1130428j7888381j4808398j2292617
5220H9424543r844739p979137o778890n689589m931113m339464l638782l353944
5212D2868885k830405k454282k322724j942464j687352j380046j350462j440271
5204B7460879j136713r00274p37714j053589r86151p49905p23558r48756o37774
5195A9586445p38424p19791o47738p43111n27109p37089n25121o45805l49611
5186A3952646m40790o19754m20509n24352k03021l41890p4939n25282l06499j88221
5176A0307389j34571j64947l01337l61516j08788P9362j38910k98042m38402j76065
5166H264173q3847Q759j24996k47486k18823r9822j57315j20680j86256k41700
$$ y = [227302091, 203142363, 178844045, 155544367, 134413939, 116525558, 101717160, 89424543, 79579804, 71600667, 64821777, 59132188, 54201075, 49861611, 46222829, 42868885, 40038480, 37584198, 35261474, 33319010, 31631658, 30251612, 28901150, 27460879, 26324166, 25423892, 24686178, 23632589, 22646438, 21896533, 21172975, 20224219, 19586445, 18848021, 18128230, 17480492, 16737381, 16210272, 15473183, 14948062, 14302257, 13952646, 13511856, 12892102, 12471593, 11947241, 11744220, 11402330, 11327391, 10802109, 10495610, 10307389, 10172818, 10007871, 9706534, 9345018, 9236230, 9315592, 9176682, 8878640, 8440238, 8264173, 8180326, 8189085, 8064089, 7816603, 7597780, 7497958, 7340643, 7219963, 7033707, 6792007]
5156F792007k74997p8905k70571j2217j08811m03433k2108k86845j18820l84289
5146D831011o8645o076j36083l8616k66301j90515K0264k94034k02350P513j85802
5135C470366O3555P7602j4984j03217j32550j66249j19866l1880j5646k09246
5125B817885j11281j46929N6957R7670m4670j98692j07602p2514O3425J5699k13119
5114B156829m6789P0291n6289l1950J06719N4748j66619K6564j29193N685k24199
5103A765797O9544O9893r7876O6361j28951n4850P2760j2181O4960l07931L0958
5092A538484m8649k0839K616k3411j07008r4172J30398j926K4101j19656m0853
5081A239085L0818m1623p2402J70959O3294j52344o033n6989L8013J79591l60802
$$ y = [6792007, 6517010, 6438105, 6167534, 6155317, 6046506, 5643073, 5620965, 5334120, 5215300, 4831011, 4762366, 4756290, 4620207, 4581591, 4315290, 4124775, 4145039, 3851005, 3648655, 3656168, 3470366, 3533921, 3611523, 3596539, 3493322, 3360772, 3194523, 3074657, 3042777, 3027131, 2817885, 2706604, 2559675, 2616632, 2714302, 2669632, 2470940, 2363338, 2290824, 2354249, 2369948, 2156829, 2110040, 2180331, 2124042, 2092092, 2198811, 2253559, 2086940, 2113504, 1984311, 1989996, 1765797, 1835341, 1905234, 1807358, 1873719, 1744768, 1689918, 1762678, 1750497, 1815457, 1507526, 1538484, 1489835, 1468996, 1471612, 1448201, 1341193, 1247021, 1377419, 1375493, 1399594, 1279938, 1239085, 1269903, 1228280, 1155878, 1326837, 1390131, 1237787, 1231754, 1174765, 1212778, 1392369, 1031567]
5070A031567j08174P8469r0998Q7289j51365o2952L5955m2997r0454j58576L18848
5059H46612R4395p2700R6825j03212N0818q0068J086K69304K7323J3130j47378
5048I96135K1090l4789q6948O3382L9328M1202l4555l23447R1517J23994o9432
5037H27477q7483l477J10455P5775o1157o4588J01000Q2558j95034n9784j8043
5026G07699m9846J65805N3762k36276Q6008p0464J21578o7052l3514J92277k00134
5015F69843J11270J04085j40678o9530j15460N171K19459j64335k18630L5331
5005D36526K6447k1521L5340L4013J47142K1935j04245j34137o1228K54404K04095
4994H38771j9899l42953J11707j20189j8527J18797j01607L5995o416O2780j62828
$$ y = [1031567, 923393, 1001862, 910864, 998153, 846788, 783836, 819791, 776794, 686340, 527764, 846612, 941007, 868307, 965132, 861920, 912738, 832670, 833756, 1103060, 1130383, 1143513, 996135, 1017225, 982436, 895488, 958870, 998198, 1039400, 1004845, 681398, 772915, 896909, 827477, 739994, 736517, 846972, 922747, 861590, 797002, 898002, 980560, 785526, 725742, 707699, 657853, 823658, 877420, 641144, 727152, 656688, 778266, 711214, 677700, 869977, 669843, 781113, 885198, 744520, 674990, 559530, 564701, 784160, 619825, 401195, 436526, 462973, 441452, 476792, 510805, 657947, 679882, 575637, 441500, 380272, 634676, 838771, 818872, 475919, 587626, 467437, 448910, 567707, 466100, 502095, 495679, 558459, 395631]
4983C95631l5308m2487J97738J60902J7328j62420j5464j1489J6853O109j60494
4972C66899K6117J71963n0812k04170J4365R769L9156n4511j46738J34431K19347
4961E25816J75015j03126j15823q9603N8995K21623K6710J46736J01220l20742
4951F26821L573j07794p2578J45308L3618J53722R9092k61171j74405J53315O4378
4940F63879J19414K6987J57248m6257J15151J77630J1624R215N5580L74588N7732
4929A722791J75398j20535q911j11375k37197k7326J30101k6282k44189j28663
4919A123812l06877o9635j11412k1525n9429J00043k6151k45153K0074J3800n5214
4908C62333J20813o7515R403p6893j15265K45645K35198k59703r7900q3054M1528
$$ y = [395631, 360323, 317836, 515574, 676476, 693804, 531384, 515920, 504431, 521284, 527393, 366899, 393016, 564979, 514167, 309997, 324362, 334131, 373287, 318776, 172038, 306469, 525816, 700831, 597705, 481882, 392279, 451274, 672897, 699607, 846343, 947563, 626821, 630394, 522600, 450022, 595330, 628948, 782670, 881762, 620591, 446186, 599501, 663879, 783293, 810280, 967528, 921271, 1036422, 1214052, 1225676, 1234891, 1290471, 1665059, 1722791, 1898189, 1777654, 1768743, 1657368, 1420171, 1392845, 1522946, 1496664, 1252475, 1123812, 816935, 747300, 635888, 614363, 554934, 654977, 628826, 383673, 403747, 417547, 362333, 483146, 415631, 425034, 348141, 232876, 478521, 713719, 454016, 356116, 273062, 314590]
4897C14590p7828K5463j12078j17088J40820k00956J44283J54706m352n0491q7493
4886A29576j17134q032J75507J88775p9376O8882M2485j8045r2295j31226L1343
4875A90460Q1361p4369o2129Q9147J87160j09340j24054R5983j18400j15464j27094
4864h6739J49225P0683P8987O8665l4063R0018J09793p2544k18422Q1553J83306
4853D20462K4421j54414n3304K3443m6868J05988L7059j19267J58044l1259J1165
4842C75470m3568J10294j49698m6174j31393K3940J17318K7580j8306k15252n160
4831D5051J65329Q9524O2149p6941j2582j7564j34217J80520L4571J11981j69267
4820B78554j52440j5886r3283J33161J07991Q4796j5278j02523p8672J06864R5857
$$ y = [314590, 236762, 262225, 150147, 33059, 173879, -27077, 117206, 271912, 267560, 217069, 129576, 12442, 4410, 179917, 368692, 289316, 358198, 400683, 382638, 290343, 159117, 190460, 271821, 197452, 135323, 224470, 411630, 302290, 178236, 274219, 155819, 40355, -86739, 62486, 133169, 212156, 280821, 246758, 336776, 446569, 374025, 155603, 237156, 420462, 444883, 290469, 237165, 260608, 213740, 319728, 356787, 237520, 395564, 364305, 375470, 331902, 442196, 292498, 246324, 114931, 138871, 256189, 283769, 265463, 50211, 45051, 210380, 299904, 362053, 285112, 272530, 254966, 120749, 301269, 335840, 447821, 278554, 126114, 110228, 16945, 150106, 258097, 342893, 327615, 225092, 146420, 253284, 349141]
4809C49141p1952J48778Q402j2845k25724O5305K9637m9258L05853m7789j61410
4798C38138M4882q2241j90627L073p7878J05177J87254j07564k2997J32158M3656
4787C73031k06218K72836J31702p7656j55310M500n4026q0981Q0060J65907J61840
4776F15685j32693j61204P3851q4576K2231Q1446J01128J33487j96034k26905
4766B26416K9475J45213m0410K7741K36461j50986j08506R132q7241o3044J08945
4755C33196k5197P8599J77552K2309J493j98476k1617j1252O854K11602j36938
4744D38125j45694k0113j12592L72411K4055k02720j15494n0026J76058N7951
4734D21961j93653p1821M1063K64509k6388m7370K6854l04780J58217J88987m1978
$$ y = [349141, 277189, 425967, 434369, 421524, 195800, 261105, 290742, 241484, 547337, 499548, 338138, 383020, 300779, 110152, 113225, 35347, 140524, 327778, 220214, 197217, 329375, 373031, 166813, 439649, 571351, 493695, 338385, 342885, 288859, 207878, 287938, 453845, 615685, 482992, 321788, 395639, 311063, 333294, 414740, 515868, 649355, 453321, 226416, 255891, 401104, 360694, 388435, 624896, 473910, 365404, 374536, 287295, 224251, 333196, 307999, 386598, 564150, 586459, 587952, 389476, 367859, 356607, 363461, 575063, 438125, 292431, 272318, 159726, 532137, 556192, 353472, 237978, 187952, 364010, 421961, 228308, 156487, 197550, 462059, 435671, 388301, 415155, 110375, 268592, 457579, 415601]
4723D15601l2124r8317M4669M6670P3333O2560M0384k20240j35177J67986m6443
4712C18902Q3818K2725j45897J64400j01850j10812Q1072J7981j36650J43345
4702C37034O7475j87099J06339J1232p2014J56964j03322l5879j6609J9294n9262
4691B24153o243j03449P1739K7144r0422P2041K3610P7052R7999J4535j86158
4680B22001r8655n6449J00680J20919j13032L2286j24969K14532r7842o7670R0624
4669B22425n9664j05005J12657K31876r7899O3085k5410k72677P1310J16253j27720
4658A29231O5743J4539J19268j05714n5458m0951J05701M8194L5767j11141j49650
4647E5529K24324J4693j17004K59468o8746j25856n1242J3276j02497J27396O9531
$$ y = [415601, 383477, 285160, 329829, 376499, 449832, 512392, 552776, 332536, 197359, 365345, 318902, 402720, 425445, 279548, 443948, 342098, 231286, 312358, 330339, 193689, 337034, 404509, 217410, 323749, 334981, 262967, 419931, 316609, 280730, 264121, 283415, 224153, 217910, 114461, 186200, 213344, 122922, 194963, 218573, 295625, 393624, 408159, 222001, 123346, 66897, 167577, 288496, 175464, 207750, 82781, 297313, 199471, 131801, 222425, 162761, 57756, 170413, 402289, 304390, 367475, 342065, 69388, 140698, 256951, 129231, 194974, 209513, 328781, 223067, 167609, 126658, 232359, 280553, 316320, 205179, 55529, 279853, 294546, 177542, 437010, 368264, 242408, 191166, 204442, 101945, 229341, 298872]
4636B98872Q6831n6488O629q0664j72320j82230J80614K23327j47393k1019J15253
4625B51412l2597K6822M0890j31415j3541L41136J09685j10994k04288k7799J04494
4614C53805j78040k6396N8207R9887J4316j02260J89186n4929k26559r2000P8961
4603A14178K59643N3954R6219j56989r1355J8834N3686q9635J0676J61166p208
4592D23169m3435j47078j05431J07980r7571J0799K75376K69091k6295k26429
4582D40176o5326j03333N8663J48066m5339m9398j90231R6738J18012j97767R5563
4571C05824L7217j33960M3221l2137J22141j34870J67042J2253n8842K69306j19393
4560D77802n7395K15662l05213j23245P3141L5602N8110J17539R3041k37405O9621
$$ y = [298872, 385703, 329215, 335844, 255180, 82860, -99370, 81244, 304571, 157178, 136159, 251412, 218815, 245637, 286527, 155112, 141571, 482707, 592392, 481398, 277110, 249311, 353805, 175765, 149369, 207576, 307463, 321779, 219519, 408705, 353776, 127217, 35217, 114178, 373821, 427775, 523994, 367005, 275650, 294484, 348170, 258535, 269211, 430377, 423169, 379734, 232656, 127225, 235205, 137634, 148433, 423809, 692900, 666605, 440176, 374850, 271517, 330180, 478246, 432907, 383509, 193278, 290016, 408028, 210261, 305824, 343041, 209081, 252302, 220165, 342306, 207436, 374478, 386731, 327889, 597195, 477802, 420407, 636069, 330856, 207611, 280752, 316354, 374464, 492003, 585044, 347639, 417260]
4549D17260J14727j11271K7346m44J70163R8759j51230q4403n9219n253J62457
4538E78892k8304j13394L8998R0749n2457K29635K04121K48543L4723k33903P9395
4527A076998k08442l7396M7137l4005j6435J6467j17756j41979J65096j19742
4517F29943O8645q7274P0274l9048L245Q642o4897L2820o3143J37599j93428N8724
4505E62102k88884J0348L92735J8125j052m1321j53216P7950K5863j3333k5054
4494E64263Q9512m3777Q9327k3910n5893j60039j46707K14917L7599q471o919
4483E49902J00654L4977j57627J85464r7399j80491M0713K35345j39018m4225
4473E28295j2012J66147J10006J815k01879j74495J98072K8676o7762J23753Q3414
$$ y = [417260, 531987, 420716, 448062, 447618, 617781, 716540, 565310, 480907, 421688, 416435, 578892, 550588, 437194, 476192, 566941, 514484, 744119, 948240, 1196783, 1231506, 997603, 1076998, 868556, 831160, 878297, 844292, 827857, 844324, 726568, 584589, 749685, 629943, 698588, 611314, 681588, 642540, 645785, 654427, 589530, 622350, 559207, 696806, 503378, 562102, 273218, 283566, 676301, 694426, 693374, 652053, 498837, 576787, 602650, 589317, 564263, 653775, 609998, 699325, 675415, 619522, 459483, 312776, 527693, 565292, 556821, 549902, 650556, 685533, 527906, 713370, 615971, 435480, 476193, 711538, 572520, 528295, 516283, 682430, 792436, 794251, 592372, 417877, 615949, 644625, 576863, 700616, 784030]
4462G84030M211k46454l0512k2935J20171J02841j89490P6005J75692L7829n0297
4451G61091L4041j52238m0831K01251J27596q9581P121j8727K5107o1216O1866
4440H55480K5079J65520N1234J5736k5323j15020k30690J26964K3493j60188K66072
4429I98357j55514j2396K83586k6210Q1656J69837J15303j14447Q902J02548J40271
4418A591893Q5204j51617k824J72593n1219K30740J76408N4697k5288K36367M97419
4407B814373L21289K78834M90879L64506J9834j11815P3974j25558k55744k11081
4397C659491l86239j55669m21825l65791j77515k86042J44398q1001l39926l6919
4387A552962J02639k7534J55176R5835j09444n2005j54653j60424J10781K48920
$$ y = [784030, 788241, 541787, 511275, 488340, 608511, 711352, 521862, 597867, 773559, 811388, 761091, 795132, 642894, 602063, 803314, 930910, 841329, 848450, 829723, 854830, 793614, 855480, 880559, 1046079, 1097313, 1113049, 1087726, 972706, 742016, 868980, 892473, 732285, 998357, 842843, 830447, 1114033, 1087823, 1169479, 1339316, 1454619, 1340172, 1349074, 1451622, 1591893, 1677097, 1525480, 1522656, 1695249, 1644030, 1874770, 2051178, 2105875, 2080587, 2316954, 2814373, 3135662, 3414496, 3905375, 4269881, 4289715, 4177900, 4251874, 4126316, 3870572, 3659491, 3273252, 3117583, 2695758, 2329967, 2152452, 1866410, 2010808, 1929807, 1589881, 1552962, 1655601, 1628067, 1783243, 1879078, 1769634, 1717629, 1562976, 1402552, 1513333, 1762253]
4377A762253o3338J47778k7576j45019r114j29374J64980P8152L2159p2188n4122
4366A684591j1490J1917J9692O3465O7763N0664r9677J67813J03604r3478j9593
4355A945271O3347N5328M4119J09129O3409q3044j13197J24200J11992M1249l6411
4344B325392K92709J44676J80742R553J42748L47435K82756M03994N14704M45315
4334E090024M81392K19008K54260j83188l27096l16632k08111p0381j81903j34703
4324D622670k57785l44172p6183k44957k49118M8942o4629j6426K9071J61479
4314C608892k0355J9340k1353K1665j18619K74730K52717K28030M42973L08682
4304D996702K94376J80391k05192l93891j60148k65136m33981k68972j60008o7732
$$ y = [1762253, 1698915, 1846693, 1819117, 1674098, 1664984, 1535610, 1700590, 1778742, 1810901, 1738713, 1684591, 1673101, 1685018, 1704710, 1768175, 1835938, 1886602, 1786925, 1954738, 2058342, 1964864, 1945271, 2008618, 2063946, 2108065, 2217194, 2280603, 2197559, 2084362, 2208562, 2320554, 2361803, 2325392, 2618101, 2762777, 2943519, 2953072, 3095820, 3443255, 3726011, 4130005, 4644709, 5090024, 5571416, 5790424, 6044684, 5861496, 5534400, 5217768, 5009657, 4939276, 4757373, 4622670, 4364885, 4020713, 3944530, 3699573, 3450455, 3499397, 3434768, 3418342, 3447413, 3608892, 3588537, 3607877, 3586524, 3608189, 3489570, 3764300, 4017017, 4245047, 4688020, 4996702, 5291078, 5471469, 5266277, 4872386, 4712238, 4447102, 4013121, 3744149, 3584141, 3516409]
4294C516409k02751k64814J78697r6595j65983N7293J31538j22072L3990J76034
4284C241746L0218J23565J02370r2418P2658K00655l6818K0863P783o8788j03763
4273C498071K76196P1930j61477J53159k13325K01626K98552j28245j49417J320
4263C848390k6677J22845j62052K45647L9258q1734J4655K00063J5864j46508
4253D069751l4596n4411K33334Q8646J16344J9562K63764o2621R4457J90969J68891
4242E094090o1310k4164q3710n3388K87972J9109j89754P6334n0550n545N136
4231E014220P8660K01592J16403O3738k1025J34755J49744p0507j802M52602J09112
4220F227492K1079q021j6080K50231K00833n0083L9948O1631J9857J22550O13
$$ y = [3516409, 3313658, 3048844, 3227541, 3130946, 2964963, 3022256, 3153794, 3031722, 3065712, 3241746, 3271964, 3395529, 3497899, 3405481, 3478139, 3678794, 3641976, 3662839, 3670622, 3601834, 3498071, 3774267, 3846197, 3684720, 3837879, 3624554, 3826180, 4124732, 3996487, 3847070, 3848390, 3821713, 3944558, 3782506, 4028153, 4067411, 3985677, 4000332, 4200395, 4216259, 4069751, 4035155, 3980744, 4214078, 4302724, 4419068, 4438630, 4702394, 4639773, 4734230, 4925199, 5094090, 5032780, 5008616, 4924906, 4871518, 5159490, 5178599, 4988845, 5065179, 5014629, 5009084, 5014220, 5092880, 5294472, 5410875, 5474613, 5453588, 5588343, 5738087, 5667580, 5665778, 6118380, 6227492, 6248571, 6240550, 6224470, 6474701, 6675534, 6625451, 6665399, 6727030, 6746887, 6869437, 6870050]
4209F870050J43988J01347J01721M9434K15905K71104K55035J09151O2222K64958
4199H444915J79373J89352K23713J66326J74131K54321K16853K71098K52241J14022
4189A0486345L54001K20472L93064K44736L80422M28690K70093K68296J79254
4180A3225373K99952M74168L57344O28751Q79696O39387N27440N81294Q31239
4171A8444644O08842M29335L00813K08817j74567k87613O0901K60323L43962J99177
4161B0394634M22968O20845O35527N44595O24194O74880N32228O22840Q85503
4152B5958214O64196P58863Q13879Q60155O71607J061579R98027R91624R96805
4143C3774949J383847J636364J309482J590724K044162J775581K055402K492801
$$ y = [6870050, 7014038, 7115385, 7217106, 7266540, 7482445, 7753549, 8008584, 8117735, 8179957, 8444915, 8624288, 8813640, 9037353, 9203679, 9377810, 9632131, 9848984, 10120082, 10372323, 10486345, 10840346, 11060818, 11453882, 11698618, 12079040, 12507730, 12777823, 13046119, 13225373, 13525325, 13999493, 14356837, 14985588, 15865284, 16504671, 17032111, 17613405, 18444644, 19053486, 19482821, 19783634, 19992451, 19817884, 19530271, 19591172, 19851495, 20195457, 20394634, 20817602, 21438447, 22073974, 22618569, 23242763, 23917643, 24449871, 25072711, 25958214, 26622410, 27381273, 28195152, 29055307, 29726914, 30788493, 31786520, 32778144, 33774949, 35158796, 36795160, 38104642, 39695366, 41739528, 43515109, 45570511, 48063312]
4135D8063312K256707K628448K767303K941939L151218L477086L814846L979174
4127G3080033M757528N300486N904127P327458Q556008J0378908J2307379J5130559
4119A42742486J8455565K2325925K6260577L1837879L8073673M4979116M9511287
4112C74186508M6874112L8814898K8535026P860813k1143413m0424363n0418575
4105C84285006n6076115n4342011m7059699l7805920k9098571k2104269j7190240
4098A20608181j3503875j0771867q731523p280085n935066n373226m688596m076439
4090F0247504l775432l517063l056472k584470k315235j981840j722691j681905
4082C9612396j579013j402816j150402j302746j407771j070962j173446j093845
$$ y = [48063312, 50320019, 52948467, 55715770, 58657709, 61808927, 65286013, 69100859, 73080033, 77837561, 83138047, 89042174, 96369632, 104925640, 115304548, 127611927, 142742486, 161198051, 183523976, 209784553, 241622432, 279696105, 324675221, 374186508, 421060620, 459875518, 488410544, 496271357, 475127944, 434703581, 384285006, 328208891, 273866880, 226807181, 189001261, 159902690, 137798421, 120608181, 107104306, 96332439, 87600916, 80320831, 74385765, 69012539, 64323943, 60247504, 56472072, 52955009, 49898537, 47314067, 44998832, 43016992, 41294301, 39612396, 38033383, 36630567, 35480165, 34177419, 32769648, 31698686, 30525240, 29431395]
4074B9431395r86363r79818j119555j005337j145835j015247q72426q87939p61507
4065B0657368p84914o31825q31167o53555o11706n33141m98629m62194l33447
4056A5316790k25473l16617l21845l07053m39183m20404j71117k44986m14381
4047A2455731k21196l22984j53900j92488p2682j29385k03211k44727j07290k90983
4037A0516885m21116k5650k13546k44637k68859j08621n4814k96747j85958m63977
4027H232960j97794r9912l40803k77857k93514l35160j95488m12936j06886k14452
4017E758158k06938q8461k5671j16433J23593L5470j46925j65314j97097j65072
4007D805310j70285k06474p6899l875M7901k69195j31309j02288j2866R8956k33413
$$ y = [29431395, 28445032, 27465214, 26345659, 25340322, 24194487, 23179240, 22306814, 21418875, 20657368, 19872454, 19240629, 18409462, 17755907, 17144201, 16611060, 16112431, 15650237, 15316790, 15091317, 14774700, 14452855, 14145802, 13706619, 13286215, 13115098, 12870112, 12455731, 12234535, 11911551, 11757651, 11565163, 11492481, 11363096, 11159885, 10915158, 10807868, 10516885, 10095769, 10070119, 9856573, 9611936, 9343077, 9234456, 9179642, 8882895, 8696937, 8232960, 8035166, 7935254, 7594451, 7316594, 7023080, 6687920, 6492432, 6079496, 5972610, 5758158, 5551220, 5462759, 5437088, 5320655, 5444248, 5479718, 5332793, 5167479, 4970382, 4805310, 4635025, 4428551, 4351652, 4347777, 4395678, 4126483, 3995174, 3892886, 3880020, 3978976, 3745563]
3996C745563j2390k6093k40210J73018K2195K6328N0879p2306j05069q527J35569
3985C688957p6829P4222L765O7047j05914j37845K14783m904k95711Q5827K13601
3974C726999l0169P083J5648J14503P2648j82768l0005j19266j10139j39637r8465
3963C226432j62621j12409k07286j12559j45234j01245j58856r7560j625J07749
3953B234786K31933l9487j61764k93642k7878O7204k6412q6250j1326M750j74310
3942A717604M4655l7999j85301J77407k7333j11088J35790j73230N9645J29308
3932A729458Q4929K95942j65388r4045k1492J2698k3094j56731n9334m5645O2956
3921A620254j18257Q4964J87758J46004k72337J9593K9018J9588R8388j11161
$$ y = [3745563, 3733173, 3707080, 3466870, 3639888, 3662083, 3688411, 3739290, 3666984, 3561915, 3553388, 3688957, 3612128, 3686350, 3690115, 3757162, 3651248, 3513403, 3728186, 3723282, 3427571, 3513398, 3726999, 3696830, 3703913, 3719561, 3834064, 3906712, 3723944, 3693939, 3574673, 3464534, 3324897, 3226432, 3063811, 2951402, 2744116, 2631557, 2486323, 2385078, 2226222, 2128662, 2127037, 2234786, 2466719, 2427232, 2265468, 1971826, 1943948, 2011152, 1984740, 1898490, 1887164, 1891914, 1717604, 1762259, 1724260, 1538959, 1716366, 1689033, 1577945, 1713735, 1540505, 1600150, 1729458, 1814387, 2110329, 1944941, 1850896, 1829404, 1842102, 1819008, 1662277, 1602943, 1557298, 1620254, 1501997, 1586961, 1774719, 1920723, 1648386, 1667979, 1696997, 1716585, 1814973, 1703812]
3911A703812j36541J27247q524j17976m6926j3443Q8086p0308r3227k42325l5706
3900A154169K22166o8528l0623P4756p0077K22760J37824P5018k41599j12943
3890A362923J49721j09483J31809K77581R9355K0471k05634j94434j08141Q2050
3880A506218Q6746k45997P8488j58586P9645o6871j6005P7562m7481J16328j11722
3869A298325J16678q974j49556j57792J62687n6902o4188O7305r3958K7373L4248
3858A175246J29250j28880q7502q877o0127J47455k19508J73561L1607j01195
3848A051030P5915J71377k347j45638J0045k60924O6291k06364N0337r4660J56508
3837H71570L33798k4542j4850l164q1431n1303J46923Q6173l1518J38635J07239
$$ y = [1703812, 1567271, 1694518, 1685994, 1568018, 1521092, 1507649, 1595735, 1525427, 1432200, 1189875, 1154169, 1376335, 1307807, 1277184, 1351940, 1281863, 1504623, 1642447, 1717465, 1475866, 1362923, 1512644, 1403161, 1534970, 1812551, 1911906, 1932377, 1726743, 1532309, 1424168, 1506218, 1592964, 1346967, 1425455, 1266869, 1346514, 1279643, 1263638, 1341200, 1293719, 1410047, 1298325, 1415003, 1406029, 1256473, 1098681, 1261368, 1204466, 1140278, 1207583, 1113625, 1140998, 1175246, 1304496, 1175616, 1088114, 1079237, 1019110, 1166565, 947057, 1120618, 1152225, 1051030, 1126945, 1298322, 1295975, 1150337, 1160382, 899458, 965749, 759385, 809722, 715062, 871570, 1205368, 1180826, 1165976, 1162812, 1081381, 1030078, 1177001, 1263174, 1231656, 1370291, 1477530]
3826A477530j5026L53424n3086J13617L45541L00500K46361J97525L04078M31864
3816C702328L45055K0897n7315l01567m15478l91076k32383l46812m95989N9399
3806A887059j17313l50565k83392p585N7790j12071k03686l5052O7905j22877
3796G80213q4316K5735k8708J02408r7025N223j10731j42841J60115J39737R8238
3785H48048j19225j60306m0363m3432J08129j37139K8522R7275k54151J00438
3775D27796K47363r7673j69104O922K29235r6176j638j4427J0122K00650o3957
3764F79113m6635j817N7082k2267j6231n9048k98j58608R0783j19438j9883O6251
3752D49004J12266j14661o6613J62295l5031j38682L8111j3867j10926J83851
$$ y = [1477530, 1462504, 1815928, 1762842, 1876459, 2222000, 2522500, 2768861, 2966386, 3270464, 3702328, 4047383, 4068280, 4010965, 3709398, 3293920, 2902844, 2670461, 2323649, 1827660, 1887059, 1769746, 1419181, 1135789, 1128204, 1185994, 1073923, 870237, 835185, 903090, 780213, 695897, 721632, 692924, 795332, 698307, 703530, 592799, 449958, 610073, 749810, 848048, 728823, 568517, 528154, 484722, 592851, 455712, 484234, 581509, 327358, 427796, 675159, 577486, 408382, 415304, 644539, 548363, 546725, 532298, 542420, 743070, 679113, 632478, 630661, 687743, 665476, 649245, 590197, 589899, 431291, 522074, 402636, 382753, 449004, 561270, 446609, 379996, 542291, 507260, 368578, 406689, 392822, 281896, 465747]
3742D65747J65633j00819r9144n3297j10050m9827N9214J72228k05640j1010L7764
3731B70799p1746K12085k6074q3213K04689j98597o1526J61120K1195k2996M8370
3720D54106m6467m1304j6281q4600M349o1382J21664j34474j00580K35653N6015
3709C86699m06R8213j27489N303L9752j17518n59m7781j27639J71239p5269N1555
3697B56100J28525o6736J52246j07760n1019m3104j70398N3236M5962L6958K09208
3686D43218l434Q015j17612J7058N6767R6863m9705o4468k17944J40027J93514
3675E02299k62464O4373l0951o0340J21362o7642j27789j6616l395J20196K2954
3664B61987j3733k3222R413n747Q4861R123K6931k26457j994N0091m7108M7173
$$ y = [465747, 631380, 530561, 431417, 378120, 268070, 218243, 277457, 449685, 244045, 233035, 270799, 199053, 411138, 385064, 301851, 506540, 307943, 246417, 407537, 428732, 405736, 454106, 407639, 366335, 350054, 265454, 269803, 208421, 330085, 195611, 95031, 330684, 386699, 386293, 484506, 357017, 362320, 402072, 284554, 283995, 236214, 108575, 279814, 204545, 256100, 384625, 317889, 470135, 362375, 311356, 268252, 97854, 151090, 197052, 234010, 443218, 439784, 447799, 330187, 347245, 404012, 500875, 451170, 386702, 168758, 308785, 502299, 239835, 304208, 273257, 212917, 334279, 266637, 138848, 122232, 118837, 239033, 261987, 248254, 225032, 234445, 228698, 313559, 322682, 349613, 123156, 121162, 171253, 124145, 171318]
3652A71318J64973j8549q3043J47070N519L7672J35051j29567O748j23866Q6384
3641C99710j76716J19873L2606j11190O0422l1848q0133J66386q9749q323K07430
3630D88468K6152J70787k03941n719p6140O8961m2979J04295m8342j7663k64187
3619A99692o2480K60178k7431J39658J04260j3370K1550k05879j16884J19623
3609D18917J46255j1765R308p4372J5412j02444l7699M5513O2555J94222j27244
3598E38658j32355j91639N325L29039J99529k07453l15150j19730J14278J71407
3588C91909P640q9781k03935J00488L3699J00631r5328R5793J41672j99399p6479
3577B06910n1485q4044Q5610J70132J30358r7343j4661Q3144Q8712J4351k38130
$$ y = [171318, 336291, 317742, 234699, 381769, 387288, 424960, 560011, 430444, 437192, 313326, 399710, 222994, 342867, 375473, 264283, 324705, 292857, 212724, 379110, 289361, 281038, 488468, 514620, 685407, 481466, 475747, 399607, 468568, 425589, 529884, 481542, 463879, 199692, 137212, 397390, 369959, 509617, 613877, 600507, 622057, 416178, 299294, 418917, 565172, 553407, 562715, 488343, 503755, 401311, 363612, 409125, 471680, 665902, 538658, 406303, 214664, 219989, 549028, 748557, 541104, 225954, 106224, 220502, 391909, 399549, 309768, 105833, 206321, 240020, 340651, 245323, 341116, 482788, 283389, 206910, 155425, 71381, 156991, 327123, 457481, 360138, 345477, 428621, 517333, 531684, 293554]
3566B93554K1836Q3274j15522j06639j1918J16890K6892n2418K9824L8066Q0146
3555D03985J129L4212p2920M7716k3397l58561n2643J83392P2990l0408P7938
3544B83433J68036n6534K13362N4602r9023j86651m9719N0778j43288K7849N3888
3533C16733j48089L1181J8578J8629P8036j36359J58327O0231J07573K0331o6614
3522D58557k54716P8461J91687m6945m2689o5766J22298j75429M3313J47833m9603
3511D07001k21631M0637Q9060p3531m9631j02229J76406n5616L1406o8575j6870
3500A56427J22811N8506J53992j39283j18579k1931P7258q7954p5787K14755J97284
3489E37499l1978k8437k10262n8846J55113r9409j58963K24424j4509J22509K8043
$$ y = [293554, 315390, 398664, 283142, 176503, 164585, 281475, 308367, 255949, 285773, 323839, 403985, 405114, 439326, 366406, 414122, 390725, 32164, -20479, 162913, 235903, 205495, 283433, 451469, 394935, 608297, 662899, 563876, 377225, 327506, 378284, 234996, 262845, 316733, 168644, 199825, 218403, 237032, 315068, 178709, 337036, 397267, 504840, 525171, 458557, 203841, 282302, 473989, 427044, 384355, 318589, 440887, 265458, 308771, 456604, 407001, 185370, 226007, 315067, 241536, 191905, 89676, 266082, 210466, 241872, 173297, 156427, 279238, 337744, 491736, 352453, 233874, 211943, 289201, 201247, 125460, 340215, 537499, 505521, 477084, 266822, 207976, 363089, 263680, 104717, 329141, 314632, 437141, 465184]
3478D65184p0298k3953N5256N600p3264O2792p886M6181j4901j90752r0048J47347
3466C11258J82956J12828Q7824j01590j35262J64181P5078j28133Q3554J59344
3456H12038j1962j23985j02693K66313Q8020P9405N508j20806r4179k70169J17485
3445F44975p3553Q4859N8540j43241k1637K4184j37926k9365j07031r4171Q9364
3434B94998n0645J88928l3516Q6314j63298O3041K75789L5512j25958J46183K21920
3423I39268L5303j9360J18965P0760J76378J19693j37242j58689j15673k15029
3413H14374p4803j01391N121m1744l7570L1783Q3070r4091j96310k014m7391J28236
3401D67270J01868j201n6185o5431J3715N6102j4573O7268J05653j1911M7373
$$ y = [465184, 394886, 370933, 426189, 431789, 358525, 421317, 413431, 459612, 444711, 253959, 163911, 311258, 494214, 607042, 694866, 593276, 458014, 622195, 697273, 569140, 652694, 812038, 800076, 676091, 573398, 839711, 927731, 1007136, 1012644, 891838, 797659, 527490, 644975, 571422, 656281, 714821, 571580, 549943, 574127, 436201, 406836, 299805, 205634, 294998, 244353, 433281, 399765, 486079, 322781, 385822, 661611, 697123, 571165, 717348, 939268, 974571, 955211, 1074176, 1144936, 1321314, 1441007, 1303765, 1145076, 1029403, 814374, 739571, 638180, 643301, 601557, 563987, 595770, 678840, 584749, 388439, 386425, 339034, 467270, 569138, 567937, 511752, 446321, 460036, 516138, 501565, 568833, 674486, 662575, 709948]
3390G09948M0181n330J56818o2574p2376j08829P1526J4433q0398R1274j10870
3379F43803n9287j7405l945O6772p1246j35195K02255O9219k1546n5636k3571
3368E94218M5846j55031J10095j69862R4773q1004J00261p2148M4650j21403J2951
3357D03346K26559m0522k26461n9347K15446R7582J10460r9056J6069n4185R4388
3346F84279j57537J06410k9580q3738P1270J279K2153R7465J27767o5838j26710
3335F47220O2133K37752m529o5152J26480k2834J00236J0159Q2054r165m4395
3324A119959m2134J59478K12962K06523j8227J68282m1580k0094K8568k36245
3314A537492j15862l9510J60312K9705j05600N6040L2075j47482K04227j58772
$$ y = [709948, 750129, 744799, 901617, 839043, 766667, 657838, 729364, 743797, 663399, 754673, 643803, 584516, 567111, 563166, 629938, 558692, 423497, 625752, 694971, 673425, 617789, 594218, 640064, 485033, 595128, 425266, 520039, 439035, 539296, 467148, 511798, 390395, 403346, 629905, 589383, 362922, 303575, 519021, 616603, 727063, 628007, 644076, 589891, 684279, 526742, 633152, 603572, 519834, 591104, 592383, 614536, 712001, 839768, 773930, 647220, 709353, 947105, 942576, 877424, 1003904, 981070, 1081306, 1091465, 1173519, 1164354, 1119959, 1077825, 1237303, 1450265, 1656788, 1638561, 1806843, 1765263, 1745169, 1773737, 1537492, 1421630, 1382120, 1542432, 1572137, 1466537, 1522577, 1554652, 1407170, 1611397, 1452625]
3304A452625o5857L13032j4460N0598J49469R9557J11298J56666j3184k37585
3294B002159M4718L39024K63721J04060m6558J92121L87618K17667M8929j31388
3284C422071O2008p0284j98826k27764j18144j63586P5025J51243J42322K89145
3274C363210J605j27414o7583j75266j88268J27338J18660j59687J18647K05052
3264C216294J53185O4455J89204L06460Q3777K83610K66147R1250J63021j32155
3254D685248Q195m22576j76251J00485j01569L2362k61989Q5327J57289o932J96865
3243D296454k8110m3368m73374l93795m73938m89019k87106n3170J36573j74851
3233B016296j11587M8248j89589j53097J28367P6720K10290p8907o0112o0851
$$ y = [1452625, 1386768, 1699800, 1685340, 1735938, 1885407, 1984964, 2096262, 2252928, 2239744, 2002159, 2046877, 2385901, 2649622, 2753682, 2707124, 2899245, 3286863, 3504530, 3553459, 3422071, 3484079, 3413795, 3214969, 2987205, 2869061, 2705475, 2780500, 2931743, 3074065, 3363210, 3364815, 3237401, 3169818, 2994552, 2806284, 2933622, 3052282, 2892595, 3011242, 3216294, 3369479, 3433934, 3623138, 3929598, 4013375, 4296985, 4563132, 4654382, 4817403, 4685248, 4693443, 4270867, 4094616, 4195101, 4093532, 4125894, 3863905, 3949232, 4106521, 4099589, 4296454, 4268344, 4224976, 3751602, 3357807, 2883869, 2394850, 2107744, 2054574, 2191147, 2016296, 1904709, 1952957, 1763368, 1610271, 1738638, 1815358, 2025648, 1946741, 1886629, 1825778]
3223A825778O271p2919l7501L9930L3408K2100q8008J67093M4239j04347K06480
3212B042524K57807K40561J9305k57058n8790j11115k36056j64463j93397R9317
3202A638635O559J84521p6473k22088j00102j90404o5592N5865L471J71972O1797
3191A468161P3039j30848o6144m8510j48006L76392j55974k09434m2025r0289
3181A026362N7716J20313P4723j28843j24443R2670k13336k9779J21444J72391
3171A169218R7697l75831M7647R8271L6721j92375M2454K8627J30927j75657n1021
3160H56678O7290J59051L7757P9500M7292k55854J11098L4945n2538k74560p1958
3149G38701J13734j08695j32294k5472N1174K3845m66O5987l2J9954o7245K9219
$$ y = [1825778, 1832049, 1759130, 1721629, 1761559, 1794967, 1817067, 1729059, 1896152, 1940391, 1836044, 2042524, 2300331, 2540892, 2560197, 2303139, 2244349, 2133234, 1897178, 1732715, 1539318, 1638635, 1645194, 1829715, 1753242, 1531154, 1431052, 1240648, 1175056, 1230921, 1234392, 1406364, 1468161, 1541200, 1410352, 1344208, 1295698, 1147692, 1524084, 1368110, 1158676, 1116651, 1026362, 1084078, 1204391, 1279114, 1150271, 1025828, 1118498, 905162, 875383, 996827, 1169218, 1266915, 891084, 938731, 1037002, 1073723, 881348, 923802, 952429, 1083356, 907699, 856678, 923968, 1083019, 1120776, 1200276, 1247568, 991714, 1102812, 1137757, 1085219, 810659, 738701, 852435, 743740, 611446, 585974, 637148, 660993, 660527, 726514, 726482, 746436, 679191, 708410]
3137G08410k03542L4938K10326J5530j57288q8197m0447K43299J43507o1792n5167
3126G49577r7842j45037r7070m057J30607j6971j93439M5583J27863j57292Q77
3115C42799j92109K6798K00447j01404P61M101p9115J41527j10856j9986J30821
3104C43784j91014O1502O2328l5447P9903J30621o9414p3359l5289K9626l912
3093B99329o4237J11397k6712j34474r078J01787r9584R837K04271n837K0322
3082D07021m4096J35637r7493N9747p1640q1316k45464j05618J54592q6476n516
3071A9378N6984J91897J45541j22446r3004o7982J11319j99714j00857R8488j02677
3060f3073J98109J11574J6058k78872N0720R1663Q8053p78j95904O3581l0006
$$ y = [708410, 504868, 539806, 750132, 765662, 608374, 520177, 479730, 723029, 866536, 804744, 749577, 651735, 506698, 409628, 405571, 536178, 519207, 325768, 371351, 499214, 341922, 342799, 150690, 177488, 377935, 276531, 277292, 281393, 202278, 343805, 232949, 212963, 343784, 152770, 214272, 276600, 241153, 321056, 451677, 382263, 308904, 273615, 303241, 299329, 235092, 346489, 319777, 185303, 176225, 278012, 178428, 188265, 392536, 386699, 407021, 362925, 498562, 401069, 460816, 389176, 307860, 62396, -43222, 111370, 24894, 19378, 76362, 268259, 413800, 291354, 198350, 130368, 241687, 41973, -58884, 39604, -63073, 135036, 246610, 262668, -16204, 34516, 126179, 214232, 213454, 17550, 81131, 51125]
3049E1125j27366p1344K66063K39794j2818p7722j07609R5308J2146k59156r0721
3038h2300m1638j05052K58451j21871l3236M533J39284J07842j08866J62374j53058
3027B6463j8659l7143k68J24791j57535m6287J41055J62905J61735k67051j64528
3016g4522k3771J41847N6630j49121n2087Q7034J71396k24938O6444p8518J05535
3005B5929J8403j28462Q4001L06485j55200j33222J05953M4960J01433k58585
2995A1695J93174L4745p0136j17979L8827J16644N6788m814j93109o8602o7892
2984g0659K15722K98102o9991j04661N5465K5986j21310j91136J8823J71696o7240
2973A60797o5162j75270L2564J0990k2649m9391j08985K44027L03959j22987l5669
$$ y = [51125, -76241, -147585, 118478, 358272, 345454, 267732, 160123, 255431, 267577, 8421, -82300, -123938, -228990, 29461, -92410, -125646, -121113, 18171, 126013, 17147, 179521, 26463, 7804, -29339, -29607, 95184, -62351, -108638, 32417, 195322, 357057, 90006, -74522, -98293, 43554, 100184, -48937, -101024, -13990, 157406, -67532, -1088, -79606, 25929, 44332, -84130, -129, 306356, 151156, 17934, 123887, 168847, 270280, 11695, 204869, 239614, 169478, 51499, 90326, 206970, 263758, 258944, 65835, -2767, -70659, 145063, 443165, 373174, 268513, 323978, 349964, 228654, 37518, 56341, 228037, 160797, 95635, -79635, -47071, -36081, -58730, -108121, -217106, 26921, 330880, 207893, 172224]
2962A72224J3300p789p0179K6103r2247J25940r886J4796L8992j00774j72565
2951f2085j03612J59743R0469M7215K88n7813r2909j2878n5685m2359j16957K73127
2939B6544K92893L8733r7925o3985k76699J2924J41260l243K5528J82137o6361
2928B11806o5053j16507m0804J80343j4537j647J71242P3959r2942l9978Q621
2917B74503q4379J24098J05635k27898n8207l6049O765L3144O7929j07289m5657
2906E2595Q9172q1073O3560Q3721l483N3507k05380k19142J28928J33570J12575
2895B08550J45406m888k54045j34980M6484J09471j12529k7549J54784k6073N9128
2884A63759R9915N4555j67396j31021O6208P8201J16348j42461k2533J3054K5512
$$ y = [172224, 185524, 177735, 107556, 133659, 41412, 167352, 157466, 172262, 211254, 110480, -62085, -165697, -5954, 84515, 131730, 132018, 74205, -18704, -31582, -87267, -129626, -246583, 26544, 319437, 358170, 260245, 196260, -80439, -67515, 73745, 70502, 96030, 278167, 211806, 146753, 30246, -10558, 169785, 155248, 153601, 324843, 398802, 305860, 265882, 274503, 190124, 314222, 419857, 191959, 133752, 97703, 104468, 137612, 205541, 98252, 52595, 141767, 60694, 124254, 207975, 204492, 257999, 52619, -166523, -37595, 95975, 208550, 353956, 349068, 95023, -39957, 6527, 115998, 3469, -24080, 130704, 104631, 163759, 263674, 318229, 150833, 19812, 86020, 164221, 280569, 138108, 115575, 128629, 154141]
2873A54141J4437p6732J58166r7718k53325m1178J0267J89269K81235K3289j63390
2862A98461k1479p0962K6459J12046j43364l4850l9066L5819j43000Q0637K38347
2851B39048j27990j47227l47646J06529J47881R1639j27856J02363M1462j30604
2841a52401N142M8708J260k7041K5342O8566J91900j16101j96267j85420N4078
2830b82234J74977P1495j18783j84307m7381J90105j8646o5630R7415J10457p5857
2819a48389k2023o8417P3242N0386L5358Q7244M0741j974j4067j20584K1598J48854
2807H1969j74887j34641m3401Q6943J10916n1329m174J28803P7616q1861j10863
2796a14909j01631K49478j30933j99769J48722K74348p6344j79997k05714J53091
$$ y = [154141, 168578, 91846, 250012, 152294, -101031, -142209, -131942, 57327, 338562, 361851, 198461, 176982, 106020, 132479, 244525, 101161, 66311, 27245, 63064, -79936, 701, 239048, 111058, -36169, -383815, -277286, -129405, -37766, -165622, -63259, -21797, -152401, -147259, -98551, -97291, -124332, -98990, -30424, 161476, 45375, -150892, -336312, -282234, -107257, -35762, -154545, -338852, -386233, -196128, -214774, -280404, -182989, -72532, -148389, -170412, -238829, -165587, -115201, -79843, 7401, 48142, 46168, 32101, -88483, -66885, 81969, -92918, -227559, -270960, -184017, -73101, -124430, -128604, 199, 77815, -4046, -114909, -216540, 32938, -97995, -297764, -149042, 125306, 48962, -131035, -336749, -183658]
2786a83658N7600k6373J00013j00802m9071n5729p6980m1772J20776J11461K2483
2775a22052R0744O3128l88736k4908P4419J05998J02275K5984p5527P9633q6753
2764a55795o0711k264J19213Q957k17072J75923J7032r3492Q6937N2801J4570
2753e3901j6665q3476r2425J6988Q757K5699J65716n2707l9320o0462j12548J41276
2741a53068J12196k25390m4633J20606J67447k4314q2818q1639r51J72413Q8348
2730D8197m1962j6655o0343k3451o9847j25610M8777n6271k3127J74609J92706
2719D7023k56776j9270p3514K0924L2845M8811j0681p1241J01062J46902o0439
2708i4354M0155o6023j67509K9323n6833R5622J54237l593q2466M4428j64569
$$ y = [-183658, -126058, -152431, -52418, -153220, -202291, -258020, -335000, -376772, -255996, -144535, -122052, -31308, 31820, -356916, -381824, -307405, -201407, -99132, -73148, -148675, -69042, -155795, -216506, -218770, -99557, -90600, -307672, -131749, -114717, -208209, -121272, -68471, -53901, -70566, -154042, -246467, -229479, -220722, -195023, -29307, -82014, -121334, -181796, -294344, -153068, -40872, -266262, -310895, -190289, -22842, -47156, -129974, -211613, -212564, -40151, 48197, 6235, -10420, -70763, -94214, -164061, -289671, -240894, -297165, -320292, -145683, 47023, -209753, -229023, -302537, -281613, -248768, -199957, -210638, -281879, -180817, -33915, -94354, -54199, -120222, -287731, -258408, -315241, -219619, -65382, -68975, -151441, -107013, -271582]
2697b71582K9587j1138O7784j22651j84133J22591K48179J7911q157J11668k10178
2686b10119J15622j96813J68799L5318j63878K12995j10946j86755Q0969J39754
2676a15054L4257j8847J783J06569n6142m4496j60434J0910O4027j24659J19630
2665a82456j69008N2461K41089R8295j81392j14218K14255J24486j47779q6812
2655a51079m4730J1591P1463R064k407j5568K1389N9315M2649J0008L2742j40147
2643i5710o5116o3509K08410j52164n6229j46568k476O8905K25723q2387j19881
2632b81002o2358O4543K26473j40988J13652j69587Q6932K17774q5431n3833l40485
2621d24310l0240K08430L7524o9163J89481J16592N0715j51137n4094J30810r9284
$$ y = [-271582, -241995, -253133, -185349, -308000, -492133, -369542, -121363, -103452, -111609, 59, -210119, -94497, -291310, -122511, -87193, -251071, -38076, -149022, -335777, -254808, -115054, -80797, -99644, -97861, 8708, -47434, -91930, -252364, -241454, -177427, -302086, -182456, -351464, -299003, -57914, 40381, -141011, -255229, -40974, 83512, -64267, -151079, -195809, -184218, -112755, -103691, -106098, -121666, -100277, -40962, 1687, 11695, 44437, -95710, -160826, -224335, -15925, -168089, -224318, -370886, -373362, -304457, -78734, -161121, -281002, -343360, -278817, -52344, -193332, -79680, -249267, -162335, 55439, -29992, -83825, -424310, -454550, -246120, -208596, -277759, -88278, 28314, 79029, -72108, -126202, 4608, -94676]
2610i4676q3414n9066K61471M9039o961J0388j42259o5223L8174Q2568p5571r8311
2598a83841J45623k1261p0922K1271o68O498N4097l06131j28471J25212L2211
2587c26382N51J04969J13726o4299j21431O0413J41977m8542M8126n9785P1587
2576g9090l6042M2090K15470k14445j09116p549O8900o2677l9170N0981J48476
2565b2172n9679l09815n1369J79110J90738j25678k3392o8459J5792j696J151
2554b75469l9127Q7068p6804J90804J06969k02896L3374P8874n6530m587p3651
2543b31975r3078J72253O4315R9597O2206k92236J6967m087N6803R8325r5887
2532a46797N7918j10268K6977J06109L9233n2903J49781O1279M9779j80018j07995
$$ y = [-94676, -178090, -237156, 24315, 73354, 66393, 76781, -65478, -130701, -92527, -9959, -85530, -183841, -38218, -59479, -130401, -109130, -109798, -103300, -49203, -355334, -483805, -358593, -326382, -325831, -220862, -107136, -171435, -292866, -232453, -90476, -139018, -90892, -150677, -79090, -115132, -73042, 142428, -72017, -181133, -188682, -119782, -182459, -221629, -170648, -22172, -81851, -391666, -443035, -263925, -73187, -198865, -222257, -290716, -274924, -276620, -275469, -314596, -227528, -304332, -113528, -6559, -209455, -176081, -97207, -153737, -158324, -231975, -325053, -152800, -88485, 11112, 73318, -218918, -201951, -206038, -149235, -50910, -146797, -88879, -199147, -172170, -66061, -26828, -79731, 70050, 131329, 181108, 1090, -106905]
2521a06905l39948l6134J98883O6273j43063j32750L20059q259j11763q8261O9540
2510c12328Q6158J1175N4153l8982p5155J7962K36462j66525Q2737k645M2017
2499f4971j07758j6296J71297p1703r8523L0696Q0066J1063j28863j88213p0263
2488d53468K13462J56497P0098o3398j65221m7527K00102J32336j12934k72296
2478c42349Q6981o2787j339J31468l31260K52886K60422r6004L4011K17841R2256
2467B42126l1289l09595l1247J6947k2238o9330K73670j5166j17356o6145K2043
2456a07580Q8720R4591j57290L5264N1373M5248k5754r9803l7363N9024j6191
2445f9761r005N2319k2982M7587L8596q8784j7493N0970r2331j35110R0636M2230
$$ y = [-106905, -446853, -482987, -284104, -217831, -360894, -493644, -173585, -181844, -293607, -381868, -312328, -226170, -214995, -160842, -199824, -274979, -257017, -20555, -187080, -104343, -106988, -64971, -172729, -189025, -17728, -89431, -187954, -157258, -77192, -66129, -194992, -383205, -453468, -240006, -83509, -13411, -76809, -242030, -289557, -89455, 42881, -70053, -342349, -255368, -318155, -319494, -188026, -519286, -266400, -5978, -101982, -67971, 149870, 242126, 210837, -98758, -130005, -113058, -135296, -204626, 69044, 53878, -63478, -129623, -107580, -18860, 75731, -81559, -46295, 5078, 50326, 24572, -75231, -112594, -53570, -69761, -78766, -26447, -49429, -1842, 36754, -52030, -69523, -18553, -110884, -245994, -155358, -113128]
2433a13128l1151R105n9056M702j30987k342N0458P4641L5076P083r5369R4308
2421a56660J28295J49715R6646j82052j08020K06461j17849q7007j22475J47286
2411d5660J62578j69263j46556R1660K38050O3663M8097P8049r6549j15759O7362
2400A75672r0912O9870O0853o9442j83738P4610J20883Q9999K71151j00737q6969
2389C31240K66731O8181n4124J3551P2878j48721j22796K8250j56161n2883o4444
2378A81702k26109J994J95237p4318J53122J2813q2533j06979J61730p8919j40038
2367b298Q1986n1187L0817j08135J77770j66222p3521J04556J06086o6498l0881
2356B473n833q7708n6074Q2792K12070j30130J15077j36529m8068J95277m0824
$$ y = [-113128, -144279, -135174, -194230, -189528, -320515, -322857, -272399, -197758, -162682, -155599, -250968, -156660, -28365, 121350, 217996, 35944, -72076, 134385, 16536, -70471, -192946, -45660, 116918, -52345, -198901, -107241, 130809, 194472, 242569, 320618, 224069, 108310, 175672, 84760, 154630, 215483, 146041, -37697, 36913, 157796, 247795, 518946, 418209, 331240, 597971, 666152, 612028, 625579, 698457, 549736, 426940, 455190, 299029, 246146, 181702, -44407, -42413, 152824, 78506, 231628, 244441, 161908, 54929, 216659, 137740, -2298, 79688, 28501, 59318, -48817, 128953, -37269, -110790, -6234, 99852, 33354, 2473, -3360, -91068, -147142, -64350, 147720, 17590, 132667, -3862, -51930, 143347, 102523]
2345A02523J75842l08892p1578K1920q0595o389j987J01379r737K74121J95598
2334C92205k72159n5836O4963j01279J26860n6836J27739N8493j1171J4366j32870
2323A54475l3704R0606r516k13715n776K44696p1473j99523j9768J63675J20325
2312B20302j6603J11259K68150k57880k40970N1890J32774J3470K3126q4235M4853
2301B66136J15664k35646q145J39386K59260J7551M360N4290j70558q8124q0718
2290B73456m7533J91944J40725O7664j12546j19284n5062M6645Q4606k8932l9335
2279D02348q967R7268j00813P228p9643l3884r026K9599J63588L8306j14201n9008
2267C32795M2784Q393J27826O9231P7944j14368q6650K58407r7405o0442J36507
$$ y = [102523, 278365, -30527, -102105, -80185, -160780, -167169, -169156, -67777, -77514, 196607, 392205, 120046, 64210, 129173, 27894, 154754, 97918, 225657, 284150, 272979, 287345, 154475, 120771, 211377, 201861, -11854, -17630, 227066, 155593, -43930, -63698, 99977, 220302, 203699, 314958, 583108, 325228, 84258, 136148, 268922, 282392, 305518, 221283, 266136, 381800, 146154, 138009, 277395, 536655, 554206, 558566, 612856, 442298, 354174, 273456, 225923, 417867, 558592, 626256, 513710, 394426, 339364, 386009, 470615, 441683, 402348, 393381, 490649, 389836, 397064, 317421, 283537, 274511, 304110, 467698, 506004, 391803, 332795, 375579, 383972, 511798, 581029, 658973, 544605, 457955, 716362, 618957, 558515, 695022]
2256F95022K789l10088P6368K40775P4189j90516k0604J19079p6837n3196k2854
2245E34127J65052L8394k22913l0664K26414L5582J73678r9084j9373j10513j78050
2234E12650J21880K42153R3283o4744q2013O9886L5987L6412j67586J91609P7037
2223A066554M8295j98712j99634O2098K24063K60429L6006q9022J42645n6385
2213A296337J01527N8400L5874K4044j21684K55934P3175j97313p6895j018P5801
2202A524182J07732M7213Q8303j10537j1374K11882L5765J06685Q8031q283J22358
2191B201957N5265M9167j43852J8629J41845K75695K4199k776q6168J13573J27247
2180B774781K24631K31358J20674p0693J00962J45472M4692O1269P2592j9204
$$ y = [695022, 697811, 387723, 464091, 704866, 779055, 588539, 567935, 687014, 610177, 556981, 534127, 699179, 737573, 514660, 483996, 710410, 745992, 919670, 820586, 801213, 690700, 512650, 634530, 876683, 969966, 905222, 823209, 893095, 929082, 965494, 797908, 989517, 1066554, 1114849, 916137, 716503, 778601, 1002664, 1263093, 1299099, 1210077, 1352722, 1296337, 1397864, 1456264, 1492138, 1516182, 1394498, 1650432, 1723607, 1526294, 1449399, 1448381, 1524182, 1631914, 1679127, 1767430, 1656893, 1645519, 1857401, 1893166, 1999851, 2087882, 2079599, 2201957, 2257222, 2306389, 2162537, 2181166, 2323011, 2598706, 2622905, 2620129, 2533961, 2647534, 2774781, 2999412, 3230770, 3351444, 3280751, 3381713, 3527185, 3571877, 3633146, 3705738, 3686534]
2170C686534J50618L18704J68959K48711j59887j7284L79624K38982J80598n6087
2160E139472K80091K3030M3014L90126J91397L40304K29067M20117L23273L09830
2150G689721L30684N10532L96209K55789L49534O22640P61241N78252P08216P43784
2140A2946602O43804J081245J008404J062705J532961J575898J053189J257290
2132B2162098J811061K303287K793190L781007M446335N747346O935608Q701098
2124E8681030J0098270J1867206J5840789K0836290J2440288j2927496k2678052
2117I4158325k0641327j6376948j0847386p918835o036064m682586l456447k482039
2109B1716693j737660j457221j219920p40870q59316j152658j271173j233383
$$ y = [3686534, 3837152, 4155856, 4324815, 4573526, 4413639, 4396355, 4775979, 5014961, 5195559, 5139472, 5419563, 5442593, 5485607, 5875733, 6067130, 6407434, 6636501, 7056618, 7379891, 7689721, 8020405, 8530937, 8927146, 9182935, 9532469, 10155109, 10916350, 11494602, 12202818, 12946602, 13590406, 14671651, 15680055, 16742760, 18275721, 19851619, 20904808, 22162098, 23973159, 26276446, 29069636, 32850643, 37296978, 43044324, 49979932, 58681030, 68779300, 80646506, 96487295, 117323585, 129763873, 116836377, 94158325, 73516998, 57140050, 46292664, 38373829, 32337765, 27655179, 24198732, 21716693, 19979033, 18521812, 17301892, 16561022, 15701706, 14549048, 13277875, 12044492]
2101A2044492r15708q64367q73608p39453k98766k12647l10434m08539l29237
2092G091733m26781m1304j92703l25907k31878p1034m50857k46587k2198k19201
2082D863283k77237j81895j00089j30379k63887k47853j76230k05898L2749P0652
2072C383216r6055k58220j15093J41189k07964L754j60403Q8977l01193O0819
2062B539027Q6033j44985j22525r6427o0000O5016j95236j67634q4921O9311N2412
2051A940071p3383O0236k041N8076k46799k8357J5823K676j9734j00598l08587
2040A297383J54498L14019j03878j99786j02506j22666j18972o0133J5101j7089
2030A055971j34796q3263o0964j19324r6382J04855q7267R4146K14570j02625
$$ y = [12044492, 11128784, 10264417, 9390809, 8651356, 8352590, 8139943, 7829509, 7420970, 7091733, 6664952, 6623648, 6430945, 6105038, 5873160, 5802126, 5351269, 5104682, 5082484, 4863283, 4586046, 4404151, 4304062, 4173683, 3909796, 3661943, 3485713, 3279815, 3312564, 3383216, 3287161, 3028941, 2913848, 3055037, 2847073, 2850827, 2690424, 2779401, 2478208, 2539027, 2625060, 2480075, 2357550, 2261123, 2201123, 2266139, 2070903, 1903269, 1818348, 1887659, 1940071, 1866688, 1926924, 1924883, 1982959, 1736160, 1707803, 1723626, 1726302, 1706568, 1605970, 1297383, 1451881, 1765900, 1662022, 1462236, 1359730, 1237064, 1118092, 1057959, 1073060, 1055971, 921175, 837912, 776948, 657624, 561242, 666097, 578830, 672976, 887546, 784921]
2020G84921j66743L994j31330P8332J91384j15486l6705L7260k37086j93561J33697
2009C48677k83R2248J13343k912j46539J12233r0149j56471P8954K30272j30569
1998D48804j80792O5818J15076L121j5980j24043l4024J4097K708K5684j22775
1987A97694J41106j20328J04335Q9130j5955k8053J32917o1468j91845R6066m5237
1976B98362O7569l0520O728J91028j86036k10740R9914q9761K12715j30809J23399
1965C51849Q2451j75574J15458J0323k41428M3266j66165O7531J16524Q4351l00905
1954a2319O6651n6323j65361J36545Q2318R4543k1288Q927j18701J52439n6744
1943A10687j04245N5372J43194k1885n5363J40192L2128k6360J37582r4331l3539
$$ y = [784921, 618178, 622172, 490842, 569174, 760558, 645072, 608367, 645627, 408541, 214980, 348677, 348394, 440642, 553985, 551073, 404534, 516767, 426618, 270147, 349101, 579373, 448804, 268012, 333830, 448906, 452027, 436047, 312004, 277980, 292077, 294785, 320469, 197694, 338800, 218472, 322807, 411937, 395982, 367929, 500846, 439378, 247533, 343599, 298362, 365931, 335411, 342139, 533167, 347131, 136391, 236305, 146544, 359259, 228450, 351849, 434300, 258726, 374184, 384507, 143079, 186345, 20180, 87711, 204235, 288586, -12319, 54332, -1991, -167352, -30807, 51511, 146054, 124766, 133693, 14992, 167431, 110687, 6442, 61814, 205008, 183123, 127760, 267952, 300080, 273720, 411302, 316971, 283432]
1932B83432N3801J2534j63286k9712Q3494k769K7197L4731j18709K33374k7813
1921C86274j49617j3518k33771R7516p8398j88929K49820O5857j45186R601P0903
1910G0552K8181Q7910o3878k31348Q0320J34873l8758l5372J29664j8555l9038
1899A04551j38889r8738k0577n0996J31169j10636L2950l53O3829K67263J26862
1888C06435j03821j15544N2663m0098m3250Q9020M914j23939m2993J17537k4133
1877G6791P9185j47611r8570k06217J17514L3742J2766M7405J59711j47983M1662
1866c1605J40066l1901k05119j43753K9380j8568J73857O7376k1345K70909l230
1855B26067l4797Q5754L03798K26521r3244q4910k01931q3023q4050k4822M1204
$$ y = [283432, 337233, 349767, 186481, 156769, 240263, 237494, 264691, 299422, 180713, 414087, 386274, 236657, 223139, -10632, 86884, 8486, -180443, 69377, 135234, -9952, -351, 70552, 98733, 186643, 122765, -108583, -28263, 106610, 67852, 32480, 162144, 143589, 104551, -34338, -133076, -153653, -204649, -73480, -184116, -151166, -151519, -87690, 179573, 306435, 202614, 87070, 139733, 99635, 56385, 145405, 150319, 26380, -16613, 100924, 76791, 155976, 8365, -90205, -296422, -178908, -145166, -132400, -84995, 74716, -73267, -31605, 108461, 76560, -128559, -272312, -242932, -261500, -87643, -20267, -41612, 229297, 226067, 191270, 277024, 580822, 807343, 714099, 629189, 427258, 344235, 260185, 235363, 276567]
1844B76567J62471k02463l39072k5185J65083j53305K6195j57722K5999J51802
1834f9630q19Q839j275M1616J59287O576j65833j33466J96017K0233k0806m9986
1822i247K1638K6893q7282j09445Q3444n8561j65242K88197K10732n9701o7324
1811G4102J5393J319j86932P9775J8035j46103K4058l4392o6943K38237R8111
1800A14660P9272l3384j13968m4807O0301k21300J85995j11886j49208J9337j45649
1789c60637J13069M4689K36425J22985j93059j85727J45630J03694j60487o6349
1779a99767J17179j94090K9931j7677k7973Q8197J72233j7477m6952o7356r3425
1768b57177K54438p895j16999O6626J04389j66190j23209K01909q6191k4372J09467
$$ y = [276567, 439038, 236575, -102497, -127682, 37401, -115904, -89709, -247431, -221432, -69630, -70449, -61610, -62885, -21269, 138018, 144594, -21239, -154705, 41312, 61545, 40739, -9247, 12391, 39284, -47998, -157443, -73999, -132560, -297802, -9605, 201127, 141426, 74102, 89495, 90814, -96118, -16343, 1692, -144411, -120353, -154745, -221688, 16549, 114660, 193932, 160548, 46580, 1773, 62074, -159226, 26769, -85117, -234325, -214988, -360637, -247568, -202879, 33546, 156531, -36528, -222255, -76625, 27069, -133418, -199767, -82588, -276678, -246747, -264424, -292397, -204200, -31967, -49444, -96396, -163752, -257177, -2739, -10634, -127633, -61007, 43382, -122808, -246017, -44108, -130299, -154671, -45204]
1757d5204K0578k58J6072j01259j7069j21513M1489M6282J03318l3387j99575
1746b90526L9309Q0696j36672j0719J98415J56952k01256M5095J58844r4098l6197
1735i0157j64834R9337j0697M7659o8890k79839J31517N2736J6748K83724k7495
1724a0191k55746j5899J00659J62041J50490k73071m5814J26826J39449j99608
1714a20864M721J83064m3018J94934q0281j57147j41866N916j17455Q3945K15446
1703B7395o4424n1970J20156J80356o7190j50529n0298p8283J40394L3834j49668
1692a10227j18085R586J56876j07844L4190Q2047Q5891n6835r0796K6020r4013
1681a83190m3661r4967L7969J05509Q8552K0808j45568J25998r251q9707M2376
$$ y = [-45204, -24626, -24884, -8812, -110071, -127140, -248653, -207164, -160882, -57564, -90951, -290526, -251217, -170521, -307193, -317912, -119497, 37455, -163801, -118706, 40138, -53960, -90157, -254991, -155654, -166351, -118692, -187582, -467421, -335904, -283168, -266420, 17304, -10191, -265937, -281836, -181177, -19136, 131354, -141717, -187531, -60705, 78744, -120864, -116143, 66921, 23903, 218837, 138556, -18591, -160457, -154541, -271996, -188051, 27395, -37029, -88999, 31157, 211513, 144323, -6206, -56504, -134787, 5607, 39441, -110227, -228312, -218726, -61850, -169694, -135504, -53457, 32434, -24401, -115197, -89177, -183190, -226851, -321818, -283849, -178340, -89788, -68980, -214548, -88550, -97801, -187508, -145132]
1670a45132k0453o801J21091m9763j27910K39714n6053m5294J6215R8986K1137
1659D5737n5183o3806J09779p703o4799q5871J01850j90890J26288M1159j80630
1648b24069j7027o0630K16111n2026p3318M0900J66073L4976j49202n7976q7754
1637b63942R9541L47K3741Q8230r7954J09875q1991J60783j37679j52176J25451
1626a25774p8822N1868J46788J53057j47408j82623J10087j72567m4540K91408
1616A474O9030K3749j20535q6169j3881j27904O1563K68132j05905r2120O6367
1605e6199P8189J7851k03371K54535k58768M3793L51848M0195k24358l1366J73904
1594A86253j28243p9084J48171j67746k72673J1194J5761n9095L7240K775J94793
$$ y = [-145132, -165585, -172386, -51295, -101058, -228968, 10746, -45307, -90601, -74386, 24600, 45737, -9446, -73252, 36527, 28824, -35975, -121846, -19996, -210886, -84598, -43439, -224069, -241096, -301726, -85615, -137641, -210959, -170059, -3986, 30990, -118212, -176188, -263942, -164401, -164054, -140313, -52083, -150037, -40162, -122153, 38630, -99049, -251225, -125774, -204596, -152728, -5940, 147117, -291, -182914, -72827, -245394, -289934, 1474, 70504, 94253, -26282, -112451, -126332, -254236, -192673, 75459, -30446, -122566, -56199, 21990, 39841, -163530, 91005, -167763, -123970, 227878, 268073, 43715, 12349, 186253, 58010, -21074, 127097, -40649, -313322, -302128, -286367, -345462, -308222, -305447, -110654]
1583a10654j8530P4836R5629J61263j34931l10183L2777J42701j01024j2853j4663
1572a95632Q6909m7816n3444N9285m6335Q951O2313n663k846k2576q4084k9469
1560b70407p710n3615J6731J35239O0754K9933p8726J7115P9499N0668M5562j05378
1548h0335N5863k3732l05546j08884J23914J50746k794r6956j0275O7912O1764
1537a68323J44603J6215l6015k21818j87708q6281L85704k06359r6769J58426
1527b98325N6272j9155k8784j87505K37661J77705j01501J968J78757O2034K6178
1516A05305j04646p7078j56735J30168j78939J03997K11823j06742k3074N5700
1506d0221p7617r3741L8111R7241L1442K670k8618k8M242R2549j34929o5366J22030
$$ y = [-110654, -129184, -54348, 41281, 202544, 67613, -242570, -209793, -67092, -168116, -180969, -195632, -108723, -156539, -209983, -150698, -197033, -188082, -125769, -131432, -134278, -156854, -240938, -270407, -278117, -331732, -315001, -179762, -119008, -89075, -167801, -150686, -71187, -20519, 25043, -80335, -24472, -48204, -353750, -462634, -338720, -187974, -190768, -287724, -297999, -230087, -168323, -23720, -7505, -43520, -265338, -453046, -539327, -153623, -359982, -456751, -298325, -242053, -261208, -289992, -477497, -239836, -62131, -163632, -161664, 17093, 79127, 105305, 659, -76419, -233154, -102986, -281925, -177928, 33895, -72847, -95921, -40221, -117838, -211579, -173468, -76227, -44785, -42115, -70733, -70761, -66519, 26030, -108899, -174265, -52235]
1493e2235M646J47139j01615r9075M8069Q8880l9862j0843R7325N2858r0354l57167
1481c12234J30484r0000j26652J91328j4210o3124j16605J60308J25142J80552
1471F4989j67426l5294n3426K1243j7981l979r4595P7601j6957Q3982J22292K0078
1459E27j79218Q7986O7839j73004m9574K21626j70269k6366J34747k0532K0864
1448h5374j5262J04887J12683k21403N2939j51354R3651P3842K16985k58821q9170
1437a66397L2921p7728P7543j24433Q790r2621J7422r669N7194M0374Q4712q5170
1425b37062M5412j04551J64895n439J26729k2293J13932o7977j8938q3174n3655
1414a42121K3162J06463l8431k54692J87049o7619L3123p9835q9242l739J04544
$$ y = [-52235, -47589, 99550, -2065, -101140, -53071, 35809, -4053, -14896, 82429, 135287, 44933, -312234, -181750, -271750, -398402, -207074, -221284, -284408, -401013, -240705, -115563, 64989, -102437, -137731, -191157, -169914, -187895, -191874, -286469, -208868, -225825, -141843, -19551, 527, -178691, -90705, -22866, -195870, -245444, -23818, -194087, -220453, -85706, -106238, -85374, -100636, 4251, 116934, -104469, -51530, -202884, -109233, -35391, 181594, -77227, -166397, -133476, -211204, -133661, -258094, -249304, -341925, -324503, -334172, -276978, -236604, -151892, -237062, -191650, -296201, -131306, -136745, -10016, -32309, 81623, 13646, -5292, -88466, -142121, -118959, -12496, -50927, -305619, -118570, -186189, -153066, -232901, -322143, -325882, -221338]
1403b21338r8965K13447j7925Q784K00018k5944n4151q4736k3454R609O5310R8399
1391F9054l940r7256l4881N4923k4384j43392L4309P4238j65779M4054J74165
1380a8889m8476j25945Q2993M1006j4510L0350r2945P2320m7227Q0030K4207j8060
1368c5146j52737j18484Q667P4491r725J59593j830M2416o0363M6863K412J27857
1356H4014o5640l00483K59875N5069j27203P458K40414K467k78964m0520P9227
1345h4286p5824J53848j51869k89201L28610J07062k05400q7689P0162J47307
1335h7280K21175n917p9935j28731J08219q0137R1404J89969O7729j89684n6868
1324D9944K10615j34359k49006P1774k0031o1324k1931O7131L0797M1060M6603
$$ y = [-221338, -320303, -106856, -124781, -115997, 84021, 58077, 3926, -80810, -104264, -94655, -29345, 69054, 65114, -32142, -67023, -12100, -36484, -179876, -145567, -71329, -237108, -193054, -18889, -67365, -193310, -110317, -69311, -83821, -53471, -146416, -74096, -121323, -41293, -17086, -35146, -187883, -306367, -297700, -223209, -232934, -73341, -75171, -32755, -93118, -46255, -43843, 84014, 18374, -282109, -22234, 32835, -94368, -86910, 153504, 155971, -122993, -163513, -84286, -160110, -6262, -158131, -447332, -118722, -11660, -217060, -304749, -234587, -87280, 133895, 127978, 48043, -80688, 27531, -52606, 38798, 228767, 296496, 106812, 49944, 260559, 126200, -122806, -51032, -71063, -132387, -154318, -87187, -56390, -15330, 31273]
1313C1273j801j11445J44000l3089k27981j30463J26351K39563n9518J2287q0013
1302i0836J5025j33795J22915R1963q5274L1310j22048R8686P8200j68929K34015
1291G1232J22784l2371n95j63669l7982q0598k7758l0427N1367K01040j82455
1280a09432P0541J14859P5714j00655k23600O1009Q8927Q345m4878j64213J11637
1269a11746J31554J28726j29939j34247o4461N8428J40352k3195k3707J98242
1259A70007l1608L2485j27544o1546j48563k095K6370j5881Q8630j61599K49209
1248A7865R8084l44807J93542j44555N7452P7841j58990K01538l4519k25715J7435
1237b44829K07482j79476J82843K14242k1136m5079J94375l2933k20160k36855
$$ y = [31273, 29472, -81973, 62027, 28938, -199043, -329506, -203155, 36408, -23110, -10823, -90836, -75811, -209606, -86691, 5272, -80002, -48692, -170740, -72054, 6146, -162783, 71232, 194016, 161645, 161050, -2619, -40601, -121199, -148957, -179384, -128017, 73023, -109432, -38891, 75968, 151682, 51027, -172573, -111564, -22637, -14292, -59170, -223383, -111746, 19808, 148534, 18595, -115652, -180113, -121685, 18667, -4528, -28235, 170007, 138399, 170884, 43340, -18206, -166769, -168864, -142494, -158375, -69745, -231344, 17865, 115949, -228858, -35316, -179871, -122419, -44578, -203568, -2030, -36549, -262264, -244829, -37347, -216823, -33980, 180262, 159126, 114047, 308422, 275489, 55329, -181526]
1227a81526r6657K07755j1419O3852p1065r743K43379N4390k66498J65908m7690
1216E0686j17818N48l3915J05900j20927O5966J60455N0185l3582L8365k41207
1205g5344j11593R5583l2449R2083K6740J07584j97172J3313j35954p7798l9358
1194c34365m3217K64479L6956J47020k38469j28580J32288K32473r9936j42511
1184a73862q6123Q0486N286K841k4867p4134J48115O561j02961K39805j75894
1173a54747q3017k8487K39639m3373R5103J43039l2200M3509q4169n7843j77987
1162a40533o3959J43473J08608k7472k56138l5900P9310o7812N7713K39349k7925
1151H714J4869J60594j18288m0230p612r5339n4806J37645l7404m398n1945l3219
$$ y = [-181526, -278183, -70428, -81847, -17995, -89060, -98803, 144576, 198966, -67532, 98376, 50686, -67132, -66584, -100499, 5401, -115526, -49560, 110895, 161080, 127498, 165863, -75344, -186937, -91354, -123803, -31720, -4980, 102604, -94568, -81255, -217209, -295007, -334365, -377582, -113103, -76147, 70873, -167596, -296176, -163888, 68585, -31351, -173862, -259985, -179499, -174213, -171372, -196239, -270373, -122258, -115697, -218658, 21147, -154747, -237764, -266251, -26612, -69985, 25118, 168157, 135957, 179466, 95297, 37454, -140533, -204492, -61019, 47589, 20117, -236021, -271921, -192611, -260423, -202710, 36639, 8714, 23583, 184177, 65889, 25659, 18047, -77292, -132098, 5547, -31857, -36255, -88200, -121419]
1139a21419M7614p064R3814N025J00628j62167j70087L0896M7726J40195L4691
1128C9852Q6651o3420K3076k8953q3133L2645J0910l290L3322O0823P363J1989
1116A27835L0663k74506P2486R0602j36501j10594N7402J81342j6139n407R955
1105B7138Q0846M521m0126j68759p0736J40315R407J8673k79189K20365J20879
1094F3334j53643K24175J76299j29614l9860j51392j37283J34563o3129j13683
1084a90233K49905L1791k1596o5054k3761o4111j10482o7778K21067J03751k19018
1073a55519K0956O7242N6079l0816m6195K11555M3352p0373j52755j02269Q9855
1062f8888J29777k00484l4945Q5516l5806J74974j12763N4589n0375o8569j8083
$$ y = [-121419, -73805, -80869, 12945, 17970, 118598, -43569, -213656, -182760, -135034, 5161, 39852, 126503, 63083, 86159, 57206, -25927, 6718, 17628, 14338, 47660, 108483, 115846, 127835, 158498, -116008, -43522, 47080, -89421, -200015, -142613, 38729, 22590, 17183, 27138, 107984, 112505, 72379, -96380, -167116, -26801, -17394, 1279, -277910, -57545, 63334, -90309, 133866, 310165, 180551, 140691, -10701, -147984, -13421, -76550, -190233, 59672, 91463, 69867, 4813, -18948, -83059, -193541, -261319, -40252, 63499, -155519, -134563, -67321, -11242, -42058, -88253, 123302, 166654, 96281, -56474, -158743, -68888, 60889, -139595, -174540, -89024, -124830, 50144, -62619, -8030, -58405, -126974, -145057]
1051a45057J34897J02589J71485p0051k15463p6261k2505J11447N1777j05821
1041f2963j23219N7625J16454n8753j9152R1711O9498o6417j54738M45L55754
1030B06245J15509l4323o8227q3964L656m9749j37091J09796o077n6261O1590
1019F1104j73812j2027J36168L5420r5354P4978j507p0596j88561K62234M7915
1008G5962k38900J71901j99093j24815J16480J19239M2549N8351J27769j82976
998c3533l8870J32523r5709N9204K63525n1930r5121j9680j61618N89o2151l1553
986a34324J73948j44742J68011R6246k78050J44037k2177j08693K07391K6514
976A28161J2325m0015J0601j03760r5853J37638K4330Q9258n8806L9079j03540
$$ y = [-145057, -10160, 92429, 263914, 193863, -21600, -97861, -120366, -8919, 42858, -62963, -186182, -128557, -12103, -70856, -90008, 1703, 71201, 4784, -149954, -149509, 206245, 321754, 287431, 219204, 135240, 138896, 89147, -47944, 61852, 55775, -486, 61104, -112708, -124735, 11433, 46853, -48501, 26477, 24970, -45626, -234187, 28047, 75962, -162938, 8963, -190130, -314945, -198465, -79226, -36677, 21674, 149443, -33533, -72403, 60120, -35589, 23615, 287140, 235210, 140089, 120409, -41209, -40620, -102771, -134324, 39624, -105118, 62893, 159139, -118911, 25126, 2949, -105744, 101647, 128161, 140486, 100471, 111072, 7312, -88541, 49097, 73427, 162685, 103879, 142958, 39418]
965C9418k05256M0909R5594m6517L4700O3252K7374m8802j61966q5025q2098J5239
953c13178R9579K36787L125j57302O8903K18636J88383q4082k75686l1867O496
$$ y = [39418, -165838, -124929, -29335, -75852, -41152, 22100, 49474, 672, -161294, -246319, -328417, -313178, -213599, 23188, 26313, -130989, -62086, 156550, 344933, 260851, -14835, -46702, -40206]
$$ [...]
##END NTUPLES=NMR SPECTRUM
##END=
