##TITLE=1H_CA-8975-1
 CDCl3
 8 sc, 
 14.02.2022
##JCAMPDX= 6.0         $$ Bruker NMR JCAMP-DX V2.0
##DATA TYPE= NMR SPECTRUM
##DATA CLASS= NTUPLES
##ORIGIN= UXNMR, Bruker Analytische Messtechnik GmbH
##OWNER= root
$$ XWIN-NMR		Version 3.5
$$ Mon Feb 14 11:07:02 2022 Russian Standard Time (UT+4h)  she@DPX200
##.OBSERVE FREQUENCY= 200.131346
##.OBSERVE NUCLEUS= ^1H
##.ACQUISITION MODE= SIMULTANEOUS
##.ACQUISITION SCHEME= undefined
##.AVERAGES= 8
##.DIGITISER RES= 18
##SPECTROMETER/DATA SYSTEM= spect
##.PULSE SEQUENCE= zg30
##.SOLVENT NAME= CDCl3
##.SHIFT REFERENCE= (INTERNAL, CDCl3, 0, 15.7149)
##AUDIT TRAIL= $$ (NUMBER, WHEN, WHO, WHERE, WHAT)
$$ ##TITLE= Audit trail, XWIN-NMR		Version 3.5
$$ ##JCAMPDX= 5.01
$$ ##ORIGIN= Bruker BioSpin GmbH
$$ ##OWNER= she
$$ F:/spectra/data/she/nmr/H-F/1/pdata/1/auditp.txt
$$ ##AUDIT TRAIL=  $$ (NUMBER, WHEN, WHO, WHERE, WHAT)
(   1,<2022-02-14 11:05:37.23 +0400>,<she>,<DPX200>,
      <created by zg, POWCHK disabled, PULCHK disabled
       configuration hash MD5:
       00 E9 B6 7A A2 85 ED C7 34 08 36 98 17 FE 4E 26
       data hash MD5: 16K
       62 59 D9 E8 29 FB 05 36 9E 03 03 2C 46 C8 65 D2>)
(   2,<2022-02-14 11:05:40.07 +0400>,<she>,<DPX200>,
      <Start of raw data processing
       efp BC_mod = 2 LB = 0.24 FT_mod = 6 PKNL = 1 PHC0 = -16236.96 PHC1 = 24.20079 SI = 16K 
       data hash MD5: 16K
       98 14 E4 29 14 2E 5B FB C3 70 98 28 D9 9B 06 D8>)
(   3,<2022-02-14 11:06:00.10 +0400>,<she>,<DPX200>,
      <pk PHC0 = 7.475904 PHC1 = -13.8 
       data hash MD5: 16K
       A9 BC D9 79 BC E4 37 53 B4 81 33 2A 36 2A 18 0F>)
(   4,<2022-02-14 11:06:03.56 +0400>,<she>,<DPX200>,
      <abs ABSG = 5 
       data hash MD5: 16K
       4F 59 82 68 C7 80 D4 F4 91 F8 16 52 9C 40 32 6D>)
$$ ##END=
$$ 
$$ hash MD5
$$ E5 A6 9E C3 85 30 6D 1E BD 6F AB 4B CD D5 E4 4D
##$RELAX= 
##$RELAX= 
##$RELAX= 
##$RELAX= 
##$RELAX= 
##$RELAX= 
$$ Bruker specific parameters
$$ --------------------------
##$DU= <F:/spectra>
##$EXPNO= 1
##$NAME= <H-F>
##$PROCNO= 1
##$TYPE= <nmr>
##$USER= <she>
##$AMP= (0..31)
100 100 100 100 100 100 100 100 100 100 100 100 100 100 100 100 100 100 
100 100 100 100 100 100 100 100 100 100 100 100 100 100 
##$AQSEQ= 0
##$AQ_mod= 1
##$AUNM= <au_zg>
##$AUTOPOS= <>
##$BF1= 200.13
##$BF2= 200.13
##$BF3= 200.13
##$BF4= 200.13
##$BF5= 200.13
##$BF6= 200.13
##$BF7= 200.13
##$BF8= 200.13
##$BYTORDA= 1
##$CFDGTYP= 0
##$CFRGTYP= 5
##$CHEMSTR= <none>
##$CNST= (0..31)
1 1 145 1 1 1 1 1 1 1 1 1 1 1 1 1 1 1 1 1 1 1 1 1 1 1 1 1 1 1 1 1 
##$CPDPRG= <>
##$CPDPRG1= <>
##$CPDPRG2= <>
##$CPDPRG3= <>
##$CPDPRG4= <mlev>
##$CPDPRG5= <mlev>
##$CPDPRG6= <mlev>
##$CPDPRG7= <mlev>
##$CPDPRG8= <mlev>
##$CPDPRGB= <>
##$CPDPRGT= <>
##$D= (0..31)
0 1.2 0 0 0 0 0 0 0 0.06 0 0.03 0 0 0 0 0.0002 0 0 0 0 0 0 0 0 0 0 0 0 
0 0 0 
##$DATE= 1644822336
##$DBL= (0..7)
120 120 120 120 120 120 120 120 
##$DBP= (0..7)
150 150 150 150 150 150 150 150 
##$DBP07= 0
##$DBPNAM0= <>
##$DBPNAM1= <>
##$DBPNAM2= <>
##$DBPNAM3= <>
##$DBPNAM4= <>
$$ [...]
##$SUBNAM2= <"">
##$SUBNAM3= <"">
##$SUBNAM4= <"">
##$SUBNAM5= <"">
##$SUBNAM6= <"">
##$SUBNAM7= <"">
##$SUBNAM8= <"">
##$SUBNAM9= <"">
##$SW= 18.0517287032376
##$SWIBOX= (0..15)
0 0 2 0 0 0 0 0 0 0 0 0 0 0 0 0 
##$SW_h= 3612.71676300578
##$TD= 16384
##$TD0= 1
##$TE= 0
##$TE2= 300
##$TE3= 300
##$TEG= 300
##$TL= (0..7)
0 120 120 120 120 120 120 120 
##$TP= (0..7)
150 150 150 150 150 150 150 150 
##$TP07= 0
##$TPNAME0= <>
##$TPNAME1= <>
##$TPNAME2= <>
##$TPNAME3= <>
##$TPNAME4= <>
##$TPNAME5= <>
##$TPNAME6= <>
##$TPNAME7= <>
##$TPOAL= (0..7)
0.5 0.5 0.5 0.5 0.5 0.5 0.5 0.5 
##$TPOFFS= (0..7)
0 0 0 0 0 0 0 0 
##$TUNHIN= 0
##$TUNHOUT= 0
##$TUNXOUT= 0
##$USERA1= <user>
##$USERA2= <user>
##$USERA3= <user>
##$USERA4= <user>
##$USERA5= <user>
##$V9= 5
##$VALIST= <valist>
##$VCLIST= <CCCCCCCCCCCCCCC>
##$VD= 0
##$VDLIST= <DDDDDDDDDDDDDDD>
##$VPLIST= <PPPPPPPPPPPPPPP>
##$VTLIST= <TTTTTTTTTTTTTTT>
##$WBST= 1024
##$WBSW= 4
##$XGAIN= (0..3)
0 0 0 0 
##$XL= 0
##$YL= 0
##$YMAX_a= 68022
##$YMIN_a= -64594
##$ZGOPTNS= <>
##$ZL1= 120
##$ZL2= 120
##$ZL3= 120
##$ZL4= 120
##$ABSF1= 15.71494
##$ABSF2= -2.336909
##$ABSG= 5
##$ABSL= 3
##$ALPHA= 0
##$AQORDER= 0
##$ASSFAC= 0
##$ASSFACI= 0
##$ASSFACX= 0
##$ASSWID= 0
##$AUNMP= <proc_1d>
##$AZFE= 0.1
##$AZFW= 0.1
##$BCFW= 0
##$BC_mod= 2
##$BYTORDP= 0
##$COROFFS= 0
##$CY= -3
##$DATMOD= 1
##$DC= 0
##$DFILT= <>
##$DTYPP= 0
##$F1P= 0
##$F2P= 0
##$FCOR= 1
##$FTSIZE= 16384
##$FT_mod= 6
##$GAMMA= 0
##$GB= 0
##$INTBC= 1
##$INTSCL= 0
##$ISEN= 128
##$LB= 0.24
##$LEV0= 0
##$LPBIN= 0
##$MAXI= 10000
##$MC2= 0
##$MEAN= 0
##$ME_mod= 0
##$MI= 1.114404
##$NCOEF= 0
##$NC_proc= -8
##$NLEV= 6
##$NOISF1= 3.799351
##$NOISF2= 2.8
##$NSP= 0
##$NTH_PI= 0
##$NZP= 0
##$OFFSET= 15.71494
##$PC= 1
##$PHC0= -16229.48
##$PHC1= 10.40079
##$PH_mod= 1
##$PKNL= yes
##$PPARMOD= 0
##$PSCAL= 0
##$PSIGN= 0
##$REVERSE= no
##$SF= 200.130007328733
##$SI= 16384
##$SIGF1= 3
##$SIGF2= 2
##$SINO= 5.538805
##$SIOLD= 16384
##$SREGLST= <1H.CDCl3>
##$SSB= 0
##$STSI= 16384
##$STSR= 0
##$SW_p= 3612.71676300578
##$SYMM= 0
##$S_DEV= 0
##$TDeff= 16384
##$TDoff= 0
##$TI= <>
##$TILT= no
##$TM1= 0
##$TM2= 0
##$TOPLEV= 0
##$USERP1= <user>
##$USERP2= <user>
##$USERP3= <user>
##$USERP4= <user>
##$USERP5= <user>
##$WDW= 1
##$XDIM= 16384
##$YMAX_p= 333697937
##$YMIN_p= -1406725
$$ End of Bruker specific parameters
$$ ---------------------------------
##NTUPLES= NMR SPECTRUM
##VAR_NAME=  FREQUENCY,     SPECTRUM/REAL,   SPECTRUM/IMAG
##SYMBOL=    X,             R,               I
##VAR_TYPE=  INDEPENDENT,   DEPENDENT,       DEPENDENT
##VAR_FORM=  AFFN,          ASDF,            ASDF
##VAR_DIM=   16384,         16384,           16384
##UNITS=     HZ,            ARBITRARY UNITS, ARBITRARY UNITS
##FACTOR=    0.220516191357247, 1,           1
##FIRST=     3145.03107160103, 0,            0
##LAST=      -467.685691404745, 0,           0
##MIN=       -467.685691404745, -1406725,    0
##MAX=       3145.03107160103, 333697937,    0
$$ Real data points
##PAGE= N=1
##DATA TABLE= (X++(R..R)), XYDATA
$$ [...]
11762B20435j37061k72967M45087o73070l6512K14151o0121K56851L34873r6176
11752A95490l1560K59524P6416j10952K92717k16252j66721k50976L7041o3165
11742B1562q8618o4616L22272l02000r7162L24948k71917j00842N3332n4821K40417
11731a7445m9326R3166o308j15896m0073J37114k61865J96229l55569J10607L33253
11720B3887L40441j41216m36395k97847P1461M76992J2127p2797j64513M2911
11710a44949l19202O2398k37419O51576J70907k1360k27219J34516p8780r5071
11700a04603R5664k68631K47930P5758j04306j90326M40364q433l02998K45684
11690A26103J28001m81230L8265L96294l22426k9421J88576J21661J28974l779
$$ plain form
11762 220435 83374 -189593 255494 -417576 -454088 -239937 -300058 -43207 291666 195490
11752 195490 163930 423454 499870 388918 681635 465383 298662 47686 84727 21562
11742 21562 -67056 -131672 190600 -111400 -208562 116386 -155531 -256373 -203041 -257862 -17445
11731 -17445 -66771 26395 20087 -95809 -135882 1232 -260633 -64404 -419973 -309366 23887
11720 23887 364328 223112 -213283 -511130 -439669 37323 49450 -23347 -187860 -144949
11710 -144949 -464151 -401753 -639172 12404 183311 161951 -65268 69248 -9532 -104603
11700 -104603 -8939 -277570 -29640 46118 -58188 -248514 191850 183417 -119581 126103
11690 126103 254104 -227126 -188861 207433 -114993 -144414 44162 165823 294797 291018
11680B91018q5783j43711m44568L61904j42902J27720j08362j11479j06988P877
11670c55274K29648P8709r7387J04479k52567J91075l34675k00805N17552J80329
11660F1084J38000m9198N9933J06850j25458l73501K79362j2222K7257j3406K1562
11649A20263j39479j88024k24435M19138o5937K77041J9923l20786j42256K0474
11639b24078M06323K485j66493k76777j58221L06740K75130k29809K13223J01859
11629B50382j10784j86569l9661N2499K76071n40521l00269R1683R535L29805
11619a67829K5552k18772J94218M69106M9139m92695P2774K73797j29484j53322
11609g7516J29416m63785L79733k52309J49339K22253o8986K31959j11002J15923
$$ plain form
11680 291018 205235 61524 -383044 -21140 -164042 -36322 -144684 -256163 -363151 -355274
11670 -355274 -125626 -46917 -144304 -39825 -292392 -101317 -435992 -636797 -119245 61084
11660 61084 199084 149886 209819 316669 191211 -182290 97072 84850 112107 98701 120263
11649 120263 -19216 -207240 -431675 -12537 -78474 198567 218490 -102296 -244552 -224078
11639 -224078 182245 184730 18237 -258540 -416761 -110021 165109 -64700 148523 250382
11629 250382 139598 -46971 -86632 -34133 241938 -298583 -598852 -507169 -497634 -167829
11619 -167829 -142277 -361049 -166831 302275 351414 -141281 -68507 205290 75806 -77516
11609 -77516 51900 -411885 -32152 -284461 -135122 87131 18145 250104 139102 255025
11599B55025K13760m43061j05357J53224q8635k44185L0455o2745J78L71015k02515
11588a22841j69054k77029M8478J75218K70277M5287P2360j25190l43405o6073
11578d91972k6559J67057M1646j59320K31249L0669N33838L45607k10794j56757
11568C04664m20462j12285q7859L88765N20690J47955l23374r61159j13625N19110
11558a37580M71945k70004P1720l35240L24948j976J26544j26742j11794o9520
11548e7699K98562j25904p2394k64167J04847m29008K83444L81130P2754Q918
11538B00483R7238l45510l22566J58587K23781M18421k22570p8723j72413K62442
11528B19170k03194k18682K52075P4999J45468J39106k30212l91051J6493q1274
$$ plain form
11599 255025 468785 25724 -79633 73591 -15044 -259229 -228774 -291519 -291341 79674 -122841
11588 -122841 -291895 -568924 -520446 -345228 -74951 -29664 42696 -82494 -425899 -491972
11578 -491972 -518531 -351474 -309828 -469148 -237899 -207230 326608 672215 461421 304664
11568 304664 -115798 -228083 -315942 72823 593513 741468 418094 -543065 -656690 -137580
11558 -137580 334365 64361 136081 -199159 125789 123813 250357 123615 11821 -57699
11548 -57699 240863 114959 42565 -221602 -116755 -545763 -262319 118811 191565 200483
11538 200483 297721 -47789 -370355 -211768 12013 430434 207864 129141 -43272 219170
11528 219170 15976 -202706 49369 124368 269836 408942 178730 -212321 -195828 -277102
11518b77102j76261M24574Q7558J67019j01731L49386o8255k51266m68497K66560
11508d8015J92079o2111r9754m075k07524M23348P224l63868L41415n4844J35180
11497B59055p6874K83567l91368M5123L36147J18950j54033q84385M0555N6298
11487c66965j5291J85700M79070P5726j53531J607m0087j30986n4016k48849J86565
11476h1057k62755J29570J79315P7971l5765p2559R2862j54016J26767K82434
11466B82767J08734o6545J34939m82686l336l38706K97220J64938r8137r7635
11456i8447n2695P0905j51975K22925K8704J93281J83909Q0964k3021J83675j08580
11445E29645k29907k89992k09127J25174k42165J10281n9833K30929k3771k39017
$$ plain form
11518 -277102 -453363 -28789 58769 225788 124057 473443 405188 153922 -314575 -48015
11508 -48015 144064 81953 -17801 -21876 -229400 193948 201172 -162696 178719 123875 259055
11497 259055 182181 465748 74380 119503 455650 574600 420567 -463818 -423263 -366965
11487 -366965 -382256 -196556 282514 358240 204709 206316 166229 35243 -18773 -267622 -81057
11476 -81057 -343812 -214242 -34927 43044 7279 -65280 27582 -126434 333 282767
11466 282767 391501 324956 459895 -22791 -26127 -364833 -67613 97325 -812 -98447
11456 -98447 -151142 -80237 -232212 -9287 19417 212698 396607 477571 454550 638225 529645
11445 529645 299738 9746 -199381 -74207 -316372 -206091 -265924 -34995 -58766 -297783
11435b97783J28406J79155l12821K30901J94829n59480j6174K96278J3858k11103
11425c53934J80164j968N13365j01331k73163j67987O3290K65237K55698O5130
11415D44501j56475k53597P145N0644k21579J40434J19322l69780J48358N8302
11405c2725P5303j37306J29418P3257M6933l59436J63333m58592Q9218L03124
11395a07473r2283j99587m0822M7561J86209k7517K05277j22325o38372N96203
11385a93129L99042K8496j93086K31615P857l90648L17631R7975J6080k83560
11375C8273p5471M18217k89886j78877l61779K03674L92321r0489l17893J02309
11365a59601j79787L90445J19463k29737j58758p8310n11408L41767Q6750J35197
$$ plain form
11435 -297783 -169377 9778 -303043 -72142 122687 -436793 -452967 -156689 -142831 -353934
11425 -353934 -173770 -175738 337627 236296 -36867 -204854 -141564 123673 379371 444501
11415 444501 288026 34429 41574 92218 -129361 11073 130395 -239385 -91027 -32725
11405 -32725 42578 -94728 34690 107947 154880 -204556 -41223 -499815 -410597 -107473
11395 -107473 -199756 -399343 -440165 -392604 -206395 -233912 -28635 -150960 -789332 -193129
11385 -193129 205913 234409 41323 272938 280795 -109853 207778 305753 321833 38273
11375 38273 -37198 381019 91133 -87744 -449523 -245849 146472 55983 -261910 -159601
11365 -159601 -339388 51057 170520 -59217 -217975 -296285 -807693 -465926 -379176 -243979
11355b43979j16776L33118n37222o7791K49004L0803K50576J34122L6470l49750
11345b81425l11069j43399M40830K10299j96042o5395J98210L45842J53514k54813
11335I6552l22957J15596L52103Q5809j56986j37131k86892K97484m8048j2631
11325a7101j04916J5861L01295o8106O0968j63100R7252l21160k46189O6191j37432
11314e16437J34038M52564J88431m25404k92243M90492J13759k01787j86305j75913
11304d18805M24696N9105j38352k2514p7093M29523k04200j5488J78962L2731
11294B48565N74693k54547q67096K45137p7257k5459k27589L90558J03004n17610
11284d07601k2826M25707K3100j76001n596j82077p0459K47506K57756q6053l218
$$ plain form
11355 -243979 -360755 -27637 -564859 -632650 -383646 -352843 -102267 31855 68325 -281425
11345 -281425 -592494 -735893 -295063 -84764 -280806 -346201 -147991 197851 351365 96552
11335 96552 -226405 -110809 241294 327103 170117 32986 -253906 43578 -4470 -17101
11325 -17101 -122017 -106156 195139 127033 188001 24901 122153 -199007 -445196 -379005 -516437
11314 -516437 -382399 70165 258596 -166808 -459051 31441 145200 -56587 -242892 -418805
11304 -418805 5891 64996 -73356 -95870 -172963 256560 52360 36872 215834 248565
11294 248565 823258 568711 -298385 -53248 -130505 -155964 -383553 7005 110009 -407601
11284 -407601 -430427 -4720 18380 -157621 -163217 -345294 -415753 -168247 89509 3456 238
11273B38j26785j1372j92784O14552j8015K97030n74512M064J85648l32794K21967
11262F7237l13923K53648O4231L69l80216J90999J553L31748k33305R1467M7443
11251A21251J06282J95267j04227j09455k53718j9456j53180K9574R5945j60493
11241b52210j99186O3717L91166m51499N34684J13162k25827j06726J02298J8468
11231a1953J07306K5732k57984K11934J03703J46273k78210q6200k12956K24017
11221b8338N75821k08331l20472o1497K38377J12562K0257j91657l100k1503l32110
11210b19991j99749j31757J20886K04162L66926n4404j95545K02974K07787o66981
11200c65692K24547q5914m2670m8144M86688J94794o4141J2727m30100o0228J23059
$$ plain form
11273 238 -126547 -137919 -330703 283849 265834 562864 -11648 -7584 178064 -154730 67237
11262 67237 -246686 6962 71193 71562 -308654 -117655 -116102 215646 -17659 73808 121251
11251 121251 227533 422800 318573 209118 -44600 -64056 -217236 -187662 -91717 -252210
11241 -252210 -451396 -387679 3487 -448012 86672 199834 -25993 -132719 -30421 -11953
11231 -11953 95353 121085 -136899 75035 178738 325011 46801 -39399 -252355 -28338
11221 -28338 547483 339152 18680 -42817 195560 308122 328379 136722 133622 112119 -219991
11210 -219991 -419740 -551497 -430611 -226449 140477 86073 -109472 93502 301289 -365692
11200 -365692 -141145 -227059 -269729 -317873 168815 363609 299468 312195 -117905 -178133 -55074
11189e5074J11253K34306j22732k026Q8690l3195k49631J16154p2828k22993M8831
11178a59245L0552J50904j76080j39208m6515L13680O7365L5867m03948P8196
11168b48432L09089j93536k38917K55987k53390j87334L75009J45565j88697J42379
11158h2277k81971O7397j88797P2376K00225P2170r7504k61844O6851j24923K7315
11147e30982L84680K16196l36469L31791j31640Q4544l40521J69225j32120P5353
11137b09943K21561J0926j65317J52543m0585l1554N53898J8925n51773L3294
11127h025m80955J33617Q8040m79954J95667L78148J08502j82960K18967j04878
11117a33831K37086j9116l23618j46867P4928J87530k05462j2211O0577m05756
$$ plain form
11189 -55074 56179 290485 167753 165727 254417 221222 -28409 87745 14917 -208076 -159245
11178 -159245 -128693 22211 -153869 -293077 -339592 -25912 41453 77320 -326628 -248432
11168 -248432 60657 -132879 -371796 -115809 -369199 -556533 -181524 -35959 -224656 -82277
11158 -82277 -364248 -296851 -485648 -413272 -213047 -140877 -238381 -500225 -433374 -558297 -530982
11147 -530982 -146302 69894 -266575 65216 -66424 18120 -322401 -153176 -285296 -209943
11137 -209943 11618 22544 -142773 9770 -30815 -62369 491529 510454 -41319 -8025
11127 -8025 -488980 -355363 -267323 -747277 -551610 -173462 -64960 -247920 -28953 -133831
11117 -133831 103255 84139 -239479 -386346 -311418 -123888 -329350 -341561 -280984 -686740
11107f86740J23077M84350m5548Q1380j60793K91748K87731k20994Q8700l65951
11097a23040l23610J12793J49941M86883K32979j92323p8841L0477k25734L3219
11087A02744J79160n85174P8J96696n6368J87864K75343j40941m97186j81928
11077e19712N26587J26257n54525j81702M86538J3568p1695J1228O6408P5186
11067b1862j25081J6408l6737j09093L78115m5549j8888l8005j27233k1422N23248
11056C73901j44408n3520K5683j67344k88733l85985M55346M91647m17042m3080
11046a53535o3922j23649j60931L29118L73030J35621k28254j19286k73468k86340
11036e71616M99144J3022m9747P2220K18230j78062l99664K33637K42087k05594
$$ plain form
11107 -686740 -563663 -79313 -124861 -43481 -204274 87474 375205 154211 242911 -123040
11097 -123040 -446650 -333857 -183916 302967 535946 343623 264782 295259 69525 102744
11087 102744 281904 -303270 -303192 -106496 -162864 25000 300343 159402 -337784 -519712
11077 -519712 6875 133132 -421393 -603095 -116557 -102989 -174684 -163456 -97048 -21862
11067 -21862 -146943 -130535 -167272 -276365 101750 56201 37313 -692 -127925 -149347 373901
11056 373901 229493 175973 201656 34312 -254421 -640406 -185060 306587 -110455 -153535
11046 -153535 -217457 -341106 -502037 -172919 200111 335732 107478 -11808 -285276 -571616
11036 -571616 -72472 -59450 -109197 -36977 181253 3191 -396473 -162836 79251 -126343
11026a26343k79143J61654O22976l49249L1922J0715p4000j33369m67586m109
11016f06532L27389J16338L60012K80530n3992K22851j19863j096730M36831K40662
11006A07496l34666L26523K53971o2566k31167j95120O8458K73316Q6647j48168
10996A44724l41828N7841o8372K84380j64980J09410M099k48474K67601J17323
10986A61724J62277j69890p1277k45028j1871l3838J92213j89248L23213K88239
10976D06514K28848n11309j26245J68889k74772n0425m29994J38425L82855j89725
10966b56939N5937M38403L1366j31397l58450l0825n0928J83937j13947O2688
10956a70155K65858J03063k55841r4677K1302J59753j07970l44848L14818j02811
$$ plain form
11026 -126343 -405486 -243832 379144 29895 61817 72532 -1468 -134837 -602423 -606532
11016 -606532 -279143 -162805 197207 477737 423745 646596 526733 -569997 -133166 107496
11006 107496 -227170 99353 353324 290758 59591 -135529 -67071 206245 292892 144724
10996 144724 -197104 -139263 -207635 76745 -88235 21175 25274 -223200 44401 161724
10986 161724 324001 154111 82834 -162194 -174065 -207903 -15690 -204938 118275 406514
10976 406514 635362 124053 -2192 166697 -108075 -158500 -588494 -450069 -67214 -256939
10966 -256939 -201002 237401 268767 137370 -221080 -251905 -302833 -118896 -232843 -170155
10956 -170155 95703 198766 -57075 -151752 -130450 29303 -78667 -423515 -108697 -211508
10946b11508j0907O2824r9932O03540n6157J010m56065k34549M11422j39770M3262
10935h6830K91461m90830L41817M7195n7770l95541l07005J10508O1760j13274
10925e98509o1814K59359K5699K98737L70216n1538k40293k17134j04136J48067
10915a71346j52506L19552j11581J66566j55905k32920R3980J86353K7618o6174
10905i6363J53516j76894q6137L17858l05728J07224J97541j73153j14986K43638
10895F6516J52860j24119j67228J61455R0143j32179K09059m73779J98868L78158
10885C59754j72004o3379m41489O9777K74480l7124k38550M43067J96862n9233
10875C32161l19189k82433l31965O3502M6631J28091K49275l85013L46888L44609
$$ plain form
10946 -211508 -222415 -159591 -259523 344017 287860 288870 -167195 -401744 9678 -130092 -86830
10935 -86830 204631 -286199 55618 102813 45043 -350498 -657503 -546995 -485235 -598509
10925 -598509 -660323 -400964 -375265 -76528 293688 242150 1857 -215277 -319413 -171346
10915 -171346 -323852 -4300 -115881 50685 -105220 -338140 -244160 -57807 -30189 -96363
10905 -96363 57153 -119741 -205878 111980 -193748 -86524 111017 -62136 -177122 66516
10895 66516 219376 95257 -71971 89484 179627 47448 256507 -217272 -18404 359754
10885 359754 187750 124371 -317118 -247341 27139 -9985 -248535 194532 391394 332161
10875 332161 12972 -269461 -601426 -537924 -491293 -363202 -113927 -498940 -152052 192557
10865A92557n39345j12775K51240J91278k82686k54018L83605J83631J2174J33536
10855A59197j24173k0703J3599j95747J90244P5413q7076l9569r5397K37130j60304
10844d7386J09575j54310l3136R1908K45993l81928m97544L24066N6716M26139
10834A40093k46850Q3965l28123n0552j6345K70434M43505J62792K29469K12501
10824I00889l45072j64767l60689k73604q1766L38806Q6130K19008j12974l67936
10814a61975j7068K26417j79265q2251l32110k60085N75135J54854l81039L49160
10804a08227l82964K60930L14146k98963L7790K14465Q9464k7391N298k54614
10794a50066L73515k9997M8595M1830l16488J8235k14644k71582K93870L9672
$$ plain form
10865 192557 -346788 -459563 -208323 -17045 -299731 -553749 -170144 13487 25661 159197
10855 159197 35024 14321 27920 -167827 22417 97830 10754 -28815 -124212 112918 -47386
10844 -47386 62189 -92121 -125257 -33349 212644 -169284 -666828 -342762 -286046 140093
10834 140093 -106757 -22792 -350915 -401467 -417812 -147378 296127 458919 688388 900889
10824 900889 555817 391050 30361 -243243 -325009 13797 99927 318935 205961 -161975
10814 -161975 -179043 47374 -131891 -214142 -546252 -806337 -231202 -76348 -457387 -108227
10804 -108227 -491191 -230261 83885 -215078 -177288 37177 126641 99250 104548 -150066
10794 -150066 223449 193452 242047 283877 -32611 -14376 -229020 -500602 -206732 -167060
10784a67060j29549j71387P9321j2208k02046j26464J14529J07415J69200R8393
10774b39856J28343K02839K21552l79392j92628P4372K24125j40622K55909p6211
10764G8431m46404k81094L08377J76189l6679q6836l17885K08641J60238j15400
10754c52422N2235j6453L29770L44557j96880q8438M332o9055p4852m45328N5234
10743d57300M02649j39534j47595M32357m88974L8918r6625N2168J57194L12210
10733F5468J17807k00669J54567k9127P5936K48594m2789k19494k24562L7947
10723a6322L1998k69889l02404j48279N31102L63693R9381l12632o4102N7147
10713c0307k75741n7463J57651J53454M0905k64692j31206j91204K44073L4828
$$ plain form
10784 -167060 -296609 -467996 -388675 -400883 -602929 -729393 -614864 -507449 -338249 -239856
10774 -239856 -111513 91326 312878 -66514 -259142 -184770 39355 -101267 154642 78431
10764 78431 -367973 -649067 -340690 -164501 -201180 -288016 -605901 -397260 -237022 -352422
10754 -352422 -300187 -316640 13130 357687 160807 72369 76701 7646 -67206 -512534 -457300
10743 -457300 -54651 -194185 -341780 90577 -398397 -359479 -456104 -403936 -246742 65468
10733 65468 183275 -17394 137173 108046 183982 432576 389787 170293 -54269 -16322
10723 -16322 15676 -254213 -556617 -704896 -173794 189899 289280 -23352 -87454 -30307
10713 -30307 -306048 -363511 -205860 -52406 -11501 -276193 -407399 -598603 -354530 -319702
10703c19702j10942L00695M3770l19365K28621k86904r610K55691J19709J13066
10693A5029M4332K4715j38088j30930M9765j20610m0632m8013L74136n7727l47421
10682c75444K87562K16040q00401L73404L1240K9432K72538m56445L25293j21945
10672b18726J20257J83815k73130J8727k09112J87225K34273l62619R6722L89477
10662A66909k79462j9690K15863M08917J06420k79926k05475k97586O4556n9509
10652a78983l81169J96207L05204j35540J7937Q1625N5365N215l67220k76850
10642f78209N72256P8808O848j05855J15024O9707j46318j31069M3650j90653
10632c65811K3068M64808L779m17807j56213R8825K49668m2739j33148K03230
$$ plain form
10703 -319702 -430644 -129949 -86179 -405544 -176923 -463827 -473437 -217746 -98037 15029
10693 15029 59361 84076 -54012 -184942 -135177 -255787 -296419 -344432 29704 -28023 -375444
10682 -375444 -87882 128158 -672243 -298839 -267599 -238167 34371 -422074 -96781 -218726
10672 -218726 -98469 85346 -187784 -169057 -378169 -190944 43329 -319290 -222568 166909
10662 166909 -112553 -132243 83620 492537 598957 319031 113556 -184030 -119474 -178983
10652 -178983 -560152 -363945 -58741 -194281 -176344 -94719 -39354 -34139 -401359 -678209
10642 -678209 -105953 -27145 -20297 -126152 -11128 58579 -87739 -218808 -175158 -365811
10632 -365811 -342743 122065 125844 -291963 -448176 -349351 -99683 -142422 -275570 -72340
10622g2340J905J45488K20786m44793J00221j46675J75850j92545k66122K89618
10612a88607O1382K87892K31064l31815l47440n1142J33586O4687K72555R0208
10602B22370r223j94571j1002o1450j28071K2548J15694l02637q7984K66074M38966
10591B70714J60753j43143k17461P959J90276m56342l4561K2255K40038m9696
10581i208j83758j54728k1478J50738K46592k17642n0619M9445N07262j78288
10571A38316n6694j92209J60687k65411k99866K62465K05475j52925j46542J25250
10561b21454M12678R1088k93582k32291k50624K18244J49809l39660J30798q179
10551c43173k74040O21019l5268J49288k18615m43888o9238M00815J62850L35155
$$ plain form
10622 -72340 -70435 75053 295839 -148954 -48733 -195408 -19558 -212103 -478225 -188607
10612 -188607 -127225 160667 391731 59916 -287524 -338666 -205080 -140393 132162 222370
10602 222370 213147 18576 7574 -53876 -181947 -159399 -43705 -346342 -434326 -168252 270714
10591 270714 431467 288324 70863 78822 269098 -187244 -221805 -199550 40488 -9208
10581 -9208 -192966 -347694 -369172 -218434 28158 -189484 -240103 -190658 316604 138316
10571 138316 81622 -110587 50100 -215311 -515177 -252712 -47237 -200162 -346704 -221454
10561 -221454 191224 282312 -11270 -243561 -494185 -275941 -126132 -465792 -334994 -343173
10551 -343173 -617213 3806 -31462 117826 -100789 -544677 -613915 -213100 -50250 284905
10541B84905K85396l1784l59160J85583K16313l25552k80277J0387N06710l75482
10531A17039k75554L25940j04784M7500J83694k83404j51280J08830K28027m03683
10521b07675p8785j21939J00251j80957N0929J35438m7429M36414j52312J7503
10511d8562j18148O4350M64510l15588k23507K29877j95950M43247r2601k53497
10501d5869k8240m64391O23205O7022o0788j5816O2746R4628k58082J63109j99577
10490f2053K03337J51344k09805N4783K24243n71246k2554L98436k96273J06102
10480b3686r3340j72039J86564L39799k357m25925j04199J13712K33160k73989
10470b22300j91380J94272j52323L8389J37520j57322K48389k04419J43223P7117
$$ plain form
10541 284905 570301 538517 179357 364940 581253 255701 -24576 -14189 492521 117039
10531 117039 -158515 167425 62641 110141 293835 10431 -140849 -32019 196008 -207675
10521 -207675 -286460 -408399 -308148 -489105 -438176 -302738 -350167 86247 -66065 -48562
10511 -48562 -166710 -102360 362150 46562 -176945 52932 -143018 300229 207628 -45869
10501 -45869 -74109 -538500 84705 151727 90939 75123 137869 232497 -25585 137524 -62053
10490 -62053 141284 292628 82823 137606 361849 -209397 -231951 166485 -129788 -23686
10480 -23686 -117026 -289065 -102501 237298 234941 -190984 -295183 -181471 51689 -222300
10470 -222300 -413680 -219408 -371731 -333342 -195822 -353144 -104755 -309174 -165951 -88834
10460h8834J07234Q6006j86956l62168M56237K44582k03223K5254k06913L33961
10450B05180J97437m05724j4055l32786j37887O55240r4877l65072k21526K33593
10440b80477k7985j34613N0384P1147K63152L93432O1130N4512j89575l95511
10430a34404R591J44185q2349K34075k5447Q3213Q1915p5223j01350l70322k04899
10419d41015J61791L49456r5152j68704n5837j21770m5273m4597K46653J94564
10409a9884k08289k76129K67361P7584O0793j27704j26681m5590R0127K78797
10399b9615L1113R147K11543q3087l42842L2110L17502j74612m8143L01290n14821
10388b90415L28734o354m59113K26770L32515K64710m09663p2619L4595O8725
$$ plain form
10460 -88834 18400 104406 -82550 -444718 11519 256101 52878 78132 -128781 205180
10450 205180 402617 -3107 -17162 -349948 -487835 167405 72528 -292544 -514070 -280477
10440 -280477 -308462 -443075 -392691 -321544 -58392 335040 396170 450682 261107 -134404
10430 -134404 -124813 19372 -62977 171098 145651 228864 310779 235556 134206 -236116 -441015
10419 -441015 -279224 70232 -24920 -193624 -249461 -371231 -416504 -461101 -214448 -19884
10409 -19884 -228173 -504302 -236941 -159357 -98564 -226268 -352949 -398539 -308412 -29615
10399 -29615 1498 10645 222188 139101 -203741 -171631 145871 -28741 -76884 224406 -290415
10388 -290415 38319 31965 -427148 -200378 132137 396847 -12816 -85435 -50840 17885
10378A7885L70660j89650p9748j18039k46994k86425K51473N79108k4846k6326
10368B47098k21674O6914K99149m97930j71041P3890M9538J23120m44120j21986
10358e97042J58979O38471J4823l8304j9146j23539k56676K92010J9450J09577
10348A98603N96886j43513j95930k66129J02384O2944M35021j51783l60253n54500
10338b76270K49021J64966K14804k20117n06426M64250J81234L8259k23113q6156
10328D52l06751J99817J97296l33308L555p0740K69269P2029l65592P1970J38527
10317a23476K17724o8938j07555K0537k66963R0181R2057J14546p5911J73340
10307F5542j48376k87264m12537Q1807J21308J98764L69787K84794m9151J56611
$$ plain form
10378 17885 388545 198895 119147 1108 -245886 -532311 -280838 298270 273424 247098
10368 247098 25424 92338 391487 -106443 -277484 -203594 -154056 -30936 -475056 -597042
10358 -597042 -438063 200408 215231 176927 157781 34242 -222434 69576 89026 198603
10348 198603 795489 651976 456046 189917 292301 355245 790266 638483 278230 -276270
10338 -276270 -27249 137717 352521 132404 -374022 90228 271462 309721 86608 452
10328 452 -306299 -106482 90814 -242494 -238939 -309679 -40410 31619 -333973 -262003 -123476
10317 -123476 94248 25310 -82245 -61708 -328671 -238490 -146433 -31887 -107798 65542
10307 65542 -82834 -370098 -782635 -700828 -579520 -380756 -10969 273825 224674 381285
10297C81285Q7835m32770P9410K83863m4254k53562l70295K54850J57281m26600
10287b82957j74541J53300M94610j35800r5500N1423j59639l04804K95723k8651
10277a86836p5671L5912N64892K8264m09177J26988k98813j05898m5286O6782
10267b98843J80563J04151k71363J14235j8979j67950m3127k8113P09175k08916
10257G0833K80568P6251j49991k42444J28408k6236n44167j39800J45780M0300
10247c60498P3931K16638r1260k06992n8026j18233O79722J62947q9022K14161
10237D23368j49136l45318J10700o3626j2299j19970Q3548M00156l92445M1248
10227b3774m043o2048k22127K70116j49214j75550K97470M5105K8393j0059l05632
$$ plain form
10297 381285 469120 36350 115760 399623 355369 101807 -268488 -13638 143643 -282957
10287 -282957 -457498 -304198 190412 54612 -40888 10535 -149104 -453908 -158185 -186836
10277 -186836 -262507 -226595 338297 366561 -42616 84372 -214441 -320339 -365625 -298843
10267 -298843 -118280 -14129 -285492 -171257 -190236 -358186 -401313 -429426 279749 70833
10257 70833 351401 427652 277661 35217 163625 137389 -406778 -546578 -400798 -360498
10247 -360498 -286567 -69929 -161189 -368181 -426207 -544440 135282 298229 209207 423368
10237 423368 274232 -71086 39614 -24012 -36311 -156281 -72733 327423 -65022 -23774
10227 -23774 -27817 -89865 -311992 -41876 -191090 -366640 -69170 -24065 4328 -5731 -311363
10216c11363N7255R9124L0564N48521j26860j78829j23276r7822J27689O5377
10206I0380L10270j4036l1133j52651l08523l412L95493o3609q546M1286k7064
10195B28455m58736J58356L56093k0537j40467j04427M9883J22405l84619K03850
10185A0256K29220j64799l70808J11767Q5176k8762K12389J14240O9086l6262
10175B31503k69793K24424k26033j21573J61764n1330j75619P50146r3612p62614
10165c32737M30367K50400j30487k21666k38304n92694K53991K82011n9875L363
10155c55631M92741P6995l03498q9610L54309M5418k45409L4606J30122l66772
10145b26729r144L19032J8958j60289P2965m45011k7167L6646M8785k6535M38206
$$ plain form
10216 -311363 -254108 -154984 -124420 424101 297241 118412 -4864 -102686 25003 90380
10206 90380 400650 386614 355481 202830 -105693 -109105 286388 222779 214233 255519 228455
10195 228455 -230281 -71925 284168 263631 123164 18737 68620 191025 -193594 10256
10185 10256 239476 74677 -296131 -184364 -99188 -127950 84439 198679 267765 231503
10175 231503 -38290 186134 -39899 -161472 292 -51038 -226657 523489 429877 -332737
10165 -332737 97630 348030 217543 -4123 -242427 -835121 -581130 -299119 -358994 -355631
10155 -355631 137110 214105 -89393 -179003 175306 220724 -24685 9921 140043 -226729
10145 -226729 -235873 83159 102117 -58172 14793 -430218 -457385 -420739 -371954 -398489 39717
10134C9717j20992k20587K94596J25293K06668l81763Q8904O34314n58892l74321
10124b67063L23035P3905J71751p15345k84247K09560K77980M71680l3701n00374
10114b72819j88577P9929j2645J34913o4243k28353K8519J1254m64194J91061
10104g85155Q01341N0410r5147K2538k5030k72420l1900K37761j72105k26506
10094d96213L83935k34787J50816K71518m59138J9654J35890J75945J17481q5929
10084b0828q1347J07254J70920n9565j98312o4928R9953J97110o07121J85959
10074b70905K19429J30153N5093J08450j9231O9694q964j93805j89399j28745
10064b28230K92334J79109j39680k1169j97704O5693l07257P7905K56020j16653
$$ plain form
10134 39717 -81275 -301862 -7266 118027 324695 -57068 31836 666150 107258 -267063
10124 -267063 55972 129877 301628 -413717 -697964 -488404 -210424 261256 227555 -272819
10114 -272819 -461396 -381467 -394112 -259199 -323442 -551795 -523276 -512022 -976216 -785155
10104 -785155 16186 66596 -28551 -6013 -31043 -303463 -335363 -97602 -269707 -496213
10094 -496213 -112278 -347065 -196249 75269 -383869 -364215 -228325 -52380 65101 -20828
10084 -20828 -102175 5079 175999 116434 -81878 -146806 -46853 150257 -456864 -270905
10074 -270905 -51476 78677 133770 242220 222989 292683 283719 89914 -99485 -228230
10064 -228230 64104 243213 103533 82364 -115340 -49647 -356904 -278999 -22979 -139632
10054a39632r1781J3648m1885o2585L84231P5640j44348m74494J36838Q2822J35334
10043a26212K91422k18628n1120J22997o8740J42015k59145k6244J34982J01346
10033D2673j26996J26633k56228k3670L36831K70180k54336K12876n5179l31081
10023e8297J11943m2093M9762J32131l03535J30581K62535l67323j0079k51226
10013c45601j32288N92334K5395l48398k29566J92931L19769l52m79450J02358
10003c02868o6180j16143L19438k2902M06002j10705m85884M8711L41805P4450
9993H5724N1259L700J68847P9836l75020n47375L61246j64011J15298M83941K40138
9982E03583j92839m35504J76563j88026l4003j68542j48642q616K1691K28665
$$ plain form
10054 -139632 -231413 -217765 -259650 -322235 61996 137636 -6712 -481206 -344368 -261546 -126212
10043 -126212 165210 -53418 -104538 18459 -50281 91734 -167411 -193655 -58673 42673
10033 42673 -84323 42310 -213918 -237588 99243 369423 115087 327963 272784 -58297
10023 -58297 53646 11553 61315 193446 -110089 20492 283027 -84296 -94375 -345601
10013 -345601 -477889 114445 139840 -208558 -438124 -245193 74576 74224 -405226 -302868
10003 -302868 -369048 -485191 -165753 -188655 217347 106642 -379242 -330531 11274 85724
9993 85724 136983 140683 309530 389366 14346 -533029 -171783 -335794 -220496 263445 503583
9982 503583 310744 -124760 51803 -136223 -170226 -338768 -487410 -496026 -474335 -245670
9972b45670k1823O6764J53820j41765k655r7055l0066k13698J25586J8140J15310
9961b73112K66051J84455k6525j85549o41685K51526M61271P7925J2050k04670
9951g8263J49949N0621J77822j50989J17613k88686m06843L77321L02536m01199
9941a50118J5874L47361J84240J48172k9582k24307k21288j09728J7266Q0090
9931E7980O7021R3300K30006J52961l74601j12896J77197k80214j2548K45246
9921B43452j53999K36987l40149j38850J15000j92730J635k97014k2465N53000
9911D867n901k43184L38416j94377m6469J34114K96971j43310l3190l21505L22726
9900A09158k41149L6364k84119L14719K45155k19944m24987o2400M84707J27227
$$ plain form
9972 -245670 -267493 -200729 -46909 -188674 -191329 -288384 -318450 -532148 -406562 -388422 -273112
9961 -273112 -7061 177394 150869 -34680 -676365 -424839 36432 114357 126407 -78263
9951 -78263 71686 122307 300129 149140 266753 -21933 -428776 -51455 251081 -150118
9941 -150118 -134244 213117 397357 545529 515947 291640 70352 -39376 -22110 57980
9931 57980 125001 218301 448307 601268 226667 113771 290968 10754 -1794 243452
9921 243452 89453 326440 -13709 -152559 -37559 -230289 -228654 -525668 -548133 4867
9911 4867 -1034 -244218 94198 -100179 -146648 -12534 284437 141127 107937 -213568 109158
9900 109158 -131991 -95627 -379746 -65027 180128 -39816 -464803 -527203 -42496 84731
9890H4731J01222j90849o3325o5175K45962j96150l6677M58573J22627n2990m17765
9879i816m7125R8504L76813m96952o40198J63273J57125J56800j36030J60606
9869b17000r8815Q3929P3917K62663k04835k0141q7680K6403L03019l63774l44746
9858e87060K2941J192L64959O84427j02430o71637L39319r0320K92669n4358k03733
9847d031N90900k99833m74995M00707j95903n6086j00210k68160L73882J08413
9837G4684J9563l83139P4275l26406K98992M80970j56464J86348j82505J16082
9827B02400k71236l0256j20037M09519l00152k77423K54680M23148j87790o0893
9817D1960j12939j65248L55057j00356j30678j00134J13909j47012K4108n03401
$$ plain form
9890 84731 185953 -4896 -68221 -133396 112566 -83584 -120261 338312 460939 407949 -9816
9879 -9816 -56941 41563 418376 -78576 -718774 -555501 -398376 -241576 -377606 -217000
9869 -217000 -315815 -231886 -157969 104694 -100141 -120282 -207962 -181559 121460 -242314 -587060
9858 -587060 -564119 -562927 -197968 486459 384029 -287608 51711 -38609 254060 199702 -4031
9847 -4031 586869 287036 -187959 212748 16845 -39241 -139451 -407611 -33729 74684
9837 74684 94247 -288892 -214617 -541023 -242031 238939 82475 268823 86318 202400
9827 202400 -68836 -99092 -219129 190390 -109762 -387185 -132505 290643 102853 41960
9817 41960 -70979 -236227 118830 18474 -112204 -212338 -98429 -245441 -221333 -724734
9807g24734j55523N92846o5752J36419N23773l22891O0090K73712o0152J00538
9797C58326k19811j65630R4433P5347j9721k69641o1154K82613J32775N4879r4625
9786A67791j98112J78926M9709r9569K60306j04335m89256k26335l18298J35019
9776f44154M53302k1180j14658M46852j15774N502l7411p6459O9696l57926J67534
9765b24676L12960K83702K5235p4690l96385p5508N70725J36560n51905p4747
9755f8729P1557K60625K36300J6739J67713o08393j09192r4094k56536l1890M32510
9744A6610L51989n47575j40639M27074j09639M305J5019K3267L57721k1732j33754
9733B42646l10275L0347J89027m46546R8828J3793j11409J38266J14154J56501
$$ plain form
9807 -724734 -880257 -287411 -353163 -216744 307029 -15862 44228 317940 257788 358326
9797 358326 138515 -27115 67318 142665 122944 -146697 -207851 74762 207537 262416 167791
9786 167791 -30321 148605 198314 98745 359051 254716 -234540 -460875 -779173 -644154
9776 -644154 -190852 -212032 -326690 120162 4388 9890 -27521 -103980 -34284 -392210 -224676
9765 -224676 88284 371986 397221 322531 -73854 -149362 421363 557923 6018 -68729
9755 -68729 2828 263453 499753 516492 684205 75812 -33380 -127474 -384010 -415900 16610
9744 16610 368599 -178976 -319615 107459 -2180 2125 17144 40411 398132 376400 242646
9733 242646 -67629 -37282 151745 -294801 -195973 -182180 -293589 -155323 -41169 115332
9723A15332l22543k45982J71109R0577K58246k13784j53112k99498M7202N03925
9713d8528K95604R5340K70416l31554n11852N40720l21375n32530k6674J33939
9703d36494Q8414L78433K37249l36800M0100j32629p2012J57391o7313R5404J22549
9692G4292j23753j02357K69899m4454k67475J29511j6193J34727m8240J86899
9682A92856j08905j55966J4953j56010q4410L51783r7964J96949K38489n37377
9672a45602J79121L90343k50955j93827N1787k4671N2361q9240q7323j23561q500
9661b50067j60473M00267k3561N454N4055j10120P5821j23880O8633M40607k63415
9650A13321j12896N5394O5735l3596J74637l29459j68307K97312L3016k38790
$$ plain form
9723 115332 -207211 -453193 -282084 -191507 66739 -147045 -300157 -599655 -552453 -48528
9713 -48528 247076 342416 612832 281278 -230574 310146 -11229 -543759 -570433 -436494
9703 -436494 -348080 30353 267602 -69198 -29098 -161727 -233739 -76348 -143661 -48257 74292
9692 74292 -49461 -151818 118081 73627 -193848 -64337 -80530 54197 5957 192856
9682 192856 83951 -72015 -57062 -213072 -297482 54301 -43663 153286 391775 -145602
9672 -145602 33519 423862 172907 -20920 30867 6196 58557 -30683 -118006 -241567 -250067
9661 -250067 -410540 -10273 -33834 -28380 25675 -84445 -8624 -132504 -63871 376736 113321
9650 113321 425 55819 121554 87958 262595 -66864 -235171 62141 95157 -143633
9640a43633j88388l3033J39078K7933k56943r0506N9161P5008M09497j16541r498
9629a27865k83997j10614K39688k0918L37379R0275k03850j67170J86139m19872
9619d80805J66904K00359k99016j63781J86920N82761l46081j25282K83520j71846
9609a66347J06988k04790K07713j45804p3584K62107j1396k96670L48669n5117
9599b8231o5347J3688M1402J16682l5490K33994l29734j19372J55643K54108J17983
9588C55326l27366l27473j47476N20084M86906k52225o8781O8192J1497j11387
9578B07297k32778k07749k01374J24712J31964j55617J10257J03855l1046Q7677
9568f2802l33535K83464J27345Q8541q2352O33L5412j06467r0628J6074K81595
$$ plain form
9640 -143633 -332021 -365054 -225976 -198043 -454986 -545492 -486331 -411323 -1826 -118367 -127865
9629 -127865 -411862 -522476 -282788 -303706 33673 123948 -79902 -247072 -60933 -480805
9619 -480805 -313901 -113542 -412558 -576339 -389419 193342 -152739 -278021 5499 -166347
9609 -166347 -59359 -264149 -56436 -202240 -275824 -13717 -25113 -321783 26886 -28231
9599 -28231 -93578 -79890 -38488 78194 42704 276698 -53036 -172408 -16765 237343 355326
9588 355326 27960 -299513 -446989 73095 560001 307776 238995 307187 318684 207297
9578 207297 -25481 -233230 -434604 -309892 -177928 -333545 -223288 -119433 -150479 -62802
9568 -62802 -396337 -112873 14472 103013 20661 21294 56706 -49761 -140389 -124315 157280
9557A57280l59789n46881K53835K42702K01739j74203K32247k40032j77587J96988
9547b13701K7442N05923k37334L00928N9160p1480M0650Q50M51O5773m34338l08613
9535b64289l38537L40630L7006j7891j27873J21318J96540L64989J916q5866j60432
9524F7511r9664K15249l21668J45989k27085j10537K95081J25046J80303k38170
9514C2055L3897J79176m58142K7714M99558p60607P1378J87764n4863K15685j6013
9503d2398j428j20809K1082J41413M00021l33136n01657N9123O9310J29282K09675
9492C0478k72597L14932Q963m7119k36351q7864p9319j84841K59349P2764O70499
9481D48894k96731k37481o1212k68008K85185R6407j02620j66676J23263j46351
$$ plain form
9557 157280 -202509 -749390 -495555 -252853 -51114 -225317 6930 -233102 -410689 -213701
9547 -213701 -186259 319664 82330 383258 442418 370938 411588 412438 412889 478662 44324 -264289
9535 -264289 -602826 -262196 -225190 -243081 -370954 -249636 -53096 311893 313809 227943 67511
9524 67511 -32153 183096 -138572 7417 -219668 -330205 -35124 89922 270225 32055
9514 32055 65952 245128 -213014 -185300 314258 -446349 -374971 -187207 -242070 -26385 -42398
9503 -42398 -43826 -164635 -143553 -2140 397881 64745 -436912 -377789 -308479 -179197 30478
9492 30478 -242119 72813 81776 34657 -201694 -289558 -368877 -553718 -294369 -221605 448894
9481 448894 152163 -85318 -146530 -414538 -129353 -32946 -135566 -302242 -178979 -325330
9471c25330J96894R7324j5827k19227L42320M08350n60318j75756J33144k57601
9461c76027J35060J26209L04741j56695n47172M28788L71074j38694O6128n7094
9451A56318o99920j30844M27797o3017J18773K80853j75565j26424P26316k3137
9441D91150j86405q7717L6949m43903K8096N90610k65826l597R3697n7905M18827
9430F13976n34983k48121M58605j05678k36900K13786K23358M5295k26426k20467
9420a7555j6854K06579J08576m1341j43620L2708k65064K9610K9105q851O24230
9409E37523o77599K39623N26180k15325L495l112l04654k77311L79247J04064
9399C12131K38280j59885k70689K45138n01779J37530K03976j25581k29584N79241
$$ plain form
9471 -325330 -128436 -31112 -46939 -266166 76154 484504 -75814 -251570 -118426 -376027
9461 -376027 -240967 -114758 189983 33288 -513884 -85096 285978 147284 213412 156318
9451 156318 -543602 -674446 -246649 -309666 -190893 89960 -85605 -212029 514287 491150
9441 491150 304745 217028 253977 -189926 -161830 428780 162954 159357 253054 195149 613976
9430 613976 78993 -169128 289477 183799 -53101 160685 384043 429338 202912 -17555
9420 -17555 -34409 172170 280746 239405 95785 128493 -136571 -106961 -77856 -86707 537523
9409 537523 -140076 99547 625727 410402 413897 410785 106131 -171180 208067 312131
9399 312131 550411 390526 119837 364975 -136804 726 204702 79121 -150463 428778
9389D28778l44826k52461j66922k86731J03213j89784N61842L8699j50379L22034
9379F3463j68446j44315P2858L1144N03060N6932J38055K3720l17758Q1735j30454
9368B09994l46420M7576j03314N11716M0312m58515L61826k14632o5857M8998
9358C1684k42029R5229Q0645J64830J66561n49633M35860q4689J37322L24737
9348E60517j52495j23105J66831j95349O0850J02642L03500r118m95994J58053
9338C76332M15957j90818k09287Q8346j28207L94737o3427k24902Q7610K12250
9328G58591k74423m5518L07202J40650m72772m57436j45299L47601K14231k3624
9318C49203j11882J89664j38437m60276J52639P0565J00981k94637M3782P5001
$$ plain form
9389 428778 83952 -168509 -335431 -622162 -518949 -708733 -146891 -108192 -258571 63463
9379 63463 -104983 -249298 -176440 -145296 357764 414696 552751 576471 258713 340448 209994
9368 209994 -136426 -88850 -192164 319552 359864 -98651 263175 48543 -17314 31684
9358 31684 -210345 -115116 -34471 130359 296920 -252713 183147 98458 235780 560517
9348 560517 408022 284917 451748 256399 317249 419891 723391 714273 218279 376332
9338 376332 792289 601471 392184 480530 352323 747060 683633 458731 546341 758591
9328 758591 484168 438650 745852 886502 413730 -43706 -189005 158596 372827 349203
9318 349203 237321 426985 288548 -171728 -19089 51476 152457 -142180 -98398 -23397
9308b3397J26822K89310m14569l3622m7283k18016J62011J59684Q1886l73856
9298b91030j59104K11898N4072l2798r3183K75945k9096K2238J20059J00116J51084
9287C30201L3067k61463j18670K19974J79685l08281o2548m8179m67601L15961
9277a87854K7995O476L73314m9747j7758m4688J0463k22422k28066J35979J31809
9266f4499j03913j36967N22636m7873p2132O5737j4802J92229j33245J90477j45947
9255B51701K57134j86156l02224K5124J11073k1465J74510J25154q8663p9650
9245B66538R376K14953k13252k91852P9399R0112J14251k522K62829J5350J26798
9234F71980k63423K39007J12767k54533M4607K22740o9423p37643k21802J47111
$$ plain form
9308 -23397 103425 392735 -21834 -55456 -102739 -320755 -158744 940 82826 -291030
9298 -291030 -450134 -238236 -184164 -216962 -310145 -34200 -63296 -41058 79001 179117 330201
9287 330201 363268 101805 -16865 203109 382794 74513 11965 -36214 -503815 -187854
9277 -187854 -159859 -153383 219931 170184 152426 107738 118201 -104221 -332287 -196308 -64499
9266 -64499 -168412 -305379 217257 169384 97252 162989 148187 340416 207171 397648 251701
9255 251701 508835 322679 20455 45579 156652 135187 309697 434851 346188 266538
9245 266538 275914 490867 277615 -14237 65162 155274 269525 267003 529832 545182 671980
9234 671980 408557 647564 760331 505798 550405 773145 703722 -33921 -255723 -108612
9224a08612N09933L74756j44124o13709J34215k30124n0768M91507K70630K96526
9214I30230l13577p0692K38904j23506k33809j65205j69492l7966L02675n3684
9204C03878K87327K1777k59871J4028N06322n0870m2772l16056l38007J67513
9194B93269J74038j85555j9936o6721K50398M02964J66819J44014o0861m01433
9184F96996m0359k52179L77436k43312L0547J38516k90606l5483R6497J23670
9174F01723k30875N27078l49469J41000j1949N1757L9382o7181n38654M9975M45600
9163F58387J54196k01454l25562K97302J81663l27061M5609N26674k70401m66050
9153B73303L12182L94166R4098l28714j10946J3479j9632k06119L59144O154n1130
$$ plain form
9224 -108612 401321 776077 631953 18244 152459 -77665 -128433 363074 633704 930230
9214 930230 616653 545961 784865 661359 427550 262345 92853 54887 357562 303878
9204 303878 591205 612982 353111 367139 873461 822591 779819 463763 125756 293269
9194 293269 467307 281752 261816 195095 445493 848457 1015276 1159290 1098429 696996
9184 696996 656637 404458 781894 538582 569129 707645 417039 381556 478053 601723
9174 601723 370848 897926 548457 689457 677508 729265 768647 701466 162812 212787 658387
9163 658387 812583 611129 285567 582869 764532 437471 483080 1009754 739353 273303
9153 273303 585485 979651 1073749 745035 634089 647568 627936 421817 780961 787115 735985
9142G35985j15164j35579M16334J10583L21333j45089k5861J46601m13095L7213
9132I33261K17987J08937k80789J02245j90261O0021J21003k39808J07588j86468
9122G53716P1433j11308J39243L61627j36124l52567L20020K12946J0540l9923
9112A229603K10954k71455J43397R2750j4016J3391m41011J09301L44370J35096
9102A552380Q0712k74088j49224k44517J53849l04890K3043J02066k8136J34539
9092A045734m21026J76994O9135q1674L23424J21619l10342q0233J69698N5766
9082A069095n41250j12257j617j53251L79268j61540k04584j12739N13299L74015
9072A048439l26115K51773n50948K9290K01945k69807N25722k7228l42270n96383
$$ plain form
9142 735985 620821 485242 901576 1012159 1333492 1188403 1162542 1309143 896048 933261
9132 933261 1151248 1260185 979396 1081641 891380 951401 1072404 832596 940184 753716
9122 753716 825149 713841 853084 1214711 1078587 726020 1046040 1258986 1269526 1229603
9112 1229603 1440557 1169102 1312499 1405249 1391233 1404624 963613 1072914 1417284 1552380
9102 1552380 1633092 1359004 1209780 965263 1119112 814222 837265 939331 911195 1045734
9092 1045734 624708 801702 870837 789163 1112587 1234206 923864 843631 1013329 1069095
9082 1069095 527845 415588 413971 260720 639988 478448 273864 161125 674424 1048439
9072 1048439 722324 974097 423149 452439 654384 384577 910299 883071 540801 -55582
9062e5582K34931L16815j9676K27457Q9742k26483n90544K16580O03280j00564
9052F95956J77299O3854l39214m8637R9087j66226M17744L37385m81457n26557
9042B29234K81214M72038m703K96550l98384m08308Q1783j05070J51872J47704
9032G43930m38770K1419M63236k46824J16248K76834j78201K94717o6675n9042
9022I26872L52014M36281q53424K6957k71688O5045M98883k60538J06228J45421
9012A172051K09394o3519l4574j58787K196q6220K50497N63876k11963J53211
9002A796162J45376j35638m12704n5793M4399N9671L79382j04513q6908K21944
8992A851378J05831j26891k09996p4901K6925j35442L97838r4937p5845J31823
$$ plain form
9062 -55582 179349 496164 476488 703945 793687 567204 -23340 193240 796520 695956
9052 695956 873255 937109 597895 549258 648345 482119 899863 1237248 755791 229234
9042 229234 510448 982486 977783 1274333 875949 467641 549424 444354 596226 743930
9032 743930 305160 326579 789815 542991 659239 936073 757872 1052589 985914 926872
9022 926872 1278886 1715167 861743 888700 617012 682057 1180940 920402 1026630 1172051
9012 1172051 1381445 1317926 1283352 1124565 1126761 1040541 1291038 1854914 1642951 1796162
9002 1796162 1941538 1805900 1393196 1337403 1381802 1441473 1820855 1716342 1629434 1851378
8992 1851378 1957209 1830318 1620322 1545421 1572346 1436904 1834742 1739805 1663960 1795783
8982A795783J6139J87030m17913k58955L66793J30408j85045O0703n911K7985
8972A717017j17670j55410q7478L43242K0481J38361M81079j15411Q6732m55065
8962A855878L3690K5653K10089K01735l78685L67473L85795N6097l45046n4081
8952B358598K30474N33541K94312m50157l29335j04690K01146p5264R4981K01032
8942B954638J34255K37245R9040J01893j31485j5174J06590l84750J7669O00136
8932C720057L01087J16586j81991j60573P9687J34568l7482K75252K43217N91006
8922E081414j55722M886k10493m14114N53850K61897k5997L05815M64318m4991
8912E820863j33883M58669L73312J55840N01759L65032N1304O39683M94123L51258
$$ plain form
8982 1795783 1811922 1998952 1581039 1322084 1688877 1819285 1634240 1694943 1689032 1717017
8972 1717017 1599347 1443937 1356459 1699701 1720182 1858543 2339622 2224211 2310943 1855878
8962 1855878 1889568 1915221 2125310 2327045 1948360 2315833 2701628 2757725 2412679 2358598
8952 2358598 2589072 3122613 3416925 2966768 2637433 2532743 2733889 2658625 2753606 2954638
8942 2954638 3088893 3326138 3425178 3527071 3395586 3380412 3487002 3102252 3119921 3720057
8932 3720057 4021144 4137730 3955739 3795166 3874853 4009421 3971939 4247191 4490408 5081414
8922 5081414 4925692 4930578 4720085 4305971 4859821 5121718 5095721 5401536 5865854 5820863
8912 5820863 5686980 6145649 6518961 6674801 7176560 7541592 7592896 8232579 8726702 9077960
8902I077960N33897K80126M41748L66661K61258k17097L9120J66527K33433L28548
8892A1512181K75212J21531k15105L72471L28058k11768k17555K00370K51148
8883A2416543n40467L11546K73358L75576J22762K81016j07500Q35936O09855
8874A4578625M89134L08426Q52287O24546M30930M63175N40437N62044P39058
8865A9588662O39087P19262N61995O50007K0127L80986J23127M58582R79701j70375
8855B3951161J64863J68083l05002k91841K46315K38008O80865L99772N11687
8846B5763911K38087P35108J51948J57353N62340M10660Q72989J170446J587042
8837C1649884J630095P18212L07531J98032l44596p37052L04832J18958N37932
$$ plain form
8902 9077960 9611857 9891983 10333731 10700392 10961650 10744553 10783673 10950200 11183633 11512181
8892 11512181 11787393 11908924 11693819 12066290 12394348 12182580 11965025 12165395 12416543
8883 12416543 11876076 12187622 12460980 12836556 12959318 13240334 13132834 13968770 14578625
8874 14578625 15067759 15376185 16228472 16853018 17283948 17747123 18287560 18849604 19588662
8865 19588662 20227749 20947011 21509006 22159013 22179140 22560126 22683253 23141835 24121536 23951161
8855 23951161 24116024 24284107 23979105 23687264 23933579 24171587 24852452 25252224 25763911
8846 25763911 26001998 26737106 26889054 27046407 27608747 28019407 28892396 30062842 31649884
8837 31649884 33279979 33998191 34305722 34503754 34159158 33422106 33726938 33845896 34383828
8828C4383828Q24750J177208J442101R99011R53188O51328J272170J967276J546023
8819D5216883J010428J098964J314912R85070J726527K637188K997670K525037
8811E9512679K827791K508520K077352K791175L428670M323694N787606N414621
8803H8672108N298039L749595K961322J849210N50217j036174j659430j179126
8795I9205761L02889J873398L591941N045298O221387O574214O523690O792883
8787A36131461P442990J0237753J3353171J6235971K0401991K5068629K8213037
8780B57085003K7109733J9837553Q725294j334538m233783k76562O760862J0912589
8772C24586151Q526417N85369q717790j8135619k4008855k7309993k7182035k4230270
$$ plain form
8828 34383828 35208578 36385786 37827887 38826898 39780086 40431414 41703584 43670860 45216883
8819 45216883 46227311 47326275 48641187 49626257 51352784 53989972 56987642 59512679
8811 59512679 62340470 64848990 66926342 69717517 73146187 77469881 83257487 88672108
8803 88672108 93970147 97719742 100681064 102530274 103080491 102044317 100384887 99205761
8795 99205761 99508650 101382048 104973989 110019287 116240674 122814888 129338578 136131461
8787 136131461 143574451 153812204 167165375 183401346 203803337 228871966 257085003
8780 257085003 284194736 304032289 312757583 311423045 307189262 306912700 313673562 324586151
8772 324586151 333112568 333697937 324980147 306844528 282835673 255525680 228343645 204113375
8764B04113375k0738469j6912937j3102549r641666p164436n483577m426709m453574
8756A22189458m319481l417966k822475k747084k414561k788836k890575k383830
8748I8404650k605000k857085k932224k740227j735737j218329j316830j632291
8740H1366927j291762j363934j997401k289282l500404l759874l087427l327665
8732F0749178k966857k546644k061884j256372j443998j328011j189642k15413
8724D7740357O07338Q82885J633947K780591L797422M805053P468598Q794483
8716G8510674O873694J136471o797623j1772708j1427754q152131n829575m426895
8708C8114153k887710k430923j871257j931423j459252j363488j260416j581817
$$ plain form
8764 204113375 183374906 166461969 153359420 143717754 136553318 131069741 126643032 122189458
8756 122189458 117869977 114452011 111629536 108882452 106467891 103679055 100788480 98404650
8748 98404650 95799650 92942565 90010341 87270114 85534377 84316048 82999218 81366927
8740 81366927 80075165 78711231 76713830 74424548 70924144 67164270 64076843 60749178
8732 60749178 57782321 55235677 53173793 51917421 50473423 49145412 47955770 47740357
8724 47740357 48347695 49230580 50864527 53645118 57442540 62247593 69716191 78510674
8716 78510674 85384368 86520839 79723216 67950508 56522754 48370623 42541048 38114153
8708 38114153 35226443 32795520 30924263 28992840 27533588 26170100 24909684 23327867
8700B3327867j245502j143124n82686o33660j318645J8875r16247p00660l30323
8691A6475895q61687m77370l96187l06013k55994k08288o27963o96721l27072
8682A2318600k55887k46270n75605q07660k25092J67931J747r15330m11909k67229
8672H783296j76613P7733r5312l11900M0899k61734l83897K9125k1517p07974
8662F972106k27454M509j00398m44668L06497R19r92234R3402p0858m4010L1592
8651E529403R8321k31569l9731k81514J48317k18163K43218m35366l29122j20139
8641D363655J18560P1497m72093n3251k94369k2784q3642K4039j95936Q2218p5669
8630C462225j27155R0913R8855J87813L1924k80342l61446q4488L44152n501l12825
$$ plain form
8700 23327867 22082365 20939241 20356555 19722895 18404250 18423125 17506878 16806218 16475895
8691 16475895 15614208 15136838 14740651 14434638 14178644 13970356 13342393 12645672 12318600
8682 12318600 12062713 11816443 11240838 10433178 10208086 10376017 10377764 9462434 9050525 8783296
8672 8783296 8606683 8684416 8589104 8277204 8318103 8056369 7672472 7701597 7680080 6972106
8662 6972106 6744652 6749161 6648763 6204095 6510592 6511511 5519277 5612679 5541821 5497811 5529403
8651 5529403 5627724 5396155 5356424 5074910 5223227 5005064 5248282 4812916 4483794 4363655
8641 4363655 4482215 4553712 4081619 4028368 3733999 3711215 3627573 3651612 3455676 3537894 3462225
8630 3462225 3335070 3425983 3524838 3712651 3744575 3464233 3102787 3018299 3362451 3356950 3044125
8619C044125J6295o9171N1666m8424j70838k04091K4176j95299j36184J208K14694
8608B528157J09424p7538p3136n049k91785M63979j14159j72178M65074k86948
8598B545841k17258j80752l26520L72044N93108p1248j96744o38321Q0945J79007
8588B140102l6292P2526Q0141j10268l68295N47711k71085n09866m128L72482
8578A913028j10792K7343l96228j91489K46757L22927O9904n44698P3530o1104
8568A349178J25298Q5581K8393K0127J99261Q1977k93924j08115m05340j13709
8558I68727K24461k55400L27443l49548k41941N41992J21971k89891J96794j51114
8548A093494l33741k76484L39899O6485j03065L10314j75780J31826j33164o7612
$$ plain form
8619 3044125 3060420 2991249 3042915 2994491 2823653 2619562 2643738 2448439 2312255 2313463 2528157
8608 2528157 2637581 2560043 2486907 2481858 2190073 2654052 2539893 2367715 2832789 2545841
8598 2545841 2328583 2147831 1821311 2193355 2786463 2715215 2518471 1880150 1961095 2140102
8588 2140102 2103810 2176336 2256477 2146209 1777914 2325625 2054540 1544674 1540546 1913028
8578 1913028 1802236 1829579 1433351 1241862 1488619 1811546 1881450 1336752 1410282 1349178
8568 1349178 1474476 1560057 1588450 1608577 1807838 1889815 1595891 1487776 1082436 968727
8558 968727 1193188 937788 1265231 915683 673742 1215734 1337705 1047814 1244608 1093494
8548 1093494 759753 483269 823168 889653 786588 1096902 921122 1052948 919784 852172
8538H52172J89777l28795n0807L28343j33227O6430m5260l09623K71432p5829
8528G64613L71314J70961l46786J1540N6661j30208j20182M44339k48924q9272
8518H84056K56257j65196l54190l69442K28227P9441R943K49912O1256n2119j06575
8507G21570K03170j53086j06666J04995Q2124R9556R8647p1130o134L89399l05609
8496A056836m94908J21340m1979l4892m0384j38999K27360j40583L5155L04220
8486H53166K32113M8202m82212J38656K21255j28208k17871r5538M7051J61326
8476G77940q6898j65272n7718N23445o4094l13398J1417K73694L63931j32865
8466A130182k06085j35698K91955k04059k5597K73014k67172K3845l14586k83683
$$ plain form
8538 852172 1041949 713154 662347 990690 857463 923893 878633 569010 840442 764613
8528 764613 1135927 1306888 960102 971642 1028303 898095 777913 1222252 973328 884056
8518 884056 1140313 975117 620927 251485 479712 559153 569096 819008 880264 828145 721570
8507 721570 924740 771654 664988 769983 852107 951663 1050310 979180 973046 1362445 1056836
8496 1056836 561928 683268 641289 606397 566013 427014 654374 513791 548946 853166
8486 853166 1085279 1133481 651269 789925 1011180 882972 665101 569563 616614 777940
8476 777940 691042 525770 468052 991497 927403 614005 625422 899116 1263047 1130182
8466 1130182 924097 788399 1080354 876295 850698 1123712 856540 880385 565799 282116
8456B82116L68313k08999R9828L45684K90147j35418l71788K9409J4185j57238
8446E56239L48804R7405l8292J64618O51479r0931k39845j9870N011l97570o7113
8435I69935R5909O7812J23709J19652j50968Q7215K52915n61365k24324K10356
8425I90846J65507J00540r6337K9995J65874J46238l22809p6324J29240n7674
8415A175096K06506l3532j45802Q3124l673m90528k4609K72858M52002L4690m61854
8404A064278m43983J63396K20030m3769J44109J48943l73785j31890J80453Q7499
8394A015281k68150K8622L70653L0839O998m1243K16450l87030M5723K44755k74167
8383I88731l9296l75198J9490K89935j0080l65981j73195R2378J99957J76530
$$ plain form
8456 282116 650429 441430 541258 886942 1177089 1041671 669883 699292 713477 556239
8446 556239 905043 1002448 964156 1128774 1780253 1689322 1449477 1429607 1434618 1037048 969935
8435 969935 1065844 1133656 1257365 1377017 1226049 1313264 1566179 1004814 780490 990846
8425 990846 1156353 1256893 1160556 1190551 1356425 1502663 1179854 1103530 1232770 1175096
8415 1175096 1381602 1348070 1202268 1285392 1281719 791191 766582 1039440 1491442 1526132 1064278
8404 1064278 620295 783691 1003721 959952 1104061 1253004 879219 747329 927782 1015281
8394 1015281 747131 775753 1146406 1177245 1184243 1143000 1359450 972420 1018143 1262898 988731
8383 988731 949435 574237 593727 883662 873582 507601 334406 426784 626741 803271
8373H03271j3338J56825j67652K6434K99486o55415J38897Q1285m06563o0857
8363B02373J10363k76191J3795O43403K81991k48105o3634m30447K30983j21047
8353C43484J31446K19568N8862j79497n92428j00182N0561J94853k36640J41602
8343C1629j14838K66422J99439J90809N52m88882J20352M51815J35950m59819
8333C33429p03527m3526L57646p8328J0720J35187J28332N6340P5778p0269J62424
8322C64206k58834J04844m3467l0979L88709M2445J61555j30406k60300m72168
8312a34395K90515K53186k6330k24181J3495L75459o11364K75002L62771j80479
8302C93679J42l59334L28639j46968J1139M3687J9914j36631n8537k54757M65802
$$ plain form
8373 803271 789933 946758 779106 805540 1105026 449611 588508 669793 263230 202373
8363 202373 312736 36545 50340 693743 975734 727629 663995 233548 464531 343484
8353 343484 474930 694498 753360 573863 -18565 -118747 -68186 126667 -109973 31629
8343 31629 -83209 183213 382652 573461 574013 85131 205483 657298 793248 333429
8333 333429 -370098 -413624 -55978 -134306 -123586 11601 139933 196273 272051 201782 364206
8322 364206 105372 210216 166749 135770 524479 566924 728479 598073 337773 -134395
8312 -134395 156120 409306 382976 158795 172290 547749 -63615 211387 574158 393679
8302 393679 393821 34487 363126 216158 227297 270984 290898 154267 95730 -159027 306775
8291C06775K41926k48852n5140j43096r2743r8048L81242J04561L5135k15268
8281B16492k42138K51328j97725r6003P98450j17853j87131l07719J22474L5829
8271B76004j3983k7317n69473M38979N6260j91904J68070k59603K69728K44896
8261C91657j29466K3084k71454l80640J52815L13143J06509L185j79575J46947
8251A76205M1445k943K2516j64721k2072K83745K73819m00880l32623N11403L51616
8240G37510Q6730l08950l4779l918J79213l85696O9888K94800O3969m01979r8579
8229A98209J95459m9023l9189K59380K24891o38457K39522J40479k49073J85j6995
8218B65388j51580L8888L10297J68683J40474k55043l0245J08447k08816k28659
$$ plain form
8291 306775 548701 299849 244709 101613 8870 -89178 292064 396625 431760 216492
8281 216492 -25646 225682 27957 -68046 730404 612551 425420 117701 240175 276004
8271 276004 262021 234704 -334769 104210 160470 -31434 136636 -122967 146761 391657
8261 391657 262191 285275 13821 -366819 -214004 99139 205648 208833 29258 176205
8251 176205 217650 214707 237223 72502 50430 334175 607994 207114 -125509 385894 737510
8240 737510 824240 515290 480511 476593 655806 270110 339998 634798 698767 296788 198209
8229 198209 393668 344645 305456 564836 789727 151270 390792 531271 282198 282383 265388
8218 265388 113808 152696 462993 631676 772150 517107 486862 595309 386493 157834
8208A57834J38394R0447K4382J44839L2201M3646j70689N3381Q402k25154j4179
8197B83504J44317K85200M98156k13050J190334j914927j680259Q92309N5696
8188d58720K08757k99610M27739L70843l01650j33519J53759L3476J77353K5880
8178B04308K41921j10035j95382k98915J42053M13000k47069l64584k0764L22854
8168H7387R182j16991L03737j53800l9690O1414O6819n5351N8114N03994k66580
8157D58235n23027K9601N9359J06893K9751R4364N6431O1234K214k3230k04148
8146A47677K05388j67350K8707Q7172m01436K36223L30974K66181l08244j17105
8136C08187j50493j79884k313O13856j59339k13569M6711l1710p9916J5567l2480
$$ plain form
8208 157834 296228 386675 411057 555896 588097 631743 461054 514435 522837 297683 283504
8197 283504 427821 713021 1211177 998127 2188461 273534 -1406725 -514416 -458720
8188 -458720 -249963 -549573 -121834 249009 -52641 -186160 -32401 1075 178428 204308
8178 204308 446229 336194 140812 -158103 -16050 396950 149881 -214703 -235467 87387
8168 87387 96569 -20422 283315 129515 89825 151239 218058 162707 220821 724815 458235
8157 458235 -64792 -35191 24168 131061 160812 255176 311607 372841 375055 351825 147677
8146 147677 353065 185715 214422 301594 -99842 136381 467355 733536 425292 308187
8136 308187 157694 -22190 -24503 589353 430014 216445 263156 231446 151530 167097 134617
8125A34617R70536R460n18608l48036q100L55460j02150m29593K25416q3302o3392
8114A42308J51824J83352q2683j56552n1699j21540K09026P2898K83413n92621
8104C7726K91264K37389k22223j57477L91420j72205k49600k15583P0655r9208
8094h7842p0285O4952k16828K28465L28210L49079J99583r097j84802q7031Q5984
8083F00388K17979k34089r5939J64180j68615l43819L59143J10838k02974L73886
8073G80978j54210J06475Q1451n07718j9455J92974J50567j65540Q371j93496
8063B80397j30807M11353p7150l07101Q7596O40740n6403m58861P2655k55847
8053B06572j803K5514K56649J88780m9217P7106J75580k28144j17146L40104m95188
$$ plain form
8125 134617 1105153 1114613 596005 247969 239869 595329 493179 63586 289002 205700 142308
8114 142308 294132 477484 394801 238249 186550 65010 274036 346934 630347 37726
8104 37726 328990 566379 344156 186679 578099 405894 156294 -59289 11366 -87842
8094 -87842 -158127 -93175 -310003 -81538 246672 595751 795334 786237 601435 514404 600388
8083 600388 818367 584278 488339 652519 483904 140085 499228 610066 407092 780978
8073 780978 626768 733243 814694 306976 287521 480495 631062 465522 473893 280397
8063 280397 149590 560943 483793 176692 264288 905028 848625 389764 462419 206572
8053 206572 204769 230283 486932 675712 626495 703601 879181 651037 533891 873995 378807
8042C78807j20225O2957N2637L04339j72508J81567Q2056n8400R3231r922n3316
8031G41223M2178l87684K05719K60374m42796J26357m03454M81853J54568J12826
8021H91164k6603p2939l93801J54429J3944K76391N68992l33443l002k40750Q9894
8010I24276J4058J0129J0719j21784J86034R2154l2171n40325k39879K3895J97897
7999E25003J27349J20588K57277K76015j18979l38596L0530l1113n3629k24228
7989E70217J15315J80373p2491J44849j57532J0040K91992k84150j89464J3815
7979F22964P4175K25097r2032R7403J10063j70324J84344j00685J47808j28027
7969I70786j30021r7218o7090l29664N41012K17209k0950O67684m44614l43591
$$ plain form
8042 378807 258582 321539 374176 678515 506007 687574 769630 711230 804461 794539 741223
8031 741223 783401 395717 601436 861810 419014 545371 141917 623770 778338 891164
8021 891164 864561 791622 397821 552250 566194 842585 1411577 1078134 1075132 834382 924276
8010 924276 938334 948463 959182 837398 1023432 1115586 1083415 543090 303211 327106 525003
7999 525003 652352 772940 1030217 1306232 1187253 848657 879187 848074 794445 570217
7989 570217 685532 865905 793414 938263 780731 790771 1082763 798613 609149 622964
7979 622964 697139 922236 830204 927607 1037670 867346 1051690 951005 1098813 970786
7969 970786 840765 743547 676457 346793 887805 1105014 1084064 1751748 1307134 963543
7959I63543K21569k99228j18348J73897K71474k00891K69167M49517l19956K15168
7949A625912k3965o4622J86494j45069j71566o834n3269k03255K04458j73873
7939A174411L6325j92918k1832M34182J42926j3241o0804J81472L22601k20348
7929A782774L6210p4253j78008J38854j393j7758k05269j37942J40209j30500
7919A352924k74240N40848K8958M00448k07620q7320K5153l29476J95508J58120
7909A803303M5776j30599J35683K32548l09455m8876j24951K04872p0891k6710
7899A710700J27454N11635j45429o6894n9231p9734J19840l35640k4908k165P18590
7888B474218j13707j73026m00080P1592L9077L01955J14210N6019M69542n6664
$$ plain form
7959 963543 1185112 885884 767536 941433 1212907 1012016 1281183 1730700 1410744 1625912
7949 1625912 1601947 1537325 1723819 1578750 1407184 1400350 1347081 1143826 1348284 1174411
7939 1174411 1210736 1017818 995986 1430168 1573094 1559853 1499049 1680521 2003122 1782774
7929 1782774 1818984 1744731 1566723 1705577 1704184 1686426 1481157 1343215 1483424 1352924
7919 1352924 1078684 1619532 1648490 2048938 1841318 1753998 1779151 1449675 1645183 1803303
7909 1803303 1849079 1718480 1854163 2086711 1777256 1728380 1603429 1808301 1737410 1710700
7899 1710700 1838154 2349789 2204360 2137466 2078235 1998501 2118341 1782701 1757793 1755628 2474218
7888 2474218 2360511 2187485 1787405 1858997 1898074 2200029 2314239 2370258 2839800 2783136
7878B783136k64463N6468J32287K46098J72691m35759k38235J68893K39909N5225
7868B916250K33738K146k60968J78724K14238l9340O6808L0953k73076p7071J88177
7857C180579R3564j11111M518K45307J61952k72167R3385o6756L30579K56435
7847C916285n46032Q4911J90640L02150J99708K35236j18957L86543L73428k16738
7837D807174n6808J09253J54842K10639K5520j73002K61052O0778R2804J80848
7827E673100m0021k45142n0665O7348J1218M62394O7221q3695J33735N00748L04084
7816F800325l20231P9581L27939J60196k51850M54897K47549J66820p73403Q80315
7806G772138Q45969k79288l5203j32785K33008K26868j36900q6887N54708L31849
$$ plain form
7878 2783136 2518673 2575141 2707428 2953526 3126217 2690458 2452223 2621116 2861025 2916250
7868 2916250 3149988 3152134 2891166 3069890 3284128 3244788 3311596 3342549 3069473 2992402 3180579
7857 3180579 3274143 3163032 3167550 3412857 3574809 3302642 3396027 3329271 3659850 3916285
7847 3916285 3370253 3455164 3645804 3947954 4147662 4382898 4263941 4650484 5023912 4807174
7837 4807174 4750366 4859619 5014461 5225100 5250620 5077618 5338670 5399448 5492252 5673100
7827 5673100 5633079 5387937 5337272 5404620 5415838 5878232 5945453 5861758 5995493 6496241 6800325
7816 6800325 6480094 6559675 6887614 7047810 6795960 7250857 7498406 7665226 6891823 7772138
7806 7772138 8618107 8338819 8303616 8170831 8403839 8630707 8493807 8406920 8961628 9293477
7796I293477N08856j80651L0768N30893o4791j5846N1536M51730K26118M94J20171
7785A0952755K37985L80364L16942K66746L60652M07554j23079k31713j35979
7776A2432227O84822J33701J12794M22440K74967L22042J55820L44928M37202
7767A5320943k42900P21214L51318J19546K12576M46420J61070M16099N35035
7758A8041321J35885L0951J73972M2959K06794J60815N51261k14695J79450j25252
7748A9183461M31802m401J44098k8019J49279L03016k49099L18275M71868N005
7738B0725285K23207Q4889K3486K55470j20957j28176P0131K17945k12494J13433
7728B1252219Q9428p9126k988J22683k604K16222q64590j62283k43431j47896
$$ plain form
7796 9293477 9802333 9621682 9652450 10183343 10118552 10102706 10154242 10605972 10832090 10832584 10952755
7785 10952755 11190740 11571104 11888046 12154792 12515444 12922998 12799919 12568206 12432227
7776 12432227 13117049 13250750 13363544 13785984 14060951 14382993 14538813 14883741 15320943
7767 15320943 15078043 15799257 16150575 16270121 16482697 16929117 17090187 17506286 18041321
7758 18041321 18177206 18208157 18382129 18425088 18631882 18792697 19343958 19129263 19308713 19183461
7748 19183461 19615263 19610862 19754960 19726941 19876220 20179236 19930137 20248412 20720280 20725285
7738 20725285 20948492 21033381 21056867 21312337 21191380 21063204 21133335 21351280 21138786 21252219
7728 21252219 21341647 21262521 21259533 21382216 21379612 21595834 20731244 20568961 20325530 20177634
7718B0177634L07687p7035l44717j29514l72482j78912l11856j78332k82188J21257
7708A8731542j17086j99219l90963K2990n8495m1368k10113l87935j56459J96554
7698A7389448j16819j80374k0997k93312m64904L3195l0699p00172n77737Q1559
7688A5119188K91807K34374k92545o6813k92559q7921k73399j62393k98874k3344
7678A4147521j16870l90828K16120N6230j67438J91276k94378j56942L8555J91810
7668A3715056J43801l80139k4632j59429P4334N24475n39174Q5729m3097m6698
7658A3350226K32323j34763R957N4556M0374l33723m8232j24700J03085K90865
7648A3439968J19034j54155R1955j99867Q4313O6170J21919q00K33759M37646
$$ plain form
7718 20177634 20485321 20408286 20063569 19934055 19561573 19382661 19070805 18892473 18610285 18731542
7708 18731542 18614456 18415237 18024274 18047264 17988769 17947401 17737288 17349353 17192894 17389448
7698 17389448 17272629 17092255 17071258 16777946 16313042 16346237 16315538 15615366 15037629 15119188
7688 15119188 15410995 15645369 15352824 15286011 14993452 14905531 14632132 14469739 14170865 14147521
7678 14147521 14030651 13639823 13855943 13912173 13744735 13936011 13641633 13484691 13523246 13715056
7668 13715056 13858857 13478718 13454086 13294657 13368991 13893466 13354292 13440021 13396924 13350226
7658 13350226 13582549 13447786 13457743 13512299 13552673 13218950 13170718 13046018 13149103 13439968
7648 13439968 13559002 13404847 13496802 13296935 13381248 13447418 13569337 13568537 13802296 14239942
7638A4239942K74224K31029K25399l671O99824M82567M5759O6939j29096K18018
7628A6350934K0933k47007j41929L7228M02822O8831q3266L92763N67474k96130
7618A7072653K07117K309M91458J5842L33179K68455J69326K29025K08903L4367
7608A9032634O6835J61235L34465J90320P7372J24859R9083k23576L08604K92138
7598B0463969K50244J59364m00336M75636L52272m16815l38114j99608P59814
7589B1106426L43365J86166M24087J93130L3276j76148j30467n79785j8036J24216
7579B1506230q6134m48893o5127k57431P4991l90144l12325k05098K19247L85128
7569B0420444j99340k56249l25522n07530O10473N3173k40473j7810j44044N1266
$$ plain form
7638 14239942 14514166 14745195 14970594 14966923 15666747 16149314 16195073 16262012 16132916 16350934
7628 16350934 16371867 16124860 15982931 16020159 16422981 16491812 16408546 16801309 17368783 17072653
7618 17072653 17279770 17282079 17773537 17789379 18122558 18391013 18560339 18789364 18998267 19032634
7608 19032634 19099469 19260704 19595169 19785489 19862861 19987720 20086803 19863227 20171831 20463969
7598 20463969 20714213 20873577 20473241 20948877 21301149 20884334 20546220 20346612 21106426
7589 21106426 21449791 21635957 22060044 22253174 22286450 22110302 21979835 21400050 21382014 21506230
7579 21506230 21420096 20971203 20906076 20648645 20723636 20333492 20021167 19816069 20035316 20420444
7569 20420444 20221104 19964855 19639333 19131803 19742276 19795449 19554976 19537166 19393122 19444388
7559A9444388j12737J25383k08432J61663L94969l32085o18417m68233k74601
7550A8111898L0789k24368m26868p40737n90886N35926J18241p65049j06847k57490
7540A5684609j76471j17844k99496j16218j90110n50510k26696K85975m22087
7531A3871152p9946j41615k52552j77797k18323M07107J53987l22675j67077j40611
7521A2931650k66423P4852j11836j75254L10351l24457m52072K06316N06195j73205
7511A2526117j21595M45338k9472K61399Q01861o8779J69087L76006O34027Q66977
7501A5860966P54525L17045k73020J6545j285884j106076n35958o74633n29456
7492A2544054n54403L8271P805j15595k1959K28085K20292K76698L51644N59030
$$ plain form
7559 19444388 19331651 19457034 19248602 19410265 19805234 19473149 18854732 18386499 18111898
7550 18111898 18142687 17918319 17491451 16750714 16159828 16695754 16813995 16048946 15942099 15684609
7540 15684609 15508138 15390294 15090798 14974580 14784470 14233960 14007264 14293239 13871152
7531 13871152 13791206 13649591 13397039 13219242 13000919 13408026 13562013 13239338 13072261 12931650
7521 12931650 12665227 12740079 12628243 12452989 12763340 12438883 11986811 12193127 12699322 12526117
7511 12526117 12404522 12849860 12820388 13081787 13883648 13814869 13983956 14359962 14993989 15860966
7501 15860966 16615491 16932536 16659516 16676061 15390177 14284101 13748143 13073510 12544054
7492 12544054 11989651 12027922 12035727 11920132 11898173 12126258 12346550 12623248 12974892 13533922
7482A3533922L43713Q11219J066441J563289J525635J653074J978490R55347l47478
7473B3083652j759712k411876k464773j571766r17858n63779q05255j83890k3427
7464A2381316M11741M219J6199O05884L63903J31459J329925J267277M92651J352131
7454A8356705J779046J376670k97600n18916r6788r18530j853248j302833j026113
7445A5498393j158595p14165l79828J4549J2681k21401L16936O25379N22648N3653
7435A4570250J063706J474235J264627J732275K308054K588582J305000l37303
7427B5969426j068431j434308j388762p13133q7101J23914m39446q16726k55425
7418A9890008j482615j547153p98934n52786j242799l46075M51593O8476N01213
$$ plain form
7482 13533922 13877635 14688854 15755295 17318584 18844219 20497293 22475783 23431130 23083652
7473 23083652 21323940 18912064 16447291 14875525 13957667 13393888 12588633 12404743 12381316
7464 12381316 12793057 12797276 12813475 13419359 13783262 13914721 15244646 16511923 17004574 18356705
7454 18356705 20135751 21512421 21214821 20695905 20599117 19680587 17827339 16524506 15498393
7445 15498393 14339798 13625633 13245805 13260354 13273035 13051634 13368570 13993949 14516597 14570250
7435 14570250 15633956 17108191 18372818 20105093 22413147 25001729 26306729 25969426
7427 25969426 24900995 23466687 22077925 21364792 21277691 21401605 20962159 20145433 19890008
7418 19890008 18407393 16860240 16061306 15508520 14265721 13919646 14371239 14439715 14940928
7409A4940928J169400R00833J177866J316335J235440J160843K09037M04909J18581
7400B2634172O49506R13436J374176J369514J47084j623692k795652l072562k697561
7391A6898421r85833o63745o57771m76222l36200m9125m3809L7049J68770R97420
7381A4888955M58708N36122R65947J900598J764067J759555J473974N63463k30260
7372B4081129j208412j327294j727775k650462j276094j508088j022591l58434
7364A3001979n06156N2556J65966J6942m4767L32247J138067J149909P39828J647717
7354A7694288J936031J896738K687882K279716L80100j942740l351075l375359
7346A8205581k567962k094517j291260j288969o14032l12493r40967Q469l5530
$$ plain form
7409 14940928 16110328 17011161 18189027 19505362 20740802 21901645 22110682 22515591 22634172
7400 22634172 23283678 24197114 25571290 26940804 27087888 25464196 22668544 19595982 16898421
7391 16898421 15912588 15248843 14591072 14114850 13778650 13729525 13685716 13722765 13891535 14888955
7381 14888955 15347663 15883785 16849732 18750330 20514397 22273952 23747926 24311389 24081129
7372 24081129 22872717 21545423 19817648 17167186 15891092 14383004 13360413 13001979
7364 13001979 12495823 12548379 12714345 12731287 12686520 13018767 14156834 15306743 16046571 17694288
7354 17694288 19630319 21527057 24214939 26494655 26874755 24932015 21580940 18205581
7346 18205581 15637619 13543102 12251842 10962873 10348841 10036348 9095381 9103850 9068320
7337I068320R9085l42769k00991P06270N61150K77445K16319Q17593Q92492R75078
7327A3069992J046423P40273j85595j575191k152913j606086q94311j477033o40371
7318F325188o82223l76204Q1468l31717k55950k59927k94482j80042n74649j53810
7308C297652k07756M43440K2415l91904j05877J37120j6588m6505n8948k78664
7298B794385k48523j87331M18680k51832j74943J73564N9698j65006l61141k91318
7288A766233K1287k1726J27548k06362L78762K77004k74475j07673l74181L58652
7278A945069M4627J10368n172j88751J59837k20713r1157K95578q4888m13851
7268A550947K12750O0276n02439j22885K62050J15878n0684j64880M08490k74087
$$ plain form
7337 9068320 9167405 8824636 8623645 9329915 9891065 10168510 10384829 11202422 12094914 13069992
7327 13069992 14116415 14856688 14671093 13095902 10942989 9336903 8442592 6965559 6325188
7318 6325188 5642965 5266761 5348229 5016512 4760562 4500635 4206153 4026111 3451462 3297652
7308 3297652 3089896 3533336 3555751 3163847 3057970 3195090 3178502 3131997 3073049 2794385
7298 2794385 2545862 2358531 2777211 2525379 2350436 2524000 2583698 2418692 2057551 1766233
7288 1766233 1787520 1765794 1893342 1686980 2065742 2342746 2068271 1960598 1586417 1945069
7278 1945069 1989696 2100064 2094892 1906141 2065978 1845265 1754108 2049686 1964798 1550947
7268 1550947 1763697 1823973 1321534 1198649 1460699 1576577 1525893 1361013 1769503 1495416
7258A495416K82101k48283m97362N35278m380j17070l17775j76358J8046r85R7206
7247A065834p2500j74195J54332j37457k23143L13521O68963j30268m47028J13048
7237A131107K16912p5405O8782l43260K27130n96850L54642R9250L36760j59360
7227A259708k73698l32080l8375M85505m19192k57466L75738J57192k9256N47637
7217A475713j83845Q2214J4870K16857q6737m41166j38029M26966J36574j51730
7207A351687n90106K09543L68543J10296J97898k3028l66603M751j59258p1540
7197A032183k65372r689m0881K36024J35472j1828k27420J11023J35032k64075
7187H30469M3023j35064L92814l12805j66426J84547k35809K43678q1548L5898
$$ plain form
7258 1495416 1777517 1529234 1031872 1567150 1562770 1445700 1127925 951567 969613 968628 1065834
7247 1065834 993334 819139 973471 836014 612871 926392 1595355 1465087 1018059 1131107
7237 1131107 1348019 1272614 1341396 998136 1225266 628416 983058 1082308 1419068 1259708
7227 1259708 986010 653930 615555 1101060 681868 424402 800140 957332 928076 1475713
7217 1475713 1291868 1374082 1388952 1605809 1519072 1077906 939877 1366843 1503417 1351687
7207 1351687 761581 971124 1339667 1449963 1647861 1624833 1258230 1262981 1103723 1032183
7197 1032183 766811 757122 716241 952265 1087737 1075909 848489 959512 1094544 830469
7187 830469 873492 738428 1131242 818437 652011 836558 600749 844427 762879 798777
7177G98777k8110J43881J56656p3881o9271j4197j87452O7203L4717j03152K68924
7166I94095n6242J29927N1195m64899K80893o0662l65417j31873p4182L55641
7156F58476o6213N7822K46831j78630j81142K39667k15475M59J513k22961N0315
7145C90662N7898J12526J88524j97523j0500J28121J27467j49779P1242J44052
7135H62690J19664r8664m4806k59666l33559K71719K30524j52045j18968M41258
7125I18147K82518o8871l078l87466n9968K73963o9944j78593l37950k21100K09619
7114C57277M8356K79461L8552n02580k08948M37804J0243k25696K47702j27631
7104C54540K16117l44667N4375J03908K47988N0690L21821k95930R6063J26633
$$ plain form
7177 798777 770667 914548 1071204 997323 928052 913855 726403 793606 828323 725171 994095
7166 994095 937853 1067780 1118975 654076 934969 874307 508890 377017 302835 658476
7156 658476 592263 650085 896916 718286 537144 776811 561336 561795 563308 340347 390662
7145 390662 448560 561086 749610 552087 541587 669708 797175 647396 718638 862690
7135 862690 982354 883690 838884 579218 245659 517378 747902 595857 476889 918147
7125 918147 1200665 1131794 1128716 741250 681282 955245 885301 706708 368758 147658 357277
7114 357277 405633 685094 723646 221066 12118 449922 460165 234469 482171 354540
7104 354540 570657 225990 280365 384273 632261 682951 1004772 708842 804905 931538
7094I31538n15299K58400N3015j13534j14926K54073k41264q5619P2349j57580
7084C41153L34310J25142k52710M2304K80512j5158m04729J71844J43831Q1311
7074H47810O1274k8065L5519r3657l04663J52872j42103K69537K63180Q6223l38303
7063H09624j34633M23401k52016l71923L4630K23546J78309L24663o34153j27819
7053D73629J13400k83066N59897N8334l33783j14515O7295L04055K7413N74037
7043A446696J79165k88094j81181k86241l71301K31163J77337M1752p2715N4433
7033I31014J05914L58301j8438l21852L19346j44278M2556k30166m92864j11661
7023D37872O32027J3283J13942K50364q5839m1072K37833l6401J85845j53981
$$ plain form
7094 931538 416239 674639 727654 614120 499194 753267 512003 426384 498733 341153
7084 341153 675463 800605 547895 590199 870711 855553 450824 622668 766499 847810
7074 847810 909084 881019 916538 822881 518218 671090 528987 798524 1061704 1147927 809624
7063 809624 674991 1098392 846376 474453 509083 732629 910938 1235601 601448 473629
7053 473629 587029 303963 863860 922194 588411 473896 541191 845246 872659 1446696
7043 1446696 1625861 1337767 1156586 870345 499044 730207 907544 949296 876581 931014
7033 931014 1036928 1395229 1376791 1054939 1374285 1230007 1272563 1042397 549533 437872
7023 437872 1069899 1083182 1197124 1447488 1361649 1320577 1558410 1522009 1707854 1553873
7013A553873j64739J88382J49988N3944j93783j03580o0140k27876j63098K46893
7003A279864J61421P9677Q2635k6030J87466J19606K8740m47690L9601l7378N693
6992A473605K35242J00949j26573M9638k81401j78438M27820k32019J44929L58530
6982A972282J33395j39840R4482j8709r0680K63730N82712k77636j11818K08609
6972B616527Q7811J15077J7445l73765j98448K25801R312J15621M86325l67635
6962B734071K4037L32475J69932j69821J49482L52602M17495k36784l1883Q3445
6952C825051j11358J60313L11606J56896L02712M72652M34754M3982j00957J59420
6942E655071P86750M03487L29207N12720K44841M52251L66269L08488n37653K79756
$$ plain form
7013 1553873 1389134 1577516 1727504 1781448 1587665 1484085 1423945 1196069 1032971 1279864
7003 1279864 1441285 1520962 1603597 1577567 1765033 1884639 1913379 1465689 1505290 1467912 1473605
6992 1473605 1708847 1809796 1683223 1732861 1451460 1273022 1700842 1468823 1613752 1972282
6982 1972282 2105677 1965837 2060319 2041610 1950930 2214660 2797372 2519736 2407918 2616527
6972 2616527 2704338 2819415 2836860 2463095 2264647 2490448 2499760 2615381 3101706 2734071
6962 2734071 2758108 3090583 3260515 3090694 3240176 3592778 4010273 3773489 3741606 3825051
6952 3825051 3713693 3874006 4185612 4342508 4645220 5117872 5552626 5596608 5495651 5655071
6942 5655071 6441821 6845308 7174515 7687235 7932076 8384327 8750596 9059084 8521431 8801187
6932H801187L98940P14635j10457n66502l29359l97336J78692p9037m96312J94623
6922H309074J39225k93876K04939j16661j23140M04704K04503M13518Q6797K64369
6912I493452J4677O16732J091786M24946K04371J89513J008127N58691L89733
6903A3992028p9289M923K99890l8321J59021J32322j31173O13383p2424O0517
6893A4940877M51913j7922M93200J85645J85411O60063J090914L89769Q32579
6884A9212449R45107J245577J241479J104168J374243K081797K382930K182272
6876C1770022K265351J968241K251992K332056K413357K477361K434312J505328
6868D9418020J116411J831756R47176J167767J287398R72800N79335k48985o55739
$$ plain form
6932 8801187 9200127 9914762 9804305 9237803 8908444 8511108 8689800 8610763 8114451 8309074
6922 8309074 8448299 8154423 8359362 8242701 8119561 8524265 8728768 9142286 9229083 9493452
6912 9493452 9508129 10124861 11216647 11641593 11845964 12035477 13043604 13602295 13992028
6903 13992028 13912739 13917662 14217552 14179231 14338252 14470574 14339401 14952784 14880360 14940877
6893 14940877 15392790 15374868 15868068 16053713 16239124 16899187 17990101 18379870 19212449
6884 19212449 20157556 21403133 22644612 23748780 25123023 27204820 29587750 31770022
6876 31770022 34035373 36003614 38255606 40587662 43001019 45478380 47912692 49418020
6868 49418020 50534431 52366187 53313363 54481130 55768528 56741328 57320663 57071678 56415939
6859E6415939j048862o04515q40151l63687j005572j253249o41186q1471N1909
6850E0629155N92393Q24426N88757Q73396R01931R38956J381297K194157K016036
6841F0940504J202226p08189j541788j999285j621181p67700j208965k274318
6833E2021304k942031l088644k775797k698448k374548k303810k083087j662150
6825C2092789j539728j193851o21662m20078o52440j23956J58160J34716K37647
6816B8071597N82233R57761R60690O27651J437599J752381K104371K717475K653438
6807D1865196M258339M430829L945931L983039L390230L030833K181538J560316
6799F8646251Q63015J414678J357445J072976J279589N69938O78497O25848P06434
$$ plain form
6859 56415939 55367077 54762562 53922411 53558724 52553152 51299903 50658717 50577246 50629155
6850 50629155 51221548 52045974 52634731 53508127 54410058 55349014 56730311 58924468 60940504
6841 60940504 62142730 61434541 59892753 57893468 56272287 55504587 54295622 52021304
6833 52021304 49079273 45990629 43214832 40516384 38141836 35838026 33754939 32092789
6825 32092789 30553061 29359210 28737548 28317470 27665030 27541074 27699234 27833950 28071597
6816 28071597 28653830 29611591 30572281 31199932 32637531 34389912 36494283 39211758 41865196
6807 41865196 46123535 50554364 54500295 58483334 61873564 64904397 67085935 68646251
6799 68646251 69509266 70923944 72281389 73354365 74633954 75203892 75882389 76508237 77214671
6790G7214671j06772j210561k727889l860648l664380l503413k968101l014349
6782E6158558l509488l927005l968150l929541l446848k996221k629035k618804
6774B9133466k305740j849259j702439j653251j036567p71048j414563j169916
6766A7230683o66592o21776r11101o55143m28138o96053q80498j31791l30115
6757A1909476r26306l42785m02616l46781n97787l6491l09688k5619m83053n22860
6747G915490k80727n48842J34847k74431p38391k63282p5325N7555l15371j20733
6737E490790M31665j48035m06108l62738p2997P0256L77344l15490l2995l22069
6727D709623k78786m91017j17957J95757j87017j56826J64760p5903M81835R0916
$$ plain form
6790 77214671 77107899 75897338 73169449 69308801 65644421 62141008 59172907 56158558
6782 56158558 52649070 48722065 44753915 40824374 37377526 34381305 31752270 29133466
6774 29133466 26827726 24978467 23276028 21622777 20586210 19815162 18400599 17230683
6766 17230683 16564091 15942315 15031214 14376071 13947933 13251880 12371382 12239591 11909476
6757 11909476 10983170 10640385 10237769 9890988 9293201 9256710 8947022 8921403 8438350 7915490
6747 7915490 7634763 7085921 7220768 6946337 6207946 5944664 5869339 5926894 5611523 5490790
6737 5490790 5922455 5774420 5368312 5005574 4932577 5002833 5380177 5064687 5031692 4709623
6727 4709623 4430837 3939820 3821863 4017620 3830603 3673777 3838537 3762634 4244469 4335385
6717D335385j94394n54911j91732K47678m35095k34215j39298M50716K9185n53034
6707B760285j25280L22212j75121J57104J33708p1367l52178k14017j46081p7575
6697B211690k27208L51211N68541m13695l3916K83656k61284J86830l15855K2373
6687B372343O1036K0590k8232k65283K17071j55528L5244N8295k84642k0742J02304
6676B112456k73992O5583k0573J48427O2589k81177j33224K28991Q6329J14152
6666B109561k0493j57089J36716k64360M9831j34085K87055L5470J61556M5383
6656B249545l18614k3341n2011n9361j42362l48909M7352K26262m70397K6784
6646A134948k77129l7563L79102K93121m83491L16724k01797j74030L48335J10611
$$ plain form
6717 4335385 4140991 3586080 3394348 3642026 3206931 2972716 2833418 3284134 3313319 2760285
6707 2760285 2635005 2957217 2782096 2939200 3072908 3001541 2649363 2435346 2289265 2211690
6697 2211690 1984482 2335693 2904234 2490539 2456623 2740279 2478995 2665825 2349970 2372343
6687 2372343 2433379 2453969 2425737 2160454 2377525 2221997 2257241 2315536 2030894 2010152 2112456
6676 2112456 1838464 1904047 1883474 2031901 2094490 1813313 1680089 1909080 1995409 2109561
6666 2109561 2089068 1931979 2068695 1804335 1854166 1720081 2007136 2042606 2204162 2249545
6656 2249545 1930931 1907590 1855579 1796218 1653856 1304947 1352299 1578561 1108164 1134948
6646 1134948 857819 820256 1199358 1492479 1008988 1325712 1123915 949885 1298220 1408831
6636A408831J7568k30264k17342r7049K85282K39926k24914j92034L37608P0854
6626A398466j54968K04424j04120j19386K07892j20541p9580j55071J26652j403
6616A202365j09138k11711o2215r9513M94225K7138k51493o0173m3565l32568
6606E53352K57378K35649p349l31386L63903j61583J02557n1286k17103K90793
6596A034925J98287o9378k77311Q7986J65138J26458l88197n5839J66682L26758
6586A315509m17912Q0957J60000L5489m47134K47036K43194J96151k46123m07107
6576G60060J29898K20311J79048j96576O923Q3366Q4386L68720l43988j81248
6566A110900j51152J12471L43334k93743N1827K37617m04994L36951L32547j45108
$$ plain form
6636 1408831 1426399 1196135 978793 881744 1167026 1406952 1182038 990004 1327612 1398466
6626 1398466 1243498 1447922 1343802 1224416 1432308 1311767 1232187 1077116 1203768 1202365
6616 1202365 1093227 881516 819301 719788 1214013 1241151 989658 929485 885920 553352
6606 553352 810730 1046379 1039030 707644 1071547 909964 1012521 961235 744132 1034925
6596 1034925 1233212 1163834 886523 974509 1139647 1266105 877908 822069 988751 1315509
6586 1315509 897597 978554 1138554 1174043 726909 973945 1217139 1413290 1167167 760060
6576 760060 889958 1110269 1289317 1092741 1099664 1183030 1267416 1636136 1292148 1110900
6566 1110900 959748 1072219 1415553 1121810 1173637 1411254 1006260 1343211 1675758 1530650
6556A530650L0686l2622r44891K49215L38189J86136j4937P8934J44091l89206
6546A176245R2443M42577K3333n56476n6662o5458M63024l98603N4734L48444
6536A523601j74549L43308l67852j19487L32497J1915j55515M3386l3296n0803
6526A353205K72506o2838J03924k76148K25953L2381K58039j70213q055K53438
6516A982192L29562j16129J0102j75516J33088K66737J25478j47585J33508k70963
6506B270474P8429J13312l14819j90973L44965M78508O317k05368l43796j81054
6496B055995J18263M25672J05229K81855k3344K59021j22729j88952P0504R7495
6486C079009r182l25800J12583O74416j89655N02639o6161L7516k07437M4474
$$ plain form
6556 1530650 1561336 1528714 583823 833038 1171227 1357363 1342426 1421360 1565451 1176245
6546 1176245 1268688 1711265 1734598 1178122 1121460 1056002 1519026 1120423 1175157 1523601
6536 1523601 1349052 1692360 1324508 1205021 1537518 1549433 1393918 1437304 1404008 1353205
6526 1353205 1625711 1562873 1666797 1390649 1616602 1648983 1907022 1736809 1728754 1982192
6516 1982192 2311754 2195625 2205727 2030211 2163299 2430036 2555514 2407929 2541437 2270474
6506 2270474 2348903 2462215 2147396 1956423 2301388 2779896 2786213 2580845 2237049 2055995
6496 2055995 2174258 2599930 2705159 2987014 2963670 3222691 3099962 2911010 2981514 3079009
6486 3079009 3069827 2744027 2856610 3531026 3341371 3844010 3777849 3815365 3607928 3652402
6476C652402q3565m13218K93537l84414M79515o1464j77067L23056K23605K51614
6466D104001J4179J02044k362m05866P4095K35715k78124K16776K90582k05332
6456D145708L75440J6009o2121k8476L17401L72912j86908J72269K91042K34188
6446E647464n6975L55252J85372J3940l03551R0062K20833j60596O19909N30210
6436G141920p3183J60635P5715j16667M26365N47364K90832J74074O67150K8183
6426I322388J6208K36568K86213M8825M27815J91798j7296N08216K46855N09340
6416A1776930K91502M22969N74931K95431N98874K33830M32714O83109Q3762N72541
6406A5966593Q39202M38180J69470J163201P21941Q83868N11850J014000J289812
$$ plain form
6476 3652402 3568837 3155619 3449156 3064742 3544257 3482793 3305726 3628782 3852387 4104001
6466 4104001 4118180 4220224 4217862 3811996 3886091 4121806 3843682 4060458 4351040 4145708
6456 4145708 4521148 4537157 4475036 4446560 4763961 5136873 4949965 5122234 5413276 5647464
6446 5647464 5590489 5945741 6131113 6145053 5841502 5931564 6152397 5991801 6611710 7141920
6436 7141920 7068737 7229372 7305087 7188420 7614785 8162149 8452981 8627055 9294205 9322388
6426 9322388 9338596 9575164 9861377 9910202 10338017 10529815 10512519 11020735 11267590 11776930
6416 11776930 12068432 12491401 13066332 13361763 13960637 14194467 14627181 15310290 15394052 15966593
6406 15966593 16805795 17243975 17413445 18576646 19298587 20182455 20694305 21708305 22998117
6397B2998117J110266J028091Q33130J046667J044243J740876J716822J367113
6389C2885325J780809J858225K463739K512436K474916K835873K596853L557213
6381E2965389L671105L343926L809465L818281M135988M060292L464438K862049
6373H2130933K159282J276358O13408p72496j031824j597098k076444k109124
6365G8592995k529101j991274j496686r27036p58874r23729m5825J24342N84448
6356G0629260J451770J466306J781131K193036J975881R59231J615282J030671
6348H3102568l59172p98086j061169k806572l542593l316749l749434m567237
6340F2901556l979799l931695l752055l014191l235125l059839k589965k436228
$$ plain form
6397 22998117 24108383 25136474 25969604 27016271 28060514 29801390 31518212 32885325
6389 32885325 34666134 36524359 38988098 41500534 43975450 46811323 49408176 52965389
6381 52965389 56636494 59980420 63789885 67608166 71744154 75804446 79268884 82130933
6373 82130933 84290215 85566573 86179981 85407485 84375661 82778563 80702119 78592995
6365 78592995 76063894 74072620 72575934 71648898 70890024 69966295 69920470 70044812 70629260
6356 70629260 72081030 73547336 75328467 77521503 79497384 80456615 82071897 83102568
6348 83102568 82743396 81945310 80884141 78077569 74534976 71218227 67468793 62901556
6340 62901556 58921757 54990062 51238007 48223816 44988691 41928852 39338887 36902659
6332C6902659k004209j581646k296132j638855j102191j885663j340688j664037
6324B3389238o17174r90609j003290q40447q00938q6256r57289r11812o63922
6315A6517501p48591m66368j86897k17962l92555p07281m73958l78215n17706
6306A2427968k62816j47643l71638n28676m88229j82491k3181j79033m33595l43841
6296I466825J55185j99890p42875k53601j07345J67748p6466q6345l46588M4936
6286H021584L95100j31650m94333k71728N1452j17799N3280n2192k14739J15238
6276G354213J76238j11726o5188L81092J43068k0056Q5822M47297L47806L10143
6266I048709J42626N62416K69497R38870O15549M16918Q60532M4391L11042L14047
$$ plain form
6332 36902659 34898450 33316804 31020672 29381817 28279626 26393963 25053275 23389238
6324 23389238 22772064 21781455 20778165 19937718 19136780 19050524 18093235 17181423 16517501
6315 16517501 15768910 15302542 15115645 14897683 14505128 13797847 13323889 12945674 12427968
6306 12427968 12165152 12017509 11645871 11117195 10628966 10446475 10423294 10244261 9810666 9466825
6296 9466825 9622010 9422120 8679245 8425644 8318299 8486047 8409581 8323236 7976648 8021584
6286 8021584 8416684 8285034 7790701 7518973 7570425 7452626 7505906 7453714 7238975 7354213
6276 7354213 7530451 7418725 7353537 7734629 7877697 7857641 7943463 8390760 8738566 9048709
6266 9048709 9191335 9753751 10023248 10962118 11577667 11994585 12855117 12899508 13210550 13524597
6256A3524597L57382k65171n50864l62764m74932p18055j096594l83865k89677
6247I740057j126476o39075l24075L2858o0542n8171L14003j47183j64657M75804
6237H042543J94382R18290k7916O56645O79801P71707K93028j46049N29867j8276
6227A1894022k25988n14588m86719p17402l74411l0684m76265j016405p81806
6218G269754p40429m76351p32862m34168l36219n8308j23654m66816K0042j41533
6208C779456j0731N1357J12280n34303m76659J1698l31802L33187j93321J5917
6198B757079N6450j6061P3992K53264L0569J64927n83442n74604j02192K01154
6188B261136K27488k07561K5876M1486l35082m58301J87968J92336K8714K60812
$$ plain form
6256 13524597 13881979 13616808 13065944 12703180 12228248 11510193 10413599 10029734 9740057
6247 9740057 8613581 7974506 7650431 7683289 7622747 7564576 7878579 7731396 7566739 8042543
6237 8042543 8236925 9155215 9127299 9783944 10463745 11235452 11528480 11382431 11912298 11894022
6227 11894022 11668034 11153446 10666727 9949325 9574914 9544230 9067965 8051560 7269754
6218 7269754 6529325 6052974 5320112 4885944 4549725 4491417 4367763 3900947 3920989 3779456
6208 3779456 3768725 3820082 3932362 3398059 2921400 2933098 2601296 2934483 2741162 2757079
6198 2757079 2813529 2797468 2871460 3124724 3155293 3320220 2736778 2162174 2059982 2261136
6188 2261136 2488624 2281063 2306939 2348425 2013343 1555042 1743010 1935346 1964060 2224872
6178B224872l32326p4655J47918J66667K79245q50254K44486J83085k87817L68893
6168B070114k13383k06005M99616j13048l48362J47597k86753J9490O09619J9513
6158B198398k70322j57419r2987J36854l4107k67630J80158J899J73890J19812
6148A988546n76429j71043p7861O93497K67493k67547m075m5337L00691q7397
6138B020538m07552L20200L92026O2918n51139j91085L18015K8237l38545m42557
6128A211056N47777J49173l12238j72150J73093p6123K82631J74914O4345K44717
6118B287195J21733j76799m29617K43524M90797J0390l55967l3672K8964N50993
6108B737541k18127p8883L4795j6354J24154M3732j35750k87727L60753L45977
$$ plain form
6178 2224872 1892546 1817891 1965809 2132476 2411721 1561467 1805953 1989038 1701221 2070114
6168 2070114 1856731 1650726 2150342 2037294 1688932 1836529 1549776 1569266 2178885 2198398
6158 2198398 1928076 1770657 1677670 1814524 1780417 1512787 1692945 1694844 1868734 1988546
6148 1988546 1412117 1241074 1163213 1856710 2124203 1856656 1852581 1807244 2107935 2020538
6138 2020538 1612986 1933186 2325212 2388130 1836991 1645906 1963921 1992158 1653613 1211056
6128 1211056 1758833 1908006 1595768 1423618 1596711 1520588 1803219 1978133 2042478 2287195
6118 2287195 2408928 2232129 1802512 2046036 2536833 2547223 2191256 2157584 2186548 2737541
6108 2737541 2519414 2440531 2475326 2458972 2583126 2626858 2491108 2203381 2564134 2910111
6098B910111l81698o9477j13926J59675J94738M0261J11887m2588L13860M1028
6088C163871O796m34007L18490j79135L91456K06098r0588K33389j50783K13921
6078C679508O95835J13408M35958K19323k36635J38025N7381M53163M37620O34479
6068F628065M97451J50994Q25681P01373P79054J031401J212166J358641J475753
6059A4660579J373365J561451R04910J206963P92822L74152l82558n61571o08172
6050A9321941q86325p71633j201041j015203j719745k024716j279511j017917
6042I405850q99091k79495o15888o48023n32846P8908J46175J83281l17880l38649
6032F182342L2491k173k66889J15295K05658L76015K08396J07714K06969J01657
$$ plain form
6098 2910111 2528413 2458936 2345010 2504685 2699423 2739684 2851571 2808983 3122843 3163871
6088 3163871 3170667 2736660 3055150 2876015 3267471 3473569 3382981 3616370 3465587 3679508
6078 3679508 4375343 4488751 4924709 5144032 4907397 5045422 5102803 5555966 5993586 6628065
6068 6628065 7125516 7276510 8102191 8803564 9582618 10614019 11826185 13184826 14660579
6059 14660579 16033944 17595395 18500305 19707268 20500090 20874242 20491684 19930113 19321941
6050 19321941 18435616 17663983 16462942 15447739 13727994 11703278 10423767 9405850
6042 9405850 8506759 8227264 7611376 6963353 6430507 6509415 6655590 6838871 6520991 6182342
6032 6182342 6214833 6212660 5945771 6061066 6266724 6642739 6851135 6958849 7165818 7267475
6022G267475K85289K27268K77900m3137K70356Q24068R51704J258692Q60864J381057
6012A3561536J543155J697866J450526Q54998Q04685N34331K63071j79528n85528
6003A9945112j353507j168939j269653j705370j562668j581528j615236r07448
5995H780763k66015p59435p68658m91842J25220q12675q93319j95495J24453R4355
5985D937352l05489l68589j40900o7304p5412n59210J26899J00055K38105p6597
5975C808910l91316J04322m8148J542l41471j52553n55206O16154r6812R5062
5965C040484L26713j33735j84751n66770M22365M6928k63291r6071L8614j47743
5955B482743K13377n4695k09154J47932L35289L6236L88545j00318j65421k17460
$$ plain form
6022 7267475 7552764 7780032 8057932 8014795 8285151 9109219 10060923 11319615 12180479 13561536
6012 13561536 15104691 16802557 18253083 19108081 19912766 20447097 20710168 20530640 19945112
6003 19945112 18591605 17422666 16153013 14447643 12884975 11303447 9688211 8780763
5995 8780763 8514748 7755313 6986655 6494813 6620033 5807358 4914039 4718544 4842997 4937352
5985 4937352 4631863 4263274 4122374 4055070 3979658 3420448 3547347 3647402 3885507 3808910
5975 3808910 3417594 3521916 3473768 3475310 3133839 2981286 2426080 3042234 2945422 3040484
5965 3040484 3367197 3233462 3048711 2481941 2904306 2951234 2687943 2591872 2630486 2482743
5955 2482743 2696120 2641425 2432271 2580203 2915492 2951728 3340273 3239955 3074534 2857074
5945B857074p8974j50549O0259j10555J54766K15986J30033j12407j64173k97382
5935B504078k32836L74341k97891L39831J95256q7039j59481J44636m0349l49667
5925B390879K27933j09530P9066P2186j83274K07484L78176K56084j12858M32671
5915C638817k11570r3776k56203N6088J50654K80353Q934j20828j8327J74270
5905C608412l19340M63959L42613m014j98571r8790L45661j55987j7809L31468
5895D297602J44835J75820M86608k29388o424j95970l94519M52799L85111L61962
5885E478436k83533J450J87488J72178J13569L32998M73601J63161N6178K3169
$$ plain form
5945 2857074 2778100 2627551 2687810 2577255 2732021 2948007 3078040 2965633 2801460 2504078
5935 2504078 2271242 2645583 2347692 2687523 2882779 2795740 2636259 2780895 2740546 2390879
5925 2390879 2618812 2509282 2588348 2660534 2477260 2684744 3062920 3319004 3206146 3638817
5915 3638817 3427247 3333471 3077268 3133356 3284010 3564363 3573297 3452469 3434142 3608412
5905 3608412 3289072 3753031 4095644 4091630 3893059 3794269 4139930 3983943 3966134 4297602
5895 4297602 4442437 4618257 5104865 4875477 4869053 4673083 4278564 4731363 5116474 5478436
5885 5478436 5194903 5196353 5383841 5556019 5669588 6002586 6476187 6639348 6695526 6718695
$$ [...]
##END NTUPLES=NMR SPECTRUM
##END=
