##TITLE=1H_CA-8974-2
 CDCl3
 8 sc, 
 8.02.2022
##JCAMPDX= 6.0         $$ Bruker NMR JCAMP-DX V2.0
##DATA TYPE= NMR SPECTRUM
##DATA CLASS= NTUPLES
##ORIGIN= UXNMR, Bruker Analytische Messtechnik GmbH
##OWNER= root
$$ XWIN-NMR		Version 3.5
$$ Tue Feb  8 12:28:37 2022 Russian Standard Time (UT+4h)  she@DPX200
##.OBSERVE FREQUENCY= 200.131346
##.OBSERVE NUCLEUS= ^1H
##.ACQUISITION MODE= SIMULTANEOUS
##.ACQUISITION SCHEME= undefined
##.AVERAGES= 8
##.DIGITISER RES= 18
##SPECTROMETER/DATA SYSTEM= spect
##.PULSE SEQUENCE= zg30
##.SOLVENT NAME= CDCl3
##.SHIFT REFERENCE= (INTERNAL, CDCl3, 0, 15.7149)
##AUDIT TRAIL= $$ (NUMBER, WHEN, WHO, WHERE, WHAT)
$$ ##TITLE= Audit trail, XWIN-NMR		Version 3.5
$$ ##JCAMPDX= 5.01
$$ ##ORIGIN= Bruker BioSpin GmbH
$$ ##OWNER= she
$$ F:/spectra/data/she/nmr/H-F/1/pdata/1/auditp.txt
$$ ##AUDIT TRAIL=  $$ (NUMBER, WHEN, WHO, WHERE, WHAT)
(   1,<2022-02-08 12:25:45.65 +0400>,<she>,<DPX200>,
      <created by zg, POWCHK disabled, PULCHK disabled
       configuration hash MD5:
       00 E9 B6 7A A2 85 ED C7 34 08 36 98 17 FE 4E 26
       data hash MD5: 16K
       6F BB 26 D3 A4 45 09 89 D0 AE 69 B6 8E 4B 60 81>)
(   2,<2022-02-08 12:25:49.60 +0400>,<she>,<DPX200>,
      <Start of raw data processing
       efp BC_mod = 2 LB = 0.24 FT_mod = 6 PKNL = 1 PHC0 = -15866.98 PHC1 = 7.00078 SI = 16K 
       data hash MD5: 16K
       E5 78 98 07 57 28 5E 03 C2 88 FF 1C CC 90 68 02>)
(   3,<2022-02-08 12:26:17.78 +0400>,<she>,<DPX200>,
      <pk PHC0 = -0.9456031 PHC1 = 3 
       data hash MD5: 16K
       67 79 85 28 6C 56 2F DC C3 21 FF 98 52 9C 9D 4E>)
(   4,<2022-02-08 12:26:23.81 +0400>,<she>,<DPX200>,
      <abs ABSG = 5 
       data hash MD5: 16K
       C3 D5 51 0F EA 1D B1 89 FA 8B 75 DE 9F 93 3A 23>)
$$ ##END=
$$ 
$$ hash MD5
$$ 3A 32 57 18 D6 65 01 16 8F B1 95 69 06 DF 72 A8
##$RELAX= 
##$RELAX= 
##$RELAX= 
##$RELAX= 
##$RELAX= 
##$RELAX= 
$$ Bruker specific parameters
$$ --------------------------
##$DU= <F:/spectra>
##$EXPNO= 1
##$NAME= <H-F>
##$PROCNO= 1
##$TYPE= <nmr>
##$USER= <she>
##$AMP= (0..31)
100 100 100 100 100 100 100 100 100 100 100 100 100 100 100 100 100 100 
100 100 100 100 100 100 100 100 100 100 100 100 100 100 
##$AQSEQ= 0
##$AQ_mod= 1
##$AUNM= <au_zg>
##$AUTOPOS= <>
##$BF1= 200.13
##$BF2= 200.13
##$BF3= 200.13
##$BF4= 200.13
##$BF5= 200.13
##$BF6= 200.13
##$BF7= 200.13
##$BF8= 200.13
##$BYTORDA= 1
##$CFDGTYP= 0
##$CFRGTYP= 5
##$CHEMSTR= <none>
##$CNST= (0..31)
1 1 145 1 1 1 1 1 1 1 1 1 1 1 1 1 1 1 1 1 1 1 1 1 1 1 1 1 1 1 1 1 
##$CPDPRG= <>
##$CPDPRG1= <>
##$CPDPRG2= <>
##$CPDPRG3= <>
##$CPDPRG4= <mlev>
##$CPDPRG5= <mlev>
##$CPDPRG6= <mlev>
##$CPDPRG7= <mlev>
##$CPDPRG8= <mlev>
##$CPDPRGB= <>
##$CPDPRGT= <>
##$D= (0..31)
0 1.2 0 0 0 0 0 0 0 0.06 0 0.03 0 0 0 0 0.0002 0 0 0 0 0 0 0 0 0 0 0 0 
0 0 0 
##$DATE= 1644308745
##$DBL= (0..7)
120 120 120 120 120 120 120 120 
##$DBP= (0..7)
150 150 150 150 150 150 150 150 
##$DBP07= 0
##$DBPNAM0= <>
##$DBPNAM1= <>
##$DBPNAM2= <>
##$DBPNAM3= <>
##$DBPNAM4= <>
$$ [...]
##$SUBNAM2= <"">
##$SUBNAM3= <"">
##$SUBNAM4= <"">
##$SUBNAM5= <"">
##$SUBNAM6= <"">
##$SUBNAM7= <"">
##$SUBNAM8= <"">
##$SUBNAM9= <"">
##$SW= 18.0517287032376
##$SWIBOX= (0..15)
0 0 2 0 0 0 0 0 0 0 0 0 0 0 0 0 
##$SW_h= 3612.71676300578
##$TD= 16384
##$TD0= 1
##$TE= 0
##$TE2= 300
##$TE3= 300
##$TEG= 300
##$TL= (0..7)
0 120 120 120 120 120 120 120 
##$TP= (0..7)
150 150 150 150 150 150 150 150 
##$TP07= 0
##$TPNAME0= <>
##$TPNAME1= <>
##$TPNAME2= <>
##$TPNAME3= <>
##$TPNAME4= <>
##$TPNAME5= <>
##$TPNAME6= <>
##$TPNAME7= <>
##$TPOAL= (0..7)
0.5 0.5 0.5 0.5 0.5 0.5 0.5 0.5 
##$TPOFFS= (0..7)
0 0 0 0 0 0 0 0 
##$TUNHIN= 0
##$TUNHOUT= 0
##$TUNXOUT= 0
##$USERA1= <user>
##$USERA2= <user>
##$USERA3= <user>
##$USERA4= <user>
##$USERA5= <user>
##$V9= 5
##$VALIST= <valist>
##$VCLIST= <CCCCCCCCCCCCCCC>
##$VD= 0
##$VDLIST= <DDDDDDDDDDDDDDD>
##$VPLIST= <PPPPPPPPPPPPPPP>
##$VTLIST= <TTTTTTTTTTTTTTT>
##$WBST= 1024
##$WBSW= 4
##$XGAIN= (0..3)
0 0 0 0 
##$XL= 0
##$YL= 0
##$YMAX_a= 34797
##$YMIN_a= -41177
##$ZGOPTNS= <>
##$ZL1= 120
##$ZL2= 120
##$ZL3= 120
##$ZL4= 120
##$ABSF1= 15.70612
##$ABSF2= -2.34573
##$ABSG= 5
##$ABSL= 3
##$ALPHA= 0
##$AQORDER= 0
##$ASSFAC= 0
##$ASSFACI= 0
##$ASSFACX= 0
##$ASSWID= 0
##$AUNMP= <proc_1d>
##$AZFE= 0.1
##$AZFW= 0.1
##$BCFW= 0
##$BC_mod= 2
##$BYTORDP= 0
##$COROFFS= 0
##$CY= -3
##$DATMOD= 1
##$DC= 0
##$DFILT= <>
##$DTYPP= 0
##$F1P= 0
##$F2P= 0
##$FCOR= 1
##$FTSIZE= 16384
##$FT_mod= 6
##$GAMMA= 0
##$GB= 0
##$INTBC= 1
##$INTSCL= 0
##$ISEN= 128
##$LB= 0.24
##$LEV0= 0
##$LPBIN= 0
##$MAXI= 10000
##$MC2= 0
##$MEAN= 0
##$ME_mod= 0
##$MI= 1.114404
##$NCOEF= 0
##$NC_proc= -9
##$NLEV= 6
##$NOISF1= 3.799351
##$NOISF2= 2.8
##$NSP= 0
##$NTH_PI= 0
##$NZP= 0
##$OFFSET= 15.71494
##$PC= 1
##$PHC0= -15867.93
##$PHC1= 10.00078
##$PH_mod= 1
##$PKNL= yes
##$PPARMOD= 0
##$PSCAL= 0
##$PSIGN= 0
##$REVERSE= no
##$SF= 200.130007328328
##$SI= 16384
##$SIGF1= 3
##$SIGF2= 2
##$SINO= 5.538805
##$SIOLD= 16384
##$SREGLST= <1H.CDCl3>
##$SSB= 0
##$STSI= 16384
##$STSR= 0
##$SW_p= 3612.71676300578
##$SYMM= 0
##$S_DEV= 0
##$TDeff= 16384
##$TDoff= 0
##$TI= <>
##$TILT= no
##$TM1= 0
##$TM2= 0
##$TOPLEV= 0
##$USERP1= <user>
##$USERP2= <user>
##$USERP3= <user>
##$USERP4= <user>
##$USERP5= <user>
##$WDW= 1
##$XDIM= 16384
##$YMAX_p= 358235834
##$YMIN_p= -2089965
$$ End of Bruker specific parameters
$$ ---------------------------------
##NTUPLES= NMR SPECTRUM
##VAR_NAME=  FREQUENCY,     SPECTRUM/REAL,   SPECTRUM/IMAG
##SYMBOL=    X,             R,               I
##VAR_TYPE=  INDEPENDENT,   DEPENDENT,       DEPENDENT
##VAR_FORM=  AFFN,          ASDF,            ASDF
##VAR_DIM=   16384,         16384,           16384
##UNITS=     HZ,            ARBITRARY UNITS, ARBITRARY UNITS
##FACTOR=    0.220516191357247, 1,           1
##FIRST=     3145.03107159467, 0,            0
##LAST=      -467.68569141111, 0,            0
##MIN=       -467.68569141111, -2089965,     0
##MAX=       3145.03107159467, 358235834,    0
$$ Real data points
##PAGE= N=1
##DATA TABLE= (X++(R..R)), XYDATA
$$ [...]
7213 283215 768857 1767700 1287569 275755 223588 838422 837055 705516 212616 721447
7203 721447 306651 -1121614 -836517 -997551 -852214 57167 -131400 -904484 -1570560 -947586
7193 -947586 -696608 -1307903 -731033 -1105559 -928228 -1176695 -471710 -296381 -394976 254986
7183 254986 412925 242062 -71485 -647530 -922548 -1734412 -827024 -417947 -1316099 -672240
7173 -672240 -155782 75086 -135567 -81241 198950 -337375 -811632 -819846 -1240493 -1180075
7163 -1180075 -696210 -156305 965129 444914 -251219 -214185 314748 870220 632796 99535
7153 99535 750333 630479 126791 49334 -499201 -874890 -1171144 -520618 320046 37691
7143 37691 -293740 -361113 -666683 -158051 -552270 -60214 -1051863 -1863177 -1420792 -928710
7133 -928710 -1028672 -516117 -345378 832764 498604 -680732 -1196596 -1490228 -599593 -173472
7123 -173472 247637 -26990 625907 914281 235737 -481806 -163036 -60946 -238470 -791262
7113 -791262 -825945 -835806 -288836 -1534991 -1211861 -1068102 -373391 -1044839 -709573 85006
7103 85006 25803 -217119 -926409 -1231393 -1197178 -926319 -700126 -494954 -604361 -253439
7093 -253439 304403 -103657 -901608 -1027590 -1265341 -295450 292055 -228914 -971567 -428323
7083 -428323 79627 164888 -93278 -188642 -207633 -181766 -517634 -715731 -235247 -593308
7073 -593308 -1242490 -1385676 -631627 -135415 -181271 60839 -522555 -1159152 -918156 -192073
7063 -192073 -174845 50765 73850 -42779 -481061 -945961 -528988 -454214 -207225 -90887
7053 -90887 -333563 -37460 -154396 -34616 -297431 222377 -606995 -219395 657259 1352361
7043 1352361 732230 606661 308889 354025 535261 921452 39494 -439145 -567069 189283
7033 189283 260353 215555 -347682 -786785 -461018 -216811 -546674 82039 -163354 -403760
7023 -403760 -429634 -242057 132436 137604 -91013 188859 -447240 -459057 -809147 -893694 -288268
7012 -288268 -549262 -555592 -196987 -82340 -635937 -20717 -2571 288991 -7840 -341142
7002 -341142 -456785 -474367 -531026 61414 -300326 -134149 -534443 -433305 -218614 201586
6992 201586 -49687 -676352 -1428552 -1007865 -1287201 -1068245 -351167 79612 -333338 -190197
6982 -190197 -313547 -456515 -848370 -462087 -1373282 -419918 -716543 -841393 -657112 -995638
6972 -995638 -615365 -266878 -273189 -274787 -810484 -1408873 -1401738 -927221 -983836 -918748 -1494555
6961 -1494555 -1350000 -1535198 -1694471 -934381 -288880 233556 -169569 -973298 -539870 -369138
6951 -369138 -293088 -185125 -198831 52648 -694142 -602544 -535536 -378499 -192915 -348888
6941 -348888 -621970 682318 1481069 712899 746406 1494071 1418610 1302143 1380174 1505393
6931 1505393 311901 -631935 -505839 141773 750961 909630 595749 -76746 -931116
6922 -931116 -812537 -825531 6638 216986 666039 82616 -198254 406878 -105643 -973287
6912 -973287 -310405 490874 911442 -67069 -358541 -738331 -1384607 2831 -95743 -107526
6902 -107526 611101 -323505 -740279 -499411 -362852 -569158 171890 -446044 -691976 -513150
6892 -513150 -242143 61137 -42578 -313814 735292 682878 554217 174023 -187390 -40504
6882 -40504 -754959 -143249 681064 -71244 286132 552516 327833 691272 66243 209752
6872 209752 -557009 256329 -316105 -800137 -1047097 -1000358 -724899 -61355 -47863 -553828
6862 -553828 -958624 -1302683 -408173 -443087 -320834 -1108926 -721112 -327624 -236993 112544
6852 112544 -471929 218174 -220952 -825176 -364961 -123289 -666307 -587449 -486186 -110856
6842 -110856 -284680 468952 104432 -552410 -604727 -570446 -498195 -242094 109700 -408558
6832 -408558 -391717 237768 81599 -575559 -798186 -771003 -628264 -61215 263009 417051
6822 417051 725638 1007172 517958 369315 300768 -772333 -742493 52182 227341 -542255
6812 -542255 375953 406190 339215 -36834 -419404 -219180 -464341 -272200 -240873 -393167
6802 -393167 535910 629846 667067 -136022 -1505931 -1234262 -396122 -492152 -156572 -563382
6792 -563382 -457012 337428 -59170 88576 -231136 -318809 -551421 159609 328237 -435920
6782 -435920 -490189 -181280 -326316 -597077 -843320 -412357 -566256 -1150210 -679185 -349528
6772 -349528 -753724 -552778 172317 -106888 145074 -742316 -300581 53462 -89823 -318795
6762 -318795 -783747 -882908 -604503 -282568 -87717 2032 -613716 -814417 -527730 -160312
6752 -160312 282901 73537 324695 20080 -173573 127324 -368335 122179 249337 -615378
6742 -615378 -660610 -216479 -518214 -29868 178876 -735179 -153593 255791 -282709 -862430
6732 -862430 -913495 47839 114272 1460655 889493 -574337 -765154 -418372 -267019 -715351
6722 -715351 -1560224 -1585617 -1217732 -431025 -387386 -159369 396107 170037 -295990 25056
6712 25056 48603 112520 231169 -145456 -303954 -383523 -630772 -117155 -389880 -496233
6702 -496233 -308951 312508 -222537 22595 82110 -1031203 134055 254362 -291815 21415
6692 21415 108697 -367841 -916591 -1290254 -752685 182894 100567 -1049954 -870160 -943028
6682 -943028 -937992 -1441579 -913516 -495487 -1040912 -739057 -285872 234871 55540 687889
6672 687889 193286 131635 -639838 -267286 581816 -297645 -118483 74878 285041 -114104
6662 -114104 -423727 -295368 11909 -724544 -565915 -597024 -752259 -91169 -141634 -490073
6652 -490073 -545802 -478069 291864 -377815 -428459 -66300 -724360 -306333 361210 -146765
6642 -146765 -271867 38481 97408 -334437 -504032 -830513 -240470 -26570 -701493 -660800
6632 -660800 -246146 -204373 -139227 565466 447772 -226729 145182 230557 35841 -245379
6622 -245379 -477132 -110443 -80454 164759 275323 -82307 -337128 -138636 464728 40553
6612 40553 217999 87427 -222332 287263 459460 -273274 27522 72891 72185 -344760 -311470
6601 -311470 -363679 -1280352 -485708 437446 -3253 -867150 -342989 -281416 -703408 -170809
6591 -170809 455985 -85608 -212170 -346646 345174 722927 -6301 -308234 -463010 -1129641
6581 -1129641 -1276898 -616272 -44006 353348 711358 -234505 -165302 -480300 -63934 193468
6571 193468 47980 -211135 132760 -179509 170960 85139 -981521 -699135 -214005 -415181
6561 -415181 -63064 346037 -85636 -302952 619021 388665 55036 -170125 -585837 -299708
6551 -299708 -400253 -10292 -347668 -971334 -738801 -353371 -682297 -522371 -118364 125132
6541 125132 184954 801349 -73152 462246 357099 -248732 -223858 -55488 -183320 -1238415
6531 -1238415 -990790 -777048 -454163 -1009917 -1399289 -1174351 -380009 -266856 -525152 -645944
6521 -645944 -606808 -910235 -939524 -470903 -851185 -704010 392212 947662 -254455 -834054
6511 -834054 -707044 -889725 -667855 -228015 -1192022 -803898 -649583 -768075 -582273 -355515
6501 -355515 -1031513 -637654 -723389 -1337219 -713684 -199339 -108741 108267 424221 43843
6491 43843 394982 319444 -68324 381185 -318269 -34541 521524 1185200 562471 18614
6481 18614 -45458 -38443 27902 682268 679082 540884 735767 821 159005 82272 223712
6470 223712 -863588 -990974 -539332 -11670 363681 -99035 -267370 -102353 -183471 118912
6460 118912 578542 680038 797678 565499 -493646 226148 954197 1267377 852992 374387
6450 374387 -421555 -541823 -314788 -695864 -1051149 135521 -450399 -556898 20612 -488019
6440 -488019 -537877 -625908 101361 103556 23605 -264605 -642299 -307562 -617905 -560490 -66656
6429 -66656 -192721 47944 46643 -491921 -317262 -290680 -668521 -991953 -332820 -86769
6419 -86769 -557899 -643977 -97923 296412 489543 -834278 -608092 -119216 -225483 -39680
6409 -39680 -807270 -911214 -532410 -143299 -955437 -1189217 -447460 -57413 14044 -352336
6399 -352336 -702068 -361395 30343 -246768 -436060 -82746 231086 193778 93193 428380
6389 428380 392176 -348219 -1275199 -1411213 -1327044 -532655 221946 316940 -433328 -715035
6379 -715035 -374798 -155960 -765134 -717630 -518096 -203901 10123 -28195 -254806 -653553
6369 -653553 -762082 -402142 -494691 -367099 321451 -39361 -607421 -736369 -1206144 232700
6359 232700 -114869 -2376 -195772 -449209 -129659 468461 1255663 715225 516451 -207196
6349 -207196 -544384 -255654 -272715 -457688 -611414 -1005862 -788221 346933 702015 920122
6339 920122 329760 249858 343415 387862 985027 882902 251300 152563 591170 587621 435798
6328 435798 -309009 -11214 754252 692788 387347 390451 238349 -390881 -561760 -322875
6318 -322875 -728137 -709154 10831 -65147 -757736 -668139 -408387 -516279 -1011972 -1135148
6308 -1135148 -455330 -902802 -1032013 -605696 -247707 85817 -492500 -1014583 -581743 602101
6298 602101 708234 922384 532821 1112443 751029 355687 743289 882700 147495 70118
6288 70118 106487 782324 762024 1000316 1524901 1661587 613767 369479 1000154 634484
6278 634484 1058064 332298 31051 -284913 -94207 396398 295611 972982 144004 -1138457
6268 -1138457 -805430 -58596 128518 7877 166463 462317 534843 160570 -11736 442613
6258 442613 -272483 -665078 -174887 205881 457866 80717 47068 380402 470535 -185018
6248 -185018 355002 850727 368380 324186 1238808 911614 -72022 553790 215607 554430
6238 554430 297144 336186 509894 799781 1125582 722758 917712 874034 520975 184729
6228 184729 898174 399835 277221 -43745 510765 1052781 639501 77861 274120 757164
6218 757164 12033 413097 356159 1177952 1155513 -141549 167974 462189 570244 530763
6208 530763 500499 72739 336311 339093 -73998 -605274 -341229 190796 1412049 639193
6198 639193 -281939 335545 740797 334814 -9516 444958 155737 -695700 26779 779384
6188 779384 745687 625774 606907 810261 712224 382361 113015 -368233 -679609 -301103
6178 -301103 63895 221208 37512 441983 480266 -288631 -432171 -500820 308478 418164
6168 418164 580150 768152 880907 1149337 1091463 1159259 1166714 1303058 727563 849209
6158 849209 637706 775287 1128993 1395368 510195 776817 1095176 1288097 280250 620391
6148 620391 2224697 1647144 463450 795343 504260 576011 1165242 1057277 1174681 1274310
6138 1274310 1280328 1086211 684591 -142141 861171 1876098 1189718 940780 1060738 1140368
6128 1140368 1048135 1340002 1467691 1250926 2203540 2190106 1833477 1217248 917922 503852
6118 503852 1253906 1776304 966784 962063 709791 261361 766717 1136844 1661918 1571970
6108 1571970 1337111 2104456 2308252 2233610 1959040 1718214 1746663 1616205 2297722 2789612
6098 2789612 3045187 3094096 1895550 1611187 2719827 2367328 2901795 3199676 3743539
6089 3743539 3672707 3880416 3917367 3438613 3530408 2832801 3140073 3162514 3333897 3770673
6079 3770673 3808070 4313931 4533260 3749211 3466618 4192803 4167838 4142574 4668911 4426834
6069 4426834 4432607 4374997 5276725 5492601 5892011 6008148 6074312 7157016 8283106 7348852
6059 7348852 8140961 9388883 10102977 11405905 12286819 12865621 13161060 12750493 12316434
6050 12316434 10825409 9112635 8966867 9427487 9765489 9343568 9283076 8544285 7663643
6041 7663643 7357233 7562657 8284615 9178690 8949985 8515748 10278497 11071555 11400934
6032 11400934 12435960 13475305 14026151 14441891 16762653 18127817 20165284 22247962
6024 22247962 24138140 26118709 28049464 28419603 27053220 25416262 22531913 20236341
6016 20236341 19546219 19514116 18496187 17424142 17917756 17671935 18367832 18379675 18349589 19910805
6006 19910805 21001430 22993718 23795492 24365210 25189641 24968655 24889782 24313142 23649330
5997 23649330 24051799 24594294 25839278 27654679 29674245 31001167 33232477 35791163
5989 35791163 36253419 36256970 34592612 33091483 32786391 33542149 33591456 34538352 35205292 36885234
5979 36885234 37619352 37625840 37739145 37980674 39400947 42315731 45200011 47200712 48652808
5970 48652808 49208847 47858869 44897912 41364994 38155535 36337703 34813185 34514883
5962 34514883 34505941 35499266 34455471 35823250 37457831 39276224 40881103 42620790 42977380
5953 42977380 45119071 48233772 51453071 54614620 57916536 60143722 60329111 59072285
5945 59072285 56171480 53425996 52370357 52121015 52834915 55832282 57922412 57971228 56490576
5936 56490576 52959823 49774431 46886034 43964523 42777691 41407163 39721628 38190254
5928 38190254 37141000 35571085 35546338 35419422 35502767 37293711 39475731 42057025 44602730
5919 44602730 46977229 50891380 53890839 56083858 56338866 54497615 50171254 46243498
5911 46243498 43289896 40979464 40861396 41234485 41987225 41804958 41295595 41129306 40495338
5902 40495338 42011552 42654619 43839715 44502245 44492379 42087124 38916435 35601945 32099521
5893 32099521 29803363 28291310 27626033 27966861 27872136 27251825 26972108 27348428 28138866
5884 28138866 29064106 29183242 27993583 26512495 24902659 23420570 22291818 22256266 22470109
5875 22470109 22506182 22810922 23656909 24454534 25890658 27623684 29682116 31552022 32223835
5866 32223835 33218478 32777366 30047207 25425555 22375628 20367265 18231401 17915539 16053375
5857 16053375 14983609 13743470 12777508 12219141 11643868 10995669 9978866 10192321 10179953
5848 10179953 9837807 9688729 9306547 10044790 10333276 10069606 8936315 9270549 10338304
5839 10338304 11110083 11365080 12204765 12751232 13064087 12881254 13430078 12516326 11487649
5830 11487649 10649478 9248731 7841058 7071154 6421634 6007233 6404057 5775162 5195239
5821 5195239 5672880 5693837 5068608 4918710 5387934 4724931 4082668 3678002 3673469 2241842
5811 2241842 2455598 2968678 2639895 3099025 3406155 3332741 3131987 3399903 3855066 4067258
5801 4067258 3634956 3441750 2825323 2663569 2310746 2044729 2212905 2284327 1887011 2359825
5791 2359825 2817817 2677978 2223014 1356103 1331201 2098965 2561182 2582051 2135519 1960667
5781 1960667 1497333 2310091 2171088 1683627 1163448 1273151 1143493 1698717 1294919 1000587
5771 1000587 879211 1700979 1852472 2187739 1661227 1571033 1839394 2048537 2108499 1694370
5761 1694370 1414615 1933680 1013657 637516 1503080 2541454 1570415 772646 1407855
5752 1407855 1598077 1057262 1060537 1405390 1156671 1427245 1105580 998039 1038583 1891940
5742 1891940 1448264 756757 345936 801329 43636 405275 1086111 394783 1029218 1180857
5732 1180857 538763 1231325 1058657 254513 837039 1181841 706473 587033 415044 1120575
5722 1120575 1169846 1036808 338887 420317 89311 1062929 1411894 1939883 1526698 1580145
5712 1580145 1761309 1223614 323468 189946 932150 1090421 958212 1259823 1716987 554100
5702 554100 423661 -403150 -682759 -988943 -129230 972131 762614 757185 256279 921824
5692 921824 1376874 1438622 1821195 2032747 1116722 979905 1465756 887537 594149 1034566
5682 1034566 1973760 2051562 1242251 661675 1597276 1385976 1749996 1915371 475865 -91095
5672 -91095 600915 705088 145046 -380555 464219 1196433 1040550 701309 999227 1093615
5662 1093615 657109 1211504 1284588 321101 339382 341137 149207 397144 356 240582
5652 240582 202989 402320 570231 900684 924280 577788 1178367 343031 113359 717174
5642 717174 832962 263959 957152 1125563 1701059 1954506 662656 638680 77870 484624
5632 484624 1116250 1043102 742086 1369849 1596274 1457612 1031839 1315600 967997 1244480
5622 1244480 1324270 1056142 1233107 1037575 664533 157349 803144 975902 785814 1281946
5612 1281946 1423102 971636 1342969 2085447 2135626 1690618 1569839 2026291 1554453 1561453
5602 1561453 1444452 919742 1362131 902071 1491151 1516144 1243094 968772 1108430 1369425
5592 1369425 686493 948076 1758555 1206919 574292 700823 916377 1194407 1701263 1850209
5582 1850209 1426602 1988572 1256231 917006 713509 820292 1420123 1157803 1846255 1431560
5572 1431560 1912198 2066624 1211666 958888 888745 1064211 1167629 1496810 2442768 2306022
5562 2306022 2013133 1875725 2338391 1708908 1767554 2201436 1642188 1705271 2428237 1856074
5552 1856074 517228 1232155 1626091 1620041 1943313 1929387 1582240 2110169 2022196 1292158
5542 1292158 1150685 1575523 2105337 2909995 3421542 4321829 3726373 2696991 3370293
5533 3370293 3411529 2363427 2242347 2808159 2857763 3502091 3515289 3457098 3448984 2954105
5523 2954105 3254317 3453369 3316388 3418760 3256506 3625567 3797383 4071774 3528225 3740940
5513 3740940 4194911 3728387 3534687 3363496 3865949 3697934 3590740 4337136 3638510 3971989
5503 3971989 4403686 4609199 5133816 4634268 4907154 5062934 5638886 5708245 5855779 6900769
5493 6900769 7198674 5742035 6355862 6506710 6669689 7204523 7415059 7476105 7238754 7639255
5483 7639255 7276688 7686754 8822813 8843017 9032965 9305551 10101171 10404787 10592260 11543108
5473 11543108 11962350 12488655 13256561 14536312 15412828 16787620 18779957 19750092 21624601
5464 21624601 24055974 26737449 29592534 33013565 37753381 42687003 48042226 55592587
5456 55592587 62091298 66306103 68362617 65838315 59196585 50483206 42502689 36651968
5448 36651968 31206880 27419643 25557174 23899232 21878765 21211223 19668604 17457860
5440 17457860 16486817 16077548 15187503 14561468 14348840 13389643 12930204 12129630 12319976
5431 12319976 12154506 11279339 12077308 12118803 12653048 12688998 11974917 12150945 12185033 11637703
5421 11637703 11250353 11513434 11001838 11464003 12174167 12799949 12242910 12834809 13628487
5412 13628487 13727139 13464288 13190302 13941414 15102787 15595482 15898425 15591701 16163095
5403 16163095 18354539 19033084 20402881 22465531 22388385 24198679 25644177 28485946 30244063
5394 30244063 32559216 36251826 40231849 44969994 49875686 55952727 63776531 72693373
5386 72693373 82575169 90789145 96351011 96772717 92315507 83445794 71210513 60611832
5378 60611832 52312114 45712731 40603297 36638415 33319679 30669738 28233280 26045494
5370 26045494 24544291 23687768 22178130 21244758 20386058 18848948 18079428 17053041 15567943
5361 15567943 15424729 15310064 14772278 14511504 13764470 12546572 12806478 12450272 12146781
5352 12146781 11773490 11036327 11438909 10785724 10622764 10343647 9720167 10858484 10293214
5343 10293214 9907963 10111526 9540064 8892160 9319638 9840708 10087345 10124755 9271595 9361215
5333 9361215 9750049 9786674 10929913 11108571 11528246 11297621 10812562 10576261 12069639
5324 12069639 12916766 12893688 13643006 14356683 14429838 14490828 15483256 16603950 17199115 17909937
5314 17909937 19209251 20890869 22473645 24397360 26237821 29016975 31265021 35449914
5306 35449914 39529491 43187433 47050532 49017102 47872354 44476639 39337356 33323248
5298 33323248 29849632 26412468 24770464 22898268 21004867 19991924 18980869 17768293
5290 17768293 16966316 16612062 15855082 15223070 15062215 14651131 14265906 14131382 13059183
5281 13059183 12521249 13105364 13679281 13376342 13579310 14012562 13990361 14596494 14374493 14856786
5271 14856786 14969206 15390698 16543772 17397439 17350474 17986274 18791397 19584834 20757276
5262 20757276 22659624 24346028 25186186 27772121 29670645 32408370 34967543 38917869
5254 38917869 44373527 50551758 57751275 65976706 73956168 81035009 84878350 83060032
5246 83060032 75535287 66046151 55505461 46168739 40071484 35321174 32306469 29204162
5238 29204162 25348607 23050794 20944938 19619652 19194853 17985382 17019593 16156577 14626229
5229 14626229 12911751 13914795 12309635 11745722 11170361 11074279 10421856 10136694 10497785
5220 10497785 9814686 9026382 8214186 8024930 7907352 6837269 6871261 6717119 6501327
5211 6501327 6460688 6034351 6299892 6240660 5890815 5362615 4845586 5555908 5041011 4673293
5201 4673293 4052933 4538391 4165987 3811221 3847995 3815361 4775402 4888908 5228392 4494991
5191 4494991 4602858 4190699 3751447 3242637 2840891 2994408 3340930 3101756 3629611 3839528
5181 3839528 3132306 3235722 3093310 2716808 2467738 2621984 3673566 2772881 2484496
5172 2484496 2405561 2957086 2726466 2707615 3369958 3017300 1812013 2007603 2314912 2057571
5162 2057571 2774615 2591745 2635923 2019695 2335368 2655249 2119819 2075269 1769231 1395239
5152 1395239 1455444 1750608 1538662 2032205 1870223 1572195 2207853 1772554 1491203 2157926
5142 2157926 1085631 1181768 567387 329107 1245504 1819053 1846465 1693381 596761 317822
5132 317822 1381001 1104521 1052605 530012 406642 -308801 -48380 321629 1341258 1053020
5122 1053020 883570 299643 112611 604952 1021836 1015914 942398 958814 1709945 1954950
5112 1954950 1574386 2158113 1382166 881505 416991 350490 -121303 291442 887294 970047
5102 970047 772951 465955 475500 685647 342615 1063952 922049 1186114 1363407 1034395
5092 1034395 2060152 1866969 1692547 1587426 2405485 1784740 1237402 1996979 1791298
5083 1791298 1560147 1111205 1255924 1076371 1237049 1377743 1229803 1346203 1429336 279658
5073 279658 830841 775934 1092177 936361 762793 981899 216804 433627 313551 336941
5063 336941 -100565 236618 976698 1047956 1309885 1879605 1311907 1079568 158824 -352736
5053 -352736 815613 1089076 376377 161066 156973 -13154 351696 660950 684877 808776
5043 808776 881011 750768 242475 -187750 -252247 -239833 -410864 42007 -758957 -931191
5033 -931191 -913262 -17275 754497 672012 94255 231286 -485609 73431 668793 786169
5023 786169 1562917 1452783 1127722 625183 1032554 415053 495667 256432 91953 337378
5013 337378 206948 -52712 439492 933322 1281914 1852185 1298751 898852 525472 1107050
5003 1107050 926202 989913 873457 604889 698511 -371419 568296 67513 229952 745551
4993 745551 1065495 413805 66032 -285787 -288708 -149539 -416042 296584 -161329 -520169
4983 -520169 -341481 -430305 -354288 -11659 350284 498883 909306 -56954 -315602 667069
4973 667069 375332 68239 312635 479143 476597 47144 -369860 798372 741393 89413
4963 89413 821739 1113640 61836 -176100 -4181 261553 136912 740765 1102941 680954
4953 680954 576469 676774 875391 1112419 1320216 1029419 567408 1061614 600158 391063
4943 391063 548838 457504 847268 926363 1070735 522941 44481 -232558 244249 538185
4933 538185 196095 323608 67093 -71200 62742 198713 679663 1054719 9788 372956
4923 372956 343267 314608 1487 911611 251283 -258675 563866 512169 70449 -100476
4913 -100476 -30177 64221 529274 24622 251009 491727 615278 365270 685238 -551744
4903 -551744 -919713 -751763 -508370 -358216 -265625 569247 -117119 687476 1378125 667482
4893 667482 302490 33662 -30227 -563519 -302316 868397 1151264 550601 811898 445780
4883 445780 403323 511616 -52088 530568 184352 -422394 138241 -435326 -551006 556161
4873 556161 1073065 653717 443640 -290102 115637 -448706 -800180 -317708 -129766 -43658
4863 -43658 -388780 -462566 167744 242826 1300130 925575 219117 757149 1487357 379006
4853 379006 615484 864396 4901 -21394 20281 -162530 -566960 -746795 -569703 -208958
4843 -208958 -534418 -447811 -633599 -766001 92519 245999 -155649 -319531 22951 -136626
4833 -136626 -656244 -273679 98354 200957 -715540 -454940 450065 592192 -380833 -564110
4823 -564110 -166214 65116 102024 -248305 -178120 -597925 -366214 -786457 -788229 -280490
4813 -280490 -291730 746885 765211 -275993 -65140 927445 339310 -582003 -543254 94917
4803 94917 993530 928215 -305868 -285815 144409 348786 -705925 206043 -78363 -344514
4793 -344514 223888 174373 -768699 -793536 -364600 -53344 -803237 -990072 -721054 -1010080
4783 -1010080 -755500 -307544 -9462 198540 343518 727670 359350 239984 394621 286683
4773 286683 20628 -285635 -73436 370562 859174 1027439 449066 -399654 -664732 -88526
4763 -88526 -48260 -905466 -1467682 -1301133 -961546 -501190 190629 -806832 -1056812 -371932
4753 -371932 -424596 -438962 -832155 -336604 -61377 -512200 414306 515074 742667 502752
4743 502752 209041 862143 206747 142534 -407089 473713 891098 -68132 -282976 -569121
4733 -569121 168478 -295430 -633333 -457986 -72391 -429704 -136742 495546 762150 1278749
4723 1278749 1288509 807627 848049 542565 301774 -311700 -430596 -184591 460154 -288623
4713 -288623 121961 -17997 -578605 -464712 -903634 -1111820 -684316 -334831 -544277 -134337
4703 -134337 368503 578891 899462 196822 160490 193114 -136943 -315522 -577262 311703
4693 311703 1290227 835883 712909 1223852 501477 288398 748883 1052730 208626 -109046
4683 -109046 -226732 -119606 349801 263881 182481 81545 -44471 -284426 63019 238759
4673 238759 549519 693308 848598 -307319 51084 551997 -474177 -1070403 37479
4664 37479 574439 144654 -481408 -220531 210914 -74486 956626 564713 454877 458717
4654 458717 382299 590734 -321135 -618860 92334 -399786 -699190 -779068 190870 430927
4644 430927 -102304 -343120 267745 171299 -261165 -748523 424724 728460 941975 737358
4634 737358 578191 257732 250945 720560 863498 739126 -585657 -752413 -906681 465686
4624 465686 722257 666142 324310 -604714 45496 766973 -295525 -512094 511299 411029
4614 411029 215189 -509552 -62175 105201 -296138 32394 544782 808964 545090 94830
4604 94830 186714 164829 -72081 23901 444954 304005 -411550 158191 582702 580308 607362
4593 607362 -58191 -356839 141202 -549532 -592849 -142641 -417403 -233111 162558 -122248
4583 -122248 -183538 83935 83071 -318195 63228 -228963 265656 -69571 -32412 1110521
4573 1110521 1455794 1098516 645865 675982 -341202 335143 449654 -339855 -79925 705631
4563 705631 657942 661450 477272 102532 -286623 54384 -395439 -710439 153446 -237134
4553 -237134 -229717 201505 289197 243391 477800 769032 513364 223050 286402 486705 268846
4542 268846 331114 -189060 232559 711416 443135 314780 368310 -460205 -151515 664623
4532 664623 1102133 519969 -21567 743640 338901 -52360 -239681 -540400 -225015 -264108
4522 -264108 -626127 -129449 385706 919410 222239 614235 774043 444565 164999 -252497
4512 -252497 -53343 -84165 -100991 256289 1066651 1101330 1247694 932553 883460 469845
4502 469845 155299 435800 459769 546252 653566 483842 109725 741264 792603 604225
4492 604225 616770 174855 178275 546808 332912 326504 537258 402745 -158078 683351 810731
4481 810731 777871 568097 438204 536534 551960 435285 -278158 -579619 80634 572928
4471 572928 784435 623122 437891 876303 1288877 871521 987084 532973 473123 523106
4461 523106 168956 820582 1353047 1278215 1209039 1208056 1032406 892160 603477 575799 856377
4450 856377 910199 206710 725011 1160007 833638 865859 485443 1450900 1502447 658305
4440 658305 222691 1003505 1080674 323366 1040965 463175 729200 870570 1718154 1827253
4430 1827253 905055 421224 703522 301912 220273 1083760 819290 589358 1174686 1252729
4420 1252729 550692 820423 -141711 179049 718487 642691 772497 876667 987596 642547
4410 642547 1233423 1020718 1247751 1116933 1748153 2610941 1937589 491525 337777 250924
4400 250924 -232348 1052144 1500928 1049287 579758 559871 943477 1310414 1318638 1022744
4390 1022744 675726 715077 1004056 1155325 1285969 1248633 746250 414854 165574 -461202
4380 -461202 401729 1446294 1363784 1050438 1072844 1369276 1220566 561202 576106 561981
4370 561981 202488 353533 959619 1780550 1398819 997920 1310564 1611161 1290602 1212346
4360 1212346 945496 1165370 1646278 1606969 2036275 2635248 2691553 2517235 2857976 2231102
4350 2231102 1958559 1297981 1993468 2124521 1815307 2578668 2745445 2080063 1949325 2298792
4340 2298792 2529660 2096423 2618699 2171188 1519453 1175659 1940740 1920792 1112483 1327793
4330 1327793 881763 1373889 1685675 1545101 891684 1370881 1666690 1551967 2047906 2189234
4320 2189234 1688672 1123667 1066286 1457827 1650482 1729375 2141644 2046848 1730598 1374969
4310 1374969 1657073 2019690 2132642 2272547 2264686 3038326 2926891 2440832 2605742 2116215
4300 2116215 2363077 2538773 2457789 2549419 2570060 2148815 2531877 3005730 2608401 3280145
4290 3280145 3639007 3483046 2661483 2688023 3053309 3767466 3365622 3905992 3466229 3595248
4280 3595248 3449221 3918134 3717357 4231542 3864437 3324377 3838239 4218033 4631336 3581552
4270 3581552 4507101 4578876 4011184 4600504 5088400 4769393 4968517 4751888 4853765 5247716
4260 5247716 5170562 5711516 6082315 5616424 6502512 6507167 5869922 6252564 6145006 6113103
4250 6113103 6783633 6967911 7876540 8148499 8178122 8125555 7477905 7811507 8445147 9017442
4240 9017442 9109653 9734238 10780140 10543972 10827099 12484888 13028244 13730611 14218175
4231 14218175 13966280 14873085 16004454 17776331 19114079 19420262 20850333 21793388 24902766
4222 24902766 27499158 29738947 32609364 36926171 42019786 47013663 52724725 59283695
4214 59283695 65762664 71322886 73666268 71604653 64808124 55582212 48189588 42644585
4206 42644585 38553802 35369993 32874630 30647491 28652729 27492989 26797116 26713694 26325265
4197 26325265 25671072 24764422 25330127 25798751 27250759 28369312 29497327 30723595 31929980
4188 31929980 32577504 31235930 30485396 28144006 25546607 23959319 23200724 21595853 21559263
4179 21559263 21268334 21670893 22169078 21648169 21644812 21745784 21140835 21949410 21190761 21452493
4169 21452493 21600867 22555152 23539447 23715232 23299090 24914134 25500214 26910393 27857559
4160 27857559 29295413 30365485 31721872 33985955 36122603 39017689 42121506 45780700
4152 45780700 49858934 54491041 61069001 67556303 75278445 85419717 97522090 108425866
4144 108425866 115238729 117407937 111171518 99303468 85728890 74547168 65715491 60188470
4136 60188470 56720727 53364620 51067259 50167211 48733969 49117751 49267263 49348952 50430885
4127 50430885 52500480 54679526 57089183 59747176 64892123 70613391 77105978 86237042
4119 86237042 96192818 107384282 120849314 133947736 142628398 143037495 132818012 115650705
4111 115650705 97800816 83696467 73172368 64996036 58434638 53559260 50258937 46411189
4103 46411189 43522875 40968256 39328126 37178743 36325809 36043440 34874897 33508624
4095 33508624 32605844 33082860 33267448 32848233 33133846 32512775 31978537 32194377 31719105
4086 31719105 31910409 33139340 32677509 33515583 34508438 34893638 36075469 37349406 39018877
4077 39018877 41503326 43636104 46005951 49394811 53776467 59134797 64936604 71480349
4069 71480349 80223197 89914270 100935194 114641694 130004424 143722439 152558231 153342810
4061 153342810 144249611 127196264 107010588 89304300 76192798 65896662 58180425
4054 58180425 52121774 47855837 44240619 40113551 36559648 34937349 33636373 31783010
4046 31783010 29739325 26808643 25877611 25112710 23752446 22434587 20998253 20282237 19921779
4037 19921779 18655487 17919086 17483120 16975193 16142566 15623899 15620481 14954076 14735529 13775024
4027 13775024 13684086 13474768 12415261 12739535 11588559 10904685 10627008 10061976 10187193
4018 10187193 10220802 10294658 9618952 9013215 8298887 8578876 8872708 8925740 8928975 9194095
4008 9194095 9415122 8535448 9099067 8617013 8588740 8637756 7978760 7785800 8315991 7447409
3998 7447409 6912813 6666888 5779907 6073338 6913095 6444933 6087072 5875876 6367535 6463931
3988 6463931 6200266 5709929 6775303 7009952 7024082 6854285 6901113 6833322 6709645 5785406
3978 5785406 4783157 4696183 5319339 4741517 4827703 5283890 4814461 4584830 4302824 3968775
3968 3968775 4337673 4279253 3927385 4584785 4697611 3998035 4023618 4096367 3231270 3079227
3958 3079227 2933562 3976928 3856628 2774743 3480261 3764897 3070187 2792280 3360881
3949 3360881 3402696 3528236 3741485 3335750 4012362 3112110 3088169 3452316 3855523 3390831
3939 3390831 2501195 2677962 3844771 4009093 3084963 2998660 3092106 3234681 3279941 3310739
3929 3310739 2853008 2837125 3205442 2787571 2657702 2212037 2510152 2924200 3387381 3323970
3919 3323970 3444433 3377035 2732042 2784573 3661608 3360282 2496604 2681681 2981856 3619518
3909 3619518 3528148 3754303 3508329 3109977 3217308 3214868 3068585 3638129 4179650 3789417
3899 3789417 3816419 4011938 4681747 4388581 4010480 3981470 4200746 4742067 5204501 5006139
3889 5006139 4975151 3953610 4217794 3348010 2808387 2638073 3015409 3208470 3694057 2683185
3879 2683185 2438581 3290464 3318772 2486858 1994512 2991061 2858199 2693624 2946462 3580073
3869 3580073 4238063 3986308 2991045 2677151 3035821 3588578 2830182 2815446 2858810 2487403
3859 2487403 2488851 3582455 3485441 3253697 3404762 3707440 3915984 4088997 3242843 2515149
3849 2515149 2455653 2643377 2238279 2838302 3390401 3275129 3063099 3188254 3304024 3284156
3839 3284156 3210416 2878674 2814655 3401547 3427214 2815651 2768251 1850031 1903400 2457525
3829 2457525 2741618 3490618 4288716 4553597 4596446 3988409 3661945 3829384 3716670 3852810
3819 3852810 3424004 3425310 4070302 3398359 2881344 3702617 3730485 3740833 3898675 4407474
3809 4407474 4718091 4250849 3914054 3767434 3242927 2938761 2310179 2695483 3269722 3482624
3799 3482624 3330309 2913548 2961466 3556474 3598353 3463022 3932577 2994926 3147883 3848146
3789 3848146 3081306 2926418 3607172 4022279 3780471 2914389 2863715 3317879 4134788 3499130
3779 3499130 3858774 3080980 3716574 4403833 4820094 4325490 4238165 4940451 4225240 4461277
3769 4461277 4681486 4786825 4239439 3969428 3897937 3841225 4108828 3873092 3138119 2732408
3759 2732408 1912721 2687925 3808519 4887634 3592045 3576535 3479908 3973731 4526045
3750 4526045 4191946 3716459 3751140 4540983 4927653 4254934 3710891 3434488 3556422 4472476
3740 4472476 4759662 4840764 4124034 3176525 3501169 4187167 4809475 4889285 5116453 5221601
3730 5221601 5291862 4444260 4764245 4634927 4746225 4903432 5196782 5495886 4316127 4847546
3720 4847546 5652258 5507050 5196377 5800070 5288488 5559251 5457336 5381173 5747250 5255864
3710 5255864 5299692 5588528 5681528 5542478 5253508 5090324 4942819 5635057 5223009 4643623
3700 4643623 4531601 4646172 4848832 5600275 6057422 5376107 4598337 4803971 4559383 4670952
3690 4670952 5155318 5624879 5343927 4952633 4758638 5629414 6369711 5356262 5658727
3681 5658727 6783142 6315958 5909151 4857645 4687799 4472072 4773701 4881267 5553209
3672 5553209 5833678 6073218 6269359 6086658 5928887 5889038 5938093 5300689 5661074 5403098
3662 5403098 4939770 5513998 6246304 6359103 6122359 6028677 5148484 5381504 5829418 5781008
3652 5781008 5969593 5432478 5816076 6077095 6377322 5636075 5543854 5094898 5789329 6037582
3642 6037582 5943673 6151883 6424348 6289941 6068970 5276707 5259246 6645156 6157849 5645582
3632 5645582 4971384 5382499 6443832 5789214 5741923 7130810 6887643 6505762 6257810
3623 6257810 5786285 5944663 5965085 5689364 5572080 5608466 5311512 5738888 5601826 5045873
3613 5045873 4956000 4277728 5313514 5469190 5972081 6586262 5994977 5633044 5040600 4734381
3603 4734381 4539627 4823246 4646991 5137419 5822081 5509787 4326453 4419128 4851241 5316654
3593 5316654 5086489 5003062 5949465 6218569 5348273 5678605 5773248 5173072 5244393 5401489
3583 5401489 5261695 4646961 5044558 5571491 5665499 5123009 4915118 4208536 3888139 4490729
3573 4490729 5637810 5246064 4411826 4373865 4141927 4195850 3980981 4781162 4451782 4349664
3563 4349664 5786739 5515920 5134816 4923338 4643441 5077537 5016278 3992806 3603899
3554 3603899 3979700 3699781 4510960 4034695 4150762 3784049 4819594 4626529 3771803
3545 3771803 4020156 4218964 3722623 3950912 4818108 3668978 4267104 4286096 4065472 3561195
3535 3561195 3786454 4106986 4345757 4143836 3867399 4326588 3998287 3645282 3563107 4031304
3525 4031304 4484791 3728518 2872351 3074890 3779008 3681589 2915153 3093597 3393403 4290636
3515 4290636 4939119 4413197 3536530 3437184 4110957 3917304 3676123 4854787 4377034 3156171
3505 3156171 3609585 3355935 2671896 3114508 3178943 3306386 4212029 3642138 3142100 2552283
3495 2552283 3200368 3917428 3368067 2655544 2529925 3238822 3734785 4045314 4262241 3961925
3485 3961925 3915995 4083862 2937462 2796916 4037474 4181773 3405660 3132067 4325520
3476 4325520 3862852 3970502 3628160 3711565 4442564 4399243 3240223 3071063 4295349 4219546
3466 4219546 3412527 3756096 3981304 3459617 4073495 4187923 3716989 4128292 4784062 5394147
3456 5394147 4932564 4435061 4224439 4209328 4182997 4045981 4214545 4208111 4358095 3690278
3446 3690278 4234542 4442356 4935787 5163264 4696888 4364274 4711267 4526982 4131592 4157623
3436 4157623 4709223 4768571 5573384 5540856 5479207 5263747 5173418 5277540 5149669 5063278
3426 5063278 4932362 4990473 4418805 4474162 5379066 6040680 5669809 5806801 5670360 5089165
3416 5089165 5804467 6651217 6402263 6740485 6372828 6546042 6891668 6101151 6666726 6729441
3406 6729441 7085230 6869351 7175486 7880898 7261183 7820010 8474843 8631114 7822380 8712825
3396 8712825 8977012 8717409 9659368 10224558 10278299 10571474 10574091 10571243 11251834 11469152
3386 11469152 12496537 14138577 14922022 15645261 14681886 14159386 13393978 13482885 14621731
3377 14621731 15253713 15108309 14689984 16345917 16490166 16359672 17634097 18114511 18718496
3368 18718496 19190683 19628931 20330085 21043561 21583622 23085701 24006808 24783496 26265537
3359 26265537 28501040 31039102 33631595 36177578 40080950 44007060 48060352 50572680
3351 50572680 52470641 52785054 50810385 50721665 50872733 52127892 54979966 58282486 61199991
3342 61199991 63606789 63078359 60740779 56873918 53575147 52151906 50971925 50884572 51754667
3333 51754667 53757365 55496048 58946123 63408655 68324632 73733756 79018874 85918386
3325 85918386 91441182 94438411 94142056 94935203 95093941 96328746 96564351 95145397 93055821
3316 93055821 90949846 90509035 91865711 95827811 100345289 106222399 111298228 110822457
3308 110822457 106134531 98116280 90568244 85802273 82576104 80704181 81715900 83867351
3300 83867351 87697015 92313627 97841270 106768556 116568460 127811590 137056064 142064632
3292 142064632 141326239 133125724 120729874 109163105 101251630 94862574 89124327 84381964
3284 84381964 80232061 78217983 76082349 75812644 76520344 78034086 79293426 78209479
3276 78209479 75755888 72114961 69028951 66571728 64498057 63561421 63981658 65672525
3268 65672525 68399900 71286532 76623837 82128667 90429366 99578046 106898567 110847854
3260 110847854 109214819 100755367 88543668 77173624 66940451 59583653 53922407 49242339
3252 49242339 45402334 42143475 39997290 37282127 34768814 33483508 31962766 30680183
3244 30680183 30349107 29512435 28407812 27927343 27693461 28195699 28359919 28255133 28680176
3235 28680176 29415409 30538337 32502167 34540776 36469250 38339518 39612567 38238500
3227 38238500 36124860 32745421 28959085 25958177 23405162 21292512 19438127 18730074
3219 18730074 18306553 17416402 16582474 14811849 13782564 13498036 14194110 13979093 12698255
3210 12698255 11091554 10420878 10271772 10274688 9452470 9834317 9699599 8862622 8914584 9350754
3200 9350754 8507993 8588613 8564228 8350294 8826223 8542681 7993712 7397092 6779606 7100327
3190 7100327 6120867 6568989 6864731 6571532 6629084 6494989 5977048 5602564 5773948 5777548
3180 5777548 5582926 5660679 5909742 5009143 5144452 4998602 5318736 5029133 4743038 5784259
3170 5784259 5419839 5217799 5218717 4018071 4740630 4276975 3744292 3797929 3021034 3929229
3160 3929229 4101772 4109270 4038531 3093514 3471256 3608062 2713419 3377694 3078443 2472124
3150 2472124 3703416 2962062 2868642 2326525 2673300 2623348 2983114 3020481 3299750 2832515
3140 2832515 2592531 1647079 1889765 1675075 1892657 1483633 1617130 1246785 1464848 2490542
3130 2490542 2721070 2891396 3167770 2384440 3051525 3543668 2186454 1914783 1510706
3121 1510706 1169631 2140835 2189614 1896678 2191899 1343245 1995093 2222429 2038083 1715636
3111 1715636 1350360 1298352 1350353 1670197 2035903 2233005 2837040 2397930 1503539 632206
3101 632206 946841 1377257 564133 364193 1944920 1320060 1321814 1150648 1481062 2151098
3091 2151098 1748287 2170738 2077040 1650459 1940763 1743583 1877188 1841672 1355528 1442173
3081 1442173 1599412 1556432 1857771 1164277 618825 651019 2133358 1884198 1796198 1512494
3071 1512494 968408 1010219 791951 1013818 1105749 2009040 1221843 1462364 1711902 1585191
3061 1585191 1400873 1411002 990258 1061861 1515322 1600252 1531059 1298773 608375 1373376
3051 1373376 946297 962842 403456 502630 984312 230140 1017645 1410832 906235 958724
3041 958724 1541848 1177591 1790530 1274611 1449880 1029124 1095555 1239781 675357 586525
3031 586525 275942 870436 1305093 1031009 1027724 673166 1396096 1482828 2078359 1759220
3021 1759220 905366 1148695 1432585 1071747 474497 725584 1166147 1698904 1809335 1541991
3011 1541991 770347 1438983 1886610 1737379 1793868 1273004 1880217 2378900 2130310 1439328
3001 1439328 1479841 1729378 1902339 1089473 796625 906510 1006967 872321 600720 1061952
2991 1061952 1077087 797519 1504976 2143245 1603838 1815123 1192404 1187745 1097200 1567450
2981 1567450 1570230 1760913 1440754 1806691 931955 997555 1182226 618512 1249601 1574630
2971 1574630 1626714 2119987 1607857 132076 126571 -347903 743794 882236 -217109 -239504
2961 -239504 -483551 -334580 1153808 1285855 53495 -549955 -108907 585304 915271
2952 915271 742915 843363 529222 -351698 -219401 447197 242046 33561 342483 675919
2942 675919 667883 708945 104719 1213577 1695666 1025307 738190 1129038 1042043 630622
2932 630622 861521 547050 919187 521788 162435 782065 651713 262239 419522 927865
2922 927865 1327652 472840 109148 12994 77302 569407 504718 292732 347955 773960
2912 773960 752634 501058 734880 218337 -646888 -1112883 -607787 -184373 801684 348339
2902 348339 444805 626752 359190 348679 -244838 -217913 914532 431741 467565 756790
2892 756790 1084021 569633 780064 1395446 317811 -256573 -379566 179651 1372117
2883 1372117 1132021 796576 748699 493445 656685 540119 569268 756754 172212 80286
2873 80286 529162 483341 704852 563262 243675 -516695 116224 161142 366557 186122
2863 186122 155027 -172804 -817890 -921632 -406497 -304437 -369979 -597573 -832760 -324410
2853 -324410 42989 -705518 -393930 -57715 272080 159795 -124474 -177935 47363 401698
2843 401698 17764 445330 588678 400494 607840 189349 -142686 -101055 -662545 298624
2833 298624 242555 -417923 399499 509106 842252 -13185 -420389 -463210 -1047940 -383664
2823 -383664 783999 572685 -46601 -207306 216040 -496755 -286180 148255 243361 207874
2813 207874 347367 515907 -87238 -228425 -660741 -612864 -787961 -716590 -790533 -1290308
2803 -1290308 -479183 234807 -113108 -417049 -431874 245751 450484 392435 -80112 203433
2793 203433 -471146 -631808 -144289 429 -320216 -948958 -1319970 -826841 -38563 689336
2783 689336 465497 869316 705843 612774 761404 795523 -394790 -433897 -512262 -892307
2773 -892307 -374305 -625324 -640957 -775053 1769 -140052 -361988 47068 -155055 -257112
2763 -257112 204312 -579215 -832460 161872 1141607 -25496 -109346 -677503 -770413 -176975
2753 -176975 -287528 -73199 -575000 -675094 -1031185 -1185393 -319468 512211 -498344 -476140
2743 -476140 321097 422018 16513 -34421 -291671 -453330 -604143 -467756 -130546 -747284
2733 -747284 -410516 189430 -93374 466337 32120 -255051 -405443 -110609 -119740 693049
2723 693049 -4732 -673565 -86183 -1171225 -1105503 -518867 -535460 28989 304458 -201803
2713 -201803 371415 205162 541998 -98059 -147580 -749281 -162707 -768094 -1613433 -1481791
2703 -1481791 -1039226 -52641 748575 675583 -278801 -779571 -1311539 -1276886 -596702 -385330
2693 -385330 -258092 -378060 -376880 -453452 238700 -87384 -7151 -445520 -609303 114117
2683 114117 126672 -519767 -1021778 -757218 -281431 -255799 -827638 -458818 -223034 -613981
2673 -613981 -378418 -413521 -46314 51211 -213282 -35003 -271600 384709 13809 111957
2663 111957 -234038 -45074 -326444 516693 569649 222237 455495 597690 4402 -318568
2653 -318568 120301 -535879 106286 572018 -349129 -599344 -339513 -496489 -195780 24049
2643 24049 6901 682170 308884 180815 30423 -550443 -381073 42783 -511885 -358011
2633 -358011 205595 557379 659947 722615 -274192 -32144 -167144 -353593 -415934 -321368
2623 -321368 -388580 -956272 -885433 -968954 -1051815 -603014 17240 185116 -75216 84315
2613 84315 242096 -63936 140724 557230 525644 239619 -337759 -628788 -477678 -747346
2603 -747346 -813752 -1313394 -696002 -955941 -100500 91203 450354 -454109 26339 493090
2593 493090 125475 674033 694064 836570 -297495 -483109 -685769 23921 -96905 -321051
2583 -321051 -706908 -1510678 -1292779 -279993 -202164 -451421 -289159 -55191 475884 126773
2573 126773 205875 -648671 276157 270227 123201 323414 170361 -576760 -581400 55462 -173536
2562 -173536 -297820 -199628 -190360 -369490 -506425 -278525 201988 -244244 -5291 -599580
2552 -599580 -179606 -179867 279784 364735 -220219 -1037062 -726153 222139 337577 -158696
2542 -158696 -617298 -486977 -470337 185509 -727596 -517113 -261488 -176252 614422 656600
2532 656600 581876 281934 -957507 -696435 350932 307303 -258031 -442401 -583382 -76908
2522 -76908 106543 -409515 -248514 -372309 -179843 63780 65972 -600164 -557603 -621984 -335891
2511 -335891 -393618 73100 -367082 -415063 -1050863 -1504094 57839 320910 539089 1055155
2501 1055155 433653 180403 80313 -393961 173457 180830 -369657 -416484 -1062412 -779971
2491 -779971 260476 -506959 -708859 114467 -429118 -132215 383795 53715 239498 -218183
2481 -218183 -254997 -410440 -508322 415827 819831 755597 1535633 -75301 -554816 -638002
2471 -638002 -232207 150497 505648 623076 1064882 491644 -416397 -76799 -246833 -529135
2461 -529135 -792958 -86761 288148 286013 -3315 -152983 -113035 -130524 -273785 -461111
2451 -461111 208476 152555 265281 -655149 -929544 -737056 -458982 -146081 -239621 -373542
2441 -373542 -1077338 -790333 -653891 -583281 -66868 481485 -420322 -583869 318639 -471425
2431 -471425 -395908 555048 -4433 645291 1291229 599802 -118483 -234620 732746 128118
2421 128118 -337580 -43029 -363016 -30853 -627268 -462810 -608551 14665 241890 290058
2411 290058 234967 727593 586011 166112 396180 453291 1163731 1149659 266511 -37000
2401 -37000 -369206 438494 137382 657332 -375326 751287 1519580 436379 -142572
2392 -142572 523723 1489482 1837677 2374181 2159061 2394640 2338047 2220248 1804826 1800740
2382 1800740 1531575 1629920 1061426 696276 1542750 993432 218721 -130460 -182607 127890
2372 127890 533382 669165 834893 1461424 1175356 875658 156643 359860 230523 512308
2362 512308 502035 -365488 -230849 -46190 -260232 320677 599394 40419 -1849 572703
2352 572703 -147824 284612 240795 -656157 -10667 -59850 -374817 150537 -70967 83222
2342 83222 261273 -16485 457480 200794 -652174 238054 -149626 -353719 9251 301522
2332 301522 94935 833391 434016 157830 477379 382986 747616 712321 187977 126809
2322 126809 50811 135959 838889 1232762 835864 726059 825740 576799 1149292 1018009
2312 1018009 277977 -1092814 -772267 646848 523566 413420 229030 429778 324861
2303 324861 294420 354739 848095 635754 611558 1129815 475009 992179 316192 482640
2293 482640 651093 348291 701899 676146 1078028 2051640 1263073 1168549 613615 816829
2283 816829 1153974 392859 -21338 1053033 1082491 1131121 1311570 1261295 1118411 814992
2273 814992 660386 741505 750936 152407 49249 541312 1149498 1031686 953191 1929062
2263 1929062 2239420 1603519 1487789 555709 1082134 655682 976296 1661104 2058722 2069293
2253 2069293 2880458 2206577 2252143 2179571 1615568 1717145 2418876 2154585 2592396 2206858
2243 2206858 2210516 1656841 2428252 3248754 3119801 2674640 2243188 2373720 1210320 1657511
2233 1657511 1401236 2365000 2622024 2647399 2821736 2626079 1955199 1998122 2241588 2010465
2223 2010465 2619669 2587528 2754521 3349237 2985038 3253198 3199333 3143370 3130026 3521726
2213 3521726 3751872 4073239 3877621 3569399 4046254 5185513 5069425 5497108 6225504
2204 6225504 6112110 5711815 5166340 4981872 5803481 6111203 6215092 6191482 6146522 6558880
2194 6558880 7224041 7423827 7434697 7672782 7832555 8807598 9294614 8729385 8910453 8160240
2184 8160240 8877023 8734588 10200619 9913883 9976984 10414885 10216840 10051745 10762601 10853654
2174 10853654 10863805 10984023 11224714 11776504 11942323 12352609 13516269 14159094 14080085 14513059
2164 14513059 15306046 16173989 15749895 15768698 17123529 17542730 17743648 18938262 19398623
2155 19398623 20460072 21398077 22858111 23499145 23951874 25593578 27568874 29427255 30562762
2146 30562762 31853356 33614430 35292454 38072823 39809586 42989962 45682342 49843017
2138 49843017 53182333 57978478 62453720 66619419 71752109 78069686 84866432 93334978
2130 93334978 103653404 116290215 132178489 151324429 175308377 204874287 239916787
2123 239916787 285676323 325568740 356881197 358235834 320034713 258505040 201889366
2116 201889366 165377523 138545040 119919706 104374206 93154695 85288881 78758565
2109 78758565 72689959 68845829 64238598 60407155 57342254 53688400 48408521 44296032
2101 44296032 41737321 39644956 37077358 36016640 34284795 31266967 29881714 28405547
2093 28405547 26199319 26126562 25406613 23226497 21671146 21975985 21046995 19664012 18919241
2084 18919241 18129507 17607160 16612889 16068370 15812825 15386419 14332486 14433581 14247796
2075 14247796 13421137 12869348 12286172 12447691 12216251 12429483 11364295 10002824 9520658
2066 9520658 9839886 10334914 10780536 10227440 10005347 9289738 9158419 9442114 8672498 8599585
2056 8599585 9173983 8402665 8103795 7740786 7387256 7231113 7174777 6861822 7508193 7300704
2046 7300704 7119741 5906388 5914795 5956267 5564560 6146870 6311888 5994053 5663458 5612013
2036 5612013 5389651 4943267 5037701 4809703 5010582 4415902 3815440 4107236 4090364 4489209
2026 4489209 3926698 3867571 3829427 4353507 4392383 3757235 3309554 3173966 3059074 3201303
2016 3201303 2337733 3061746 3282183 3005854 2637803 2398995 2476621 2654224 2317348 2696899
2006 2696899 2620409 1985214 2525214 2803241 1860926 1301078 1736865 2261946 2461458 1985605
1996 1985605 2314485 2065149 2110161 2080275 1850109 2487551 2371506 2271698 1508260 1595233
1986 1595233 1230849 1423901 1463012 582218 1366252 1321480 1305334 963528 1027405 1054329
1976 1054329 1147832 1048805 757787 1497702 1078481 1117308 721716 169710 -109091 861856
1966 861856 1222133 1231117 473445 1427876 1018902 944806 744204 235953 206697 -97953
1956 -97953 129112 52469 477919 -33388 -267027 236904 225110 517101 1320394 968170
1946 968170 769217 896012 1131818 1567223 981138 435525 1212716 1163963 701171 605625
1936 605625 460121 369900 604716 456553 646012 -180100 752633 627181 288581 125465
1926 125465 -109757 -95912 -379169 -377763 -251768 -84425 -637182 -423385 19067 147307
1916 147307 337239 458310 437518 940422 397925 109319 -302199 -585742 -250443 -213533
1906 -213533 365402 -329076 100506 45926 336079 -188691 -488503 286542 973772 1051627
1896 1051627 714583 112043 507454 38880 8321 303757 440926 760038 373692 271920
1886 271920 1130525 891792 296014 708734 409144 523019 732376 784793 484417 439362
1876 439362 904239 628935 1342191 842311 691710 741764 498708 1412535 2107892 1699657
1866 1699657 844677 1391581 1035566 1469763 792698 1002313 177363 204397 1486496 1582887
1856 1582887 1415921 1504036 1602432 2117939 2082303 2271626 1488612 1385497 773231 471957
1846 471957 553431 460517 -244944 -781653 -33795 -150742 -494130 -277652 695498 739112
1836 739112 190925 685198 461646 167796 -424789 90681 3599 -74629 370689 350145
1826 350145 802389 130762 435376 -60524 -348716 -60793 245759 622432 312337 -646917
1816 -646917 7256 194499 590777 1444131 718748 234681 656028 1336821 643307 297469
1806 297469 -287217 -97518 -312438 -953380 -637791 -896907 -578482 -25056 -325688 -252687
1796 -252687 -279021 -531854 -157298 -712985 -440098 1008117 37542 332082 -16466 -410701
1786 -410701 -866452 -494089 -451462 -638509 58295 -71681 260482 -560965 486184 -179919
1776 -179919 -835361 -811876 -439918 -1126982 -882958 -369314 718905 663095 890471 156019
1766 156019 798964 1051132 634176 439412 -370149 299559 -46337 -160276 -986532 -1371402
1756 -1371402 -763231 116147 475263 -135301 -839129 -434542 25659 291730 102508 -551808
1746 -551808 -791064 -1000374 -669475 -167596 619115 399959 132396 -329947 79498 136252
1736 136252 -656960 10919 -610412 -693272 -134671 456081 394120 -326255 -169747 32810
1726 32810 -383768 -574670 -1664738 -938682 -213174 -206706 85529 -59992 -186668 -111477
1716 -111477 -926745 -667830 -475862 -969730 -820494 -323562 -131788 -481429 -591907 -852274
1706 -852274 -439637 60657 -95380 -570601 -302854 169987 -522024 -560319 -688617 -499865
1696 -499865 251444 -325391 197210 -419575 -1018502 -1205151 -1114031 -466848 -543964 -290017
1686 -290017 238817 -186621 -879502 -1067782 -862894 279227 594273 483495 235119 233193
1676 233193 220786 420310 889487 728630 398111 -49935 -154378 -222558 -341812 -135075
1666 -135075 139780 56980 -192378 663172 13937 172913 334671 -29264 70135 -785416
1656 -785416 -652295 -694664 -363323 -283180 -279177 335774 292774 460389 34668 -776261 -297186
1645 -297186 -702652 -667511 -1050569 -1311128 -472457 -835914 -1414694 -360267 -240439 -89568
1635 -89568 175306 -537523 -298601 -826607 -934807 -597644 -775366 -741566 359555 222284
1625 222284 390116 235263 -350453 321862 944622 33556 -939996 -321058 171912 442276
1615 442276 270239 -187387 -326840 -871388 -750387 -775898 206588 -586315 -875521 -224172
1605 -224172 39260 -682575 -339268 565738 310039 -582279 -693256 101173 -954325 -1498833
1595 -1498833 -607930 -292961 -671086 -490053 -800355 -150551 -472984 -1602062 -1792562
1586 -1792562 -665259 -1199105 -1103761 -1269948 -1099322 -563363 -264071 -849479 -632574 -421035
1576 -421035 -455767 348049 -86516 -450620 -201771 -756450 -442699 -519915 -605475 -697024
1566 -697024 -707476 -780175 -585112 -493617 119513 -47311 215392 -124046 -87487 -544648
1556 -544648 -925247 -503254 -1066164 178064 921445 132824 279854 -191477 -427782 -526466
1546 -526466 -733522 -139286 -1170098 -1043160 -598365 -590947 -1088675 64712 -777408 -407847
1536 -407847 -236765 160054 133529 413190 -88673 -545045 -695063 -1214902 -187132 258072
1526 258072 638330 -438222 -1664453 -1496115 -1176079 -1000570 -890416 -291765 -84235
1517 -84235 336241 103386 -178336 -205593 -1228790 -297135 603120 600311 1104800 1039990
1507 1039990 185319 -358924 -761818 -628734 138790 -114071 -214366 -14824 -386105 -810123
1497 -810123 -204289 789451 522538 419426 -307485 -591053 -977032 -335720 503808 709232
1487 709232 603804 142056 -385341 -238663 989751 676332 -514973 -559688 -468046 -820384
1477 -820384 -635704 -465927 -346395 -974125 -876602 -1529713 -761190 -123469 -966028 -322304
1467 -322304 -65277 114961 -475301 119753 196565 592442 85068 178930 97648 -195608
1457 -195608 -1040054 -1361438 -453643 -283558 -181260 -132625 354117 229250 -310745 -322679
1447 -322679 -27809 155229 432133 310339 400038 482696 335926 469676 -532458 -739298
1437 -739298 -214181 -672989 -556296 -1147705 -719783 -1050516 -328907 181110 -172739 -46611
1427 -46611 -220806 -684171 110707 -75635 135416 412778 -758165 -295221 -45300 -476689
1417 -476689 -407528 -1210005 -569023 -526330 41445 501876 511532 -104365 -565021 -603890 -445007
1406 -445007 -447393 -417846 568210 235158 -5256 -192228 17239 -349622 -22630 -175734
1396 -175734 -1390863 -1621714 -734098 -208110 -559052 -318021 20257 -578384 -447770 -1030608
1386 -1030608 -1043926 -967840 -549146 -302073 403777 335106 190916 -13057 -43429 515667
1376 515667 446910 170029 -548921 -149816 718133 290032 -257980 -736675 -647468 -484853
1366 -484853 -259253 -251242 -223430 -655307 -286645 -700376 11992 657066 260929 412565
1356 412565 -135616 -427209 -525872 -64878 -160409 -749825 -108194 -99410 -609460 -672413 -956619
1345 -956619 -220026 -443099 96792 498646 438366 828638 51963 -514537 206829 372082
1335 372082 633516 688552 27213 -296978 130158 724254 95454 -556879 -278632 454524
1325 454524 585851 -123634 -777667 -979723 -593981 -610243 186624 344605 -491417 -976272
1315 -976272 -906005 -428553 -166386 -1177012 -326137 1010885 418523 -982351 -756080
1306 -756080 268851 138536 -828457 -652681 262015 -702387 -999473 -1178432 -618089 -796225
1296 -796225 -915264 -389952 -1032570 -1199018 -518518 -446611 -975664 -172835 -360386 -277726
1286 -277726 307292 -422920 -182221 180476 510644 1006519 320014 500995 -23717 -327381
1276 -327381 -472429 -367538 40188 -221943 -82745 -1137022 -1612612 -622715 -179488 104948
1266 104948 -78614 -319640 -373990 -522503 -533258 12981 103003 -296848 -161184 -156894 -229496
1255 -229496 7765 71919 -13711 128014 616784 243494 177355 851341 167650 -908483
1245 -908483 -580388 -222039 -383347 6893 -453839 -305766 -180308 -426632 218248 590998
1235 590998 829847 491105 -482635 -499739 -598576 -917831 -531259 -846494 -888491 -259786
1225 -259786 378869 1321556 633067 543945 562065 -266492 -158640 1031016 1166933 887793
1215 887793 344933 -52896 374077 833902 -198441 247403 345886 -178750 -188586 -635916
1205 -635916 -529422 194707 585653 556395 636080 205966 52004 -924862 -845759 -210478
1195 -210478 -324882 -774307 -521669 -10222 471661 692784 145931 -344978 -257206 783745
1185 783745 470184 190562 132054 92556 424932 453222 -40109 912459 1520601 -227463
1175 -227463 -645956 420920 452091 -412273 -16537 475930 582215 348089 220002 -196151
1165 -196151 -183319 451073 187102 -309709 -623126 478529 -64739 -652576 -564533 -782524
1155 -782524 -138323 -296641 261554 430499 -328533 -99460 151212 -834376 -447280 -646716
1145 -646716 -541187 -855881 -22214 140459 897891 943568 376394 967119 774946 1178807
1135 1178807 461259 662940 316281 206326 109761 444700 927384 657588 -27797 -145951
1125 -145951 617856 589407 -335054 -565930 -921271 -307087 418665 874670 858919 497913
1115 497913 366665 -761887 -10087 -1105816 -1006031 -19172 -428103 -717763 -324280 423725
1105 423725 -150240 210499 494716 1215977 1243580 420992 -65930 369752 763261 440350
1095 440350 373702 514544 111898 -369233 -396967 -180859 77413 -307464 -983668 -1271568
1085 -1271568 -1271492 -759279 134348 364453 788420 1228713 853044 289919 329204 762089
1075 762089 521910 -69427 105548 -270018 704815 282035 -273207 -238349 -468431 -49562
1065 -49562 -97918 226687 515605 55314 -70928 14786 -176441 -56991 -215074 -780240
1055 -780240 -964445 -927206 -654768 -415737 -191658 -41673 -62398 24903 36898 -114935
1045 -114935 -605831 -382094 -166889 -611221 -91080 -785453 -974080 -223042 -604308 -563520
1035 -563520 -512384 -285071 -375562 -513744 -7819 717396 890553 1205266 577586 -162302
1025 -162302 -527491 -567417 -924455 222568 679305 -143754 -264757 597407 114979 38056
1015 38056 -102029 -327720 297370 350763 267119 -341923 110952 -37486 -50798 172512
1005 172512 -40606 -279892 -615589 -182728 -491276 -137707 350298 407582 1478942 1110532
995 1110532 129357 -303297 -824262 -262007 205774 -118891 -278855 -584824 -211084 405544
985 405544 755441 804479 134994 -39513 -28293 289701 259197 -151517 -33571 199910
975 199910 974628 939926 109726 -152967 255906 309337 269943 -90971 -280031 -103426
965 -103426 89890 475336 1328348 691524 -124115 104233 346892 224127 -56363 825755
955 825755 477149 -381004 -545227 -706331 -765573 -1170116 -1246620 -1750675 -1000794 -453301
945 -453301 267238 171998 -345509 48532 -373969 638230 -61010 -599687 -267980 330438
935 330438 905094 599854 377366 551183 53541 -507538 -397774 -501822 -822129 -651803
925 -651803 -167710 -447637 -248018 -645735 -700683 -41587 597419 531490 266076 -582266
915 -582266 -1133024 -571820 -153014 409881 249580 369556 177510 160169 -430708 -1077154
905 -1077154 -1032502 -1036900 -531254 129212 43682 816571 1126363 654391 303679 189365
895 189365 331793 29332 127816 -478334 -135538 64170 616496 517771 -605657 -689389
885 -689389 -303727 -288001 -126974 -414490 -33042 -22452 420925 74880 360234 840349
875 840349 664247 576954 -73819 258779 -456797 76854 -284212 -209662 -170440 174989
865 174989 592638 -123386 306537 -255113 32859 -149038 347433 1127961 509403 1084793
855 1084793 671386 231250 243578 358111 172338 237626 -136173 332900 996058 307583
845 307583 184556 71657 56431 -443129 78046 94880 576381 173950 -243075 -535997
835 -535997 -86218 -353246 46784 395862 330025 663850 591489 646239 719624 -760057
825 -760057 -1437021 -596904 -973433 -546903 -900584 -1104174 -327265 -332331 -894164 -1179529
815 -1179529 -1155135 -725259 -262976 670760 -184158 -430505 -456603 -1187 -500340 -839656
805 -839656 -412960 15783 -168188 -261785 477524 741558 419363 571432 -7723 -919408
795 -919408 -327526 -207634 -264270 210977 524722 249970 -342820 182793 34053 544349
785 544349 519659 -171950 100869 458160 280875 -658663 -684301 150315 -510528 -615500
775 -615500 -471946 77318 267336 494080 779274 537177 134422 -86138 861570 608265
765 608265 55673 -112960 -137412 328945 952284 318790 219411 177338 -59300 197064
755 197064 897999 894485 423990 69886 -642705 -292396 -353929 -443137 156865 -18857 -165056
744 -165056 -1062023 -981783 -551021 -637187 130556 -28793 443208 63379 -433073 -4406
734 -4406 -537085 -1090457 -271654 -303250 -520329 123252 74998 449957 81718 364751 53105
723 53105 600294 377348 1625987 1156761 1278419 793361 -525393 -1005936 -148161 -57794
713 -57794 -291005 -192257 -586468 -686928 -898053 182325 860566 911719 617087 765289
703 765289 1015200 305389 647240 1480479 695933 171557 -480324 504588 55947 132386
693 132386 -47507 -514836 -413323 711046 218432 383639 314462 -104970 453960 476937
683 476937 -456581 -732917 13159 210747 732571 1162903 184589 -795935 84745 -21976
673 -21976 -170903 746520 -120406 -123112 3910 -938833 -960362 -261795 51334 -159713 -59778
662 -59778 41968 369515 474963 65626 -762757 198222 1379626 616308 -47317 34676
652 34676 -909614 -211418 391165 -178536 -356759 -108129 -171774 528901 890526 342183
642 342183 591411 -486421 -601743 -214404 -1045210 -160982 -41405 -440174 242303 327925
632 327925 -414524 -566801 -1011017 -954956 -615449 -1138171 -264830 236153 -411574 498716
622 498716 937141 1115301 412518 -101737 -306668 83595 -410163 -377182 259343 -261323
612 -261323 -167260 -731804 -309358 -58376 -314261 -603370 -781651 -297512 159256 -607872
602 -607872 337517 350737 328683 706392 98305 -1428312 -1385372 -27404 97554 -79258
592 -79258 48627 -15265 -308332 328311 193173 913677 654705 685732 895858 588612
582 588612 936028 -300776 -74401 59978 352870 695541 151249 238693 783197 621380
572 621380 919292 1205353 626918 -2740 339743 125626 399753 225223 -252048 -443667
562 -443667 -309209 254899 -61775 -6361 392568 1703120 999079 486959 567908 711449
552 711449 1144532 1394000 546038 142718 776527 882562 565144 -355162 -226645 -12107
542 -12107 83288 177899 -191681 -485583 149606 673178 519474 -96072 -471997 -395496 160371
531 160371 604956 439919 650000 475805 526822 -576665 -392902 -456994 -519861 -448175
521 -448175 145657 -131541 414866 30253 -578647 -464071 -411031 610363 319555 240172
511 240172 -76849 627262 565589 637941 1061689 36691 -677333 261220 -220599 40292
501 40292 -38700 61343 796644 535949 851609 510140 -21450 199333 795707 674122
491 674122 520641 296112 -149908 -400123 -432416 -543736 54615 389963 -118756 22888
481 22888 -195830 319290 252389 222126 595210 234308 60825 -604213 -566820 -1151632 -1326024
470 -1326024 -136118 842830 185385 -508671 371175 -314553 -349172 -71536 534026 487767
460 487767 -221373 -11156 -234688 -75598 208011 -20105 -625183 -790936 -82153 68272
450 68272 83193 -612163 117525 -278017 -888578 -220167 -101084 124257 688652 459746
440 459746 415698 -312841 -110587 425090 8538 -731169 -632092 983993 525454 -32590
430 -32590 581385 962108 686871 137139 165741 1106142 371641 542200 -58544 -169090
420 -169090 -330663 131009 -273856 -352887 -390449 -736407 -316747 -449482 -1125939 -912481
410 -912481 -640616 23283 -41718 -590489 -763994 -611149 -689116 -879891 -699533 -100305
400 -100305 210226 -188862 -178824 -69057 210142 -907757 -822841 -849213 -1224274 -179355
390 -179355 -232115 -1225431 -552411 -264907 -163774 199343 -336048 -590854 475527 -607359
380 -607359 -1511409 -845318 -308463 -50577 937832 887665 402657 871185 523353 -485667
370 -485667 -1205025 -673935 -323973 -462168 -356103 -1044116 -1377453 -466792 -1232903 -1018804
360 -1018804 -1093295 -1540550 -841269 29253 718728 92422 -578218 -220069 -623968 -1002493
350 -1002493 -1309911 -1032205 -775410 -802366 -634011 448606 91085 -102131 680278 22803
340 22803 -216971 -581173 356374 -364583 -26942 426110 -152586 125541 -245590 116784
330 116784 277131 -376148 -142582 -254108 538122 202498 380482 531521 514732 1267637
320 1267637 196223 -578252 -86334 -421377 -643120 -342500 222400 30424 -123464 -442434
310 -442434 -356401 -895936 -247457 -491524 -1122854 -697491 -1017606 -593813 -874913 -526715
300 -526715 -445737 426521 650667 -176159 -1045962 -778904 -409177 217037 -394208 -828857
290 -828857 -127293 -550227 -1327652 -591728 -513345 -642978 -822909 -126169 -291429 -1032656
280 -1032656 -1131775 -1218999 -537730 -319868 -278378 -385346 -669604 -739730 -74843 26900
270 26900 -536635 -967664 138498 -97672 -592162 -457042 -604210 -906437 -1366015 -699329
260 -699329 -313216 56037 70144 -39119 -892260 -1049132 -477536 -795754 -542042 -561740
250 -561740 -1020495 -576828 -704718 -958767 -423001 -210671 713427 1455428 -36001 -167044
240 -167044 -506140 -1264083 -535975 -715218 -670341 -763204 -972630 -926470 -11503 89749
230 89749 566284 573306 237788 141807 -486365 -357118 437319 128348 26295 -49589 -447955
219 -447955 -663371 -1134786 -817905 -677031 -496635 -291658 -722019 -1309905 -1009529 -79478
209 -79478 1086921 573720 -265831 -206800 -153537 -240114 -94287 -188430 -586172 -1511241 -796698
198 -796698 -483990 -858163 -11774 94603 -629381 -893641 -808012 -503287 -687141 -627000
188 -627000 -432881 -551681 -677620 -72672 -38072 -429296 -359543 53097 28527 70878 -61204
177 -61204 -421140 273377 -639338 -664858 -328103 2189 349232 259496 406012 188692
167 188692 -247506 121329 648655 372751 -384389 -165887 -258840 -201168 -210115 141841 -22113
156 -22113 -274492 219185 757899 101276 -609082 -550292 -572008 -380711 -496801 -80369
146 -80369 204159 -150972 -1305083 -1255881 175042 637843 -155938 -678267 -359798 456115
136 456115 543131 -223671 96704 352340 -756191 -871191 -832892 -1136812 -540577 -390306
126 -390306 -752929 -641978 -293240 201787 634578 455716 -116814 -226485 -1020522 -822149
116 -822149 -746793 -1360205 -932428 -284260 -88084 -149839 -503776 -421607 -323962 -767211 -898539
105 -898539 -895963 -191920 -30732 -151068 -18804 -134086 -58559 -283971 -516989 67406
95 67406 -160014 -624630 -748837 -408387 -501181 -845014 -642149 -822286 -1659699 -1405225
85 -1405225 -518713 -149573 101548 205134 -25888 -1017063 -871853 -151901 -233062 -943106
75 -943106 -379847 246771 158154 -102676 -109922 600763 1051932 962305 113108 -125522 -186187
64 -186187 -375330 -699288 -1104900 -809817 -731239 -858490 -77176 95521 304011 163185
54 163185 -337803 -921005 -1095086 -921019 -890850 -210418 150289 132090 -86019 -277052
44 -277052 -581755 -654124 -981896 189191 502678 23237 -722259 -872489 -1009939 -876886
34 -876886 -353081 -806739 -799890 -548184 -44443 180547 464126 -69173 -729196 -387761
24 -387761 -574162 -74104 489253 436612 -30685 -308721 -524399 -197658 -24373 -281640
14 -281640 -79312 -213449 -353584 -86628 340418 -584810 -608930 -191708 -343414 -458287
4 -458287 -433577 -284831 -299918 -403080
0 -403080
$$ Imaginary data points
##PAGE= N=2
##DATA TABLE= (X++(I..I)), XYDATA
16383 -1375142 -1356727 -1179840 -1349358 -802019 -574053 -885154 -814303 -1299580 -1816998 -1502469
16373 -1502469 -1071817 -1186084 -1324614 -1766808 -1515689 -1333844 -1489621 -868443 -1192792
16364 -1192792 -863068 -714522 -1134149 -945381 -383169 -430861 -1038836 -746467 -491205 -1224991
16354 -1224991 -927118 -717888 -1020584 -1147474 -939476 -656862 -212464 -414005 -322246 -108920
16344 -108920 -724704 -867765 -749950 -793521 -1081778 -962280 -809580 -678325 -745466 -965237
16334 -965237 -723273 -711232 -53824 22103 25622 -6500 167372 892150 394694 393699 561550
16323 561550 395543 508518 529044 401422 499323 272149 114753 -45146 -102872 191420
16313 191420 920099 724230 535685 120578 -14714 -406152 -284547 429099 138488 224705
16303 224705 1361259 1706891 644559 1259158 1231536 916576 504884 856025 818453 302369
16293 302369 445712 308574 350333 1005799 929184 723083 767663 1113904 503750 490880
16283 490880 252123 240287 775540 1337817 1100219 1459426 1455722 1943617 1050557 412933
16273 412933 667500 1145749 1559564 1143924 1500050 1674673 1691290 1100324 1367867 1428836
16263 1428836 1729934 1565033 1611210 1236646 1207095 1063272 1272374 983113 1133425 1284683
16253 1284683 1343533 1534365 1915946 1496739 1529732 1772739 1645688 1629436 1536343 1031811
16243 1031811 1198217 1850980 1732644 1734643 1765889 2070338 2423929 2142975 2147995 2022513
16233 2022513 1981998 1753625 1769011 1319134 1436281 1332724 1443335 1831385 1721973 1869656
16223 1869656 1238866 1060840 1126287 979374 1729758 1884721 1807742 1361573 1342071 1295978
16213 1295978 1185939 1775453 2136379 1982227 1982685 2682756 2750909 2231391 1758219 2017292
16203 2017292 1673811 1501390 1126323 1842916 2713128 2196270 2812958 2952474 2983580 2263768
16193 2263768 1542748 1877802 2593116 2644695 2155086 1591308 1511284 2402825 2188018 2244360
16183 2244360 1828416 1834279 2332493 2042440 2101022 2535718 2300398 1630931 2002555 2481515
16173 2481515 2693934 2772150 2640919 3501955 3503669 3363688 2908259 2275608 2960297 2692470
16163 2692470 1998356 2522230 2562715 1895011 2410552 2358860 2449853 2113918 2121253 2646517
16153 2646517 2402452 2348992 2133065 2203756 1846019 2293088 2261476 2075824 2529553 2822542
16143 2822542 2636303 2758673 2611429 2246817 2676589 2297298 1855548 2592717 2897060
16134 2897060 2307479 2330833 3191909 3044710 2331154 1731325 1614661 2280370 2761165 2915485
16124 2915485 3364823 3152961 3072373 2426408 2276481 2866414 3322268 3221665 2815497 2467038
16114 2467038 2527494 2164252 2004743 1818569 3057453 2429477 2300833 2422167 2238802
16105 2238802 2163262 1836262 2378588 2329061 2500203 2141234 2596286 2350929 2047251 2682986
16095 2682986 2208631 2658097 3387537 3490508 2646895 2081274 2098036 2193758 3174529 3954060
16085 3954060 3522388 2830799 2474973 2295883 2306066 2919660 2506777 2549601 2692824 2336599
16075 2336599 2891684 2040420 2042434 2082347 1749612 1264934 2107288 3123076 2345328 2378617
16065 2378617 2920837 2726903 2630045 2801047 2753527 3097518 3598888 2852534 3127495 3243977
16055 3243977 2732970 2686263 3276732 3245670 3477945 2652215 3315716 2901729 2224472 1571143
16045 1571143 1958924 1799402 2325597 2985414 2630363 2399298 2994922 3568140 2709759
16036 2709759 2842504 3216584 3109670 2474844 2101602 2086761 2602029 2757371 2367358 2503393
16026 2503393 3278539 2825339 2818887 2786452 2345671 3151703 3257052 2915289 3026226 2750337
16016 2750337 2336195 3314441 3476042 3386524 2853107 3441586 3387181 2221392 2297303 1987847
16006 1987847 2173717 2676576 2555431 2600460 2745147 2766026 2577220 2962359 2952297 2920067
15996 2920067 3765729 3301839 2721492 3284706 3262503 2782594 3011525 3027930 2681292 2649000
15986 2649000 3206557 3197130 2699737 2288186 2802559 3164346 2684269 1863617 1993912 2659153
15976 2659153 2536514 2300882 2950229 2711246 3313363 2793523 2672584 3224665 2924815
15967 2924815 3239421 2885545 2854599 2703140 2356668 2268636 2405216 3062533 2886371 3523843
15957 3523843 3565344 3577832 3066812 2898749 2730011 2439608 2169281 3087993 2475952 2556822
15947 2556822 3232676 3030086 2402537 2035261 2110615 2160084 2859870 3373211 2983939 2773220
15937 2773220 2977014 3710071 4251331 3442533 3876017 3778959 3134517 2910950 2860240 2631743
15927 2631743 2337330 1979918 2493425 2170365 2661925 2639504 2975433 2965991 2838134 2982232
15917 2982232 3359063 3495854 3284574 3081453 3027019 2142132 2157507 2540112 2693861 2912139
15907 2912139 2997162 3431338 2310090 2298344 2549546 2761320 2577274 3113822 3098994 3396434
15897 3396434 3472175 2798397 2468640 2146567 2838260 3050076 2493600 2497925 2705823 3554648
15887 3554648 2616960 3124968 3028380 2768384 3307334 3509803 3161484 3380252 2760002 2398058
15877 2398058 2740290 2471179 1972008 1801410 2606079 2894617 2907978 2084884 2718097 3093831
15867 3093831 2458135 1863307 2145123 1924224 2848748 3592405 3292152 2752639 1952426
15858 1952426 3044957 3241700 3325528 3708387 3089733 3161796 3106857 3572618 3596532 2719960
15848 2719960 2949730 2625363 2177237 2405558 2766715 2853248 2338613 2398916 2739671 3757608
15838 3757608 3711657 3783132 3077024 2569388 3037051 2757360 2616348 3182187 2631554 3056126
15828 3056126 3199849 2948198 2997064 3107600 3206864 3803668 3130652 2567112 2516672 3098192
15818 3098192 2999599 2228446 2400263 2872949 2364715 2364823 2592987 2744776 3012645 3444680
15808 3444680 3946364 3856639 3936525 3667761 3334081 2898227 2538553 2938267 3088229 3042655
15798 3042655 2876805 3669217 2995361 2712061 2956433 2550920 3233872 3425703 3546473
15789 3546473 2747199 2562634 2789544 2586315 2864616 1910503 1973578 2441987 2940523 3019853
15779 3019853 3559965 3130772 2022518 2708385 2653343 3239467 2818424 2030023 2071598 2290190
15769 2290190 2204978 2625306 3160910 2754861 2313050 2790612 2752637 3264646 3341764 3631023
15759 3631023 3700485 3444755 2918787 2924491 2978643 3273092 2861811 3442632 2979628 2343644
15749 2343644 2915271 2452857 2808884 3057081 3212570 2357881 2186719 2337474 3089787
15740 3089787 3205250 3302990 3320750 2994409 3602858 3174333 3164798 3258054 3273844 2609166
15730 2609166 2942462 3022503 1848018 1510559 2487315 2948055 3501877 1949529 1859743
15721 1859743 1947817 2236174 1969887 2489166 2537690 2772683 2526417 2514847 2042707 2385061
15711 2385061 2817158 2380450 2658150 2942268 3133243 2273880 2691361 3219524 2315132
15702 2315132 2911699 2730554 2992832 3217382 2132979 3292218 3082446 3290635 3104266
15693 3104266 3083044 3067953 3087931 2284139 2984362 2866269 2588043 3254862 3338547 3324016
15683 3324016 2556669 1753340 1833210 1989833 2700726 3920002 3524211 2859866 2567150
15674 2567150 2613722 3151950 2490610 2359079 2026353 2741690 2938929 2830471 2804246 2601079
15664 2601079 3058862 2435018 2584305 2740112 2378932 2923940 2651386 3212973 3546634
15655 3546634 3320403 3444734 3548329 3694090 3395976 3963067 4590083 3909022 3316063
15646 3316063 2964450 3006152 2409553 2607992 3155834 2822459 3249363 2893327 2384677 2809340
15636 2809340 2625051 2762426 2622403 3054372 2670878 2956595 3152236 3198353 3906792 3258152
15626 3258152 3415407 3470403 2957744 2927742 3517194 3573480 2939956 2668560 2782310 2908824
15616 2908824 3046458 2745215 2265427 1972635 2538029 3588233 3323337 4439652 4213599
15607 4213599 3694197 3817538 3732602 2842686 3190435 2893128 2199413 2671161 2694661 2332583
15597 2332583 1839311 2033645 2462901 3052609 2722818 3080977 2925032 3090062 2968969
15588 2968969 2887202 3364402 3699908 2693458 2853411 2983772 3398405 3839493 3849813 3640051
15578 3640051 3110573 2647416 3093506 2647654 3308868 3227729 2684459 2363012 2444408 3123423
15568 3123423 2912908 3063501 2924534 3424903 2887150 2321439 2714491 3498602 3920341
15559 3920341 3412057 2869280 3071583 2871186 3025116 2719338 2771844 3094892 2521448 2528286
15549 2528286 4141486 3315946 3036002 3379584 2485467 2473698 2259940 2034880 1555036
15540 1555036 2251643 2515673 2967506 2138144 1879477 3046371 2650252 2513673 3109588
15531 3109588 3299007 2970426 3280074 2799421 2291639 3191271 3437234 3190643 3075677
15522 3075677 3636917 3094952 2651208 2965321 3298135 3045172 2868735 2999116 2975771 3336070
15512 3336070 3090222 3709997 3674643 2335180 2160064 2799235 3647724 3226110 3075468
15503 3075468 3298301 2709888 2877006 2825756 2987986 2733080 2594081 2720300 2572433 3018859
15493 3018859 2999050 2664024 3167184 2619995 2958142 3284435 2589598 1840000 2010520 3824513
15483 3824513 4282749 3837775 3575027 3659740 2203696 2964894 3100658 2971039 2865197
15474 2865197 2942840 3513159 2916335 3399530 3547494 3706942 2812077 2492026 1971049 1843276
15464 1843276 3164011 2700580 2263370 3370432 3183211 2225518 1792136 1668102 2033988
15455 2033988 2175852 3082276 2645352 2905419 2783871 3380636 2762708 2217874 2013849
15446 2013849 2295753 2753959 2862390 3324755 2858198 2733531 2240630 2456233 2529433 2732613
15436 2732613 3435045 4039819 3882058 3676828 3038899 2565680 2987403 2982030 2866864 2815655
15426 2815655 2492158 2481052 3215340 3755207 3147343 2967658 2553588 2453661 2774041 2493119
15416 2493119 2352583 3294166 3051238 2930692 2468939 3293057 2966741 2846137 2612529
15407 2612529 3552304 2974244 2745760 3483239 3702768 3217557 2858801 2749634 3379269
15398 3379269 3021224 2558513 2987558 2921565 2184287 2584069 2826556 3616984 2849191 2917817
15388 2917817 3433626 2732102 3320900 3279639 3306951 2759472 3171593 2674849 2494817 2125808
15378 2125808 2858361 2808377 2837969 3433887 3311540 3025353 2276488 1780810 2519393 2350283
15368 2350283 2319073 2317516 3097139 2956234 3172406 3412163 2777205 2166812 2410567 3417013
15358 3417013 2800868 3181827 3242872 2961559 2255327 2606153 2798241 1931138 2545966 3159883
15348 3159883 3308771 2729831 2746019 3165501 3520319 2834373 2933175 2958849 2780206 3255961
15338 3255961 3023174 2811128 2866535 2655350 3208052 3526107 3351343 3267339 2632611 2436023
15328 2436023 3396560 2545134 2776980 2934518 2889740 3033619 2838558 3120235 3829452 3382104
15318 3382104 2566404 2631335 2594133 2774290 2722939 2459273 3328447 2878331 2953873 2950752
15308 2950752 3286989 3766159 3323459 3095718 3371714 3081113 2936146 3536401 2260386
15299 2260386 1978863 1855671 2230641 2860253 2978806 2616184 2894531 2946148 2788408 3110182
15289 3110182 2492102 3452774 3599153 3571841 3847232 3081564 2615002 2743895 2592578 2091455
15279 2091455 2176272 2328297 3080658 2715955 3142889 3787904 3885367 3314262 3737008 3928425
15269 3928425 3529615 3342326 3385158 3519617 3762530 3311828 3250165 2443417 2320321 2466780
15259 2466780 2528764 2732444 2848107 2719087 3190464 3778230 4336699 3955478 3365964 3587592
15249 3587592 3030396 3156008 2986564 3103235 3523879 2972960 3116418 3733960 3487154
15240 3487154 2870793 2580974 3405866 3660703 2459966 2569727 4012817 4119885 3461818
15231 3461818 3934218 3858385 3258235 3527183 3820670 3983358 2738875 1771556 2269583
15222 2269583 2650585 2748769 2213026 2907403 2996520 2955750 3291468 2531416 2459706 2349387
15212 2349387 2751162 2922267 2877070 2792403 3241445 3299580 2711326 2477828 2722740 2850516
15202 2850516 2170787 2497941 2603131 2813480 3132441 2863079 3009884 2952849 2764020 2187446
15192 2187446 2954660 2561169 2000762 2322394 2548423 3238012 3733846 2842582 2768840 3475808
15182 3475808 3881539 3768464 3115734 2864475 3262380 3422187 3746728 3754244 3026983 2984486
15172 2984486 3205214 2795473 2767715 2550482 2685004 3106860 2973634 3051909 3085330 3276378
15162 3276378 3159855 3264349 3375066 3472611 2929888 3000256 3541273 3349883 2684860 2421252
15152 2421252 2605451 2517961 3018733 2993258 2968438 2781546 2413279 2854957 3405100 3360017
15142 3360017 4128427 3777433 3491167 3561519 2996395 3033797 2515489 2605872 3419177 3286034
15132 3286034 3116251 3001233 2509032 2229158 2503622 3147226 2911498 3876369 3501211
15123 3501211 3004862 2858575 2267134 2240081 2252501 2920419 2952456 2673075 2599498 2072850
15113 2072850 2633503 2671759 2740499 2839893 3621601 2500410 1770392 2234529 3222961 3054539
15103 3054539 2715482 2966785 3547195 3114191 2939969 3406308 2780736 2253452 2485388
15094 2485388 3766611 4112541 3387708 3197694 2961325 2565491 2331278 2069539 2430255
15085 2430255 2507346 2589382 2385408 2734152 2972178 2235985 2473513 3270220 3606583 3846502
15075 3846502 2897217 3443568 3207074 3196063 2858047 3413147 3153665 3038931 3305872 3054715
15065 3054715 3417991 2999335 2322852 2635375 2720513 2422309 2661185 2453558 2698808 3376274
15055 3376274 2727588 3483313 3612565 3555535 2697997 2975094 3251016 2916459 3284683 3368936
15045 3368936 4085690 3656783 3031615 2130286 2894971 2761502 3022951 3281949 3510585
15036 3510585 3799889 4148050 3687057 2904777 2484092 2502025 3418026 4006991 3863465 2879092
15026 2879092 3068007 2506858 2982478 3741346 3267909 3700060 3291838 3004404 3698168
15017 3698168 3189079 3169676 3390932 3845752 2765526 2411589 2745664 3593452 3302564
15008 3302564 2841285 3698025 2969572 2879643 2543327 2983847 3286304 3256600 2767712 2606474
14998 2606474 2716978 2403022 2429624 3208969 3061797 3474867 3376171 2504625 2557947 2899287
14988 2899287 3428649 3479300 2599114 2270268 2088489 2736781 2924419 2245848 2815880 3689494
14978 3689494 4349860 3497590 2766242 2993305 3198152 2950782 2794786 3562638 3257083
14969 3257083 2848840 2783456 2781059 2771015 2967809 3044489 2987642 3610893 3310709 3160291
14959 3160291 3189828 3154060 2928772 1904673 2224852 3008866 3483990 2915788 2817076 3677231
14949 3677231 3678631 4334935 4257606 3954519 3848835 2911302 3202064 2958919 1933540 1898474
14939 1898474 2408329 2998386 3380640 2749371 3391713 3272255 3194778 3506795 3299794 2854720
14929 2854720 3431377 4262209 3755636 3137203 2825801 2635548 3560230 3684635 2718916
14920 2718916 2741445 2535986 2381231 2306021 2985131 2963626 2433025 2762062 3188292 3876469
14910 3876469 3423228 2988555 2471326 2061193 2333389 3241930 3415072 3438884 3648348 2655751
14900 2655751 3171079 3397460 3938009 3291171 3880100 3815386 2843141 2705075 3292733 3150024
14890 3150024 2387235 2247406 2496501 2610071 3436623 3184206 2524023 2371685 1953215
14881 1953215 1865146 2336277 2639849 3333380 3138413 2673526 2880064 2670050 2711154 2090769
14871 2090769 2699730 3396448 2998575 3737887 3681848 2853028 2743612 3385174 2678326 2678384
14861 2678384 2676933 2671547 3239439 3361930 3967752 3677539 3417558 3670038 3777773 3474605
14851 3474605 3261282 2813909 2683493 3453803 3449654 2294375 2833220 3224125 3746076 3605540
14841 3605540 2780558 3123304 2737935 2887766 3940659 3957965 3969292 4107221 3646622 3448643
14831 3448643 3172442 3054233 3811664 3092362 2612632 3372710 3669542 3629859 3309077 2669478
14821 2669478 2269716 2287740 2878071 2978328 3369575 4015504 3784572 3429631 2751335 2237594
14811 2237594 3849575 3847265 3158774 3304444 3581568 3457724 3045941 2616001 2444245 2483653
14801 2483653 2348793 2764187 3271234 3066409 2798946 3252829 3409025 3657143 3419172
14792 3419172 2953012 2552191 2759946 2247436 2161731 2107631 2023747 2069152 2024733 2702298
14782 2702298 2519964 3237914 2959581 3392362 2864647 2645642 2960859 2966809 3876914 3833500
14772 3833500 3840412 3820479 3400478 3457619 3741794 3565060 3580986 4102343 4135257 3709369
14762 3709369 3373747 3198810 4192786 4417679 3313022 3417027 3381636 3671606 3166722
14753 3166722 3226452 4173449 3981658 4102274 3319990 3753797 3209738 3398388 4095212 3363922
14743 3363922 3516356 4141973 4066880 3285930 3659152 3857944 2715192 2393884 2852343
14734 2852343 2947471 2223145 2750652 3758455 4276200 4364376 4121577 3513932 2965214 3775347
14724 3775347 3600417 3869636 3933703 3572445 3272519 3878489 3849002 3570179 4257104 4133506
14714 4133506 3682151 3152618 3368936 3361632 3176760 3531528 2767517 2935280 3793430 2761776
14704 2761776 3577852 3725066 4309986 3672084 2713258 1892840 2099560 2366883 2855486
14695 2855486 2949120 3442963 3614938 3062193 3703774 3676239 3532236 2958659 2914574 3860121
14685 3860121 4081511 3312529 3035912 3423137 3166466 2825776 2295874 1874786 2889830
14676 2889830 3251037 3655258 2878568 2988981 3313231 3472570 3559870 3059470 3503215 3749282
14666 3749282 4298102 3881439 3623387 3600082 3165780 2638658 2365663 2955278 3335801 3439741
14656 3439741 3850970 3147050 3129273 2762010 2544586 2908544 2643540 4045143 4127239 3482823
14646 3482823 3629676 3138847 3191711 4125777 4110450 4237864 3395049 3656806 3245867 3486115
14636 3486115 4043783 4098652 4166905 3881558 3736033 3249830 4007880 4294501 2752672 3040976
14626 3040976 2996924 2778539 3142173 3120683 2889879 2846314 2394661 2142279 2070084 2464399
14616 2464399 2494145 2494160 3940897 3819194 3589219 3353869 3604731 2638188 2361000 3686660
14606 3686660 4001855 3388333 3443414 3324022 3268756 3460983 2962066 3055381 3562502 4066557
14596 4066557 3086039 2929774 2791490 1612564 2438496 3349077 3068667 2424137 2193895
14587 2193895 2196667 3057174 3066464 2319449 2354179 2789352 3401808 2801659 2850968 3039157
14577 3039157 2814141 2220352 2742559 3267529 3325403 3846695 3980597 4080257 4159607 4370564
14567 4370564 3841966 3687295 3601322 3086368 2928340 3244132 3790120 3779432 3741343 3896732
14557 3896732 3213474 3461820 3912905 3021147 3359385 3852126 3253906 3053295 3139400 3020175
14547 3020175 3611905 3315438 3147405 3135973 2824217 2770170 3779335 3212059 2329259 2997467
14537 2997467 2391823 2914687 2647414 2587315 3154629 3306540 3575286 3441850 3238639 3297309
14527 3297309 3100078 3235008 3151891 3364276 3954041 3740022 3631934 2411386 2759179
14518 2759179 3505406 3512297 3814785 3431172 4175147 4264486 3157652 3066236 3047093 2697911
14508 2697911 3404510 3272274 2986505 2199282 2858809 2969990 3187472 3291333 3894646
14499 3894646 4297177 4606549 4129213 3189693 2952260 2907564 2813353 2936310 3384717 4074562
14489 4074562 3967534 4384968 4181677 3111262 3243040 3575760 3845683 3423457 4045198
14480 4045198 3534476 2927322 3462325 3596541 3380308 3516724 3094240 2863318 3112358
14471 3112358 3512588 2711902 3334708 2945114 3078776 3532028 3349704 2561647 3406037
14462 3406037 3730696 3493321 3372192 3217781 3190669 2734650 2974330 3190975 3559827 3317291
14452 3317291 3009358 3545073 3707083 3336183 3759937 3749688 3753115 3754374 4748302 3542528
14442 3542528 3146584 3186866 3773424 4362329 4210197 3387764 3347963 3180738 3596304 4185947
14432 4185947 4150735 4019382 3380329 3953861 4009104 3408885 2660742 2821115 3204639 2720880
14422 2720880 3037269 3687020 2997739 3111442 3634313 3861982 3454475 3727205 3236516
14413 3236516 3474719 2918288 2621308 3161034 3017384 3698984 4020494 4007299 3596482 3072183
14403 3072183 2741449 3239162 3322683 3896427 3596134 3283119 3553443 3388407 2841512 3830048
14393 3830048 4005966 3149587 3669032 3876687 4064253 3583835 3921573 3801241 3532297
14384 3532297 3438680 3296136 3804280 3491610 3971849 4022848 3865519 4270514 4134756 3406876
14374 3406876 3982613 4604161 3882930 4059643 3576795 3742099 3177164 3302375 4221492
14365 4221492 4369859 3555138 3187933 2562963 2547264 3193890 4058949 3987018 4273160 4080050
14355 4080050 4297476 4149591 4233926 3985360 3668599 3243417 3034022 2744748 2487874 3998532
14345 3998532 3714635 3062979 3521554 3218857 3208225 3031047 3034972 3512414 3649229 3705947
14335 3705947 3283764 3716817 3565853 3291408 3477775 3800651 2935496 2384018 3418100
14326 3418100 2826829 2616513 3000664 3167663 3284530 3470460 3164161 2395136 2608586
14317 2608586 3221369 3136251 3633580 4481176 3984115 3756139 3707053 4180134 3475308 2623960
14307 2623960 3351181 3597763 3532658 3965927 3681473 3776429 4379848 3603143 3321775 4087836
14297 4087836 3166899 2818387 3290714 3730349 2993635 3902591 2919551 3057085 3309797
14288 3309797 3693663 3167850 2887435 3268425 3654409 3718712 3158535 2567884 2984665 3670106
14278 3670106 3582407 3135846 3002670 3210138 4055749 3561171 2613004 2962735 3250134 3735715
14268 3735715 2888573 3164905 3803644 3835541 3500635 2419667 2326055 2381058 2607305 3233843
14258 3233843 4039831 3751386 3651827 4203093 3725007 3344873 3181476 3105998 3782428 3087707
14248 3087707 2854911 2886485 3203085 3749612 3637117 3669368 3003523 3043051 3206464 3058100
14238 3058100 2838653 3108345 3417481 4097364 3456932 3453970 3376426 3670501 3385024 3569755
14228 3569755 3529981 3007196 3550378 3045641 3535164 4057336 3822756 3888402 3570532 3433221
14218 3433221 3069703 2741832 3387729 3946168 3024450 4049040 3882332 3825805 3682535
14209 3682535 3590325 3509211 2748649 3184070 3331284 4091709 3683289 3380982 3822281 3501729
14199 3501729 4179963 3225768 3524503 3768063 3340870 3602772 4095323 3530015 2527395
14190 2527395 3427996 3090908 3302868 3544500 3332744 4029197 4341839 4145328 2929906
14181 2929906 3189923 3500039 4041345 3818366 3950467 4081740 3908802 3341424 4235070
14172 4235070 4371834 4129358 3943713 3586511 3334083 2575182 2427456 2989766 3338036
14163 3338036 3834646 4266501 3610948 3334345 3119231 2809372 2980733 3592379 4034054
14154 4034054 3528007 3436745 3156594 3008253 3389201 2832297 3558461 4422469 3748971 3741359
14144 3741359 3321136 3102174 3491246 3015339 3657072 4697849 4107772 2578730 2787678
14135 2787678 3066948 3134467 2797240 3600451 3137021 3187035 3025991 3530046 4082646 3934763
14125 3934763 3634531 3339962 3541412 4136080 4439580 3511969 2447495 3001665 2988117
14116 2988117 3300850 2564670 2379096 2805551 3696559 4275940 4801471 4659237 4076261
14107 4076261 4164047 3955409 3875233 2992910 3382582 4155608 3553520 3719161 4019341 3291330
14097 3291330 3509006 4078625 3958746 4131599 3259786 3097590 3426473 3647815 4010710
14088 4010710 3572778 3387902 3297831 2656876 2735109 2905323 2986410 3802957 4183944 4356961
14078 4356961 3219407 2953256 2673566 3363320 3950396 3303046 3606983 4241509 3987023
14069 3987023 4011549 4121201 3816397 3898375 3475840 3254986 3015758 3121097 3228077 3327439
14059 3327439 4027462 3788877 3350039 3368341 3804485 4123629 3017375 3182050 3486371
14050 3486371 3263168 3565997 3275575 3622532 4150974 4454435 3564878 3771140 4267959
14041 4267959 3298894 3906421 3283577 3295509 3482447 3060543 3486000 3315969 3684179 3449818
14031 3449818 3409528 3762039 3652150 4201673 4728372 4147132 3599929 3629490 3156810 2978504
14021 2978504 3035706 3085883 2985940 3536963 4108735 3386674 2846974 3107153 3575915 4314370
14011 4314370 4494305 4155322 4168284 3939111 3803592 3209786 2722923 3246351 2948524 3216273
14001 3216273 3372801 3633650 3990162 3912568 3829803 3858682 4208833 3906650 3105413 3358244
13991 3358244 3732811 3164901 3233962 2897610 3709924 3495241 3773474 3456691 2957180 3488516
13981 3488516 4108524 4106679 4256574 3906678 4021045 4088575 4114557 4728597 3900234 3183022
13971 3183022 4003996 3670919 3908237 3613553 3557501 3051584 2780812 3293123 3225829 3359943
13961 3359943 3300103 3906805 4132863 4035620 4483654 4278828 3543263 3341985 2351497 2445319
13951 2445319 2775980 2324426 2336161 2657206 3152582 3920334 4766131 5224958 3543739
13942 3543739 2595919 3616119 3265237 3133880 2789701 2730947 3321324 4158123 4264786
13933 4264786 3730419 3527906 3936743 4058517 3046499 3085663 3720034 4072331 3471311
13924 3471311 3462002 3322621 4083762 4272205 3890965 3894339 3228839 3697721 3605621 4329671
13914 4329671 4240865 4615764 4229331 3514900 3293616 4189916 3406851 3048159 3556634 3641019
13904 3641019 3957402 3529471 3759692 3673932 3724066 3065908 2658112 3211011 3168542 3139437
13894 3139437 4380053 4103642 3290903 3782367 3704016 3278722 3646702 2496151 3045015
13885 3045015 3363162 2062501 2294416 3954041 3599033 3721381 3541809 3459589 3960741
13876 3960741 3252552 2894097 4202858 4654026 4312367 3324895 2878867 3057347 3584696
13867 3584696 3574285 4702190 5166947 5202296 5382762 5547537 5025908 4292637 3307191 3969799
13857 3969799 4527661 2943763 3148269 3986328 4162084 4444251 4391098 3698599 4075846
13848 4075846 4057117 4018834 4283050 4218914 4761056 4390685 3760837 3631488 4145389 4069009
13838 4069009 4260209 3636352 3937205 3888385 3831732 3757893 3179572 2940055 2351218 2250251
13828 2250251 3489301 3750098 3261369 3585891 3556845 3134587 3886345 4262463 3721507
13819 3721507 4022488 3026445 3312584 3732441 3595300 3738322 3006647 3192177 2846997
13810 2846997 3556761 3664966 3263370 3385765 3510835 3738874 3381809 4211573 3635809
13801 3635809 4260375 4335479 4444738 4659223 4199214 3897036 4457307 4117852 3928884 2908746
13791 2908746 3293873 4457092 4501081 4318869 4109641 4491208 4205497 3320278 2673910
13782 2673910 2331242 3174786 3670756 3763962 3417431 3839060 4124528 4099788 3883509 3634518
13772 3634518 3860607 4138548 4060312 4462505 4163945 3870715 4084711 4641255 4613889 4451102
13762 4451102 4811973 4392411 3483683 4542615 4289721 4009528 3341472 3547555 4073259
13753 4073259 3384616 2273998 2985487 3793016 3466603 3425539 3579183 3591506 3874096 4436491
13743 4436491 3331001 3833111 4091082 3813064 4181059 3690112 4053488 2940433 3303058
13734 3303058 3048003 3651074 3793762 3838843 4606497 4251500 4616111 3912614 3256651 3300419
13724 3300419 3922841 3593823 3276177 3551706 3676523 3950677 4250130 4151885 4187206 3366024
13714 3366024 3667843 3755433 4230548 4252149 4436817 4237244 4517607 4590254 4727821 4873280
13704 4873280 4229445 3388766 3402985 3854096 4469247 3876215 3443048 3527632 3312875 2932704
13694 2932704 3552964 3181035 3425470 3787875 3825005 3301449 3083898 3368007 3750444 3438383
13684 3438383 3100462 2819352 3431978 3610224 3929024 3834324 4027025 4168326 3299602 3058840
13674 3058840 3358992 4053862 4249049 4031477 4371745 4397628 3500671 3433362 3845620 3312491
13664 3312491 3251251 3756773 4576574 4357857 4028728 3765244 3783189 3691731 4295319 4633107
13654 4633107 4277712 4222900 3796696 4184476 3459492 3410992 4012371 4169950 3885719 3681428
13644 3681428 3751150 3911783 4672560 5036624 4099156 3904489 4350293 3404845 4002091 4244699
13634 4244699 4128367 3965098 3209786 3490459 4102372 4003435 3638888 4259780 4320329 4242117
13624 4242117 3670895 3273736 3312320 3479194 3178320 3916906 4012818 4281510 4525729 4380505
13614 4380505 3938667 4105274 3403933 3500482 4267429 4191867 3531659 4154948 4346176 4114003
13604 4114003 4216277 3831850 4384803 4400560 4053100 4217332 4199241 3659436 4014742 4674857
13594 4674857 4447513 4172621 4899093 3864468 4429251 4368038 3322195 4512300 4354160
13585 4354160 3732613 4019654 5097601 4826279 4096391 3751321 3652046 3287443 3607281
13576 3607281 4531758 3994921 3277699 3282241 3118580 3437295 4152009 4332091 4083515 4474158
13566 4474158 3867931 3253580 3643980 4037651 3575795 3625095 3484602 3622074 3940429 3862950
13556 3862950 3400796 3696287 3583070 2717906 2695319 2803011 4265771 4804352 3764372
13547 3764372 3413137 3613228 3875674 4289868 4660620 4702175 3998579 3525926 3367160 4064826
13537 4064826 3005930 3162797 3688520 3239146 3934919 4189555 3565750 3498699 3504558 3392452
13527 3392452 2829246 3059020 3960503 4236642 4485907 4428013 4145747 4166400 4312761 4121634
13517 4121634 4550923 4159742 4123473 4151623 4087150 3570262 3760859 3343366 3232925 3019665
13507 3019665 4189108 4285066 4059518 3801819 2918551 2961084 3432876 3413069 3447611 3792192
13497 3792192 3928339 4268783 4498853 3869648 3547940 3322565 3622603 4439683 4003180
13488 4003180 3485351 3719022 4324357 4824720 4540234 3579901 3852785 4072986 3887981
13479 3887981 2871232 3523498 4206320 4459621 4203646 3951370 3877946 4088796 4344342
13470 4344342 4805507 4252352 3843293 3623537 3811487 3858977 5084947 4639159 4012172
13461 4012172 4391170 4282279 3977236 4519460 4515881 4945895 4529548 3945074 4601593 4437563
13451 4437563 4659390 4514604 4141394 4362297 4034920 3635666 3357373 3718040 4399911
13442 4399911 4502066 3486710 3269465 3843834 3554696 3800841 4590429 4649628 3977316
13433 3977316 4336993 3859438 3604274 4212521 4290327 4098536 4361115 4967092 4659098 4070497
13423 4070497 3481555 3662553 4104993 4025341 3741713 3765787 4823511 5207489 4857713 4107624
13413 4107624 4196957 4399171 3908149 4096243 4467711 4175022 4846246 4383027 4078825 4460820
13403 4460820 4524534 4133525 4130743 3576650 3774671 4098176 3996761 4350649 3816181 3370726
13393 3370726 4455993 4142123 4355373 4148872 3452266 3397492 3497648 3778321 3399698
$$ [...]
##END NTUPLES=NMR SPECTRUM
##END=
