##TITLE=1H_CA-8974-1
 DMSO
 8 sc, 
 7.02.2022
##JCAMPDX= 6.0         $$ Bruker NMR JCAMP-DX V2.0
##DATA TYPE= NMR SPECTRUM
##DATA CLASS= NTUPLES
##ORIGIN= UXNMR, Bruker Analytische Messtechnik GmbH
##OWNER= root
$$ XWIN-NMR		Version 3.5
$$ Mon Feb  7 12:05:32 2022 Russian Standard Time (UT+4h)  she@DPX200
##.OBSERVE FREQUENCY= 200.131346
##.OBSERVE NUCLEUS= ^1H
##.ACQUISITION MODE= SIMULTANEOUS
##.ACQUISITION SCHEME= undefined
##.AVERAGES= 8
##.DIGITISER RES= 18
##SPECTROMETER/DATA SYSTEM= spect
##.PULSE SEQUENCE= zg30
##.SOLVENT NAME= DMSO
##.SHIFT REFERENCE= (INTERNAL, DMSO, 0, 15.7689)
##AUDIT TRAIL= $$ (NUMBER, WHEN, WHO, WHERE, WHAT)
$$ ##TITLE= Audit trail, XWIN-NMR		Version 3.5
$$ ##JCAMPDX= 5.01
$$ ##ORIGIN= Bruker BioSpin GmbH
$$ ##OWNER= she
$$ F:/spectra/data/she/nmr/H-F/1/pdata/1/auditp.txt
$$ ##AUDIT TRAIL=  $$ (NUMBER, WHEN, WHO, WHERE, WHAT)
(   1,<2022-02-07 12:03:07.82 +0400>,<she>,<DPX200>,
      <created by zg, POWCHK disabled, PULCHK disabled
       configuration hash MD5:
       00 E9 B6 7A A2 85 ED C7 34 08 36 98 17 FE 4E 26
       data hash MD5: 16K
       D7 1D AE 21 44 6E A3 44 F4 CD 03 92 B2 B0 59 F9>)
(   2,<2022-02-07 12:03:14.21 +0400>,<she>,<DPX200>,
      <Start of raw data processing
       efp BC_mod = 2 LB = 0.24 FT_mod = 6 PKNL = 1 PHC0 = -16030.29 PHC1 = 15.80078 SI = 16K 
       data hash MD5: 16K
       22 C0 D2 5F 5E 01 15 CB 28 AA 09 1B 55 C8 DF D4>)
(   3,<2022-02-07 12:03:46.98 +0400>,<she>,<DPX200>,
      <pk PHC0 = 162.0573 PHC1 = -7.400002 
       data hash MD5: 16K
       AD 5D 45 B7 26 5F 5D F2 5F 79 8E 18 6C 4F 59 FC>)
(   4,<2022-02-07 12:03:57.73 +0400>,<she>,<DPX200>,
      <abs ABSG = 5 
       data hash MD5: 16K
       7D 22 E2 3A 73 0F 0B E8 CB 9D F8 8E D8 A1 18 3A>)
$$ ##END=
$$ 
$$ hash MD5
$$ 16 8F 42 0B 3E 3E 7B DE B3 2D A3 ED 5E E3 34 B9
##$RELAX= 
##$RELAX= 
##$RELAX= 
##$RELAX= 
##$RELAX= 
##$RELAX= 
$$ Bruker specific parameters
$$ --------------------------
##$DU= <F:/spectra>
##$EXPNO= 1
##$NAME= <H-F>
##$PROCNO= 1
##$TYPE= <nmr>
##$USER= <she>
##$AMP= (0..31)
100 100 100 100 100 100 100 100 100 100 100 100 100 100 100 100 100 100 
100 100 100 100 100 100 100 100 100 100 100 100 100 100 
##$AQSEQ= 0
##$AQ_mod= 1
##$AUNM= <au_zg>
##$AUTOPOS= <>
##$BF1= 200.13
##$BF2= 200.13
##$BF3= 200.13
##$BF4= 200.13
##$BF5= 200.13
##$BF6= 200.13
##$BF7= 200.13
##$BF8= 200.13
##$BYTORDA= 1
##$CFDGTYP= 0
##$CFRGTYP= 5
##$CHEMSTR= <none>
##$CNST= (0..31)
1 1 145 1 1 1 1 1 1 1 1 1 1 1 1 1 1 1 1 1 1 1 1 1 1 1 1 1 1 1 1 1 
##$CPDPRG= <>
##$CPDPRG1= <>
##$CPDPRG2= <>
##$CPDPRG3= <>
##$CPDPRG4= <mlev>
##$CPDPRG5= <mlev>
##$CPDPRG6= <mlev>
##$CPDPRG7= <mlev>
##$CPDPRG8= <mlev>
##$CPDPRGB= <>
##$CPDPRGT= <>
##$D= (0..31)
0 1.2 0 0 0 0 0 0 0 0.06 0 0.03 0 0 0 0 0.0002 0 0 0 0 0 0 0 0 0 0 0 0 
0 0 0 
##$DATE= 1644220987
##$DBL= (0..7)
120 120 120 120 120 120 120 120 
##$DBP= (0..7)
150 150 150 150 150 150 150 150 
##$DBP07= 0
##$DBPNAM0= <>
##$DBPNAM1= <>
##$DBPNAM2= <>
##$DBPNAM3= <>
##$DBPNAM4= <>
$$ [...]
##$SUBNAM2= <"">
##$SUBNAM3= <"">
##$SUBNAM4= <"">
##$SUBNAM5= <"">
##$SUBNAM6= <"">
##$SUBNAM7= <"">
##$SUBNAM8= <"">
##$SUBNAM9= <"">
##$SW= 18.0517287032376
##$SWIBOX= (0..15)
0 0 2 0 0 0 0 0 0 0 0 0 0 0 0 0 
##$SW_h= 3612.71676300578
##$TD= 16384
##$TD0= 1
##$TE= 0
##$TE2= 300
##$TE3= 300
##$TEG= 300
##$TL= (0..7)
0 120 120 120 120 120 120 120 
##$TP= (0..7)
150 150 150 150 150 150 150 150 
##$TP07= 0
##$TPNAME0= <>
##$TPNAME1= <>
##$TPNAME2= <>
##$TPNAME3= <>
##$TPNAME4= <>
##$TPNAME5= <>
##$TPNAME6= <>
##$TPNAME7= <>
##$TPOAL= (0..7)
0.5 0.5 0.5 0.5 0.5 0.5 0.5 0.5 
##$TPOFFS= (0..7)
0 0 0 0 0 0 0 0 
##$TUNHIN= 0
##$TUNHOUT= 0
##$TUNXOUT= 0
##$USERA1= <user>
##$USERA2= <user>
##$USERA3= <user>
##$USERA4= <user>
##$USERA5= <user>
##$V9= 5
##$VALIST= <valist>
##$VCLIST= <CCCCCCCCCCCCCCC>
##$VD= 0
##$VDLIST= <DDDDDDDDDDDDDDD>
##$VPLIST= <PPPPPPPPPPPPPPP>
##$VTLIST= <TTTTTTTTTTTTTTT>
##$WBST= 1024
##$WBSW= 4
##$XGAIN= (0..3)
0 0 0 0 
##$XL= 0
##$YL= 0
##$YMAX_a= 173371
##$YMIN_a= -120822
##$ZGOPTNS= <>
##$ZL1= 120
##$ZL2= 120
##$ZL3= 120
##$ZL4= 120
##$ABSF1= 15.70079
##$ABSF2= -2.351059
##$ABSG= 5
##$ABSL= 3
##$ALPHA= 0
##$AQORDER= 0
##$ASSFAC= 0
##$ASSFACI= 0
##$ASSFACX= 0
##$ASSWID= 0
##$AUNMP= <proc_1d>
##$AZFE= 0.1
##$AZFW= 0.1
##$BCFW= 0
##$BC_mod= 2
##$BYTORDP= 0
##$COROFFS= 0
##$CY= -3
##$DATMOD= 1
##$DC= 0
##$DFILT= <>
##$DTYPP= 0
##$F1P= 0
##$F2P= 0
##$FCOR= 1
##$FTSIZE= 16384
##$FT_mod= 6
##$GAMMA= 0
##$GB= 0
##$INTBC= 1
##$INTSCL= 0
##$ISEN= 128
##$LB= 0.24
##$LEV0= 0
##$LPBIN= 0
##$MAXI= 10000
##$MC2= 0
##$MEAN= 0
##$ME_mod= 0
##$MI= 1.114404
##$NCOEF= 0
##$NC_proc= -8
##$NLEV= 6
##$NOISF1= 3.799351
##$NOISF2= 2.8
##$NSP= 0
##$NTH_PI= 0
##$NZP= 0
##$OFFSET= 15.76893
##$PC= 1
##$PHC0= -15868.23
##$PHC1= 8.400778
##$PH_mod= 1
##$PKNL= yes
##$PPARMOD= 0
##$PSCAL= 0
##$PSIGN= 0
##$REVERSE= no
##$SF= 200.129996523403
##$SI= 16384
##$SIGF1= 3
##$SIGF2= 2
##$SINO= 5.538805
##$SIOLD= 16384
##$SREGLST= <1H.CDCl3>
##$SSB= 0
##$STSI= 16384
##$STSR= 0
##$SW_p= 3612.71676300578
##$SYMM= 0
##$S_DEV= 0
##$TDeff= 16384
##$TDoff= 0
##$TI= <>
##$TILT= no
##$TM1= 0
##$TM2= 0
##$TOPLEV= 0
##$USERP1= <user>
##$USERP2= <user>
##$USERP3= <user>
##$USERP4= <user>
##$USERP5= <user>
##$WDW= 1
##$XDIM= 16384
##$YMAX_p= 344445713
##$YMIN_p= -3495553
$$ End of Bruker specific parameters
$$ ---------------------------------
##NTUPLES= NMR SPECTRUM
##VAR_NAME=  FREQUENCY,     SPECTRUM/REAL,   SPECTRUM/IMAG
##SYMBOL=    X,             R,               I
##VAR_TYPE=  INDEPENDENT,   DEPENDENT,       DEPENDENT
##VAR_FORM=  AFFN,          ASDF,            ASDF
##VAR_DIM=   16384,         16384,           16384
##UNITS=     HZ,            ARBITRARY UNITS, ARBITRARY UNITS
##FACTOR=    0.220516191357247, 1,           1
##FIRST=     3155.83599317049, 0,            0
##LAST=      -456.88076983529, 0,            0
##MIN=       -456.88076983529, -3495553,     0
##MAX=       3155.83599317049, 344445713,    0
$$ Real data points
##PAGE= N=1
##DATA TABLE= (X++(R..R)), XYDATA
$$ [...]
11754c06717N7936J10679O4429M64038k29749k49401k63118K10000L66963K072
11744B27132j20862l09797M47742j64267k39462j25207O1665l2562j9243k9848
11734c04709J96383k61535j73985K07580K44657j47048N0702k5854J57706L7278
11724a8825k58763j92931p3067J2412n24K62000L5632l3411k96292L47579q4365
11713c00555m9661J99567j00265j95222K72136m76665K58421j4821J17674L34693
11703D5302K07478j02492k20839R4548J2244j67958k88153K33759J95996j09052
11693i9167K50313L43803l73686n2218J16196O0580n08047J47395l70377o1460
11683e46668L86257K31778j9950k51554k88760k24725L439k3686j93644K57031
$$ y = [-306717, -248781, -138102, -73673, 390365, 160616, -88785, -351903, -141903, 225060, 227132, 106270, -203527, 244215, 79948, -159514, -284721, -223056, -255618, -274861, -304709, -108326, -369861, -543846, -336266, -91609, -238657, -187955, -213809, -56103, -18825, -277588, -470519, -543586, -531174, -531698, -269698, -234066, -267477, -563769, -216190, -300555, -350216, -150649, -250914, -446136, -174000, -650665, -392244, -407065, -289391, 45302, 252780, 150288, -70551, 23997, 36241, -131717, -419870, -186111, 9885, -99167, 151146, 494949, 121263, 69045, 185241, 245821, -262226, -114831, -485208, -546668, -160411, 71367, 51417, -200137, -488897, -713622, -710183, -733869, -927513, -670482]
11673f70482L34185N01998j7620m96255p883J25484j94804k2190n6671k99132
11663h03370O89204K01725n06238M93628k98276K1316O67199k85891j85010j61378
11653a67091K87855j43796K92536M4638l02737j30536N0076n7317K43067Q1169
11643A97864l48276p7036l26359M1652M52793L75997Q555K47714p21337n8022
11633b06455J05496j44918l5747j75191j45973O39933O6127l39325n028J52481
11623h8600J6290N1088l8085j72769k54713J3708O7560p5194L21794j78773j26708
11612d64402m1302P4034J83075J53065r2521K0039j64797K74176L1281R2484R8519
11601A63651M1676l57165J28634l18644j54020K35127J76929j17236J95011J07752
$$ y = [-670482, -336297, 165701, 148081, -348174, -356057, -230573, -425377, -447567, -504238, -803370, -114166, 87559, -418679, 74949, -223327, -202011, 465188, 179297, -5713, -167091, 120764, -23032, 269504, 314142, 11405, -119131, -69055, -126372, 116695, 197864, -150412, -227448, -553807, -512155, -59362, 316635, 325190, 572904, -148433, -206455, -100959, -245877, -281624, -456815, -602788, 37145, 103272, -236053, -241081, -88600, -72310, -21222, -59307, -232076, -486789, -473081, -405521, -480715, -158921, -337694, -464402, -505704, -431670, -248595, -95530, -188051, -168012, -332809, -58633, -27352, 65132, 163651, 205327, -151838, -23204, -341848, -495868, -260741, -83812, -201048, -6037, 101715]
11591A01715L05140j49937j36083k32724k2142R3110j6474K5495L80257J98157
11581E46514n05612N3266j46942l97643j97181J0569l268Q2135J94940P8081J47114
11570a38027K91159K84027k18551k84158J22262n0738j72710l37229K53121M7478
11560b03366M7998j38252q4314L12366K2250J08147k13376K16899j13062j60598
11550b05308n2834r5001P3569j84785M63716l1220L5281J21403J36564n43293
11540b81908p5056j24242J53182J7161J30716R984m7487o3141Q1502L3624r6112
11529b61777M3979k12542J63162k38389K58978K34346J84493K7780J1680r6728
11519A14982k63475J19782J63447j60591O1612J48080j81636l31650J51929N0184
$$ y = [101715, 406855, 256918, 120835, -111889, -134031, -40921, -57395, -31900, 348357, 546514, 40902, 94168, -52774, -450417, -647598, -637029, -640297, -558162, -363222, -285141, -138027, 153132, 437159, 218608, -65550, 56712, 5974, -166736, -503965, -250844, -203366, -155368, -293620, -377934, -65568, -43318, 64829, -148547, 68352, -44710, -205308, -258142, -353143, -279574, -464359, -643, -31863, 3418, 124821, 261385, -281908, -356964, -481206, -328024, -310863, -180147, -170163, -217650, -280791, -199289, -165665, -261777, -217798, -430340, -267178, -505567, -246589, -12243, 172250, 200030, 211710, 114982, -148493, -28711, 134736, -25855, 35757, 183837, 2201, -329449, -177520, -127336]
11509a27336k93539j60317j08258j11929M48755M10899n03567L81815m93504J75712
11499c81269L55118k06108p448m01738l321O7937L89946l6276K8129k03297N6795
11488c41532R389j18778k98058K57107L23988J85076K36770P5248j43052l13847
11478a27689j0209L4544J67891M7084J84376l67500j47732q9405j13076K20990
11468b00726L6779j27497K30905K77977n16973k16551K63947l93583M5658K02201
11458c97863J03755k93622J66521J40396j30326O0051L54319j8986j83074p9448
11448b78277k56357j37393O99245J43921l73226l02104j21158j29920L13411M33093
11438h765M1639k3999j46913J49286J53275J94R0412o888q2399J35183k43563
$$ y = [-127336, -420875, -581192, -689450, -801379, -352624, 58275, -445292, -63477, -556981, -381269, -26151, -232259, -239707, -641445, -644766, -576829, -186883, -223159, -195030, -398327, -341532, -332143, -450921, -748979, -491872, -167884, 17192, 253962, 329210, 186158, -127689, -137898, -103354, 64537, 111621, 295997, -71503, -219235, -308640, -421716, -200726, -163947, -291444, -60539, 217438, -299535, -516086, -252139, -645722, -600064, -397863, -294108, -587730, -421209, -280813, -411139, -351088, 3231, -15755, -198829, -278277, -534634, -672027, 27218, 171139, -202087, -504191, -625349, -755269, -441858, -8765, 32874, 8875, -138038, 11248, 164523, 164717, 255129, 248241, 165842, 301025, 57462]
11427E7462k24629r2792J32454J4174j31599n07184L55918o8649j76855k05763
11417h47463K67731Q66945m97875J19774R7758o301N6019m69518K19138r1266
11407b85058L2143K74198j32702k05612N33j37374J05474j47506L3901K34768
11397b27235L33786m8650o1253R4821o1146k72359j46379M2656j01570m8920J44033
11386c52216l1762M92350j58463J60441m34086J92522j73198j23927K14502j477
11376b15314J52713j91567n20q0470K53569j31551K38484K38830p6750m05474
11366b18050J11414K95790l29491n25300k9693M42096L12459m11899J03027J80311
11356f9336J05226j27373m16160L68383L49554l81617k79792O95754j43213m03604
$$ y = [57462, -167167, -259959, -127505, -113331, -244930, -752114, -396196, -464845, -641700, -847463, -579732, 287213, -210662, -90888, 6870, 569, 56588, -412930, -193792, -285058, -252915, 21283, -111419, -317031, -316498, -453872, -348398, -495904, -462003, -227235, 106551, 57901, -3352, 91469, 30323, -242036, -388415, -345759, -447329, -496249, -352216, -383978, 108372, -50091, 110350, -323736, -131214, -304412, -428339, -213837, -215314, -62601, -254168, -254688, -335158, -81589, -213140, 25344, 264174, 187424, -218050, -106636, 189154, -140337, -665637, -695330, -253234, 59225, -352674, -249647, -69336, 35890, -91483, -507643, -139260, 210294, -171323, -451115, 244639, 101426, -302178]
11346c02178L08219M02728n269o99450l43506N25906J83337j14219k98600r6907
11336d39939M48204j23863j39850P5436J33325J05532m67230J15643K68355j6711
11326d1098l79643L5513N66753j33345P4892k04242j7962k49966R4190Q7124j2719
11315a80503K24232L18526j24419j08422j20802j93406j52305M86385L11664j16196
11305C44754o0875l74303j42174N38586k93865Q2043k96184p7659K72507k00757
11295b07927L6267o951M9724p788k05754j06354M69760l5697n8134M09828n3255
11284B83719J20301j66534K3455l61338P7180O6134K16292j11256m64173j16388
11274d32608M10834j19934Q7220R85127j68801o75007m15440L07906K01956j85767
$$ y = [-302178, 6041, 408769, 403500, -295950, -639456, -113550, 69787, -44432, -343032, -439939, 8265, -115598, -255448, -180012, -46687, 58845, -408385, -292742, -24387, -41098, -420741, -385228, 181525, 48180, 123072, -81170, -99132, -349098, -254908, -167784, -180503, 43729, 362255, 237836, 129414, 8612, -184794, -337099, 149286, 460950, 344754, 283879, -90424, -232598, 305988, 12123, 94166, -202018, -279677, -7170, -207927, -171660, -178611, -128887, -136675, -342429, -448783, 20977, -14720, -72854, 336974, 283719, 404020, 237486, 260941, -100397, -23217, 42917, 259209, 147953, -316220, -432608, -21774, -141708, -54488, 930639, 761838, 86831, -328609, -20703, 181253, -4514]
11264d514J50959P2125J84918m9554q9080l28293j75543m3686K0902J89276l2185
11253a04675J38951J22360j98047j80441j40991o4429M39160k34404M48025l54928
11243a29419l4884L80813j02736j5036J35823j27246J06138l61170k03777Q20
11233c50674M04825J03159m52458J0571j5899n1042J03495L08625L43583J68361
11223E72546k83098k32466K22351p1946k4410p949m6245k60316J63441K78095
11213C10003M5223m75721J02530L59121k23787j26672j36590j29490L79991K86616
11203C91224m79933j03194M14943k21896m5962o6171K87429P6986m0644R7138
11193C09920N1752o67591J4406L20135n5241K95155m24019j50076L44666K25450
$$ y = [-4514, 146445, 218570, 403488, 353934, 264854, -63439, -238982, -282668, -261766, -72490, -104675, 34276, 156636, -41411, -221852, -362843, -427272, 11888, -222516, 225509, -129419, -164303, 216510, 113774, 98738, 234561, 107315, 213453, -147717, -351494, -350674, 54151, 157310, -295148, -284577, -300476, -351518, -248023, 60602, 404185, 572546, 289448, 56982, 279333, 207387, 182977, 175028, 128783, -131533, 31908, 310003, 355226, -120495, -17965, 341156, 117369, -9303, -145893, -275383, 104608, 391224, -88709, -191903, 223040, 1144, -44818, -110989, 176440, 253426, 212782, 309920, 361672, -305919, -291513, 28622, -26619, 268536, -155483, -305559, 39107, 264557]
11183B64557j24156j44960J50757j28213k92130J10891J05321l0392j26523P2648
11173a42200l5990l26245L45901J51072k38598L01664N67643q2569k27601j63268
11163A49809j32130J4982k85648J59789J48092J16356j06167O3943l22628k2909
11153b16511R7307l23497j77645J57345K66193j40903K25715L5524j40863j55387
11143c72722l9169K36907j30787p594j94750K17164J52172r9564p9566L07057
11133a0852n4131l5994K14002J28127q2342L1097q8612m41482Q8901K2054K7580
11122b01652p2766L18035M0309k69528K53158K28083K3114j58691k24299l1617
11112i5854L89988R3237K2790p892r43j08821l75517j9554L30111p5932J78164
$$ y = [264557, 140401, -4559, 146198, 17985, -274145, -163254, -57933, -88325, -214848, -142200, -178190, -504435, -158534, -7462, -246060, 55604, 623247, 540678, 313077, 149809, 17679, 32661, -252987, -93198, 54894, 171250, 65083, 129026, -193602, -216511, -119204, -442701, -620346, -463001, -196808, -337711, -111996, -76472, -217335, -372722, -411891, -174984, -305771, -313365, -508115, -290951, -138779, -238343, -317909, -10852, -64983, -100977, 113025, 241152, 158810, 189907, 101295, -340187, -251286, -229232, -201652, -274418, 43617, 83926, -185602, 67556, 295639, 318753, 160062, -64237, -95854, 294134, 387371, 410161, 402269, 401326, 292505, -83012, -102566, 227545, 151613, 329777]
11101C29777r7098n16253l39489K47164J84536j48668j56514K66443j88000M65625
11091D7523n7921k8999J2443J54543j62782p0138J92791j13946N1906Q6617k52478
11080a40441j6465k18253j33711K95345J32136j3986m4887K6865o6429j68153
11070c47979K04075L37321j01093j55262J78557l68577q0885K11274k96330j06080
11060e24979P02276K08552k35439o4441p9551l3362M4341J72394j62272J83337
11050B10856n11706j40590J77181k14912M20085J85902m37875j33764p2758J19178
11040c98403L4819N6116L59814j03408L8319O9166o43760M76284j10873K36878
11030A4952O7796P762l11263O7129n18158K74020K1349K34446r2504J12886k56734
$$ y = [329777, 232679, -283574, -623063, -375899, -191363, -340031, -496545, -230102, -418102, 47523, -10398, -39397, -26954, 127589, -35193, -105331, 87460, -26486, 25420, 112037, -140441, -156906, -375159, -508870, -213525, -81389, -95375, -140262, -113397, -179826, -347979, -143904, 193417, 92324, -62938, 115619, -252958, -333843, -122569, -418899, -524979, 177297, 385849, 150410, 85969, 6418, -26944, 17397, 189791, 27519, 210856, -300850, -441440, -264259, -479171, -59086, 126816, -311059, -444823, -517581, -398403, -363584, -307468, 52346, -51062, -12743, 56423, -587337, -111053, -221926, 14952, 82748, 90510, -220753, -153624, -671782, -397762, -376413, -141967, -234471, -121585, -378319]
11019c78319J0099J85247L43888J47534j29379J34541P8511n59166l46534L02318
11009b11260j97538l78502K06102J22021o3890J25515j57289M34488L12891L6420
10999B28958n26329k55056K01380K50305l70216j64209L56263o6313j65067P0227
10989d40057L54062j90108k95458K09790L58663J54753n6164Q011j02314m65349
10979d64171Q9304M5186r5516L30083q9708j68802K541k99199o9173M01380L33285
10968A5210J08307l01021j67167r6067L079J5104K02688J38407j47360l65364
10958e94184N22330m3232k7497j70363j59644k14922L08193J4190P4959O2868
10948b27302J37221K5745J09619j06316j41779j8180K02484k26612J62440J63656
$$ y = [-378319, -368220, -182973, 160915, 308449, 179070, 313611, 392122, -167044, -513578, -211260, -408798, -787300, -581198, -459177, -523067, -397552, -554841, -120353, 192538, 228958, -297371, -552427, -351047, -100742, -470958, -635167, -278904, -345217, -510284, -440057, -85995, -276103, -571561, -361771, -3108, 151645, 95481, 103492, 1178, -464171, -374867, -329681, -425197, -95114, -184822, -353624, -351083, -650282, -719455, -318075, 15210, 123517, -177504, -344671, -440738, -437659, -422555, -219867, -81460, -228820, -594184, -71854, -115086, -142583, -312946, -472590, -687512, -379319, -365129, -290170, -227302, -90081, -64336, 45283, -61033, -202812, -220992, -18508, -245120, -82680, 80976]
10938H0976m99961Q6950M00333j1293J72464l71918P7633R3331j8343j16008O3788
10927d2048J09669j93218O0759M2822M5692j11156J38334k84905M9418L74873
10917A90240m1085K9702j68143L0381k8192M6643l27550n92717O50743J26192
10907h3786l68359M47324L22311k10321j82462j44267O8736J0694k63312K79644
10897a23798q0410n09404K99659N64807n65041j97855J64486J73092J74702q7238
10887a87000O1580R6518l90222P0521L14242j09906J30337R2757m39640j26930
10877d87743M09251k42703J55687k56767o0921r6380K20826Q3060k1355j82602
10867d79647J09873O9754L76289l23893R3516J06869R5894q6649K0770j53328
$$ y = [80976, -418985, -332035, 68298, 57005, 229469, -142449, -64816, 28515, 10172, -105836, -42048, 67621, -125597, -64838, -22016, 23676, -87480, 50854, -234051, -184633, 190240, 149155, 178857, 10714, 41095, 12903, 59546, -268004, -860721, -209978, -83786, -452145, -4821, 317490, 107169, -75293, -219560, -150824, -140130, -403442, -123798, -204208, -713612, -413953, 150854, -414187, -612042, -447556, -274464, -99762, -187000, -125420, -28902, -419124, -348603, -34361, -144267, -13930, 78827, -360813, -487743, -78492, -321195, -165508, -422275, -483196, -579576, -358750, -275690, -297045, -479647, -369774, -300020, 76269, -247624, -154108, -47239, 48655, -37994, -17224, -170552]
10857a70552j96886J65141J10973p6019k63157K70165j18228q7147K49204o8534
10847a85040K33407K5342k14792l861j78943L22269Q334j77836L23114K67300
10837D19294o2680o6253m7421N4436j82681m47043J03949N83975J8404j51712
10827B22268l86934k38999n039J9466M51016j25868l08840R579M64164j98521
10817i7708j17700r9428R1286K1559q8183R1174j78550K60192k25432p9810n2917
10806d75517M9105N28211J16481j82379l50840K05155j42599j0151K20566q8968
10796a30936j25389p3021j45279k31942K12468N3424M74894J25528j17065r9278
10786e6596K28324j12963k35211L05324K18779j24680j06370k63717K60757m10955
$$ y = [-170552, -367438, -202297, -91324, -167343, -430500, -160335, -278563, -365710, -116506, -185040, 48367, 73709, -141083, -144944, -323887, -1618, 6716, -171120, 151994, 419294, 356614, 290361, 242940, 297376, 114695, -332348, -228399, 355576, 373980, 222268, -164666, -403665, -408704, -389238, 61778, -64090, -372930, -363351, 100813, -97708, -215408, -314836, -223550, -201991, -290174, -199000, -377550, -117358, -342790, -422600, -475517, -426412, 101799, 218280, 35901, -314939, -109784, -252383, -262534, -41968, -130936, -256325, -329346, -474625, -706567, -494099, -440675, 34219, 159747, 42682, -56596, 171728, 58765, -176446, 128878, 347657, 222977, 116607, -147110, 113647, -297308]
10776b97308M5123M47842r2888l97297l3067p1303P2658J90768j07507K61021
10766A8042k60439k37353j91712p8547J99966L90308J43260P1017j74256O7887
10756e1827j3623Q8931k35033R4332O8173j86545J20572J35710k52393J06542
10746a25161n1680k78848n6650J14821J1460n87359M11082o2287K08407L43111
10736g3104j64886K24692l60858p0853J2551l4532N28486j61752j06824K82478
10726G5398o3155l63102q666Q4202L4945P6003l9017J99846K97448r1504j45713
10715E6685j95972k2598k8277O6912M7515o4313K7276L43343l72586j44434L69999
10704H3550K32947n087n4215k28072j0314k099j03298l08757L367M56908k25766
$$ y = [-297308, -252185, 195657, 102769, -294528, -327595, -398898, -326240, -135472, -242979, 18042, -242397, -479750, -671462, -750009, -550043, -159735, -16475, 54542, -119714, -51827, -65450, 23481, -211552, -117220, -49047, -235592, -115020, 20690, -231703, -125161, -176841, -455689, -512339, -397518, -386058, -973417, -562335, -624622, -416215, -73104, -237990, -13298, -374156, -445009, -432458, -466990, 61496, -100256, -207080, 75398, 12243, -350859, -359525, -275323, -240378, -164375, -203392, -3546, 293902, 202398, 56685, -139287, -161885, -190162, -123250, -75735, -140048, -112772, 230571, -142015, -286449, 83550, 316497, 311410, 257195, 29123, 18809, 16710, -86588, -395345, -391978, 64930, -160836]
10693a60836K6946k12050j04003M87621k89453N4317P7717J91939k39836j67094
10683c34732M62601K55929l74107J934K576j19486N4349k20505J98281j42399
10673b15559J19124p5050K12684j6390k34741J30685R8371J22744k70340j57969
10663b86441O16159J81813k74528m21180l1459k99107j43411m8745L15930J65907
10653b25062k6171k16596O8322k14367K33242j7974J1298J74051j49289J22283
10643b40263k52845j20980K1687L40275L4938Q3557k04119L2101J25723j57279
10633c37205J6933J16612j71960K3312R8083l7102K14242P6997k1990j36029k56359
10622d14466n85225M40712L32777o2431j88846J80877M76214j19530j44185j26004
$$ y = [-160836, -133890, -345940, -449943, 37678, -251775, -197458, -119741, 72198, -167638, -334732, 127869, 383798, 9691, 11625, 14201, -105285, -50936, -271441, -73160, -215559, -96435, -171485, 41199, 24809, -209932, -79247, 19124, 141868, -128472, -286441, 329718, 511531, 237003, -184177, -215636, -514743, -658154, -706899, -390969, -225062, -251233, -467829, -399507, -613874, -380632, -398606, -387308, -213257, -362546, -240263, -493108, -614088, -592401, -252126, -217188, -133631, -337750, -305649, -179926, -337205, -320272, -203660, -375620, -352308, -254225, -291327, -77085, -88, -22078, -158107, -414466, -999691, -558979, -226202, -288633, -477479, -296602, 179612, 60082, -84103, -210107]
10612b10107J02835J12402l99874k15852J94904J91157P803n9302p6145j83279
10602e35458J06008j34744L91635M1449J19081L57055k10534m51638l7876L17229
10592c7793R4583J19046m46194j12342M5527M9356K58062J6292k24996j4822K5777
10581b27504r2250n3331j63183J73009k7296j94847J08447K5706J84595J40630
10571a26024j91510L16138J62027J78889J29346q0582m03543R9188J31016j41275
10561G3670J74627k38673j72146l5685j7654k2933K9316K52942j7275l82108q2647
10550d38566l4324J19413K29116m4250L95612K8803k44298n08453J79734L33817
10540A6604j83645o1905m9149j94869K4673L61826l34607O1311M1012Q0031j19053
$$ y = [-210107, -107272, 5130, -394744, -610596, -415692, -224535, -216732, -276034, -352179, -535458, -429450, -564194, -172559, -131110, -12029, 345026, 134492, -317146, -355022, -37793, 56790, 175836, -270358, -382700, -337173, -287817, -29755, -13463, -238459, -253281, -227504, -319754, -373085, -536268, -363259, -390555, -585402, -476955, -451249, -266654, -126024, -317534, -1396, 160631, 339520, 468866, 388284, -15259, 83929, 214945, 73670, 248297, 9624, -162522, -198207, -215861, -238794, -209478, 43464, 26189, -355919, -438566, -472890, -353477, -124361, -168611, 227001, 255804, 11506, -496947, -317213, 16604, -167041, -228946, -278095, -472964, -448291, -86465, -421072, -359761, -318749, -238718, -357771]
10529c57771j55358J98433P9699J82340J33926n0115L03317J98869k27407j60367
10519A45566m58554j02787J6193K24775M3925j27511R8704K04994K7314j90168
10509a17549j47320K69491L34766l61737m53513l6081J14388J34635M7662k12807
10499d28065M15389k23205J73115m1490k76795L33513j215K0876k48039J7353
10489b58563j02902M13321J8670j39413K21168K4930j72549j62946J72974j24719
10479a10029k04022N5585R7551J75001M45931J49729l47642n50057J6701J1970
10469b59282K3649J7382k6322M557K48372j03790K65112L6669l77875O6724L0080
10458g4724k56344j0368N85427q4849j13847m9122k17499L43013j89419J31644
$$ y = [-357771, -513129, -314696, -234997, -52657, 81269, 31154, 334471, 533340, 305933, 145566, -312988, -415775, -399582, -174807, -130882, -258393, -159689, 45305, 72619, -117549, -264869, 4622, 339388, -22349, -475862, -511943, -397555, -262920, -215258, -428065, -12676, -235881, -62766, -104256, -381051, -47538, -48753, -27877, -275916, -258563, -361465, 51856, 70526, -68887, 152281, 177211, 4662, -158284, 14690, -110029, -314051, -258466, -160915, 14086, 460017, 609746, 262104, -287953, -271252, -259282, -235633, -218251, -244573, -240016, 8356, -95434, 169678, 206347, -171528, -104804, -74724, -331068, -341436, 243991, 159142, 45295, -3827, -221326, 121687, -67732, 63912]
10448F3912M9496j06878k59189l04080K35205k57143K65103L88387j44411k03276
10438b72874K17855k32525L52543k12911M72472j03399l17549l45855K99351l1648
10428a74540j5774K55415m16405J58362K19612j75440Q677k26170o7548k62645
10418f96456K53504N51712J6889m0895o7252k28304k86931L92368M3524j09895
10408a71736Q0617M4022K69841N2282o02042J68479K7475j41891J28238L09576
10398A64861j0793j99797l72340K83754P6625k08674l51224M87658K1793J94238
10388H6101K00435n59714P7323L19942j05435p8689j73240P2534n25397J55777
10378e30363N34685M63779o01782j57795J25784M8183j25449j00330L51905M8730
$$ y = [63912, 113408, 6530, -252659, -556739, -321534, -578677, -313574, 74813, -69598, -272874, -55019, -287544, 64999, -147912, 324560, 221161, -96388, -442243, -142892, -174540, -190314, 65101, -351304, -192942, 26670, -148770, -140093, -366263, -433811, -696456, -442952, 108760, 125649, 84754, 17502, -210802, -497733, -105365, -61841, -171736, -91119, -47097, 222744, 275026, -327016, -158537, -131062, -272953, -144715, 164861, 154068, -45729, -418069, -134315, -57690, -266364, -617588, -129930, -108137, 86101, 286536, -273178, -195855, 124087, 18652, -60037, -233277, -160743, -686140, -530363, 4322, 468101, -133681, -291476, -165692, -117509, -242958, -343288, 8617, 57347]
10368E7347q507M8815J53390j34095j33411j32945j45093K7192N06110J29180
10358C67983L6104r9418l99008M27994n06525k53830N7229K26878m3027J22209
10348f3411J21155k14113k80698k57872K9979L51223L44049J53880J10585m23439
10338a28662M833o82807k5006K18442K96568Q2162K85954j96194J58135j62906
10328a49481J19762o5491L04844J23852k54924k19737k10038k18738L25340N9581
10318a85030J7471J16931k01159L61365N7232J06031J23087k19031q9768j2407
10308G4722j18901n9265j5497K95289K94106k71963P9802j22335j03811J26155
10298A78302k01839k38298L85953J23871m24425j7313K21590m05291K05323J11091
$$ y = [57347, 48840, 97655, 251045, 116950, -16461, -149406, -294499, -267307, 238803, 367983, 404087, 304669, -94339, 333655, -172870, -426700, -369471, -142593, -185620, -63411, 57744, -156369, -437067, -694939, -664960, -313737, 30312, 184192, 294777, -128662, -123829, -806636, -831642, -613200, -316632, -234470, 51484, -144710, 13425, -149481, -29719, -95210, 209634, 333486, 78562, -141175, -351213, -569951, -244611, -185030, -167559, -50628, -251787, 109578, 166810, 272841, 395928, 176897, 87129, 74722, -44179, -103444, -118941, 176348, 470454, 198491, 278293, 155958, 52147, 178302, -23537, -261835, 124118, 247989, -176436, -193749, 27841, -377450, -172127, -61036]
10288f1036J3877N8522L43936k15957l14925j76175N7536J0703k29847K90426
10278b22940J93565j03654k15214R7710J95810J93455K13453P8607j87437k19851
10268B3504k77640J82240l11184O1759K54144N303j14058L08038p2844m27288
10258c68026j13166K65030K37755J5759P4907k68620l55219Q1000J00021l8586
10248c69145J67432K2820P8927K46965j07093j23107k29595J01560k67954j10735
10238e89925J65042L9570n52500M18918L75941k81299O1521K94287k61358J43306
10228a86497M24033K24157j85769j28290k13394q0913j97029K14188j78823J27523
10218a80814M67429M6764M1687k12690n04442J69956M043r8266L38501m52870
$$ y = [-61036, -47159, 11363, 355299, 139342, -175583, -351758, -294222, -283519, -513366, -222940, -29375, -133029, -348243, -250533, -54723, 138732, 352185, 430792, 243355, 23504, -254136, -71896, -383080, -321321, -67177, -61874, -175932, 132106, 59262, -368026, -481192, -216162, 21593, 37352, 112259, -156361, -511580, -430580, -330559, -369145, -201713, -178893, -99966, 146999, 39906, -83201, -312796, -211236, -479190, -589925, -424883, -385313, -937813, -518895, -142954, -424253, -362732, -68445, -329803, -186497, 237536, 461693, 275924, 147634, -65760, -146673, -343702, -129514, -308337, -180814, 286615, 333379, 375066, 162376, -342066, -172110, -168067, -266333, 72168, -380702]
10208c80702p6695K08463R3077j34762K40102K86744j18966k82248J76529j00651
10198h9109J34448J28909j41957k92899K67646m76675j37122O22153K322n4070
10188c6354j41894k60321L14757J61153k62382J53814k98084m65965L83600J90942
10178b60734j89422j29602Q0466K15011j67337k8080j4131L16320K71206p3240
10168B0457l2773K84220O1683l78145l89863j11770Q5319Q1352L95686p6749K76402
10157B15819j84047O8075q5054m13255N16321J26710K04087l67779k49163L04286
10147A36000j33422J70307L09176n06604j29754O65349j30103m51668l01461L05468
10137f6712p9881N3497J411J43187k14752m7303K49554M20514l98438m9745J58661
$$ y = [-380702, -457397, -248934, -155857, -290619, -50517, 236227, 117261, -164987, 11542, -89109, 45339, 174248, 32291, -260608, 7038, -469637, -606759, 15394, 17716, -36354, -178248, -438569, -123812, 37341, -225041, -71227, -369311, -835276, -451676, -260734, -450156, -579758, -499292, -284281, -451618, -479698, -493829, -177509, 93697, 20457, -12316, 271904, 333587, -44558, -434421, -546191, -460872, -379520, 16166, -60583, 215819, 31772, 99847, 14793, -398462, 117859, 244569, 448656, 80877, -168286, 136000, 2578, 172885, 482061, -24543, -154297, 511052, 380949, -70719, -372180, -66712, -146593, -93096, -91685, 51502, -163250, -210553, 39001, 459515, 61077, 11332, 169993]
10126A69993k02086r9198O791p3431p243L40619n0755j67437J79513K8783j43470
10115a7921K35940J199j72896l22395L90013K60937J64450j39589j69809o07294
10105c77365K74421j23980M1349k62347J54362K26096o28598L53996N6102M43618
10095A57654m2970k2219j07028O566j19384J32177J5206j96986J87349J16455
10085A26820K14394k03775k20785K67593M3147k78562r651n9044L1854n4801J11995
10074c0815J2664Q5597n0845J15482m49400M19985j11009M55L4102o5927J25747
10063H6036k47354Q41O8953J61403j4336P1681J46079n1714j44058r0160J04623
10052I1994R9378j38031J53799p1189k00151p9359N2654l19187J68260M21896
$$ y = [169993, -32093, -131291, -124500, -197931, -205174, 135445, 84690, -82747, 96766, 125549, -17921, 218019, 219218, 46322, -276073, 113940, 374877, 539327, 399738, 229929, -377365, -102944, -226924, -185575, -447922, -293560, -67464, -696062, -342066, -285964, 157654, 114684, 92465, -14563, -7997, -127381, 4796, 20002, -176984, 10365, 126820, 341214, 137439, -83346, 184247, 227394, -51168, -60819, -119863, -88009, -142810, -30815, -18151, 67446, 16601, 132083, -317317, 102668, -8341, -7886, 26216, -39711, 86036, -161318, -160477, -91524, 69879, 55543, 127224, 273303, 221589, 77531, -12629, 91994, 191372, 53341, 207140, 135951, -64200, -143559, -90905, -410092, -241832, 180064]
10042A80064k47783J10930j33610K49816j51707k41449L51537k17926M9849r8535
10032a48814j96554j34621M48852M63118N2776m42733m7999q285J39766l0415
10022I5091L52731J75738j064j51242n05819K10026R2712k80820J21755o5396
10012D3712k15841q3805M54996K20515o4613k75889m57150K07148P6449j8189
10002a12667j70191M50243J64139j47189l75290L22362q2402o9770K73638p2627
9992A80246K66035l78385k8716M5166N0266l78918n080J27491J71077j95029K1107
9981a24740N11117K5429o7091P1746J64911k78579m66494O620L34839k42872J37896
9970G2782Q8962K6424O476o3503R5773j23007O2912J57399K9723m72688j32225
$$ y = [180064, -67719, 43211, -90399, 159417, 7710, -233739, 117798, -100128, -50279, -148814, -345368, -479989, -31137, 431981, 484757, 42024, -5975, -14260, 125506, 95091, 447822, 623560, 622496, 471254, -34565, 175461, 268173, -12647, 109108, 43712, -172129, -255934, 199062, 419577, 354964, 79075, -378075, -170927, -94478, -112667, -282858, 167385, 331524, 184335, -190955, 131407, 49005, -20765, 252873, 180246, 446281, 67896, 39180, 84346, 134612, -244306, -249386, -121895, 49182, -145847, -124740, 386377, 411806, 344715, 416461, 581372, 302793, -163701, -157081, 177758, -65114, 72782, 161744, 188168, 194644, 131141, 226914, 103907, 166819, 324218, 353941, -118747, -250972]
9959b50972K22100P3242L22491k25801j24240J17222q23j8563j22808L06629P768
9948C06245m93667k54429R7409M18014J89403m27309j92281Q6830j61643J99352
9938b32076K17207Q1060L46876m3317m42326p5739j8864L8259K11904R0711n7572
9927A16123P2100k81517K67980Q7859p6481l86024o0478L57942q9318J34090J46299
9916B88575M9086j42897J0044J40749k32503k38212L74597j93566J188k41634
9906a84573j95694M01432M68394j59947M27K13597k16251L05042l69554J606m47889
9895a83410J27748k18937J69244N94550q8873j22033m07927j44641J03024L25743
9885A54488l17223L94219l60475p6918j33741O5582Q3699M25745M6593l24136
$$ y = [-250972, -28872, 44370, 366861, 141060, 16820, 134042, 133219, 114656, -8152, 298477, 306245, -187422, -441851, -344442, 73572, 262975, -164334, -356615, -269785, -431428, -232076, -14869, 66191, 413067, 369750, -72576, -148315, -167179, -128920, 82984, 173695, 116123, 188223, -93294, 174686, 262545, 186064, -199960, -260438, 97504, 8186, 142276, 288575, 337661, 194764, 204808, 345557, 113054, -125158, 249439, 55873, 57061, -184573, -380267, 21165, 489559, 329612, 330039, 543636, 327385, 632427, 262873, 264479, -183410, -55662, -274599, -105355, 489195, 400322, 278289, -129638, -274279, -171255, 154488, -162735, 231484, -128991, -205909, -339650, -274068, -190369, 235376, 281969, -42167]
9875d2167j204M87150m3986R5976j46441p9746N5947n61365M33992K677l85478
9864a84645K56410P0332j65632K67128k12970k14498L61346j65104j97019M01082
9854B16430N494p7146Q6390k13241m76331L59477K55978l48437R0664K27011l72215
9843b45926K5422J31688m75209K65619J55084p6260Q2667K60182m7864k20713
9833a45310P1028N6730M45020k73097J40429r8039L2118l8377O7137k41652j89891
9822a73904L09082K02096k74179K21040k3419m6201J10079l87076k46185K5419
9812b83248p9028J85478K73427K3301o07961J10524K65843L29311L2108k56991
9802g236J47336O4321m27538J30699K41189J09174k22055j08301L05023j66167
$$ y = [-42167, -43371, 443779, 399793, 495769, 349328, 269582, 325529, -235836, 198156, 200833, -184645, 71765, 142097, -23535, 243593, 30623, -183875, 177471, 12367, -184652, 216430, 221924, 144778, 231168, 17927, -458404, -98927, 157051, -191386, -100722, 126289, -245926, -220504, -88816, -564025, -298406, -143322, -219582, -136915, 123267, 75403, -145310, -74282, -17552, 427468, 154371, 294800, 196761, 228879, 190502, 257639, 15987, -173904, 135178, 337274, 63095, 284135, 260716, 214515, 324594, -62482, -308667, -283248, -362276, -176798, 96629, 119930, -488031, -377507, -111664, 217647, 249755, -7236, 140100, 204421, -223117, -92418, 148771, 257945, 35890, -72411, 232612, 66445]
9792F6445J07594j00242J33026j94821J27978l89155o4973L72140j3236k99358
9782b54602P89585n08758m9510L12748k51580L41318R5404j20474k51846J83785
9772B86070r8001k89363J99275P2654L60897K183m89975k03889R9670k2212J81438
9761I8747j62l97719J80615M80192J99085k5389K2417j2309j98767m26842k40636
9750c20768L85114P7349j24917m9114j09848K65148K61734k03979k06235m51625
9740d77141L14943L86518k42459k09619j15676O08656R9222L7650K19376l13450
9730C08020M8300m5259J05547j29902J18708k0348j41275L7989q4555n0259r8729
9719D8237k03597M5658N35899j02285M9011k40223j30179L62501L36902k14983
$$ y = [66445, 174039, 73797, 206823, 12002, 139980, -249175, -314148, 57992, 44756, -254602, 534983, 26225, -23285, 289463, 37883, 379201, 474605, 354131, 102285, 286070, 188069, -101294, 97981, 170635, 531532, 533715, 43740, -160149, -60479, -82691, 98747, 98585, -299134, -118519, 361673, 560758, 535369, 557786, 545477, 346710, -80132, -320768, 64346, 141695, 16778, -32336, -142184, 122964, 384698, 180719, -25516, -477141, -162198, 224320, -18139, -227758, -343434, 265222, 364444, 402094, 621470, 308020, 356320, 311061, 416608, 286706, 405414, 385066, 243791, 281780, 197225, 146966, 48237, -155360, -109702, 426197, 323912, 372923, 132700, 2521, 365022, 701924, 486941]
9709D86941J83587K48640k22492q3825M3714m26274J43583j23846J60230L18421
9699G28679j51272j69331j32014J70460k94558m2008J32567l76681J20712L55108
9689C41662m8191l14150p0989J39623K89059K18354n258j45412m00769K78038
9679B81967o4478k56911Q5903K36761J99346j7267O5431J84062j37885j88864
9669C88065n39951J33766R875Q9385K11599k00316L89717j11075k17975k9793
9659A23297r6929J8090J49139N19733p5246j93619p9245K49144n30176P7127M70017
9648F31332J2959N16543k0507N7740k69055j9389j15892M57508j8343J31438K68889
9637A633223k00522j29619Q7327J54819J54204J1944J59910m70684P7977k19506
$$ y = [486941, 670528, 919168, 696676, 612851, 656565, 230291, 373874, 250028, 410258, 728679, 577407, 408076, 276062, 446522, 151964, 109956, 242523, -134158, -13446, 341662, 293471, -20679, -91668, 47955, 337014, 555368, 550110, 404698, 3929, 281967, 217489, -39422, 46481, 283242, 482588, 465321, 530752, 714814, 576929, 388065, -151886, -18120, -8245, 81140, 292739, 92423, 482140, 371065, 153090, 123297, 26368, 44458, 193597, 713330, 638084, 444465, 365220, 614364, 84188, 161315, 631332, 644291, 1160834, 1140327, 1198067, 929012, 909623, 793731, 1251239, 1232896, 1364334, 1633223, 1432701, 1303082, 1390409, 1545228, 1699432, 1711376, 1871286, 1400602, 1478579, 1259073]
9627A259073K7173J64594l25937k57199m977M77363M48980J30058m92897J97369
9617A623600L02771k12894M57648k40453j19328Q3366M05707N15085k57689J4229
9607B572042M05698N77161J70263M30339O72254J256248J041212J061211k07679
9598G978749j065547j126327r25462q50540q58890K1716q9893o17488P1056j79250
9588B358124J34315o0802m99231m9514J1650K04719m91430o21073k30877L43641
9578A099522K27215l48240j91982J65579O4442j83767K00477k53544l28448K9530
9568D80784M79210k15085N4980L8916j49144K9748k8964K48491q5624r57J48552
9557A000907l53969j24086k01884K80998l49785O3031N68852N274j29124m55435
$$ y = [1259073, 1286246, 1450840, 1124903, 867704, 862727, 1340090, 1789070, 1919128, 1426231, 1623600, 1926371, 1713477, 2171125, 1930672, 1811344, 1894710, 2300417, 2815502, 2557813, 2572042, 2977740, 3554901, 3725164, 4155503, 4827757, 6084005, 7125217, 8186428, 7978749, 6913202, 5786875, 4861413, 4010873, 3151983, 3173699, 3083806, 2466318, 2537374, 2358124, 2492439, 2431637, 1932406, 1882892, 1894542, 2099261, 1607831, 986758, 755881, 1099522, 1326737, 978497, 786515, 952094, 1016536, 832769, 1033246, 779702, 451254, 480784, 959994, 744909, 799889, 838805, 689661, 719409, 690445, 938936, 853312, 852355, 1000907, 646938, 522852, 320968, 601966, 252181, 315212, 884064, 889338, 760214, 304779]
9547C04779L54712J28804k79813j68326j05366M79665L01523k7358j16844n99556
9537B72220j31947J64913K58546l6466Q3744N3221j01726K02495K80750j39604
9527I06146P6471J6228M1080p5860j61496l6056l56668J08294o0975P4352K61839
9516G93355M1092K87216n2861j58437K97426j20257k627K5068l00640J76837r4801
9505H91371J025K13089N5857j73528l47971r6449j08335R6319K13835O6851R4410
9494I06474j5069K86555j27815J28954m7625J86659j98323q9006O56855m97243
9484A190416j10871K7299J42592M7779l7507J5352M81008k41585k65799L81411
9474A630095R5740j72452L3767L32190K55876l17288j87577M23308j48501j18697
$$ y = [304779, 659491, 788295, 508482, 340156, 234790, 714455, 1015978, 988620, 871776, 272220, 140273, 305186, 563732, 527266, 611010, 664231, 562505, 765000, 1045750, 906146, 982617, 998845, 1039925, 964065, 802569, 766513, 409845, 518139, 457164, 531516, 793355, 834447, 1121663, 1068802, 910365, 1207791, 1087534, 1084907, 1109975, 809335, 986172, 891371, 892396, 1105485, 1161342, 987814, 639843, 543394, 435059, 531378, 745213, 812064, 906474, 891405, 1177960, 1050145, 1179099, 1131474, 1318133, 1119810, 1030804, 1687659, 1190416, 1079545, 1106844, 1249436, 1297215, 1259708, 1275060, 1756068, 1514483, 1248684, 1630095, 1725835, 1553383, 1587150, 1919340, 2175216, 1857928, 1670351, 2093659, 1945158, 1826461]
9464A826461j04540K03452m0785k33774J628L66473k35471K50186j7009J79979
9454B196600L31139k19243j06307n0313K74891J33612o6670J68228L53426k06689
9444B808674k08444r04j24712O7600k2113J83843n55941L49682J26263M84383
9434C108331M77562n15179o73423N6210j05946O3499L84562l75195n1601k1476
9424B347344j40623L01775M41232k62221k29451k70621K97217l4563N4150k13872
9414B290367J95188R1689J5418K93542J54688N7851L8748l65533Q5566J26099
9404B983623q3956N0936M16146j64247Q9118L98334m1157j26145o7935K85386
9394C740103N3820k67633Q2546O0222l9835j57190l7962k6659K64705J4944Q8869
$$ y = [1826461, 1721921, 1925373, 1884588, 1650814, 1652442, 2018915, 1783444, 2033630, 2016621, 2196600, 2527739, 2308496, 2202189, 2151876, 2426767, 2560379, 2493709, 2661937, 3015363, 2808674, 2600230, 2599326, 2474614, 2542214, 2520101, 2703944, 2148003, 2497685, 2623948, 3108331, 3585893, 3070714, 2397291, 2453501, 2347555, 2411054, 2795616, 2420421, 2368820, 2347344, 2206721, 2508496, 2949728, 2687507, 2458056, 2187435, 2484652, 2450089, 2504239, 2290367, 2485555, 2577244, 2592662, 2886204, 3040892, 3098743, 3137491, 2771958, 2857524, 2983623, 2899667, 2950603, 3366749, 3202502, 3291620, 3689954, 3648797, 3522652, 3454717, 3740103, 3793923, 3526290, 3608836, 3669058, 3629223, 3472033, 3434071, 3407412, 3672117, 3687061, 3775930]
9383C775930j50841j27799J89271j3985j17911N7378J92680L1962P92348m07635
9373D221398j31813J54174R6956Q100k6717l4926j00045j72878M05520J86231
9363D606000M3262O1182k80641N53157l4085O5721M0175K23253L43192L6007K01269
9352E858492M24614M97834R2873n827k54696N79980J08175k14454j27174K55134
9342G214951K10009Q7911L44895J15765N48523J95089j26822J02813M67589M53451
9332I614174J44746k76833n0526k19278M03162K99807P45302M99279J72021L89798
9322A1721652J71358L24065R3304O10904N43724J43821M95044O12138M76727M40518
9312A5633255M75705M43596L57780N06756M96541K14154K86230P14495P01507
$$ y = [3775930, 3625089, 3497290, 3686561, 3672576, 3554665, 3612043, 3804723, 3836685, 4629033, 4221398, 4089585, 4243759, 4340715, 4348815, 4322098, 4287172, 4187127, 4014249, 4419769, 4606000, 4649262, 4710444, 4429803, 4982960, 4948875, 5014596, 5054771, 5278024, 5621216, 5657223, 5858492, 6283106, 6780940, 6873813, 6867986, 6613290, 7193270, 7301445, 7086991, 6959817, 7214951, 7424960, 7512871, 7857766, 7973531, 8522054, 8717143, 8590321, 8693134, 9160723, 9614174, 9758920, 9482087, 9431561, 9212283, 9615445, 9915252, 10660554, 11159833, 11331854, 11721652, 11893010, 12217075, 12310379, 12921283, 13465007, 13608828, 14103872, 14716010, 15192737, 15633255, 16108960, 16552556, 16910336, 17417092, 17913633, 18127787, 18414017, 19128512, 19830019]
9303A9830019Q10793Q74211M70513O66362R53367P40250J369086Q76515J074571
9294B7665687J018228J449386J436470R86012J425471K114083J791519J469124
9286C9355980K184164K190606K629139K953917L284800L639141M359057N075037
9278F5671841N654569P048216Q653855R924738J2181255J4056840J6255138J6870947
9270A56317399J6407016J2136284O436417J122505j191954L24438K266930L328170
9262A97147205L64865n159776j1075749j5689167j6158245j3968406j1567795
9255A23892932q153144n959532m279434l364892k726011k182899j187081m13931
9247I5626008K45915P07257P32373J143374R37505J343260J763917K990967M835470
$$ y = [19830019, 20640812, 21515023, 21985536, 22651898, 23605265, 24345515, 25714601, 26591116, 27665687, 28683915, 30133301, 31569771, 32555783, 33981254, 36095337, 37886856, 39355980, 41540144, 43730750, 46359889, 49313806, 52598606, 56237747, 60596804, 65671841, 71326410, 78374626, 87028481, 96953219, 109134474, 123191314, 139446452, 156317399, 172724415, 184860699, 191297116, 192419621, 191227667, 191552105, 193819035, 197147205, 197512070, 192352294, 181276545, 165587378, 149429133, 135460727, 123892932, 115739788, 109780256, 105500822, 102135930, 99409919, 97227020, 96039939, 95626008, 95871923, 96579180, 97311553, 98454927, 99392432, 100735692, 102499609, 105490576, 110326046]
9238A10326046O646159Q198293J0511576J3665090J5976229J8898157K0595934
9231B04817484J9172741J4502603P872828R57229k704157l796281n823810j0639489
9223B24359148j6240868k1557497k3341851k1765914j8644068j5486594j1492691
9216I5829665q916180p579941o343182n256843l988491l953175l219785l424293
9208E3147775l177839j799897j723991k238792j619257j491212j389304q30845
9200C8876638j212700j593626q98750j017624r48778p80240j351268p23478q83322
9191B9466852o45821n62552p31054p51946o79213p41920m08578l27888p72409
9182B3845471p36982m64223j32001m30857o17391j74211R2569j35956j79227l38285
$$ y = [110326046, 116972205, 125170498, 135682074, 149347164, 165323393, 184221550, 204817484, 223990225, 238492828, 246365656, 247322885, 244618728, 240822447, 234998637, 224359148, 208118280, 186560783, 163218932, 141453018, 122808950, 107322356, 95829665, 86913485, 79333544, 72990362, 67733519, 63745028, 59791853, 56572068, 53147775, 49969936, 48170039, 46446048, 44207256, 42587999, 41096787, 39707483, 38876638, 37663938, 36070312, 35171562, 34153938, 33205160, 32424920, 31073652, 30350174, 29466852, 28821031, 28258479, 27527425, 26775479, 26096266, 25354346, 24945768, 24617880, 23845471, 23108489, 22644266, 22512265, 22081408, 21464017, 21289806, 21382375, 21246419, 21067192, 20728907]
9172B0728907R0183p3196l32752J7150M23431l27125k38454M779K10786k42875
9162B0260834k11563K32204m20247k24840O45208J87346K23039L04446j56339
9153B0840088R1047k10809L61237L84070o8879n0746L28198Q3058K74135Q7013
9143B2118412k48519K66974M52436K92082J48035O54259J72877M37578Q04486
9134B5098620L28323M33690Q38933Q21009J038620j59305P59005Q53005J265181
9125C1277081J524538J182604R88159J749787J918984K088311K702974K830286
9117D6262724L382964M059271M694520N492146O679941P501757Q563962Q221956
9109I4859241P038751L939082J431157m09790o64750M56159O58751n59915l671184
$$ y = [20728907, 20819090, 20745894, 20413142, 20430292, 20853723, 20526598, 20288144, 20292923, 20503709, 20260834, 20049271, 20281475, 19861228, 19636388, 20281596, 20468942, 20691981, 20996427, 20840088, 20931135, 20720326, 21081563, 21465633, 21396754, 21346008, 21674206, 21757264, 22031399, 22118412, 21869893, 22136867, 22589303, 22881385, 23029420, 23683679, 23856556, 24294134, 25098620, 25426943, 25860633, 26699566, 27520575, 28559195, 28399890, 29158895, 30011900, 31277081, 32801619, 33984223, 34972382, 36722169, 38641153, 40729464, 43432438, 46262724, 49645688, 53704959, 58399479, 63891625, 70571566, 78073323, 86637285, 94859241, 101897992, 105837074, 107268231, 106858441, 106193691, 106649850, 107308601, 106748686, 103077502]
9100A03077502o457540p177219p150841n258887m032494k575857j774299l37116
9092F8313249K11239L52776M71240J365149J893250K396495L439323L599880M846670
9083H6889271N752954P031100R332553J0512467J2449444J5186178J6919438J8348766
9075A82422171J7027494J2972940Q224956L362300j815599o229715r484822j1073416
9067A95406309r998031p787601o300811p113814r575002j2091383j3015626j1684546
9059A17839495j0192739p880343n845272m655275l216418k545757k049478j323935
9051H0130278l89596P65811J152890K059847K851897M416811N262123P055731
9043A03305792Q544740J0277775J2151052J2209177J0298551N644337P77901l371268
$$ y = [103077502, 96619962, 89442743, 82291902, 77033015, 73000521, 70424664, 68650365, 68313249, 68524488, 68877264, 69348504, 70713653, 72606903, 75003398, 78442721, 82042601, 86889271, 92642225, 99673325, 109005878, 119518345, 131967789, 147153967, 164073405, 182422171, 199449665, 212422605, 220647561, 224009861, 222194262, 215964547, 206479725, 195406309, 185408278, 177620677, 171319866, 164206052, 154631050, 142539667, 129524041, 117839495, 107646756, 99766413, 93921141, 89265866, 86049448, 83503691, 81454213, 80130278, 79740682, 80506493, 81659383, 83719230, 86571127, 90987938, 96250061, 103305792, 111850532, 122128307, 134279359, 146488536, 156787087, 162431424, 163209325, 159838057]
9035A59838057m810929l299648j928243l314086p079798j1234005j4357349j4088665
9027I9725334j2041011r877635q035706o023757m511688m118529l100037l051259
9019D8965712k486846k592547k182274j607800j697368j765052j528175j364426
9011C3741224j049083j315551q59562j212373j041817j002451q44973p38726q54972
9002B4821716p34078n13304p99878l63249k77018o22903m62687n43043j31016
8993B0374540p59754k41108l64433n6321k61891n28682l12059l17062p44052O9086
8983A6858264j23871k82878m52850l33243n40681k70452p354K0920m86253m31725
8973A3949877J55774l54062k02394o7831j5523j10825k13507j68193J33267j6868
$$ y = [159838057, 155027128, 151727480, 149799237, 146485151, 139405353, 128171348, 113813999, 99725334, 87684323, 77806688, 69770982, 63747225, 59235537, 55117008, 52016971, 48965712, 46478866, 43886319, 41704045, 40096245, 38398877, 36633825, 35105650, 33741224, 32692141, 31376590, 30517028, 29304655, 28262838, 27260387, 26415414, 25676688, 24821716, 24087638, 23574334, 22774456, 22411207, 22134189, 21511286, 21048599, 20505556, 20374540, 19614786, 19373678, 19009245, 18952924, 18691033, 18162351, 17850292, 17533230, 16789178, 16858264, 16734393, 16451515, 15998665, 15665422, 15124741, 14854289, 14846935, 14867855, 14381602, 13949877, 14105651, 13751589, 13549195, 13481364, 13465841, 13355016, 13141509, 12973316, 13106583, 13089715]
8963A3089715l66528K19546r0771l18271M7594n60410J83846L29915Q4519P2370
8953A2691525k84359k02419k01765k0833j73771J00615K21079Q4290m44163j54418
8943A1615781N9644m6872k11657R4793K81997L14945K51475k73125K83343K732
8933A2373056p9947J37376m1464L6722L41928K57488J30361j15347L62399L52581
8923A3755153k13450J54132M4040k57684O37740j03502q4947J75430L27630j08332
8913A4326210L00855O79626N19773j8160J27976K71028p0087L85932N82560K55212
8903A7360925j25280P50740Q36035L50946j80219P09576P47709R9646M29122J32820
8893B1112020N6199J25720p1151M40210L15265M2015J31060N01593Q73740Q4286
$$ y = [13089715, 12723187, 12942733, 12851962, 12533691, 12581285, 12020875, 12204721, 12534636, 12619155, 12691525, 12407166, 12204747, 12002982, 11982149, 11808378, 11908993, 12130072, 12214362, 11770199, 11615781, 11675425, 11628553, 11416896, 11511689, 11793686, 12108631, 12360106, 12086981, 12370324, 12373056, 12293109, 12430485, 12389021, 12425743, 12767671, 13025159, 13155520, 13040173, 13402572, 13755153, 13541703, 13695835, 13739875, 13482191, 14119931, 14016429, 13931482, 14106912, 14434542, 14326210, 14627065, 15306691, 15826464, 15808304, 15936280, 16207308, 16137221, 16523153, 17105713, 17360925, 17235645, 17986385, 18822420, 19173366, 18993147, 19702723, 20450432, 20550078, 20979200, 21112020, 21168219, 21293939, 21222788, 21662998, 21978263, 22020278, 22151338, 22652931, 23526671, 23610957]
8883B3610957K98509K46875L74694Q16855M48905M16029P59886O32640Q86188
8874B8491538L12899P25418Q70218J126635J202034O88381P24174Q04728R63154
8865C5909179Q58537R27337P66801Q77838J490068J427451Q87606J117607J468412
8856D5730836J880215J610847J501724J418029K079406K455137K172928J970106
8848F0819228K364149K687628K424252K679462L873433M044017M585319N437725
8840H8915213O713229P317781Q146267R451612J1163573J3110952J4344425J4836492
8832A73999544J3847237J2541428J3121096J4593296J7472506J7381115J0512925
8825B73469147Q1745n908991m435688J407670Q096645J3895019J9009227K0401052
$$ y = [23610957, 23909466, 24156341, 24531035, 25347890, 25796795, 26212824, 26972710, 27605350, 28491538, 28804437, 29529855, 30400073, 31526708, 32728742, 33417123, 34141297, 34946025, 35909179, 36767716, 37695053, 38461854, 39339692, 40829760, 42257211, 43144817, 44262424, 45730836, 47611051, 49221898, 50723622, 52141651, 54221057, 56676194, 58849122, 60819228, 63183377, 65871005, 68295257, 70974719, 74848152, 78892169, 83477488, 88915213, 95628442, 102946223, 111092490, 120544102, 131707675, 144818627, 159163052, 173999544, 187846781, 200388209, 213509305, 228102601, 245575107, 262956222, 273469147, 273550892, 267641901, 263206213, 264613883, 272710528, 286605547, 305614774, 326015826]
8817C26015826J4793330L636557o199452r274209n986615k115005k114936p896666
8809C10858830j6522159k0998685k0031857j4770397r076103l850014J622667
8802B27232282O222645R531740J2436429J3635208J2371537J0806261J1365219
8795C03601321J3012932J1434127M787198o603873j5462063j6958544j3928208
8788B79882890r375777p170857o666135m112400j06372M902648Q316007R565405
8780B75235409P051686J776502l769454o615126o120221m371239l978037o899120
8772B52310400j1711214j5984957j7411652j5869616j2006841p833771l398185
8765A68094164Q3551K766995M731411L684816J5545o484795r679446r089273p044711
$$ y = [326015826, 340809156, 344445713, 338246261, 328972052, 322985437, 320870432, 318755496, 310858830, 294336671, 273337986, 253306129, 238535732, 229459629, 225609615, 227232282, 233454927, 242986667, 255423096, 269058304, 281429841, 292236102, 303601321, 316614253, 328048380, 332835578, 326231705, 310769642, 293811098, 279882890, 270507113, 263336256, 256670121, 252557721, 252451349, 257353997, 265670004, 275235409, 282287095, 284063597, 280294143, 273679017, 267558796, 263187557, 259209520, 252310400, 240599186, 224614229, 207202577, 191332961, 179326120, 171492349, 168094164, 168177715, 170944710, 175676121, 179360937, 179376482, 172891687, 163212241, 154122968, 147078257]
8756A47078257o080565o710347r810932j1091994j1525083r584587p365633o465503
8748G8443613m883162m396711l516823l340429k425241k655215k626812k354758
8740E2244462k183391k077287j426349j647917j595329j326959j352449j366800
8732C9267981j054087j370873q25184r31394j283511o37226q38310r41996j326799
8723C0058601q87874o84922q45113n36098q42149q86550m14765n09058o67918
8714B3784154q75846m44886p64335n12945R9889q20932m02706j32438n79244n36350
8704A8814361n4329j72914j082947q47273j13305J72230l96014l49484o80298
8695A5290027n86075l23467l45543k03061J93172j48688j39960m29736P2646m26933
$$ y = [147078257, 140997692, 134287345, 124476413, 113384419, 101859336, 92274749, 84909116, 78443613, 73560451, 69163740, 65646917, 62306488, 59881247, 57226032, 54599220, 52244462, 50061071, 47983784, 46557435, 44909518, 43314189, 41987230, 40634781, 39267981, 38213894, 36843021, 36017837, 35086443, 33802932, 33165706, 32327396, 31385400, 30058601, 29170727, 28485805, 27640692, 27104594, 26262445, 25375895, 24961130, 24452072, 23784154, 22908308, 22463422, 21699087, 21186142, 21286031, 20465099, 20062393, 19929955, 19350711, 18814361, 18760032, 18587118, 17504171, 16656898, 16543593, 16715823, 16319809, 15970325, 15290027, 14703952, 14380485, 14034942, 13831881, 14025053, 13876365, 13736405, 13306669, 13379315, 12952382]
8685A2952382o35751j89093J15403K3397m21247l08694j41294j65778l13677j98674
8675A0716974k31185r2768j34069k47481k26297j88600j36841j7401k20801k5456
8665I196075l15062j85377k77566P7520o9714k77718j01830K09606k88053k87501
8655G680380J7678j74980j05957l62763k45698k46931j90462J02218j95617k82872
8645E994996N4574k25186L86200K86550k16411m55959O1326Q3403k46145r8447
8635E624901l95327m15602J43421j31579J44176R4822l66279M69907k9331O3861
8625E202970l9809k03606j80085n4588l10949j1344j11866M44922l2063L1088
8615D734670l62606j1854q3237j12435L27313k44744j68430k8299l40588J58670
$$ y = [12952382, 12316631, 12127538, 12242941, 12266338, 11845091, 11536397, 11395103, 11229325, 10915648, 10716974, 10485789, 10393021, 10258952, 10011471, 9785174, 9596574, 9459733, 9442332, 9221531, 9196075, 8881013, 8695636, 8418070, 8495590, 8425876, 8148158, 8046328, 8255934, 7967881, 7680380, 7698058, 7523078, 7417121, 7054358, 6808660, 6561729, 6371267, 6473485, 6277868, 5994996, 6049570, 5824384, 6210584, 6497134, 6280723, 5824764, 5886090, 5969493, 5723348, 5624901, 5229574, 4813972, 4957393, 4825814, 4969990, 5064812, 4698533, 5168440, 5139109, 5202970, 5163161, 4959555, 4779470, 4724882, 4413933, 4402589, 4290723, 4735645, 4703582, 4734670, 4372064, 4360210, 4276973, 4164538, 4491851, 4247107, 4078677, 4050378, 3709790, 3868460]
8605C868460m55942j43471J44120K25087K68523K09058k76806J30200J10299j07458
8595C972070L57022p3733j97487J74596N0635l07899k02099k21294q4467L84140
8585C851484N9623n98760m2889L82256l45946j06693k56088r6602N31809k69240
8575C108954M1557J85461k04165j23762J45096j67993M28670R3323j24094q264
8565C374783k48171r178L11280q6645K49119l63902N22895l70022l71369J50322
8555C159112j63356k43198N77780l13313l26934L07304N4979m63941J31747k60532
8545B459648l06399K2481l2633P9413q2443k58985r2184J26905j30189P3806P23691
8534B583111J74460m00081J81467k22825J16983J17143j72161P5564n2056j4892
$$ y = [3868460, 3412518, 3269047, 3413167, 3638254, 3906777, 4115835, 3839029, 3969229, 4079528, 3972070, 4329092, 4255359, 4057872, 4232468, 4283103, 3975204, 3773105, 3551811, 3467344, 3851484, 3911107, 3312347, 3269458, 3651714, 3305768, 3199075, 2942987, 2846385, 3378194, 3108954, 3150511, 3335972, 3131807, 3008045, 3153141, 2985148, 3413818, 3507141, 3383047, 3374783, 3126612, 3117434, 3428714, 3342069, 3591188, 3227286, 3750181, 3380159, 3008790, 3159112, 2995756, 2752558, 3330338, 3017025, 2690091, 2997395, 3052374, 2588433, 2720180, 2459648, 2153249, 2175730, 2143097, 2222510, 2140067, 1881082, 1788898, 1915803, 1785614, 1859420, 2583111, 2757571, 2357490, 2538957, 2316132, 2433115, 2550258, 2378097, 2453661, 2401605, 2386713]
8524B386713l03935l2316O3423Q5494l95302J78905J3289k91658O476M54356K17745
8513B383190k06750l62017o1473J23606k64523J16485j24435N03379n57717l56438
8503A193307M6926M74905J38533k20560n8338L1898J94859k85097k05259O6198
8493A377372K2849L19672K2999k77599o1290n1644k76272K7553L83171m3388j8964
8482A424459j62149p8674K09807l28438p9516R4127M31567o6745M4304j30003
8472A358739m7264o7154J48740q4255k52216K45677L21807r5133L37244j91800
8462A674385p9998j13548J607j87516m5066J31743K37902M5750K11760K82591
8452B159610j60411J32366K62742M7595j63296j91883j50176M01621m8052J42733
$$ y = [2386713, 2082778, 2050462, 2113885, 2199379, 1804077, 1982982, 1996271, 1704613, 1711089, 2165445, 2383190, 2176440, 1814423, 1752950, 1876556, 1612033, 1728518, 1604083, 2107462, 1549745, 1193307, 1240233, 1715138, 1853671, 1633111, 1574773, 1606671, 1801530, 1516433, 1311174, 1377372, 1400221, 1719893, 1742892, 1465293, 1404003, 1352359, 1076087, 1103640, 1486811, 1443423, 1424459, 1262310, 1183636, 1393443, 1065005, 985489, 1079616, 1511183, 1444438, 1488742, 1358739, 1311475, 1244321, 1393061, 1308806, 1056590, 1302267, 1624074, 1528941, 1866185, 1674385, 1594387, 1480839, 1482446, 1294930, 1249864, 1381607, 1619509, 1665259, 1877019, 2159610, 1999199, 2131565, 2394307, 2441902, 2278606, 2086723, 1936547, 2338168, 2290116, 2432849]
8442B432849p5209n458l06956K57798K90449k9522m24472P8893R8518j78233O4381
8431B203038M6515n338k85645K92909n2677j54705J88403M3168J02542l16143
8421B062067L0401p0923k23218J61478J54460k51769l371K20709L84758N8565
8411B523157p80337J21490J46325o4148p8119K01792K23164P5099l41422L0949
8401B057950m4301j64178K94788p5876l04406k67410R1048m3746R0543j72012
8391A462400m33151K65618L97714J82478k98285l93520J72379k58247o4697J14261
8381A146950j95554n9870K2622K57420J29867j56454l72846n6988K04393M60010
8371A379550n19632j85903o7112l30394L16712N0656j54707J99416O2884j86172
$$ y = [2432849, 2357640, 2352182, 2045226, 2303024, 2593473, 2563951, 2139479, 2218372, 2316890, 2138657, 2203038, 2249553, 2244215, 1958570, 2251479, 2198802, 2044097, 2232500, 2275668, 2378210, 2062067, 2092468, 2021545, 1798327, 1959805, 2114265, 1862496, 1859125, 2079834, 2464592, 2523157, 1742820, 1864310, 2010635, 1946487, 1868368, 2070160, 2293324, 2368423, 2027001, 2057950, 2013649, 1849471, 2144259, 2068383, 1763977, 1496567, 1587615, 1543869, 1634412, 1462400, 1029249, 1294867, 1692581, 1875059, 1576774, 1183254, 1355633, 1097386, 1032689, 1146950, 951396, 891526, 914148, 1171568, 1301435, 1144981, 772135, 715147, 919540, 1379550, 859918, 674015, 606903, 276509, 593221, 643877, 489170, 688586, 751470, 565298]
8361E65298J56701j64585m13253p1758J80096K64699K96051J61432k12018j25513
8351F37150M6007k79692J80795l17777M3015M3496L80996k47053K64251J52420
8341I03608n4474m1064k66991J95336Q6239l6688j55651j15867l9039J50250R9064
8330G24723j70013L92476j97871l3374n2l8357j61324l0923q4705m24826K84539
8319B60293K38620j15261k24604J61846L8382J29780J78074k43090l01581k3457
8309I9002K94625M14902J00281n95680k34754m4910J86170L08665j24589m7638
8299C56074M858P399l88307K0418J58108J91244k61867j47584P7839R4348q8537
8288B3993L76623L00044j00524k83417J61985N8943j29012j43879Q9180K4141
$$ y = [565298, 721999, 557414, 144161, 72403, 252499, 517198, 813249, 974681, 762663, 637150, 683157, 403465, 584260, 266483, 309498, 352994, 733990, 486937, 751188, 903608, 849134, 808070, 541079, 736415, 822654, 785966, 630315, 514448, 475409, 625659, 724723, 554710, 947186, 749315, 715941, 715889, 677532, 516208, 485285, 400580, -24246, 260293, 498913, 383652, 159048, 320894, 359276, 489056, 667130, 424040, 122459, 99002, 393627, 808529, 908810, 313130, 78376, 33466, 219636, 528301, 403712, 356074, 360932, 368331, -19976, 442, 158550, 349794, 87927, -59657, 18182, 112530, 23993, 400616, 700660, 600136, 316719, 478704, 537647, 408635, 264756, 353936, 378077]
8278C78077R320j88062m82R9469j08199o3606k76022K18909p2507J15964J80425
8267B93286l02408J98830K15386K64455j79951l62441M02256j07031k65002J03904
8257B61284n5622j79640j6442K10531O5111k72317K29332J7374n7083K23275k46584
8246A79219J10529Q2953J57566J02227J11412l55735r2619k66992l36683L1051
8236b77072M9589j65268J48933K93469k54097M30475j20650j21364L34948l12244
8226F719L52376n6887j1516j98362j17235K63239n1146o7454K7842k35523k73379
8215c61326o7236P81367K13064l85063K03677o1151J02062J73004O9975k15603
8205D52770j10398k26867L23584K71546M16921j88280J99270k88186M13976j07721
$$ y = [378077, 387397, 199335, 198853, 298322, 190123, 126517, -149505, 69404, -3103, 112861, 293286, -9122, 189708, 405094, 669549, 489598, 127157, 529413, 422382, 157380, 261284, 205662, 26022, 9580, 220111, 285222, 12905, 242237, 259611, 202528, 425803, 179219, 289748, 372701, 530267, 632494, 743906, 388171, 295552, 28560, -308123, -277072, -227483, -392751, -243818, 49651, -204446, 226029, 105379, -15985, 318963, 6719, 359095, 302208, 290692, 92330, -24905, 238334, 187188, 119734, 147576, -87947, -361326, -428562, 352805, 565869, 180806, 384483, 323332, 425394, 598398, 668373, 452770, 342372, 115505, 439089, 710635, 1127556, 939276, 1138546, 850360, 1264336, 1156615]
8195A156615P27283o4685J508332l510083l313015J862340k30383P96156k58794
8186a326234M32016M54349L69734k21614L8153k9668k60465N14305M58894r3484
8176C35986j25990k73481o5577k10725K28779k09012K49151L67743m8833l56189
8166a08148l17071L35644j0853j44466J91544J75053O987l9051J12111k8940K1847
8155A94657k62511K15519l17448n56682K88149o4810N5118J64885k62375M60094
8145h5404K4399K23480k35870J6203l5924j83113p3170k97234N44040J37684J7954
8134E3045r8345P0165l37667l38685j10054L51360Q5218K82720p963J77594j72440
8123d5052l80597K9446k09347N87065k5104j20358j03242m72768M659M11297j24196
$$ y = [1156615, 1883898, 1819213, 3327545, -182538, -3495553, -1633213, -1863596, -1067440, -1326234, -894218, -439869, -70135, -291749, -253596, -283264, -543729, -29424, 429470, 335986, 209996, -63485, -129062, -339787, -111008, -320020, -70869, 296874, 248041, -108148, -425219, -89575, -100428, -244894, -53350, 121703, 128690, 89639, 201750, 172810, 194657, -67854, 147665, -169783, -726465, -438316, -503126, -448008, -283123, -545498, -85404, -61005, 162475, -73395, -57192, -93116, -276229, -349399, -646633, -102593, 35091, 53045, -45300, 24865, -312802, -651487, -761541, -410181, -324963, -42243, -50206, 127388, -45052, -425649, -396203, -605550, -18485, -43589, -163947, -267189, -739957, -735298, -324001, -448197]
8112d48197L7962O42604J01663l5646n24503M65141p0212r216k53007P2869K6726
8101F184J92868l767o3862k80329N5830J5740j48794n7432j58890L34399J8253
8090h9800J53974k54977J83582K74173n3371k9170R6605L05506n39058l27242
8080b79778j33238k66143M57266L069j10159j4945l35418L81575J80014K10268
8070I2511J1586j69572j67270K66552K01103l35412J58816Q0950n4426l88096
8060c03258L93842j11693R3266J1727J50221n1316k9227j4350k61403p2937K55742
8049F0614j20128j52830J50842j8206J86203k55771J11663j63224K5829M17076
8039B42068m0377j62458k95176N91994j14217l57924N87245J15276l17107j07332
$$ y = [-448197, -410235, 232369, 334032, 298386, -226117, 239024, 168812, 159596, -93411, -20542, 6184, 199052, 195285, 131423, -148906, -93076, -77336, -226130, -283562, -442452, -108053, -89800, 64174, -190803, -7221, 266952, 213581, 184411, 281016, 586522, 47464, -279778, -413016, -679159, -221893, -218824, -328983, -343928, -679346, -297771, -117757, 92511, 104097, -65475, -232745, 33807, 234910, -100502, 58314, 139264, 84838, -303258, 90584, -21109, 72157, 83884, 234105, 182789, 153562, 139212, -122191, -195128, 60614, -59514, -212344, -61502, -79708, 106495, -149276, -37613, -200837, -175008, 242068, 201691, 39233, -255943, 336051, 221834, -136090, 451155, 566431, 249324, 141992]
8029A41992M5186j78733J28382k58196L34679j60915N9908p1277j39071L60649
8019B62604k38656J29921j46488K10518K00930j59103K47155K77008o63866P9775
8009A99798k29323J22252p9845l19252M01051o9201l71460L91931K00729j31238
7999A15442l91341k2883R6575R1861j51772n0799J55406M1483j46722J43318L09543
7988A90111j49007K585j21442L11769M5635l35071K59009K66074k19557j12993
7978A37113o0095M019l6694K57481Q4632j98962L89805k06030l25050k35229p8934
7967b67944K14646K50468J19352m92831M4526j37043k87572J34378L0751J84238
7957b07031J81152k49995J32926q5531L38220K87456k29665k51270K93533k18739
$$ y = [141992, 187178, 8445, 136827, -121369, 213310, 52395, 112303, 41026, -98045, 262604, 23948, 153869, 7381, 217899, 418829, 259726, 506881, 783889, 120023, 199798, -29525, 92727, 12882, -306370, 94681, 25480, -345980, 45951, 246680, 115442, -275899, -298782, -202207, -110346, -262118, -312917, -157511, -116028, -262750, -119432, 190111, 41104, 43689, -77753, 234016, 279651, -55420, 203589, 469663, 250106, 137113, 77018, 81037, 44343, 301824, 386456, 187494, 577299, 371269, 46219, -189010, -267944, -53298, 197170, 316522, -176309, -131783, -268826, -556398, -422020, -391269, -207031, -25879, -275874, -142948, -228479, 109741, 397197, 167532, -83738, 209795, -8944]
7947h944J32287m28838J50336J33133l94283L25644O2152q5074k55527K66420
7937a02694J6556j46896M1740k21029k8520L43981P4267q0360j47636j11628k44173
7926f06392L64814L97294n1140r1607m52492L35367J40269k36007j03695k70769
7916e74358L76373K16502k2117K5848P3066J41075l1510l16085J45738J05854
7906A40386n70892l7130J58383L0131J27345n678J49411n1788j65850M06722Q1275
7895B62315n42772j19496k09469J69741L57755J858K97973K10953K5848m09379
7885D5327k72806p5530K33894K7369k79560J75164J24604J84882p0980o8065J76530
7874B00829p87279P0905M76084O9576l37228K8656j12058L584O32458n3111k51343
$$ y = [-8944, 123343, -305495, -155159, -22026, -416309, -90665, -28513, -113587, -369114, -102694, -86138, -233034, -191294, -412323, -440843, -96862, -22595, -102955, -250591, -362219, -606392, -241578, 155716, 104576, 12969, -439523, -104156, 36113, -199894, -303589, -574358, -197985, 18517, -3600, 22248, 95314, 236389, 204879, -111206, 34532, 140386, -430506, -467636, -309253, -279122, -151777, -157455, -8044, -59832, -225682, 181040, 262315, -280457, -399953, -609422, -439681, -81926, -80068, 217905, 428858, 454706, 45327, -227479, -303009, -69115, -41746, -321306, -146142, -21538, 163344, 92364, 24299, 200829, -586450, -515545, -39461, 30115, -307113, -278457, -390515, -386931, 245527, 192416, -58927]
7863e8927L3912J9624J71835j61056n0271K8848J03480Q9668k55744K18520j36586
7852C303k33926J70505J95428k9340K6202l6375n9118L30827n37800K0445L74913
7841B25064n00784J5025r3786r957n0221M21540p2745j15390M26433K30285m05345
7830G0119j52858k2090P5370O6167J5482j88860M9350L52046L29385O8175j56550
7819E05736n49019R9004l39662K6923M14828j13990J8459l461N6812k93085L2209
7808a45246q5579J67458j46924L63424K68715j08845K68257J90529O8458N24477
7798A364724o65705j287746K2885k06937M20803J13835k14115K34462q1784J24944
7788a74634J84835K63115k50135k97464L90816j79306J2718K64416m82495J69878
$$ y = [-58927, -25015, -5391, 166444, 5388, -44883, -16035, 87445, 177113, -78631, 139889, 3303, -230623, -60118, 135310, 105970, 132172, 95797, 36679, 367506, -170294, -149849, 225064, -275720, -260695, -354481, -364438, -414659, 6881, -65864, -181254, 245179, 475464, 70119, -82739, -104829, -29459, 36708, 52190, -136670, -87320, 264726, 594111, 662286, 505736, -43283, 55721, -283941, -257018, 157810, 43820, 62279, 58818, 115630, -177455, -145246, -230825, -63367, -210291, 153133, 421848, 313003, 581260, 771789, 840247, 1364724, 699019, -588727, -565842, -772779, -351976, -238141, -452256, -217794, -299578, -174634, 10201, 273316, 23181, -274283, 116533, -62773, -50055, 214361, -268134, -98256]
7778i8256J23369O6677l5743k72793J82720O0903j19929j39678K86884l47802
7768b93648O6685L0198K91500k27980p231k4719j07378K14785j91698K95873m22312
7757c75925L26253L37808J9944n2263m30558O549j56726K19559k67998m0246K50954
7746a62649J1023J87605K50675k05575m23461P660l2882K32754o1430J10405N9234
7735b6641j32123L72805j06047j33215L89889m65102J44095r5314j77204J28273
7725a00584j9746o3280o420k22476J27767M06605l348j04165O5735P6136k8020
7714A28204L37425j06129m39880K53388j36980j05430m02094J52288q4401J93040
7704b10569R3228K29620N08185n4726k62850n68940O0409J58489j91605j51235
$$ y = [-98256, 25113, 91790, 56047, -216746, -34026, 26877, -93052, -232730, 54154, -293648, -226963, -196765, 94735, -133245, -140476, -165195, -272573, -57788, -249486, 46387, -375925, -49672, 288136, 308080, 255817, -174741, -168192, -324918, -105359, -373357, -413603, -162649, -151626, 35979, 286654, 81079, -342382, -334722, -367604, -134850, -196280, -85875, -26641, -158764, 214041, 107994, -25221, 364668, -100434, 43661, -51653, -228857, -100584, -120330, -183610, -190030, -412506, -284739, 121866, 118518, 14353, 80088, 156224, 128204, 465629, 359500, -80380, 173008, 36028, -69402, -471496, -319208, -403609, -210569, -117341, 112279, 620464, 565738, 302888, -266052, -205643, -47154, -238759, -389994]
7694c89994K23801q7890J68610J29891J96751r5846n299j67977O4009L78840n78745
7683a63849K19213J40389l74060k05397j19788J36865J21105l16995P2960L020
7673d86537j95767O03690J61150Q9820j97940J81547k13830m29714J61402K89246
7663c6933Q4000j82810K26868j27136K74666n52735N203N77786j11199j14900
7653D2810n2835p4493M0750L96858K02710O8783l73693J32560j16088k66380j70689
7642a69707J40980M656j37139j45060m78322K52240M20032J13783K2258k89533
7632b65812N3227J08701k02218j46699l01857K94435M92403j01361J31864k16563
7622a53880n7349L66235N8829j87623n1315j84066k75194k61604O57531M10270
$$ y = [-389994, -166193, -254083, -85473, 44418, 241169, 145323, 140024, -27953, 36056, 414896, -163849, 55364, 195753, -178307, -383704, -503492, -366627, -245522, -562517, -489557, -486537, -682304, -78614, 82536, 172356, -25584, 155963, -57867, -487581, -326179, -36933, 47067, -135743, 91125, -36011, 238655, -314080, -308877, 268909, 157710, 42810, -10025, -84518, -43768, 353090, 555800, 624583, 250890, 383450, 267362, 982, -169707, -28727, -24071, -161210, -306270, -784592, -532352, -112320, 1463, 23721, -265812, -212585, -103884, -306102, -452801, -754658, -460223, 32180, -69181, 62683, -153880, -211229, 155006, 213835, 26212, -25103, -209169, -484363, -745967, -88436, 321834]
7612C21834k14835q3108r6541j0888j98420K10940M71545j75218k85212l3029
7602i2932l27781J00281m0457k17117K66187K81351l4690k80364l6838J47389
7592b34971N72777l49486m39160K35143K80429j03311m5849l25037k17695J93366
7582d33794N29855K32859K28486j47694k34200j85383J3841k06525j24514K42837
7572h4232Q9951j00548o8454O1866j24274J88758K76362r2385k82974M60506k06133
7561A18443o9810K3760k52255k32180P7591K73589n1739P7399j70526K40849L8829
7550G3950Q3294M5645r249J05679J6845j18120m51234R3478J73966r3515j73476
7539b52737L97560k99294K53655l30031k23864O035K75751R4697J35639J9615
$$ y = [321834, 106999, 23891, -72650, -83538, -281958, -71018, 400527, 225309, -59903, -92932, -420713, -320432, -360889, -578006, -311819, -30468, -65158, -345522, -382360, -234971, 337806, -11680, -450840, -215697, 64732, -38579, -84428, -409465, -627160, -433794, 96061, 328920, 557406, 409712, 175512, -9871, 3970, -202555, -327069, -84232, 5719, -94829, -163283, -101417, -225691, -36933, 239429, 147044, -135930, 324576, 118443, 48633, 72393, -179862, -412042, -334451, -60862, -112601, -35202, -205728, 35121, 73950, 157244, 202889, 193640, 299319, 316164, 198044, -253190, -159712, 14254, -79261, -252737, 144823, -154471, 99184, -230847, -454711, -448676, -172925, -78228, 57411, 77026]
7529G7026M44414l26357l76079L6769K48215p9379J6381j32426j45757R3651L38045
7518A94503o128o9049J91582m34472q6024j46458m7961J9090j22455L2201K19971
7507b55200k70375K31918L58865Q103l58561J60370J36807r749j3012L2308j22353
7496a00879j79552j79354K62651J48800l35039M67270P1754o11172j2623J60251
7486c07893J65653N6959J67958m57635j16641K22356K30171p7291K95601k84779
7476a05541J62795K96182j01447J2357j40164J73809j92458p0882k26203M59461
7466B67909p4843n12661k85536p6696J06773j12842K38607L67175K6735m3863
7456i9242J19262m6724j90197o7865K39444K98775R3765k87077o59645L21348
$$ y = [77026, 521440, 195083, -180996, -144227, 103988, 24609, 40990, -91436, -237193, -143542, 194503, 188375, 119326, 310908, -123564, -209588, -356046, -404007, -384917, -507372, -475171, -255200, -525575, -293657, 65208, 73311, -285250, -124880, 11927, 2178, -10834, 21474, -100879, -280431, -459785, -197134, -48334, -383373, 83897, 155651, -455521, -468144, -307893, -142240, -85281, 82677, -374958, -491599, -269243, -39072, -116363, 179238, -105541, 57254, 353436, 251989, 264346, 124182, 297991, 105533, 34651, -191552, 267909, 193066, -319595, -605131, -681827, -575054, -687896, -449289, -82114, -55379, -99242, 20020, -26704, -216901, -284766, -45322, 253453, 347218, 60141, -599504, -278156]
7446b78156N2673k2642L44704l18718L8873K96501J97442l91267k10953r0193
7436c81736K14172K39641k14006j56515j48737Q5005L08823L3259M014J4113P6297
7425G4330m3241K83881l05231P1247M9660j03516j80230j80194K97973p9098P0284
7414d4135j6205l75402j3807M21198K14694j45553j05825J46028n7299k4110k02791
7403b03207K3019J65711m5771K42370j34769l65245K17244J19645n62816Q9179
7393d54640O6926m6850J3429R5944K10002j72420L12277q4504j14402l28844K61775
7382b41307M56097j78284k5101k09326k41914L69380N13834k7187k26384r315
7372A80493Q8752J54223Q4249l95096k3948K12968O2798K35066m66892L0846J24663
$$ y = [-278156, -225483, -248125, 96579, -222139, -183266, 113235, 310677, -80590, -291543, -381736, -167564, 72077, -141929, -298444, -447181, -362176, -53353, -20094, -16080, -1967, 74330, 31089, 314970, 9739, 80986, 130646, 27130, -153100, -333294, -35321, -114419, -44135, -60340, -435742, -449549, -28351, 186343, 40790, -65035, 80993, 23694, -416, -203207, -180188, -14477, -60248, 182122, 47353, -317892, -100648, 18997, -543819, -454640, -387714, -434564, -421135, -325191, -115189, -287609, 24668, -59836, -174238, -503082, -241307, 214790, 36506, 11405, -197921, -439835, -70455, 443379, 416192, 189808, 180493, 269245, 423468, 507717, 112621, 88673, 301641, 364439, 599505, 132613, 163459, 288122]
7361B88122j19253j385l61730J23227J35936j37168j3271J74194k1466k69168
7351b01962K77639j90419j08218j0962j4065k18521J8854L18446J7583k8823J96739
7340E6291P9720j48607J060j82934m67856K5938j5780K74997J21249K26100l44728
7329c74550o9720J9700l09643L33843J06039L14360j20210J38145k11449M5785
7319a27700J81214k16026J90766O3061j16198j77877L23154L44342M8927q4345
7309D29318k21243k99144k24974n2377N2789J1070K1804M5720P2686J10056l55916
7298d10211l412M78574R7972o89988L37645K87009j69622n91751K1137P21052
7288G8405J22989l36741J4359L30851J18457k69637k10990J30307n6417m02320
$$ y = [288122, 168869, 167484, -194246, -71019, 64917, -72251, -85522, 88672, 67206, -201962, 75677, -114742, -222960, -233922, -247987, -466508, -447654, -129208, -111625, -140448, 56291, 136011, -12596, -11536, -194470, -662326, -636388, -652168, -377171, -255922, -29822, -374550, -444270, -424570, -734213, -400370, -294331, 20029, -100181, 37964, -173485, -127700, 53514, -162512, 28254, 91315, -24883, -202760, 120394, 464736, 513663, 429318, 208075, -91069, -316043, -368420, -315631, -304561, -282757, -237037, -164351, -54295, -410211, -413623, 64951, 162923, -527065, -189420, 97589, -72033, -663784, -642647, 78405, 201394, -135347, -120988, 209863, 328320, 58683, -152307, -22000, -78417, -480737]
7278d80737K58600J30910j53294J8484l0898K99026L90019j05565j75797K2807
7268A73555j54931j12248m5162R6907J012K0338m11640M10595J83771J12445J5419
7257B90061q9754n29578l0511j43212J84724J5408N6509K68010o39675L71864
7247b46154O0764N59455J89952m55567l22690o0528J11494O9295M60544K01802
7237E68367n71966k67205L31256J30008k7612j01360J12940J36846L9242p7340
7227B73176l54864Q3987l7600j5339k40019p8550J53537L73526j30249n7185O7223
7216C7643l10655m44518M15602k03482n2180j52693l73748P27416L71751k99208
7206b84072J32542K74773M4346j284m66109M3084J07504J31033J4004k94498M3669
$$ y = [-480737, -222137, -91227, -244521, -226037, -256935, 42091, 432110, 326545, 150748, 173555, 18624, -93624, -138786, -41879, -40867, -20529, -432169, -21574, 162197, 274642, 290061, 200307, -329271, -359782, -502994, -318270, -302862, -246353, 21657, -618018, -246154, -185390, 374065, 564017, 108450, -214240, -274768, -163274, -93979, 366565, 568367, -3599, -270804, 60452, 190460, 162848, 61488, 174428, 311274, 350516, 273176, -81688, 2299, -35301, -50640, -290659, -369209, -215672, 157854, 27605, -29580, 37643, -273012, -717530, -301928, -505410, -557590, -710283, -1084031, -356615, 15136, -284072, -151530, 123243, 167589, 166305, -299804, -256720, -149216, -18183, -4179, -298677, -255008]
7195b55008j39369j32018P50384l70449k57159J69906Q147r9270R7960J04739
7185a22137Q1824Q549j93763K47422J91658m19406J8923J03689j75463k0767K64184
7174a5287J77081K11716p10651J71848K18162l07823K9065K98873J72859m18271
7164a72428k48675M0943M87835N3870q1249L38571j45630k63656o1099l1382J2940
7153f9960J87038o3249J57843P3519J40553n5593k29434l8690l49251K46716j83615
7142a84123j91120k37942M96180r5701m20104K10466M66155J86900j45110j59771
7132g4170j18050O9506K30810L22214J2979l37177n30168n6855N04536j26731
7122a03106R9694r530l53831L02241J26493j54536k86183R9445L57861m8847J91305
$$ y = [-255008, -394377, -526395, 223989, -146460, -403619, -233713, -225566, -324836, -226876, -122137, -40313, -31764, -225527, 21895, 213553, -205853, -186930, -83241, -258704, -279471, -15287, 161794, 373510, -337141, -165293, 52869, -254954, -225889, 72984, 245843, -172428, -421103, -380160, 107675, 161545, 80296, 418867, 273237, 9581, -51518, -82900, -69960, 117078, 53829, 211672, 285191, 425744, 370151, 140717, 102027, -247224, -508, -184123, -375243, -613185, -117005, -212706, -632810, -422344, 43811, 230711, 85601, -74170, -192220, -122714, 108096, 430310, 443289, 106112, -424056, -480911, 23625, -103106, -3412, -12942, -366773, -64532, 61961, -92575, -378758, -279313, 78548, 29701, 221006]
7111B21006K31872p7237j62409K65929k88252J3330l03991O369L52723j64054
7101I5286L10978k04147J10023N8965j32400j65399Q7647O6183k95660R8134J21686
7090A51296l88981L54613J18843m5656p0047n7663n4784l45601N12310M39693
7080F14023l4p00038k28848J72585K3874L32751p3526j14794l66928L44776j22224
7069a18383j23166J3543j63607J31893J85900O7381l38008L52647L60596J8548
7059C87344j95956K01952J67807j06527J30582o8108k59221O6291l14313k56256
7049b46405J77532q5980N1293J28299L47316M2631m6776o5165k83553K19978j12063
7038A27107k9181j03798m6026J06862j44269j66965J15360P6573k21750O6899
$$ y = [221006, 452878, 375641, 213232, 479161, 190909, 204239, -99752, -93383, 259340, 95286, 406264, 202117, 312140, 371105, 238705, 73306, 160953, 227136, -68524, 29610, 151296, -237685, 116928, 235771, 190115, 120068, 62405, 7621, -337980, 174330, 614023, 613989, -86049, -314897, -142312, -118438, 214313, 140787, 25993, -340935, 3841, -118383, -241549, -228006, -391613, -259720, -73820, -6439, -344447, 8200, 368796, 387344, 191388, 393340, 561147, 454620, 585202, 517094, 257873, 324164, 9851, -246405, -68873, -154853, -103560, 24739, 372055, 414686, 367910, 302745, 19192, 239170, 127107, 97926, -5872, -51898, 54964, -89305, -256270, -140910, -64337, -286087, -219188]
7028b19188K12712k84841P1816L67373l79730n1932J75507J78471J53169J29637
7018C52994l52566J52828j7542m5030r4193l41744j65865J73357M10245o9883
7008B601m0407q3367L12063N3028k27904n3242j87144K32730J34874j19500j03133
6997g9401L8972J75777j88903R9878k7878J15041k6042j70982L41616n8853j49850
6986F9375n2956k46152K32431L66767n10503k73031M72384o4348k2030J2373L1250
6975A5560J71398K8688p6411O3125K7155J09755Q1196k10277l14353O0856p1479
6964a14787j5227p7943j12338L41593J65066k00759J61938J55960o197J08241
6954D05547J29091j64512k34743J80127j81365j9735o8295j86736M89819k65770
$$ y = [-219188, -6476, -291317, -219501, 147872, -231858, -283790, -108283, 70188, 223357, 352994, 428, 153256, 135714, 90684, -3509, -345253, -511118, -337761, 72484, 2601, -37806, -121173, 190890, 243918, 16014, -37228, -224372, 8358, 143232, 23732, -79401, -40429, 135348, -53555, 46323, 18445, 133486, 107444, -63538, 278078, 219225, 69375, 16419, -229733, 2698, 369465, -141038, -414069, 58315, -6033, -28063, -15690, 15560, 186958, 215646, 139235, 202360, 229515, 339270, 420466, 210189, -104164, -43308, -114787, -130014, -207957, -320295, 21298, 186364, -14395, 147543, 303503, 297306, 405547, 534638, 370126, 135383, 315510, 134145, 114410, 46115, -140621, 349198, 83428]
6944H3428k22113j04233K88710l42528J23869K69418j58457j75923J99230L34626
6934B96027p5574K06747o64880k68589K92803K63106o6311K26695N1901J24241
6924C86166l71847l6397K54756K58364n45170J04273j05764K53531k0952j65935
6914A1025J15910j41056J36688n16839K75960K54643j09136p398N9158j03623
6904b4668j68008J54202J9153N8467j08295L03710J72359p1764J92877j58752
6894C69281l09071j6383N3131j14622l19314L3952L72575p0193j01218J90234
6884H8372J04546q9126j55651J6779J42942m39622j17941M76176l8443k97619
6874c09587K13407q3429o3030K01618R6857J54808j26008J22078K19404j47160
$$ y = [83428, -138685, -242918, 45792, -296736, -172867, 96551, -61906, -237829, -38599, 296027, 220453, 427200, -237680, -506269, -213466, 49640, -16671, 210024, 261925, 386166, 14319, -22078, 232678, 491042, -54128, 50145, -55619, 197912, 176960, 11025, 126935, -14121, 122567, -394272, -118312, 136331, 27195, 19797, 78955, -24668, -192676, -38474, -19321, 39146, -69149, 234561, 406920, 335156, 528033, 369281, 60210, 43827, 96958, -17664, -336978, -303026, 69549, -644, -101862, 88372, 192918, 103792, -51859, -35080, 107862, -331760, -449701, 26475, -11968, -309587, -96180, -179609, -242639, -41021, 55836, 210644, 84636, 206714, 426118, 278958]
6864B78958J83609J80408k97769P2271L28893m91713l08412k18278L49826N86133
6854F63926k95473k66412r5576Q855L52729k94879q0243j22366K8290q3357M05498
6843B20992k58196K2417L6025k04485K32958J0670J540k78289J10952L29J57786
6832E2699J63464J16184l1169k59102N42849k92770j73675M37667j73493k53792
6822A28862j63461J11457L3815m8671n18855L05665J67913j30089q3479K64462
6812F7619J71441k56752j04827K99889j3892J2753n8735J36156R6771l5613j68675
6801A46135l36768L8100M29505J40902m71519o41000M25895M71522j71417o5483
6791c4128k56994L2256Q9981O5611J32079L45851k65469j77811J25501j00624
$$ y = [278958, 462567, 642975, 345206, 417477, 746370, 254657, -53755, -272033, 77793, 663926, 368453, 102041, 6465, 15320, 368049, 73170, -7073, -129439, -101149, -184506, 220992, -37204, -14787, 21238, -183247, 49711, 60381, 61921, -216368, -105416, -105087, 52699, 216163, 332347, 301178, 42076, 584925, 292155, 118480, 556147, 382654, 128862, -34599, 76858, 110673, 62002, -456853, -151188, 16725, -113364, -196843, 67619, 239060, -17692, -122519, 177370, 163478, 176231, 117496, 253652, 350423, 314810, 146135, -190633, -152533, 276972, 417874, -53645, -694645, -268750, 202772, 31355, -34128, -291122, -258866, -168885, -103274, 28805, 374656, 109187, -68624, 56877, -43747]
6781d3747O7186r3242K42841J98395J29067j19167P627k20734J45568L8965j91456
6770A61303j35232O0362p6257M6268J87272K46136k13141k53121N37244k94470
6760B66364Q9639n57156Q715k13921J32311N80393K57632K3932k02866p292k6439
6749C51312k08566J20920l94451J50063n8492j79576L93402l6707j36058Q2333
6739H4180k74114k00584N25326K33030J83123l96581L2795R8257j19923j41975
6729B3534N1559Q0213l2158r3714j00469J80747J93952j44100l0038N408J90900
6718C25834R0914l88284J20841J36163J63098L38805k33818m34637J36496N6473
6708C11885Q0117j70419k3335L32745n21079m2378K52709J07248N58386k15693
$$ y = [-43747, 23439, -69803, 173038, 371433, 500500, 381333, 388960, 168226, 313794, 352759, 161303, 26071, 86433, 10176, 56444, 243716, 489852, 276711, 23590, 560834, 266364, 356003, -201153, -192438, -406359, -274048, 306345, 563977, 587909, 385043, 377751, 351312, 142746, 263666, -130785, 19278, -39214, -218790, 174612, 137905, 1847, 84180, -189934, -390518, 134808, 367838, 550961, 154380, 187175, 285432, 165509, 23534, 75093, 155306, 123148, 29434, -71035, 109712, 303664, 159564, 129526, 134934, 325834, 416748, 28464, 149305, 285468, 448566, 787371, 553553, 118916, 255412, 311885, 392002, 221583, 198248, 530993, 9914, -32464, 220245, 327493, 885879, 670186]
6698F70186m39479J01165m29952J11364L43655k18051j03610j6230n5241j25462
6688a61655N6142M3496J85814K14939P2921O7486K384m17231M842q5295l84505
6677d00662K86846p0489K58080J07465M7170k58784K94633j05777k8875M47020
6667E76627j52082m07891K36257J38871j26697M7422m88745O12128L58083m36431
6657C57542k03190L7260J89370o0993k7102J86079q2845m25230k60143J12908
6647a76344L31083L4801j39978K35333J71205P7062p4312m63738J1019J98955
6637B05086m092j73575R7331J12433k58168J71518J6147j30900L42006K69616
6627F47402o16848j96988l4333j31362L89981K94318K0142k02190N7856n9206
$$ y = [670186, 230707, 331872, -98080, 13284, 356939, 138888, 35278, 19048, -36193, -161655, -105513, -62017, 123797, 338736, 411657, 479143, 481527, 64296, 69138, -16157, -400662, -113816, -184305, 73775, 181240, 228410, -30374, 264259, 158482, 129607, 576627, 424545, 16654, 252911, 391782, 265085, 312507, -176238, 435890, 793973, 357542, 154352, 191612, 380982, 319989, 292887, 478966, 396121, -29109, -289252, -176344, 154739, 189540, 49562, 284895, 456100, 533162, 458850, -4888, 6131, 205086, 200994, 27419, 124750, 237183, -20985, 150533, 166680, 35780, 377786, 647402, 30554, -166434, -200767, -332129, 57852, 352170, 372312, 170122, 227978, 168772]
6617A68772M87891P0008j11184L11561r4996r0058l59226j54436p1508L52513
6607E09337m69301K23686L5034k08582L1218q129O8241j99311n6928K92300J94525
6596D12090m27025j45827M18880j98742j80451Q7826J04282j55894J34463J14058
6586A63660J49306M30542l20968k12926k40490j61589M72971J60695l4894K20442
6576F26749k84402N216j71015m18927k6934M64334j72877k7864N4072K44733J72214
6565D65299j95839J75351J44612m60919O3702k81098M88615J18933m52980k19126
6555a53450J54459K99444k4294j1963L762l87333j19652K89637j70649J14449
6545e590L07865K52713j36673j91967j19012Q0124l50837L39659k5174l04817
$$ y = [168772, 656663, 726671, 615487, 927048, 832052, 741994, 382768, 228332, 156824, 509337, 40036, 263722, 298756, 90174, 121392, 113263, 181504, -17807, -74735, 217565, 412090, -14935, -160762, 258118, 59376, -121075, -33249, 71033, -84861, 49602, 163660, 312966, 743508, 422540, 209614, -30876, -192465, 280506, 441201, 406307, 626749, 342347, 347563, 176548, -242379, -269313, 195021, 22144, -5720, 48352, 293085, 465299, 269460, 444811, 589423, 128504, 192206, -88892, 399723, 518656, 65676, -153450, 1009, 300453, 276159, 264196, 267958, -119375, -239027, 50610, -120039, -5590, 302275, 554988, 418315, 226348, 107336, 187460, -163377, 176282, 151108, -153709]
6535a53709P4204J40485K91566J74652k61461P4718n7653j98759n4380J97642
6525B27305R7798k93800Q1604N5422J3592K65190J71774l31596j09286K58390
6515D36393m6020j74233p861K0067m9338o2597M34638k82849k46300J99691j61538
6504F0053J79904p3446M31791k14636l06364J47145k71260M58743J35182k19392
6494C27720K87935n42646Q3478K9087O7620M01671k89340J42525M7975k19871
6484C36154J5164K14491j10102l6075k26881J44891O6750j10239n1946O7088K91005
6473F00300j79025p0079o9654M2411j98248j03146N5982M86958O7447k10220k13400
6462B09326j18732J9149j86882k53639N641L70096O1767k43009r3307L96688K36077
$$ y = [-153709, -79505, 60980, 352546, 527198, 265737, 340455, 282802, 84043, 29663, 227305, 325103, 31303, 112907, 168329, 181921, 447111, 618885, 287289, 178003, 436393, 390373, 216140, 208279, 228346, 179008, 116411, 551049, 268200, 21900, 221591, 60053, 239957, 166511, 598302, 383666, 77302, 224447, -46813, 411930, 547112, 327720, 615655, 73009, 156487, 185574, 253194, 654865, 365525, 508050, 556025, 336154, 351318, 565809, 455707, 419632, 192751, 337642, 404392, 294153, 242207, 309295, 600300, 421275, 351196, 281542, 323953, 125705, 22559, 78541, 565499, 632946, 422726, 209326, 90594, 109743, -77139, -330778, -325137, 44959, 106726, -136283, -229590, 167098, 403175]
6451D03175M16771n32944J95928o935j43463l35180l17531N20604M14762p2018
6441E43169n34381J06928O5132j24577J10173n534L3245J26097M5321J3879j19376
6430B60076J8455N7285K22137l9952j2365m04960J73452M39499m89k0027j70241
6419E22870J98683m21191j24576L03218l12049O4211K97692o2838m3020p2746
6409C50254k38434J04018K37381r287l39863N059p5140J67811r970n8743J45267
6398B78353l9516k54806j29738K9217O4644L21637j36697p4801M57058P807j77146
6387C46012K13167m19889n2961K62140K67405k70302K05609l92288j41766M59570
6377D76697R5791l1905m175L52249k83654l76824K91943k88314j50130N51399
$$ y = [403175, 819946, 287002, 482930, 475995, 332532, -2648, -320179, 200425, 615187, 543169, 8788, 115716, 180848, 56271, 166444, 160910, 194155, 320252, 365573, 379452, 260076, 278531, 335816, 557953, 518001, 505636, 100676, 274128, 713627, 713138, 693111, 522870, 721553, 300362, 175786, 479004, 166955, 231166, 528858, 466020, 423000, 350254, 111820, 215838, 453219, 443932, 104069, 109128, 33988, 201799, 191829, 133086, 278353, 238837, -15969, -145707, -116490, -51846, 269791, 133094, 58293, 515351, 523158, 346012, 559179, 139290, 86329, 348469, 615874, 345572, 551181, 158893, 17127, 476697, 572488, 540583, 536408, 888657, 605003, 228179, 520122, 231808, 81678, 633077]
6367F33077M73537m12458K65399r7493j66691J19836o0392R4883l62719k49031
6357B37948P5924j55499j65585K6005K08602K18555K0831J55453k89393j13164
6347B19677l26K34732j32470k28275L41325J04030K26030r5882o24558N7624P3734
6336A75641K44002J90696J71956m8768J67742l1083k82943m25703k18898K89131
6326B31773K44264j09295J64734k99152K11164R9258k76959L1735K42834l10944
6316B29412r3077k36372J87205m8390N1334J43856K09839J42178N133k19222k37868
6305A34028N05279L04772k4375p5783J8637p8945n84062L02885o1292j84086O46245
6294I03303k45640K88725j37918m1303j33404m35727k07871o0996L83242L00586
$$ y = [633077, 1106614, 694156, 959555, 862062, 695371, 815207, 754815, 849698, 486979, 237948, 313872, 158373, -7212, 18793, 227395, 445950, 466781, 622234, 332841, 219677, 219351, 454083, 321613, 93338, 434663, 538693, 764723, 668841, 44283, 101907, 175641, 419643, 610339, 782295, 733527, 901269, 870186, 587243, 161540, -57358, 231773, 476037, 366742, 531476, 232324, 443488, 542746, 265787, 297522, 540356, 229412, 136335, -100037, 87168, 38778, 90112, 233968, 443807, 585985, 591118, 371896, 134028, 639307, 944079, 919704, 843921, 862558, 783613, 199551, 502436, 441144, 257058, 903303, 657663, 946388, 808470, 767167, 633763, 198036, -9835, -70831, 312411, 612997]
6284F12997J83146j33529k2234L51892o56696j82552J05560j07457K27064J64140
6274E42331N06419l80044l74872J76378K59939K97560n10259r7778J93007J22311
6264G34992k69627o6170L29095J39498l52432L12278l6114o8721k92502L4564
6254D64861K49111J03114j81938K7737K78867m38784j17922J68226M87447P1706
6244A112425k25842j64225O9095q6525l22373l2509K96528J24926j29549N6982
6234F98933k89496j0527j53105J13460j00959K26271M55505j21262k93038J68755
6224F94537K56433n05668M43395K18997n67878J0845Q5659l53648j36854L07677
6214D53495M09195J7798J11232l31629q1382Q6007R5896K23666r9021j65397r6265
$$ y = [612997, 796143, 662614, 640380, 992272, 335576, 153024, 258584, 151127, 378191, 542331, 1048750, 668706, 293834, 470212, 730151, 1027711, 517452, 419674, 612681, 734992, 465365, 399195, 728290, 867788, 515356, 827634, 791520, 722799, 430297, 464861, 713972, 817086, 635148, 662885, 941752, 502968, 385046, 553272, 1040719, 1112425, 886583, 722358, 791453, 704928, 382555, 350046, 646574, 771500, 641951, 698933, 409437, 398910, 245805, 359265, 258306, 484577, 940082, 818820, 525782, 694537, 950970, 445302, 888697, 1107694, 539816, 550661, 636320, 282672, 145818, 453495, 862690, 880488, 991720, 660091, 578709, 664716, 760612, 984278, 885257, 719860, 623595]
6203F23595J90539L27749K72563o35777M17525J67564k80521m61571p5961K81981
6193H27686k48004r359M90521J95815j44406l58679j67204L24585Q9225l4601
6183I65579O2564j7657J21105m11364m8381O04993M8552r4144n63630m17567J3923
6172B63973M62016k44743n6233N9617L12781N6855J80119M7299k93236M8635M6614
6161H83697L7475L5907k33995M4436L81929k5982m52771J76942L6788j19001M529
6150G69954q956k4208J07651k9767j95126j16319K96545j64539q8155N03812K39848
6139A290740k59286K07390m3811j06491Q5034o9168K56688j78564l68540j62980
6129F51012M6915N10197q7006p6472l0521j28139K61444k80625k11916K46133
$$ y = [623595, 814134, 1141883, 1414446, 778669, 1196194, 1363758, 1083237, 621666, 545705, 827686, 579682, 570323, 1060844, 1256659, 1112253, 753574, 586370, 910955, 1000180, 965579, 1028143, 1010486, 1131591, 720227, 671846, 1276839, 1325391, 1231247, 667617, 250050, 263973, 725989, 481246, 425013, 484630, 797411, 854266, 1034385, 1081684, 788448, 837083, 883697, 921172, 957079, 723084, 767520, 1149449, 1123467, 670696, 847638, 884426, 765425, 769954, 760998, 736790, 844441, 814674, 619548, 503229, 799774, 635235, 547080, 1050892, 1290740, 1031454, 1238844, 1195033, 1088542, 1173576, 1104408, 1361096, 1182532, 813992, 651012, 697927, 1208124, 1121118, 1044646, 1014125, 885986, 1147430, 866805, 654889, 901022]
6119I01022N33957P8057k55164k56019N02055j44144j3918k88768j71407J55193
6109A040864K92157O404j22236J41332R2255k08143p53927m3602M28605k12246
6099F61463r8884M74757p352l36724M8684L84239O2674L0801l66851r5093J34315
6088H92029K54824J82505k77202J22791J0169k02800J75739J63627l7477k44968
6078A039237P2804l0251K9278M50089j63879q174n6221j51458J97333l11634m7570
6067A019554J94620K23785K9278k7361P2392o6811k15611J33445L2568k31812
6057A164047N5148p018L4403k14828J98350j47924k16152J69050K46174K7482
6047A308732n5099j91979L06184K54885k15840m9509J15485k70638n241J46811
$$ y = [901022, 1434979, 1513036, 1257872, 1001853, 1503908, 1359764, 1345846, 1057078, 885671, 1040864, 1333021, 1339425, 1217189, 1358521, 1450776, 1242633, 488706, 445104, 873709, 661463, 562579, 1037336, 1029984, 693260, 741944, 1126183, 1188857, 1219658, 852807, 757714, 892029, 1146853, 1329358, 1052156, 1174947, 1185116, 982316, 1158055, 1321682, 1284205, 1039237, 1112041, 1081790, 1111068, 1561157, 1397278, 1389104, 1332883, 1181425, 1378758, 1067124, 1019554, 1214174, 1437959, 1467237, 1439876, 1512268, 1445457, 1229846, 1363291, 1395859, 1164047, 1219195, 1212177, 1246580, 1031752, 1230102, 1082178, 866026, 1035076, 1281250, 1308732, 1253633, 1061654, 1367838, 1622723, 1406883, 1357374, 1472859, 1202221, 1196980, 1343791]
6037A343791j55864J71205m5007j6462J21203l0447L0209j17389l4865p1768l4110
6026A160496J31975j02014L46577k30809J84825O29214j25432l33421k29748P860
6016A439523L1153M0557j64494J57126k46512K6393l11803L04798K33311l94254
6006A115798L39880j01697J33610O3688o901j76290j28388o485k3120j12771L56386
5995A453710O2462J4754m09860j6522J41337l5499J42382l12022L54270j53417
5985A241595k60718j44765j58976L76255M28335l058k02020k53398l0694L9616
5975A032172P4470Q0329J24482p9066k18869l31288K79884L73673k60299J35612
5965A211100j54299M97923q1489j50899m38153K43589k52671k23644R27577L80447
$$ y = [1343791, 1187927, 1359132, 1314125, 1297663, 1418866, 1388419, 1418628, 1301239, 1266374, 1194606, 1160496, 1292471, 1190457, 1537034, 1306225, 1491050, 2120264, 1994832, 1661411, 1431663, 1439523, 1470676, 1511233, 1346739, 1503865, 1257353, 1283746, 971943, 1276741, 1510052, 1115798, 1455678, 1353981, 1487591, 1551279, 1544378, 1368088, 1239700, 1233215, 1210095, 1097324, 1453710, 1516172, 1530926, 1121066, 1104544, 1245881, 1210382, 1352764, 1040742, 1395012, 1241595, 980877, 836112, 677136, 1053391, 1481726, 1478668, 1276648, 1023250, 992556, 1032172, 1106642, 1186971, 1311453, 1232387, 1013518, 682230, 962114, 1335787, 1075488, 1211100, 1056801, 1554724, 1473235, 1322336, 884183, 1127772, 875101, 651457, 1579034, 1959481]
5955A959481l43599l85218j27784L55079j46176l79832K79263l2125J29666j22858
5945A185897R3281j78337K43761K58041j34314o22159J51242M1008N08165L71831
5935A918416j44683J72149n02047l92830o0973J03816L87741J72455n82580O0828
5925A132292M07766j25817J86450l02250j38298K18801j48187J50855K41989j33672
5915A489929J8657R5142o277k57415L64171J35373l53462k59124N46153K58403
5905B031550l8008j53439p7607K05777k42037l520J74055M94796j97472k37388
5895A956707L78567l40494k66330L99925J15276m2641j86860k42257O6466K88140
5885B126499l55816L03134R3846j29743j24853j32094L38184k08940J02231L13595
$$ y = [1959481, 1615882, 1230664, 1102880, 1457959, 1311783, 931951, 1211214, 1179089, 1308755, 1185897, 1279178, 1100841, 1344602, 1602643, 1468329, 846170, 997412, 1038420, 1546585, 1918416, 1773733, 1945882, 1443835, 1051005, 990032, 1093848, 1481589, 1654044, 1071464, 1132292, 1540058, 1414241, 1600691, 1298441, 1160143, 1378944, 1230757, 1381612, 1623601, 1489929, 1508586, 1603728, 1597451, 1340036, 1704207, 1839580, 1486118, 1226994, 1773147, 2031550, 1993542, 1840103, 1762496, 1968273, 1726236, 1722716, 1896771, 2391567, 2194095, 1956707, 2335274, 1994780, 1728450, 2128375, 2243651, 2201010, 2014150, 1771893, 1838359, 2126499, 1770683, 2073817, 2167663, 2037920, 1913067, 1780973, 2119157, 1910217, 2012448, 2326043]
5875B326043o17382R4250K63457J97020K39699l6270M0556K34366M16734J69196
5865C327669p1416K50721L5709m69551k13849J65427j62276k3106j26354m66432
5855B246542Q5093r8725j14899J08112j07595k05121J65261K2413J05159o7967
5845B138273N5913L26482l73655K25439K29701o6234M9795M34193J87262p958
5835C199211J17310L66746n2624j96521J80372k49562k90593k19204k17779L34899
5825B972255L7888k14911J48322j53088j6277J1598N4984j15051L5913K34448
5815B996081l68206k29021K57429J81145J36293k79129k178L06997p5244m98307
5805B425860K7466K91260j59573K65882j24933j00386M6806l3429k36195o2209
$$ y = [2326043, 1708661, 1802911, 2066368, 2263388, 2503087, 2466817, 2507373, 2741739, 3158473, 3327669, 3256253, 3506974, 3542683, 3073132, 2859283, 3024710, 2862434, 2839328, 2712974, 2246542, 2331635, 2232910, 2118011, 2226123, 2118528, 1913407, 2078668, 2101081, 2206240, 2138273, 2194186, 2520668, 2147013, 2372452, 2602153, 2535919, 2585714, 3019907, 3207169, 3199211, 3316521, 3683267, 3630643, 3434122, 3614494, 3364932, 3074339, 2855135, 2637356, 2972255, 3010143, 2795232, 2943554, 2790466, 2774189, 2785787, 2840771, 2725720, 2761633, 2996081, 2627875, 2398854, 2656283, 2837428, 2973721, 2694592, 2692414, 2999411, 2924167, 2425860, 2453326, 2744586, 2585013, 2850895, 2725962, 2625576, 2672382, 2638953, 2402758, 2340549]
5795B340549K33544m48980k22549J12946K25260O20373j35816l49706k67517L17628
5785B425732j8730j46736M15602l8093M30719j95425l3189J20205O41582j45177
$$ y = [2340549, 2574093, 2125113, 1902564, 2015510, 2240770, 2861143, 2725327, 2375621, 2108104, 2425732, 2407002, 2260266, 2675868, 2637775, 3068494, 2873069, 2839880, 2960085, 3601667, 3456490]
$$ [...]
##END NTUPLES=NMR SPECTRUM
##END=
