##TITLE=1H_CA-8965-2
 CDCl3
 8 sc, 
 20.1.2022
##JCAMPDX= 6.0         $$ Bruker NMR JCAMP-DX V2.0
##DATA TYPE= NMR SPECTRUM
##DATA CLASS= NTUPLES
##ORIGIN= UXNMR, Bruker Analytische Messtechnik GmbH
##OWNER= root
$$ XWIN-NMR		Version 3.5
$$ Fri Jan 21 11:17:49 2022 Russian Standard Time (UT+4h)  she@DPX200
##.OBSERVE FREQUENCY= 200.131346
##.OBSERVE NUCLEUS= ^1H
##.ACQUISITION MODE= SIMULTANEOUS
##.ACQUISITION SCHEME= undefined
##.AVERAGES= 8
##.DIGITISER RES= 18
##SPECTROMETER/DATA SYSTEM= spect
##.PULSE SEQUENCE= zg30
##.SOLVENT NAME= DMSO
##.SHIFT REFERENCE= (INTERNAL, DMSO, 0, 15.7315)
##AUDIT TRAIL= $$ (NUMBER, WHEN, WHO, WHERE, WHAT)
$$ ##TITLE= Audit trail, XWIN-NMR		Version 3.5
$$ ##JCAMPDX= 5.01
$$ ##ORIGIN= Bruker BioSpin GmbH
$$ ##OWNER= she
$$ F:/spectra/data/she/nmr/H-F/1/pdata/1/auditp.txt
$$ ##AUDIT TRAIL=  $$ (NUMBER, WHEN, WHO, WHERE, WHAT)
(   1,<2022-01-21 11:16:33.95 +0400>,<she>,<DPX200>,
      <created by zg, POWCHK disabled, PULCHK disabled
       configuration hash MD5:
       00 E9 B6 7A A2 85 ED C7 34 08 36 98 17 FE 4E 26
       data hash MD5: 16K
       D3 B3 27 16 73 02 F7 E6 66 6E 67 B7 83 F5 91 BE>)
(   2,<2022-01-21 11:16:37.18 +0400>,<she>,<DPX200>,
      <Start of raw data processing
       efp BC_mod = 2 LB = 0.24 FT_mod = 6 PKNL = 1 PHC0 = -15868.81 PHC1 = 9.20078 SI = 16K 
       data hash MD5: 16K
       95 C2 B7 80 63 51 F3 C6 62 0C 28 9D 2A CA 59 C2>)
(   3,<2022-01-21 11:16:49.67 +0400>,<she>,<DPX200>,
      <pk PHC0 = -158.2449 PHC1 = -0.1999998 
       data hash MD5: 16K
       05 0D 0A 89 75 9A D8 80 96 0B 15 F6 9A B2 FC 5B>)
(   4,<2022-01-21 11:16:52.78 +0400>,<she>,<DPX200>,
      <abs ABSG = 5 
       data hash MD5: 16K
       9F 9E 69 98 D4 3B 9B 60 9C 70 B8 BB ED CE E3 9C>)
$$ ##END=
$$ 
$$ hash MD5
$$ D3 EC 18 72 6A 9C BD C8 B6 43 A7 82 A7 A7 F2 DD
##$RELAX= 
##$RELAX= 
##$RELAX= 
##$RELAX= 
##$RELAX= 
##$RELAX= 
$$ Bruker specific parameters
$$ --------------------------
##$DU= <F:/spectra>
##$EXPNO= 1
##$NAME= <H-F>
##$PROCNO= 1
##$TYPE= <nmr>
##$USER= <she>
##$AMP= (0..31)
100 100 100 100 100 100 100 100 100 100 100 100 100 100 100 100 100 100 
100 100 100 100 100 100 100 100 100 100 100 100 100 100 
##$AQSEQ= 0
##$AQ_mod= 1
##$AUNM= <au_zg>
##$AUTOPOS= <>
##$BF1= 200.13
##$BF2= 200.13
##$BF3= 200.13
##$BF4= 200.13
##$BF5= 200.13
##$BF6= 200.13
##$BF7= 200.13
##$BF8= 200.13
##$BYTORDA= 1
##$CFDGTYP= 0
##$CFRGTYP= 5
##$CHEMSTR= <none>
##$CNST= (0..31)
1 1 145 1 1 1 1 1 1 1 1 1 1 1 1 1 1 1 1 1 1 1 1 1 1 1 1 1 1 1 1 1 
##$CPDPRG= <>
##$CPDPRG1= <>
##$CPDPRG2= <>
##$CPDPRG3= <>
##$CPDPRG4= <mlev>
##$CPDPRG5= <mlev>
##$CPDPRG6= <mlev>
##$CPDPRG7= <mlev>
##$CPDPRG8= <mlev>
##$CPDPRGB= <>
##$CPDPRGT= <>
##$D= (0..31)
0 1.2 0 0 0 0 0 0 0 0.06 0 0.03 0 0 0 0 0.0002 0 0 0 0 0 0 0 0 0 0 0 0 
0 0 0 
##$DATE= 1642749393
##$DBL= (0..7)
120 120 120 120 120 120 120 120 
##$DBP= (0..7)
150 150 150 150 150 150 150 150 
##$DBP07= 0
##$DBPNAM0= <>
##$DBPNAM1= <>
##$DBPNAM2= <>
##$DBPNAM3= <>
##$DBPNAM4= <>
$$ [...]
##$SUBNAM2= <"">
##$SUBNAM3= <"">
##$SUBNAM4= <"">
##$SUBNAM5= <"">
##$SUBNAM6= <"">
##$SUBNAM7= <"">
##$SUBNAM8= <"">
##$SUBNAM9= <"">
##$SW= 18.0517287032376
##$SWIBOX= (0..15)
0 0 2 0 0 0 0 0 0 0 0 0 0 0 0 0 
##$SW_h= 3612.71676300578
##$TD= 16384
##$TD0= 1
##$TE= 0
##$TE2= 300
##$TE3= 300
##$TEG= 300
##$TL= (0..7)
0 120 120 120 120 120 120 120 
##$TP= (0..7)
150 150 150 150 150 150 150 150 
##$TP07= 0
##$TPNAME0= <>
##$TPNAME1= <>
##$TPNAME2= <>
##$TPNAME3= <>
##$TPNAME4= <>
##$TPNAME5= <>
##$TPNAME6= <>
##$TPNAME7= <>
##$TPOAL= (0..7)
0.5 0.5 0.5 0.5 0.5 0.5 0.5 0.5 
##$TPOFFS= (0..7)
0 0 0 0 0 0 0 0 
##$TUNHIN= 0
##$TUNHOUT= 0
##$TUNXOUT= 0
##$USERA1= <user>
##$USERA2= <user>
##$USERA3= <user>
##$USERA4= <user>
##$USERA5= <user>
##$V9= 5
##$VALIST= <valist>
##$VCLIST= <CCCCCCCCCCCCCCC>
##$VD= 0
##$VDLIST= <DDDDDDDDDDDDDDD>
##$VPLIST= <PPPPPPPPPPPPPPP>
##$VTLIST= <TTTTTTTTTTTTTTT>
##$WBST= 1024
##$WBSW= 4
##$XGAIN= (0..3)
0 0 0 0 
##$XL= 0
##$YL= 0
##$YMAX_a= 284687
##$YMIN_a= -399690
##$ZGOPTNS= <>
##$ZL1= 120
##$ZL2= 120
##$ZL3= 120
##$ZL4= 120
##$ABSF1= 15.69951
##$ABSF2= -2.35234
##$ABSG= 5
##$ABSL= 3
##$ALPHA= 0
##$AQORDER= 0
##$ASSFAC= 0
##$ASSFACI= 0
##$ASSFACX= 0
##$ASSWID= 0
##$AUNMP= <proc_1d>
##$AZFE= 0.1
##$AZFW= 0.1
##$BCFW= 0
##$BC_mod= 2
##$BYTORDP= 0
##$COROFFS= 0
##$CY= -3
##$DATMOD= 1
##$DC= 0
##$DFILT= <>
##$DTYPP= 0
##$F1P= 0
##$F2P= 0
##$FCOR= 1
##$FTSIZE= 16384
##$FT_mod= 6
##$GAMMA= 0
##$GB= 0
##$INTBC= 1
##$INTSCL= 0
##$ISEN= 128
##$LB= 0.24
##$LEV0= 0
##$LPBIN= 0
##$MAXI= 10000
##$MC2= 0
##$MEAN= 0
##$ME_mod= 0
##$MI= 1.114404
##$NCOEF= 0
##$NC_proc= -6
##$NLEV= 6
##$NOISF1= 3.799351
##$NOISF2= 2.8
##$NSP= 0
##$NTH_PI= 0
##$NZP= 0
##$OFFSET= 15.73146
##$PC= 1
##$PHC0= -16027.05
##$PHC1= 9.00078
##$PH_mod= 1
##$PKNL= yes
##$PPARMOD= 0
##$PSCAL= 0
##$PSIGN= 0
##$REVERSE= no
##$SF= 200.130004019545
##$SI= 16384
##$SIGF1= 3
##$SIGF2= 2
##$SINO= 5.538805
##$SIOLD= 16384
##$SREGLST= <1H.CDCl3>
##$SSB= 0
##$STSI= 16384
##$STSR= 0
##$SW_p= 3612.71676300578
##$SYMM= 0
##$S_DEV= 0
##$TDeff= 16384
##$TDoff= 0
##$TI= <>
##$TILT= no
##$TM1= 0
##$TM2= 0
##$TOPLEV= 0
##$USERP1= <user>
##$USERP2= <user>
##$USERP3= <user>
##$USERP4= <user>
##$USERP5= <user>
##$WDW= 1
##$XDIM= 16384
##$YMAX_p= 314461455
##$YMIN_p= -166650
$$ End of Bruker specific parameters
$$ ---------------------------------
##NTUPLES= NMR SPECTRUM
##VAR_NAME=  FREQUENCY,     SPECTRUM/REAL,   SPECTRUM/IMAG
##SYMBOL=    X,             R,               I
##VAR_TYPE=  INDEPENDENT,   DEPENDENT,       DEPENDENT
##VAR_FORM=  AFFN,          ASDF,            ASDF
##VAR_DIM=   16384,         16384,           16384
##UNITS=     HZ,            ARBITRARY UNITS, ARBITRARY UNITS
##FACTOR=    0.220516191357247, 1,           1
##FIRST=     3148.33707650655, 0,            0
##LAST=      -464.379686499231, 0,           0
##MIN=       -464.379686499231, -166650,     0
##MAX=       3148.33707650655, 314461455,    0
$$ Real data points
##PAGE= N=1
##DATA TABLE= (X++(R..R)), XYDATA
$$ [...]
7179B179186N213K0437K0162o3848M3737L0942l1217m625K0835j6672j3112J3667
7167B204705k5907j4724J26K3831J9914O548L1667J1270j1312k2444j5916R783
7155B217541r53k1563J2061q7L3885M294q272K3333K1707J7008j7143O823k1804
7142B266830l2427K2618J8398j9471O794P100j8195J2698j068j6722k139J7836
7130B262252p93K3980Q573q956m1135K4415k7053J6698M508N707K3077k3915J8249
7117B285607N043j9361J6778K8205j3339J6259J9584L7911J5833K8975K5130J2264
7105B458889K3152p469j1750l5107j6085J7293Q293k16n061J0348L3346K3086
7093B498719p61K7301l642k778K3618K1087L913J5830P511K3321L9676J478J1722
$$ plain form
7179 2179186 2184399 2204836 2224998 2161150 2204887 2235829 2204612 2199987 2220822 2204150 2191038 2204705
7167 2204705 2178798 2164074 2164200 2188031 2207945 2214493 2246160 2257430 2246118 2223674 2207758 2217541
7155 2217541 2216588 2195025 2207086 2206999 2240884 2245178 2236906 2260239 2281946 2298954 2281811 2288634 2266830
7142 2266830 2234403 2257021 2275419 2255948 2262742 2269842 2251647 2264345 2263277 2246555 2244416 2262252
7130 2262252 2261459 2285439 2294012 2285056 2243921 2268336 2241283 2257981 2262489 2268196 2291273 2267358 2285607
7117 2285607 2290650 2271289 2288067 2316272 2302933 2319192 2338776 2376687 2392520 2421495 2446625 2458889
7105 2458889 2482041 2474572 2462822 2427715 2411630 2428923 2437216 2437000 2431939 2442287 2475633 2498719
7093 2498719 2497958 2525259 2521617 2518839 2542457 2563544 2567457 2583287 2590798 2614119 2653795 2655273 2666995
7080B666995L5548J8200L8215K0216L0268M4545L5823L4293J9751J5149K2453
7069B981456M2700N8555M2269K4637K7945M3235M3682K2489k484N6669N5926m496
7057C392583J8310N5102L6859Q5958L0811R2685N1059Q5364N0164N1790J22958
7046D073643Q3012L7975P5003Q1344J01440O4577P0549Q3579O3428J51655J01979
7035D988184J37889J50873J17195J01966J59795J46360J64614J43923J73328K07630
7025F491757K09823K55528K33799K90927L09996K76784J94552J66837J80999J61448
7015H772450K37212K23455K70250K39762J65984M4815O0129J2742J01888K21044
7005A0349731K48611L20113L71844L61062M30940M91910M69210N34777O15739
$$ plain form
7080 2666995 2702543 2720743 2758958 2779174 2809442 2853987 2889810 2924103 2943854 2959003 2981456
7069 2981456 3024156 3082711 3124980 3149617 3177562 3220797 3264479 3286968 3284484 3341153 3397079 3392583
7057 3392583 3410893 3465995 3502854 3588812 3619623 3712308 3763367 3848731 3898895 3950685 4073643
7046 4073643 4156655 4194630 4269633 4350977 4452417 4516994 4587543 4671122 4734550 4886205 4988184
7035 4988184 5126073 5276946 5394141 5496107 5655902 5802262 5966876 6110799 6284127 6491757
7025 6491757 6701580 6957108 7190907 7481834 7791830 8068614 8263166 8430003 8611002 8772450
7015 8772450 9009662 9233117 9503367 9743129 9909113 9953928 10014057 10026799 10128687 10349731
7005 10349731 10598342 10918455 11290299 11651361 12082301 12574211 13043421 13578198 14193937
6996A4193937P34656Q07452R74079J149910J246241J441815J645264J856936K141377
6987B6191667K527603K999808L588512M525440N771276P181475Q806855J0305494
6979G1898130J1350972J1483555R601449M859629j719264q521954j3014337j4113501
6971G1824679j2670992j0030168p601581n728018m381281l500144k883753k399464
6963B2629278k009860j644464j385929j187184r97359q89503q19104o88728o35747
6954A2371400o01152o03683n41410m82526m24418m16869l09589k97360k88971
6945H405422k34288k42130k65588k71118k68254k95802k96385k63398k68055k29027
6935E771377j73305k18989j35483j52056j21444r5903o9586p1306p7797j29399
$$ plain form
6996 14193937 14928593 15736045 16710124 17860034 19106275 20548090 22193354 24050290 26191667
6987 26191667 28719270 31719078 35307590 39833030 45604306 52785781 61592636 71898130
6979 71898130 83249102 94732657 104334106 109193735 107474471 98952517 85938180 71824679
6971 71824679 59153687 49123519 41521938 35793920 31412639 27912495 25028742 22629278
6963 22629278 20619418 18974954 17589025 16401841 15404482 14514979 13695875 13007147 12371400
6954 12371400 11770248 11166565 10625155 10142629 9718211 9301342 8991753 8694393 8405422
6945 8405422 8171134 7929004 7663416 7392298 7124044 6828242 6531857 6268459 6000404 5771377
6935 5771377 5598072 5379083 5243600 5091544 4970100 4874197 4804611 4733305 4655508 4526109
6925D526109p4691p5435j23098q5867q8115n2278j00821l5035n7080m9058l7112
6914C747519j0377p4157l9987j5292k6525n187l3003l4738k7257l1612J223l8425
6902C412182k1013n3992m4160n1103r893k3139m1221j7611m3892l8972m5461n2221
6890B969504m8490o491l8069l3933l3978n820l796k9521k3655l8j8164J7894R628
6877B755071k677L1639L6275J3412J1713L5665R156J7400L0136K0373K3690J0551
6865B992404K3187N5872M6360Q1505R3532N4156N2482J08171J02798N2550J05729
6854C768746J48229J06697O3738J64332J84844J74185K27510K58422K76562L56065
6844E729330M11560M51982N81952O73967Q39889J154153J511992J970181K501925
$$ plain form
6925 4526109 4451418 4375983 4252885 4167018 4078903 4026625 3925804 3890769 3833689 3784631 3747519
6914 3747519 3737142 3662985 3622998 3607706 3581181 3575994 3542991 3508253 3480996 3449384 3450607 3412182
6902 3412182 3391169 3337177 3293017 3241914 3232021 3208882 3167661 3150050 3106158 3067186 3021725 2969504
6890 2969504 2921014 2914523 2876454 2842521 2808543 2802723 2798927 2769406 2745751 2745713 2727549 2745443 2755071
6877 2755071 2752394 2784033 2820308 2833720 2845433 2881098 2890254 2907654 2937790 2958163 2981853 2992404
6865 2992404 3015591 3071463 3117823 3199328 3292860 3347016 3399498 3507669 3610467 3663017 3768746
6854 3768746 3916975 4023672 4087410 4251742 4436586 4610771 4838281 5096703 5373265 5729330
6844 5729330 6140890 6592872 7174824 7848791 8688680 9842833 11354825 13325006 15826931
6835A5826931K858877L143226L489440L121345j58461l442293m980775m605967
6827A5252323l009367k088844j391564j048781q06328o71882n40661m69859m06924
6818D818113k94142j89204k36288j82869j50078j30387j09521r3380j02625j01894
6808C227725j08281p2916r0108l8372p0257m4751m8673o8278l8875l4225m7182
6797B565807n7844o9952n4632q7661l9262m9354p8591k1976R678m9853j4743K7312
6785B078929K22j0016k7264j8306J2429k4155k2102K4523K2764J3836l4148k2644
6773A994068J1991K570L973j3815N083j3041j0026K3681q367J2894J505J397M7291
6760B059204J7385N247L6601r064j8322M6274J9767j5688N7332M9986J5608Q035
$$ plain form
6835 15826931 18685808 21829034 25318474 28439819 28281358 24839065 19858290 15252323
6827 15252323 12242956 10154112 8762548 7713767 6907439 6235557 5694896 5225037 4818113
6818 4818113 4523971 4334767 4098479 3915610 3765532 3635145 3525624 3432244 3329619 3227725
6808 3227725 3119444 3046528 2956420 2918048 2847791 2803040 2754367 2686089 2647214 2612989 2565807
6797 2565807 2507963 2438011 2383379 2295718 2256456 2207102 2128511 2106535 2116213 2066360 2051617 2078929
6785 2078929 2079151 2069135 2041871 2023565 2035994 2011839 1989737 2014260 2037024 2050860 2016712 1994068
6773 1994068 2006059 2008629 2012602 1998787 2003870 1990829 1980803 2004484 1996117 2009011 2010516 2011913 2059204
6760 2059204 2076589 2081836 2118437 2109373 2091051 2137325 2157092 2141404 2198736 2248722 2264330 2272365
6748B272365L7225M3204P621Q355l821M1078M0812M3722K7816N8781P6482Q2290
6736B735930P5868Q0923P3172P0491Q9489J12323J21115J37709J59166J53487
6726C809673J54856J43897K53950K12112K15089K78776L30790L11888M25101M52913
6716F589045N03084N72122O62389P29946Q56365R43773R94630J085193J125851
6707A4062398J050146Q91320O08368L18733q5864n04513q30738j008800j213130
6698A3287920j243616j162196j061846r46239q28947p04252n81111n38251m66912
6689E754550l97459l64423k83127k94887k64400k26229j87570k00921j75679j42510
6679C217345r9051j56918r7208j05829j04801o3169q7633j09367n3304o6896q5339
$$ plain form
6748 2272365 2309590 2352794 2360415 2368770 2364949 2406027 2446839 2490561 2518377 2577158 2653640 2735930
6736 2735930 2811798 2892721 2965893 3036384 3125873 3238196 3359311 3497020 3656186 3809673
6726 3809673 3964529 4108426 4362376 4574488 4789577 5068353 5399143 5711031 6136132 6589045
6716 6589045 7092129 7664251 8326640 9056586 9912951 10856724 11851354 12936547 14062398
6707 14062398 15112544 16003864 16612232 16930965 16845101 16340588 15509850 14501050 13287920
6698 13287920 12044304 10882108 9820262 8874023 8045076 7340824 6759713 6221462 5754550
6689 5754550 5357091 4992668 4709541 4414654 4150254 3924025 3736455 3535534 3359855 3217345
6679 3217345 3118294 2961376 2864168 2758339 2653538 2590369 2502736 2393369 2340065 2273169 2187830
6668B187830r7784j10282m5433j8569o4355o8993l7787n3440n8618j5409m1294
6657A575866j3703k4071p9704o1605q879n653m2597K2547r775l2066l7207J0106
6645A293259j4114o0480n1778P266o009K0170j0950m5299k0090L744k4221k557
6633A088941j8373j5388K1459j1134l0743L487O202k2768l0302K340m5350k6610
6621I21761K2855j0770r739l4548k0655K415J8636m1399J3178j3575L1408q542
6609H71025o470L050j9879q23K0004j5167K6457j3712k7610J9537j7161k8849
6597H10402L0784J4608j2169k0012J1006l833j2074J4790L7244j2768j6605m062
6585H37311J9329J5745K7087N346j62P2719L1607L1604N6843L5446J9976J9402
$$ plain form
6668 2187830 2090046 1979764 1934331 1915762 1851407 1782414 1744627 1691187 1632569 1617160 1575866
6657 1575866 1562163 1538092 1458388 1396783 1387904 1382251 1339654 1362201 1352426 1320360 1283153 1293259
6645 1293259 1279145 1218665 1166887 1174153 1168144 1188314 1177364 1132065 1111975 1115719 1091498 1088941
6633 1088941 1070568 1055180 1076639 1065505 1034762 1038249 1044451 1021683 991381 993721 948371 921761
6621 921761 944616 933846 924107 889559 868904 871319 889955 848556 861734 848159 879567 871025
6609 871025 864555 867605 847726 846903 866907 851740 878197 864485 836875 856412 839251 810402
6597 810402 841186 855794 843625 823613 834619 830786 818712 833502 870746 857978 841373 837311
6585 837311 856640 872385 899472 904818 904656 977375 1008982 1040586 1097429 1132875 1152851 1172253
6573A172253K3110j0077k5673m0328m4171n1230n5021k348j6277n0596l8690p723
6561H53229j4043J2101l37j6841m15J3478j2498j8713m1183j9012J6627J7320
6549G89713k6491l2126J0380M237k3334m8019J4684m67K8l5471J5975r828r289
6536F49992j1440p415k3148R241J3548m5234M247j4527L555p991j861m7191K2543
6523E44319J0762O46q373j8452J648J4831J0225kk2078J4157m326j1225k519J3687
6509E43300j8313n705k7349L7747K097l5864j1201m221L3213J0370j0609k1496
6497D91969J76m4893O716J7871j5143p142O561K2194j5642J8744J7072k3949j9188
6484D55346J7129k7850l2390K3371N9678K2997k3224m3270J78J0811L685q324
$$ plain form
6573 1172253 1195363 1185286 1159613 1119285 1075114 1023884 968863 966515 950238 899642 860952 853229
6561 853229 839186 851287 850950 834109 833694 847172 834674 815961 774778 755766 772393 789713
6549 789713 763222 731096 741476 745713 722379 674360 689044 688577 688605 653134 669109 659281 649992
6536 649992 638552 631137 607989 617230 630778 585544 589791 575264 578819 570828 568967 521776 544319
6523 544319 555081 555727 547354 528902 530550 545381 555606 555604 533526 547683 543357 532132 529613 543300
6509 543300 524987 519282 491933 529680 531777 495913 484712 480491 513704 524074 513465 491969
6497 491969 492145 447252 453968 471839 456696 449554 456115 478309 462667 481411 498483 474534 455346
6484 455346 472475 444625 412235 435606 495284 518281 495057 451787 451965 462776 466461 458137
6472D58137n922K3349J9283K3637j6895j6957K4434k2665K311j743j140j959j6782
6459D67088l02J9039j0293j1048o057j2520Q143j991O9646j7297k2867r174j0957
6446D61410J8033K039O71k2451M4874k3480J1453M3482l9784j757k8754J6154
6434D81890k2419L0788j5024L3101M6625J3313J6326j0139K4142Rl3807J2415
6422E77220k1067n1296L327O3701j1021l4550L4576m1635O244L3904l3211N167
6410E31359J3118l5013p162P012J031j1252J3496J7705k0656j0839J5915J3888
6398E28602o94J4418J5389M750q452l306M4629J6585l839K5765K1289J8885M0351
6385G14372K4242n049K6151L1210R3154K3374M2956J10512J16984R2222J50718
$$ plain form
6472 458137 452215 475564 494847 518484 501589 484632 509066 486401 488712 486969 485829 483870 467088
6459 467088 466786 485825 475532 464484 458427 445907 454050 452059 521705 504408 481541 472367 461410
6446 461410 479443 481482 482153 459702 504576 481096 492549 536031 496247 494490 465736 481890
6434 481890 459471 490259 475235 508336 554961 568274 584600 574461 598603 598612 564805 577220
6422 577220 556153 504857 508184 571885 560864 526314 560890 519255 525499 559403 526192 531359
6410 531359 544477 509464 502302 509314 510345 499093 512589 530294 509638 498799 514714 528602
6398 528602 527908 542326 557715 562465 554013 550707 595336 611921 608082 633847 655136 674021 714372
6385 714372 738614 733565 759716 790926 884080 907454 950410 1060922 1177906 1270128 1420846
6374A420846J29862K5869n3639j80179j43698j54906j20276o0633l7184k8801
6364G97261j974K1463l5794k8115j2188K4J1452k3758P470j6062l105q18j9543
6351F96313K0804k8537q3842k0691l2287L188l079o814k7800K2041J6695n1795
6339E04196j1297L7013K5455k4094n1200k4894K4329O274P466k5947j5470J2031
6327D63862M062Q358K0421k0660K794K0100K1927j5112k3742j2452k0658K7430
6315D76330R305J3129Q162k4744J6097k9512j8389k8074p123q870J8788K6475
6303D51574K6646P920o325K9483m7423m036J9578M6680j6925o3022J7314J1574
6291D73038k94j1675l3081J3343N0641m078j6465K4519O469q191j5392L941N966
$$ plain form
6374 1420846 1550708 1576577 1522938 1342759 1199061 1044155 923879 863246 826062 797261
6364 797261 795287 816750 780956 752841 740653 740677 752129 728371 735841 719779 716674 715856 696313
6351 696313 717117 688580 604738 584047 551760 554948 551869 545055 517255 539296 555991 504196
6339 504196 492899 529912 555367 531273 480073 455179 479508 485782 493248 467301 451831 463862
6327 463862 467924 476282 496703 476043 478837 498937 520864 505752 482010 469558 448900 476330
6315 476330 485635 498764 506926 482182 498279 468767 450378 422304 415181 406311 425099 451574
6303 451574 478220 486140 479815 509298 461875 457839 477417 524097 507172 444150 461464 473038
6291 473038 472744 461069 427988 441331 491972 487894 471429 495948 502417 494226 478834 482775 488741
6278D88741k127l0684k3439K928m364L8825J5976P87j8058m675J4646J6172j9241
6265D75487n8805K8515L0074r898J0286q026K7350J0401j6368l4886K5613K0722
6253E00465j1405k1763k5608M3819J3697J6155j846K3810k929J9638N097p403
6241E51727J916p576m1501o780J005Q041n304k50j761K0670L5645Q376J8723L0711
6227F13642l3630L0012J3369L1046R611L5043N6350L9640J04515N5138N0205p002
6215I97939n9691m8008m9407j02358j8797m3805n2139m2935j5603j7977j9267
6204E27952K4376O29o3500k7526o774J7878M149l498j4515K0531j22J5122k412
6191D92290p045k2698p313L3712j1041l0j0108K235k5727J0126j7452l5233O653
$$ plain form
6278 488741 486614 455930 432491 435419 431055 469880 485856 486643 468585 463910 478556 494728 475487
6265 475487 416682 445197 475271 465373 475659 467633 494983 505384 489016 454130 479743 500465
6253 500465 489060 467297 441689 485508 499205 515360 513514 537324 534395 554033 559130 551727
6241 551727 553643 546067 504566 497786 498791 506832 501528 501278 499517 520187 555832 564208 582931 613642
6227 613642 580012 610024 623393 654439 664050 699093 755443 795083 899598 954736 1004941 997939
6215 997939 938248 890240 840833 738475 719678 675873 623734 580799 565196 547219 527952
6204 527952 552328 552957 489457 461931 455157 473035 477184 473686 459171 479702 479580 494702 492290
6191 492290 485245 462547 455234 488946 477905 477875 467767 470002 444275 454401 436949 401716 408369
6178D08369M4039J1837j6272n603j777K7234J0316K2918Q672k6236J7931r149
6166D92279j7047R843K4463k8957j9083N913L4415L3829m041k1554M4537k452
6154E52145K346K3753L1871M9308m5351n725j4585j0255O876L75Q071k423p691
6141E88715L4411J9152k6669J5602j0442J7490M550J2368j7330o768O108j8300
6129F18887K5425j896J4272L0935n39m6062K6096J4224Q688j7434K1404r627P759
6116F92132j623K143N2211L2834o454r213R001L4791j1646L012N875K3010n797
6103H20276M714K7445M4322L1298L0707K9722j6367J4826L0939L4853N2660J7670
6091A123065L2920L4399M2178N9212O4340O2020L9127R4866N2172J09992O8419
$$ plain form
6178 408369 452408 464245 447973 442370 440593 467827 478143 501061 509733 483497 501428 492279
6166 492279 475232 485075 509538 480581 461498 467411 501826 535655 531614 510060 554597 552145
6154 552145 554491 578244 610115 659423 614072 608347 593762 583507 590383 590758 598829 596406 588715
6141 588715 623126 642278 615609 631211 620769 638259 642809 655177 637847 631079 637187 618887
6129 618887 644312 642416 656688 687623 687084 641022 667118 681342 690030 672596 694000 684373 692132
6116 692132 690509 692652 744863 777697 771243 762030 771031 805822 794176 797188 803063 826073 820276
6103 820276 824990 852435 896757 928055 958762 988484 972117 986943 1017882 1052735 1105395 1123065
6091 1123065 1155985 1190384 1232562 1291774 1356114 1418134 1457261 1552127 1604299 1714291 1782710
6080A782710M1590O5399J8540Q352n381l5803L441K2817K9646O1917K0499O2260
6068B075987M3420O9743P1736P8248N7064M6100P5294M9237M8040k8623p049n9914
6056B519283j462j3214k6839j4810j7703k7258j4285k0998r193J1839j7829J0069
6044B377600m091M3571O6418P7828L6533j748J573l2171m2599n4399p7259j34738
6032B256518n6159k0555n4015m9687m2297k5433J1500K5078q871J6909L3124O901
6020B093013k604n587J8232K5974L2293M3917P4868K7859m409M6317M1638M3585
6008B435096J2827L3064L7984L4732N5469L6468P5351R6823P9411P3128J27688
5997C098041Q3167J35409R7669J46959J35962J35198J13526J56765J80646J82404
$$ plain form
6080 1782710 1824300 1889699 1908239 1916591 1911210 1875407 1878848 1901665 1931311 1993228 2013727 2075987
6068 2075987 2119407 2189150 2260886 2339134 2396198 2442298 2517592 2566829 2614869 2586246 2579197 2519283
6056 2519283 2517821 2504607 2477768 2462958 2445255 2417997 2403712 2382714 2373521 2385360 2367531 2377600
6044 2377600 2373509 2417080 2483498 2561326 2597859 2596111 2597684 2565513 2522914 2468515 2391256 2256518
6032 2256518 2200359 2179804 2125789 2076102 2033805 2008372 2019872 2044950 2036079 2052988 2086112 2093013
6020 2093013 2090409 2084822 2103054 2129028 2161321 2205238 2280106 2307965 2303556 2349873 2391511 2435096
6008 2435096 2447923 2480987 2518971 2553703 2609172 2645640 2720991 2817814 2897225 2970353 3098041
5997 3098041 3181208 3316617 3414286 3561245 3697207 3832405 3945931 4102696 4283342 4465746
5987D465746J96177K74950L19997L38015L42575L79908M52009N71709O27986P72121
5977H741193R10529J150256J414214J889794K420021L074562L664593M081571
5969B7346733M271082M113899J570217k609660n304180o306127m877861l353378
5961A4850725k258749j614559j238087j064742r05489p51760o08369m90194l89469
5952E529307l06936k37423k15705j93406j64802j63414j56851j97371j67598j40352
5942C585449j26433r5207q4584l6967m7214m8251n0594p0867o1593o3689j03648
5931B796402o8117j9062m8717m8595k6992n4830l1930n6208k6932Q473j0103Q173
5919B421562o291j5647o252l7147M1437J893k3171L516q068L0444N3612j7960
$$ plain form
5987 4465746 4661923 4936873 5256870 5594885 5937460 6317368 6769377 7341086 7969072 8741193
5977 8741193 9651722 10801978 12216192 14105986 16526007 19600569 23265162 27346733
5969 27346733 31617815 35731714 37301931 34692271 29388091 23081964 18204103 14850725
5961 14850725 12591976 10977417 9739330 8674588 7769099 7017339 6408970 5918776 5529307
5952 5529307 5222371 4984948 4769243 4575837 4411035 4247621 4090770 3893399 3725801 3585449
5942 3585449 3459016 3363809 3279225 3242258 3195044 3146793 3096199 3025332 2963739 2900050 2796402
5931 2796402 2728285 2709223 2660506 2611911 2584919 2530089 2498159 2441951 2415019 2423492 2413389 2421562
5919 2421562 2415271 2399624 2393372 2356225 2397662 2399555 2376384 2379900 2371832 2402276 2455888 2437928
5907B437928k7250J9872L352P3010K0264m6140K3073L9011O5942R5402M5532J7238
5895B767234M062K2509L6524O5416M2786N6684M3356M7976Q4871O4138Q4506J38192
5883C458254R3202J04504R1498R3892O0152P8885K5644k1787m4283J9746j4938
5872C944769j481J0189P8319N1233P8164Q6663N2693J19010J04853J01605J61200
5861D787217J35811J53255J48265Q6943P6911J5274j0144n1419j6610k4074r155
5850E292274L7742N886O9580J55653J65215J26693J40118J58272J51328J47092
5840F449853Q9465L6501O129m0899o0935j25114p7756o2042l8946k4156Q734n6786
5828F104048m5385L495J3453K2957k917l6756j5398N4528M1716R2150L5521J09196
$$ plain form
5907 2437928 2410678 2430550 2433902 2506912 2527176 2481036 2504109 2543120 2609062 2704464 2749996 2767234
5895 2767234 2771296 2793805 2830329 2895745 2938531 2995215 3038571 3086547 3171418 3235556 3320062 3458254
5883 3458254 3551456 3655960 3747458 3841350 3901502 3980387 4006031 3984244 3939961 3959707 3944769
5872 3944769 3943288 3953477 4031796 4083029 4161193 4247856 4300549 4419559 4524412 4626017 4787217
5861 4787217 4923028 5076283 5224548 5311491 5388402 5403676 5393532 5342113 5325503 5301429 5292274
5850 5292274 5330016 5335902 5405482 5561135 5726350 5853043 5993161 6151433 6302761 6449853
5840 6449853 6539318 6575819 6581948 6541049 6480114 6355000 6277244 6215202 6176256 6152100 6160834 6104048
5828 6104048 6058663 6062158 6075611 6098568 6095651 6058895 6043497 6098025 6139741 6231891 6267412 6376608
5816F376608Q3906N9609J17825P4402J0824l8823n1815p1N5284O2375K7119K4141
5804F801384N7476O6148O1732R6584R7013J83489J30781J40798J93489J98923
5794H027817K00164J92099J66810J23810J09009J14349J14101J61038J82408K07809
5784I599414K30127K50176K88129L08563L19264L71370L79007M07442M44462M32386
5774A3030340N04824N50502O00405O30380O79976Q03160Q98134R71223J124917
5765A9793861J224293J416470J640947J931647K126988K373118K724573L012177
5757C6244074L304979L507985L486170L110060K344448J297757J37826q17763
5749E2615536j347554j348945r98368n61132K2014N91607J078009J487905J836171
$$ plain form
5816 6376608 6460514 6520123 6637948 6712350 6723174 6684351 6632536 6632465 6687749 6750124 6777243 6801384
5804 6801384 6858860 6925008 6986740 7083324 7180337 7363826 7494607 7635405 7828894 8027817
5794 8027817 8227981 8420080 8586890 8710700 8819709 8934058 9048159 9209197 9391605 9599414
5784 9599414 9829541 10079717 10367846 10676409 10995673 11367043 11746050 12153492 12597954 13030340
5774 13030340 13535164 14085666 14686071 15316451 15996427 16799587 17697721 18668944 19793861
5765 19793861 21018154 22434624 24075571 26007218 28134206 30507324 33231897 36244074
5757 36244074 39549053 43057038 46543208 49653268 51997716 53295473 53433299 52615536
5749 52615536 51267982 49919037 48920669 48359537 48381551 48973158 50051167 51539072 53375243
5740E3375243K310603K975787L778764M501941N038350N289103M861040L645425
5732H5776256J701355l92576k073304k965705l265787l447812l776857m108284
5724F7447286m062885l579918k736015j783512r16302j50175M66718R00761J254703
5715E6840661J615297J954982K224141K194762J635645M41154j320563l243418
5707F2342661m732819n453283n493553n008006m341809l655835l072588k635350
5699B7949418k253104j960449j685393j435229j278081j116587r57889q54116
5691A6408570p49662p31239o62020o18839n67386m93579n01635m18209m22400
5682A1243601l91078k90851l12746l20942k91881l01273k71065k62340k60654
$$ plain form
5740 53375243 55685846 58661633 62440397 66942338 71980688 77269791 82130831 85776256
5732 85776256 87477611 87085035 85011731 82046026 78780239 75332427 71555570 67447286
5724 67447286 63384401 59804483 57068468 55284956 54368654 54218479 54685197 55585958 56840661
5715 56840661 58455958 60410940 62635081 64829843 66465488 66906642 65586079 62342661
5707 62342661 57609842 52156559 46663006 41655000 37313191 33657356 30584768 27949418
5699 27949418 25696314 23735865 22050472 20615243 19337162 18220575 17262686 16408570
5691 16408570 15658908 14927669 14265649 13646810 13079424 12585845 12084210 11666001 11243601
5682 11243601 10852523 10561672 10248926 9927984 9636103 9334830 9063765 8801425 8540771
5673H540771k53576k26758k04686k25400j68456k10674j52946j50580j49788j32385
5663F665522q0680j19887j26494o6122r8487p6290j33545j38007j07496r5013
5653E623501p3155k9395m2543q1872p9651m5978n7625n1001n2300r2298j8342
5642D999341j3581p7130m0147l8564p1000k8359l376M267j9774J0530L070J0090
5630D735367J1650K3674J7861j8603J3558l6049l6052l0497J6811j007K1053O062
5618D723828R38J9683n142L5743N1432N8053O5772L2976O4703Q2646J02078L5182
5606E267892r530M522J3544K3455Q3680K5558N1931R5074N1607O842O4108R9965
5594E778648R6754P9954P3351O0202R4930Q9136Q4035P2094P9895Q6072J57742
$$ plain form
5673 8540771 8287195 8060437 7855751 7630351 7461895 7251221 7098275 6947695 6797907 6665522
5663 6665522 6584842 6464955 6338461 6272339 6173852 6097562 5964017 5826010 5718514 5623501
5653 5623501 5550346 5520951 5478408 5396536 5316885 5270907 5213282 5162281 5109981 5017683 4999341
5642 4999341 4985760 4908630 4868483 4829919 4758919 4730560 4727184 4731451 4711677 4722207 4725277 4735367
5630 4735367 4747017 4770691 4788552 4769949 4783507 4747458 4711406 4680909 4697720 4696713 4717766 4723828
5618 4723828 4724766 4744449 4739307 4775050 4826482 4884535 4950307 4983283 5047986 5130632 5232710 5267892
5606 5267892 5258362 5262884 5276428 5299883 5383563 5409121 5461052 5556126 5607733 5614575 5678683 5778648
5594 5778648 5875402 5955356 6028707 6088909 6183839 6272975 6357010 6429104 6508999 6595071 6752813
5583F752813J04137O5571J37715J11937J50242J55227J21248J53362K06312J75750
5573H134314J43091J46643J66014J51380J87703J69593J85669J77632K16263K14157
5563I892459K36833K93351L01562L53582L86432M08837M26114L83087M16947M55587
5553A3554791M72910M75980N08502N11813N63200N77067O18502P33169Q26157
5544A8842091R34502J079213J152447J353997J513223J734956J994316K278526
5536C0883271K632369L035073L520853M029678M479412M814031M875827M605693
5528F2876207L823851K410150O43954j119510k416972k879628k740743k169956
5520E8427353j548263r27671m40146l2110N74973J264085K077582K874287L580968
$$ plain form
5583 6752813 6856950 6922521 7060236 7172173 7322415 7477642 7598890 7752252 7958564 8134314
5573 8134314 8277405 8424048 8590062 8741442 8929145 9098738 9284407 9462039 9678302 9892459
5563 9892459 10129292 10422643 10724205 11077787 11464219 11873056 12299170 12682257 13099204 13554791
5553 13554791 14027701 14503681 15012183 15523996 16087196 16664263 17282765 18015934 18842091
5544 18842091 19776593 20855806 22008253 23362250 24875473 26610429 28604745 30883271
5536 30883271 33515640 36550713 40071566 44101244 48580656 53394687 58270514 62876207
5528 62876207 66700058 69110208 69754162 68634652 66217680 63338052 60597309 58427353
5520 58427353 56879090 55951419 55511273 55479163 56054136 57318221 59395803 62270090 65851058
5511F5851058M056222M138881L815843L181899K442763J735482Q09513o05924
5503H5425737k395846m239712n513282n788531n340126m431287l486927k574740
5495E1655286j861850j349068j028178o90175k64352J82912N88733R70734J136942
5486D9340984R58598M38557m69983j571230k611846l421322l786890l719492l390786
5477C1766590k889344k458379k126483j810298j560903j319652j158372r89466
5469A7453693q54384p62470o76216n80642n46039m42397l76129l73402l14534
5460A2527480k68815k32172k29638k64294k84316k75043l12555l44318l17690
5451I998639k96471k95196k38627j83747j69655j60889q2245p1282o5418p024
$$ plain form
5511 65851058 69907280 74046161 77862004 81043903 83486666 85222148 86031661 85425737
5503 85425737 83029891 78790179 73276897 67488366 62148240 57716953 54230026 51655286
5495 51655286 49793436 48444368 47416190 46726015 46461663 46644575 47233308 48204042 49340984
5486 49340984 50299582 50738139 50268156 48696926 46085080 42663758 38876868 35157376 31766590
5477 31766590 28877246 26418867 24292384 22482086 20921183 19601531 18443159 17453693
5469 17453693 16599309 15836839 15160623 14579981 14033942 13591545 13215416 12842014 12527480
5460 12527480 12258665 12026493 11796855 11532561 11248245 10973202 10660647 10316329 9998639
5451 9998639 9702168 9406972 9168345 8984598 8814943 8654054 8571809 8500527 8435109 8428085
5441H428085N7819Q0322J00512J18359J19282J24744R6344K2496j9314o1850j65978
5430H900821k76612l13885k55821k07749k17412j84977j74772j44568j06066j17833
5420F901126p4352l3771k4896j3919j9957k23j2615m4025J3358P6861N7837M5289
5408F870713N7463L2083q5212j12125j77555k42933k30044j56674p6428m0270
5398E839018J5340l4629r3901j15020j19853k46366k23299j98075j53717j36306
5388D533192j35743o7654n4861m7021p785j057k5521m6609n3698k667k7145l2810
5376D030621m6829l2163j9468L0584R741J0072l450m9735p3257p6760j01567q7872
5364C589917m1559l9569N39K1834k587K0721L9697k4390J4500k690M414R069J9200
$$ plain form
5441 8428085 8485904 8566226 8666738 8785097 8904379 9029123 9125467 9147963 9128649 9066799 8900821
5430 8900821 8624209 8310324 8054503 7846754 7629342 7444365 7269593 7125025 7018959 6901126
5420 6901126 6826774 6793003 6768107 6754188 6734231 6734008 6721393 6677368 6690726 6767587 6825424 6870713
5408 6870713 6928176 6960259 6875047 6762922 6585367 6342434 6112390 5955716 5879288 5839018
5398 5839018 5854358 5819729 5725828 5610808 5490955 5244589 5021290 4823215 4669498 4533192
5388 4533192 4397449 4329795 4274934 4227913 4220128 4219071 4193550 4146941 4093243 4090576 4063431 4030621
5376 4030621 3983792 3951629 3932161 3962745 3972486 3982558 3979108 3929373 3856116 3779356 3677789 3589917
5364 3589917 3548358 3508789 3509328 3531162 3528575 3549296 3588993 3564603 3579103 3576413 3580827 3589896 3609096
5351C609096L2528M7644O194n3221p8345r2553j19752j09100j05864j17796j01951
5340B916880p5397k7446m5038k1770j50L04K587j002L734J7748p758o930k2494
5327B733268k7607n9139p7812k7519n486m5019j01687o1636n7965r9511m0674
5316B129213l9078j3058R075p296m926l2345J7210j02j8040J7065R514K0456K5094
5303B112782L1218L3349Q8923J0937J4127N4209P418j290j5724l2385o1052o2136
5291B180376p4109l2605j7151l3104k6993L3802K6240N466J4715K7188M6897K736
5279B153458L9806N8927M9967R0052J09994J01763P7053J33036J80884K00604
5269C195544K02254J60664N6090j5083q7976j72192j82744k55386j67130j47699
$$ plain form
5351 3609096 3641624 3689268 3695462 3642241 3563896 3471343 3351591 3242491 3136627 3018831 2916880
5340 2916880 2841483 2814037 2768999 2747229 2747079 2747383 2749970 2748968 2752702 2770450 2762692 2755762 2733268
5327 2733268 2705661 2646522 2568710 2541191 2535705 2490686 2388999 2327363 2269398 2169887 2129213
5316 2129213 2090135 2077077 2086152 2078856 2073930 2041585 2058795 2058693 2040653 2057718 2067232 2087688 2112782
5303 2112782 2144000 2177349 2266272 2277209 2291336 2345545 2352963 2351673 2335949 2303564 2242512 2180376
5291 2180376 2106267 2073662 2056511 2023407 1996414 2030216 2056456 2061922 2076637 2103825 2150722 2153458
5279 2153458 2193264 2252191 2302158 2392210 2502204 2603967 2681020 2814056 2994940 3195544
5269 3195544 3397798 3558462 3614552 3599469 3511493 3339301 3156557 2901171 2734041 2586342
5259B586342o5088p9450m4439o407k2709j6821M6227N0713O8353J15750P7239
5248B709710J51926J31657K00367J74307J61379J32399J05630O0796R620j23163
5238C714628j35511k65083k50080k06953k12763j71960j26187p6183k6120m7285
5228B196503m8052l4520j0627K386J4767M2880L0385M5970J01904J33752P1284
5217B546632L9604M984m973l0224o9708j11813j08544r5203p6541o8605l4527
5206A991082l7375K1895l975k4515n4414l4743k7466k7831l3267l2284J0388R773
5194A757268l7301N355j8141J465J6181L7778o34L1954L738J0611K9007L5411
5182A872692L3603L4472k521k1351M250j7902p522J5398J217k9555L286j7525
$$ plain form
5259 2586342 2521254 2441804 2397365 2390958 2368249 2351428 2397655 2448368 2516721 2632471 2709710
5248 2709710 2861636 2993293 3193660 3367967 3529346 3661745 3767375 3828171 3837791 3714628
5238 3714628 3579117 3314034 3063954 2857001 2644238 2472278 2346091 2269908 2243788 2196503
5228 2196503 2148451 2113931 2103304 2105690 2120457 2163337 2193722 2239692 2341596 2475348 2546632
5217 2546632 2586236 2591220 2586247 2556023 2486315 2374502 2265958 2170755 2094214 2025609 1991082
5206 1991082 1953707 1975602 1971627 1947112 1892698 1857955 1830489 1802658 1769391 1737107 1747495 1757268
5194 1757268 1719967 1725322 1707181 1708646 1724827 1762605 1761971 1793925 1797663 1808274 1837281 1872692
5182 1872692 1906295 1940767 1938246 1916895 1921145 1903243 1895721 1911119 1912336 1882781 1886067 1868542
5170A868542L5893M8820K0223K5351L1505q18K7845K230L415J4321M4218k9539
5158B092006J3750J7073J8304M1220R490J8973K3189K3293M7281M5910N4181K9130
5146B433800N5728O5248L3669O4435N7296N0862N7549K5333N8921M2391J9830
5135B965062N1741L8407O8219N2117M4325L8352P7652O4883K6415P9698J14213
5124C621084J19003N9575Q4243P9657Q9601J02415J17199J25985J16927J13417
5114D629106J08537J31732J16548R9569J12139J66759J88011J43561J28417J67097
5104E991476J64395J67271J80100J77132J69337J92172J72180J84240K38128K07084
5094G843515K42662K25846K30379K66822K18208K75757K85822K83266L13414L66033
$$ plain form
5170 1868542 1904435 1953255 1973478 1998829 2030334 2029516 2057361 2059591 2063006 2077327 2121545 2092006
5158 2092006 2105756 2122829 2141133 2182353 2191843 2210816 2234005 2257298 2304579 2350489 2404670 2433800
5146 2433800 2489528 2554776 2588445 2652880 2710176 2761038 2818587 2843920 2902841 2945232 2965062
5135 2965062 3016803 3055210 3123429 3175546 3219871 3258223 3335875 3400758 3427173 3506871 3621084
5124 3621084 3740087 3799662 3883905 3963562 4053163 4155578 4272777 4398762 4515689 4629106
5114 4629106 4737643 4869375 4985923 5085492 5197631 5364390 5552401 5695962 5824379 5991476
5104 5991476 6155871 6323142 6503242 6680374 6849711 7041883 7214063 7398303 7636431 7843515
5094 7843515 8086177 8312023 8542402 8809224 9027432 9303189 9589011 9872277 10185691 10551724
5084A0551724L36104L75379M78418M81511N57984N88530O02761O94651P33552
5075A5400614Q06975Q32534R41532R50206J005774J139877J302646J440729J614466
5066B5435353J797423K046653K321738K588697L025052L487703M016637M715494
5058D9434750N512121O533600P692751Q973124J0032776J0766135J0883834J0219944
5050A20049035Q672571N820888K201631j516398n039662q218188j0613284j1904419
5042I9452174j1947518j1106851r851656q433081o948747n726923m735488l976552
5034C6725358l328573k819011k382873k099461j837497j579356j400492j274730
5026B0003365j167339j042098r70086q93574p87632p08464o42874n74098n75835
$$ plain form
5084 10551724 10887828 11263207 11741625 12223136 12781120 13369650 13972411 14667062 15400614
5075 15400614 16207589 17040123 17981655 18931861 19937635 21077512 22380158 23820887 25435353
5066 25435353 27232776 29279429 31601167 34189864 37214916 40702619 44719256 49434750
5058 49434750 54946871 61480471 69173222 78146346 88179122 98945257 109829091 120049035
5050 120049035 128721606 134542494 136744125 135227727 130188065 121969877 111356593 99452174
5042 99452174 87504656 76397805 66546149 58113068 51164321 45437398 40701910 36725358
5034 36725358 33396785 30577774 28194901 26095440 24257943 22678587 21278095 20003365
5026 20003365 18836026 17793928 16823842 15930268 15142636 14434172 13791298 13217200 12641365
5017A2641365n07278n09128m60846n12556m82820m56290m42474m46223m24328
5008H399422l94215l53521l05660l11465k59392k64629k16032j85677j84963j89406
4998E734462j67510j70127j44586j98132j36893j39108j36394j14275j19714j14061
4988D293662m3967j04169q6603p5435q0633p9496p0819o9397o9813l2964q6361
4977C494005p3528o9148q1561j11458j20394j12636r0420q2273q7048o6012q7572
4966B511955j27356m8207r7851j26060m8660m7473r1524q1876n3358l2039k0807
4955A736744k9367o1981p7850o3363j9473l1667n540P272k473r051k4832j7294
4943A401125k2741k6151j7997p896o441J4497j0568j124r308n104R310l7955l0802
$$ plain form
5017 12641365 12134087 11624959 11164113 10651557 10168737 9712447 9269973 8823750 8399422
5008 8399422 8005207 7651686 7346026 7034561 6775169 6510540 6294508 6108831 5923868 5734462
4998 5734462 5566952 5396825 5252239 5054107 4917214 4778106 4641712 4527437 4407723 4293662
4988 4293662 4249695 4145526 4058923 3983488 3902855 3823359 3752540 3683143 3613330 3580366 3494005
4977 3494005 3420477 3351329 3269768 3158310 3037916 2925280 2834860 2752587 2665539 2599527 2511955
4966 2511955 2384599 2336392 2238541 2112481 2063821 2016348 1924824 1842948 1789590 1757551 1736744
4955 1736744 1707377 1645396 1567546 1504183 1484710 1453043 1447503 1454775 1452302 1443251 1418419 1401125
4943 1401125 1378384 1352233 1334236 1326340 1319899 1334396 1323828 1322704 1313396 1308292 1317602 1279647 1248845
4930A248845N650j8907j8014l3651n8780p944L757m5298j6254l8004k6108m1434
4918I53858j3817K1888j7953K2680Q527o119j8184L76m3791L4260Q282l3789n7635
4905H58583k7044j8086l9465o3767l9893j1910j1726l2865k7258l6662j4687p797
4893E27423K0565n895l8403k7963j0209p964j1132k8418n418p59k9122K7952j6434
4880C94223k3694m248L1907k73j8102N025j095j1606O702l128R920j7427J9659
4867C87863j5810j4805k9770k6783L07M61Q292J7184l5927j6728J7994m441K9576
4854C17413L391J4175L574m13j9295n885j3470j5162n725j5561N431j0226j596
4841B56651K1165j1126o1938m599K3474J214Q270J9034j4972l0179L0077J8101
$$ plain form
4930 1248845 1254495 1235588 1217574 1183923 1125143 1117199 1120956 1075658 1059404 1021400 995292 953858
4918 953858 940041 961929 943976 966656 975183 969064 950880 951256 907465 941725 950007 916218 858583
4905 858583 831539 813453 773988 710221 670328 658418 646692 613827 586569 549907 535220 527423
4893 527423 547988 542093 503690 475727 465518 457554 446422 418004 412586 411827 382705 410657 394223
4880 394223 370529 366281 398188 397915 379813 384838 383743 372137 378839 375711 385631 368204 387863
4867 387863 372053 357248 327478 300695 301002 301463 309755 326939 291012 274284 292278 287837 317413
4854 317413 320804 334979 338553 338140 318845 312960 299490 284328 278603 263042 268473 258247 256651
4841 256651 277816 266690 204752 200153 223627 224841 233111 252145 237173 206994 237071 255172
4829B55172k2202j6707P521j0143J7946R880j9245k6408O567O0152j2501k3085
4817B26947j8036K007k1770L1895J0051n38l0230O570L7731l9122q159R468J0795
4804B17609l1563J629K2104p05J7968J0804p32l63n7135J6307L8841j0685j1952
4791B12127Q603K650m750N50J2238n840O722q396l2895k0227J966J8171J9104
4778B10023O601j6838k4387j7947O8442j1004j1125k0677Q902J2120k6877j6837
4766A60396J3108M528L1360J5406p485L9294j296k9829L1917M3111J2946J7721
4754C31177L0185J5621N9383N6047N1725P1564N0005R7728K1746n436j4650k878
4742G62217p09l6692o3730o2104m7965o7757o4504k5431n0897l9012k9839j8217
$$ plain form
4829 255172 232970 216263 223784 213641 231587 241467 222222 195814 202381 262533 250032 226947
4817 226947 208911 210918 189148 221043 231094 230556 200326 206896 244627 205505 197346 206814 217609
4804 217609 186046 187675 209779 209074 227042 237846 237114 236751 179616 195923 234764 224079 212127
4791 212127 220730 223380 218630 219180 231418 225578 232300 223904 191009 170782 172748 190919 210023
4778 210023 216624 199786 175399 157452 225894 214890 203765 183088 191990 204110 177233 160396
4766 160396 173504 178032 209392 224798 217313 256607 255311 225482 257399 300510 313456 331177
4754 331177 361362 376983 436366 492413 544138 615702 665707 763435 785181 779745 765095 762217
4742 762217 761508 724816 661086 598982 551017 483260 418756 393325 342428 303416 273577 255360
4730B55360l4026J3792j5432l0471K1177R906J024j236L620l2987O636r600q372
4717A79391K0861k7658O83K0954O671j6672j856o0993N6423J9262j5142j0633
4705A71291k1304q468m5513K3238M7048m0558P11N193m42J8106m353J1676p846
4692A48779j3649j6549q444J5919J5944j3012K748J8664L128k3716R041m830k4779
4679A09244K5588J81m889l382j6891Q329l5441J1473J0783J5712L6336J3652q745
4666A61950q610O263k412j5193O900Q51N725K2676m4744k8722J7542q512J9884
4653A33598k171n421j2119L1808j319l840o765j318J27q980k7034K2499J1725
4640A30790K2038r491J4550K8100n0041j3023L9453k4503n707L2687J8570k3935
$$ plain form
4730 255360 221334 235126 219694 189223 210400 220306 221330 220094 223714 190727 197363 187763 179391
4717 179391 200252 172594 173277 194231 200902 184230 182374 121381 177804 197066 181924 171291
4705 171291 149987 141519 96006 119244 166292 125734 126445 131638 131196 149302 144949 156625 148779
4692 148779 135130 118581 110137 126056 142000 128988 131736 150400 153528 129812 138853 134023 109244
4679 109244 134832 135013 130124 126742 109851 118180 82739 94212 104995 120707 157043 170695 161950
4666 161950 153340 159603 157191 141998 148898 149749 155474 178150 133406 104684 122226 113714 133598
4653 133598 131427 126006 113887 145695 144376 140536 133771 132453 132580 123600 96566 119065 130790
4640 130790 152828 143337 157887 185987 135946 122923 162376 137873 132166 164853 183423 159488
4628A59488Q887N8728j4064j6350j5018R130j1134j2630M923l4583p962M1377
4616A70792J7566N193j0385j8993j4983O1148j2055l3430L6267J5120k5882R920
4604B00278K8362O395j0669j4291O297N823J2616p371k8774M6147m7255j9775
4592A77783K6913J4306K2981j669o994j2902k836j149n294K7644J1502k882K5956
4579B73359k2425n971K2081P014J4k0133M51k5997J0427k1383j9743N4522J021
4566B53237j2846K607L0459J2907n2278m022K8604j3304j2033j6905J3488N694
4554B35608O097k374k1364m866J3055J5832o274N321n535L0795K7025m5619L2844
4541B80545k6127N6890j8770l3449K2451k9384L1454N660k0814J7281j5718J8967
$$ plain form
4628 159488 168375 227103 213039 196689 181671 190801 179667 167037 171960 137377 129415 170792
4616 170792 188358 193551 183166 164173 149190 210338 198283 164853 201120 216240 190358 200278
4604 200278 228640 235035 224366 210075 216372 222195 234811 227440 198666 244813 197558 177783
4592 177783 204696 219002 241983 240314 233320 220418 217582 216433 211139 238783 250285 247403 273359
4579 273359 250934 244963 267044 274058 274072 253939 254390 228393 238820 217437 197694 252216 253237
4566 253237 240391 242998 273457 286364 234086 230064 258668 245364 233331 216426 229914 235608
4554 235608 241705 239331 217967 213101 226156 241988 235714 241035 235500 266295 293320 247701 280545
4541 280545 254418 311308 292538 259089 281540 252156 283610 289270 268456 285737 270019 288986
4529B88986J8503k6845m435J3999K063j9015J7216J3054o743K583m691k6640R198
4516B77233L3211N262r125j4254p11N881K2077J1172L7127j2825k9229l826p731
4503C14262L306K005J4753k1632L715K3372M56j8653J3691J1144K0559J6239j7921
4490C65296n7526R373J0726K8541q339j8844J5468K4509j5840l588P49K6694J891
4477C79110j6392L42K3268M4294k6461m7879L2510J6858N37j802J9399j7569K3306
4464D29521J4514j1551l036j5998K0455m4999j4413N0655m600K4767M5157j1818
4452D78654J6655J7135K8789L0202M2607K7585K2552N1555r89J7568L5662J9987
4440G87962J2473P069j6587m5341k1070k4532j4977j2558j8792k131r603j8108
$$ plain form
4529 288986 307489 280644 276209 290208 292271 273256 290472 303526 296783 299366 294675 268035 277233
4516 277233 310444 315706 306581 292327 291616 297497 319574 330746 367873 355048 325819 321993 314262
4503 314262 317568 319573 334326 312694 316409 339781 340237 321584 335275 346419 366978 383217 365296
4490 365296 307770 317143 327869 356410 348071 329227 344695 369204 353364 349776 350525 377219 379110
4477 379110 362718 363060 386328 430622 404161 356282 388792 405650 406187 404385 423784 406215 429521
4464 429521 444035 432484 429448 413450 433905 388906 374493 425148 420548 445315 490472 478654
4452 478654 495309 512444 541233 571435 614042 641627 664179 715734 714745 732313 767975 787962
4440 787962 800435 807504 790917 745576 724506 699974 684997 672439 653647 651516 641913 623805
4428F23805n352k7760j2138m333q428l0012J8664k5581K7932N8030L022P020J9715
4415F44584o767J804J7102K8776M8404J2809j0350o640R023N3363q990O548j8425
4402G71241K2163J8377K8185K006j6513N5291L2674M0056J5808J6623M8548L9302
4390A073761k6939K8703P9226M5818P8132N7253Q0512J00088J37435J39130J50736
4379A943855J73935J92235K06990J25422Q5840k3138p8144r3229j33979j62875
4369B236912j11624r7456j89751j40428j13550j02712o7122p8908p2011o5143
4359A198207l7150k8242l0045k9944k0539j6927j8457k8471J9311J5658j2462
4348A010939l1025J0060J5499L2502K0254j2215K7248O669J6456K2003p869K7515
$$ plain form
4428 623805 618453 590693 578555 574222 565794 535782 554446 528865 556797 614827 617849 624869 644584
4415 644584 637817 639621 656723 685499 733903 746712 736362 729722 738745 792108 783118 789666 771241
4402 771241 793404 811781 839966 841972 825459 880750 913424 953480 969288 985911 1034459 1073761
4390 1073761 1046822 1075525 1154751 1200569 1278701 1335954 1416466 1516554 1653989 1793119 1943855
4379 1943855 2117790 2310025 2517015 2642437 2728277 2705139 2626995 2533766 2399787 2236912
4369 2236912 2125288 2027832 1838081 1697653 1584103 1481391 1414269 1335361 1263350 1198207
4359 1198207 1161057 1132815 1102770 1072826 1052287 1035360 1016903 988432 1007743 1023401 1010939
4348 1010939 979914 989974 1005473 1037975 1058229 1046014 1073262 1079931 1096387 1118390 1110521 1138036
4336A138036L801l253J0365Q529j062l9780j170k5305K8538L2249N268M2653l0988
4323A167881j1242m786R747k7738O220J7117k1281P273K1083O0603K7181L2610
4311A284668L8817L6463Q556J454K1431J4959K8077J1425L5554k9646j1731j5147
4299A424880N4461L0370m1434K0676K4751K2084J7922j0643J0840L6725r180J0347
4287A591799M9873L2925K3046K7088J3750J7859K351K0146J1517j1064M1038M3216
4275A863544L8033O2094M5567L8078k812j4878m684N7180M6033M2637L5999J1786
4263B218577N6594J1618M5962P5405M5991N7622O8504P9996O1268M2539M2905
4252B806981N7339J02586J14876J25145J04514R3950J82417J41022J26265J18053
$$ plain form
4336 1138036 1141837 1138584 1148949 1157478 1156416 1116636 1115466 1090161 1118699 1150948 1156216 1198869 1167881
4323 1167881 1156639 1151853 1161600 1133862 1140082 1157199 1135918 1143191 1164274 1224877 1252058 1284668
4311 1284668 1323485 1359948 1368504 1369958 1391389 1406348 1434425 1445850 1481404 1451758 1440027 1424880
4299 1424880 1479341 1509711 1468277 1488953 1513704 1535788 1553710 1543067 1553907 1590632 1581452 1591799
4287 1591799 1641672 1674597 1697643 1724731 1738481 1756340 1758691 1778837 1790354 1779290 1820328 1863544
4275 1863544 1901577 1963671 2009238 2047316 2044504 2029626 2024942 2082122 2128155 2170792 2206791 2218577
4263 2218577 2275171 2286789 2332751 2408156 2454147 2511769 2580273 2660269 2721537 2764076 2806981
4252 2806981 2864320 2966906 3081782 3206927 3311441 3405391 3587808 3728830 3855095 3973148
4242C973148Q0624K1504j2999p6213p0214n4191q3166l2523q731m599O183J0651
4230C749474L4912L7704N2925J10341O8842P4932R7664M0106k7420k9416q4479
4219D125585l7648J9697r924j2349o7425j8776O0829N5693P6861J05856J04899
4208D403298Q8799J06028J02510J56349J40469J10527J06518J40692J30897P2508
4198E558595J0116O2158P7129P3706J08598J37193J32041J75899K15262J88697
4188F739394K18142K66788K66182K03020J88472J21839Q1041O4150P2722Q2250
4178H304000J70480K23886K70503L00805L26818K71377K43202K04682K23693K55943
4168A0795389L28505M23556M68018N75755P27941Q07985Q89403R53440R03908
$$ plain form
4242 3973148 4053772 4075276 4062277 3986064 3915850 3861659 3778493 3745970 3737239 3732640 3738823 3749474
4230 3749474 3784386 3822090 3875015 3985356 4054198 4129130 4226794 4266900 4239480 4210064 4125585
4219 4125585 4087937 4107634 4097710 4085361 4017936 3999160 4059989 4115682 4192543 4298399 4403298
4208 4403298 4492097 4598125 4700635 4856984 4997453 5107980 5214498 5355190 5486087 5558595
4198 5558595 5568711 5630869 5707998 5781704 5890302 6027495 6159536 6335435 6550697 6739394
4188 6739394 6957536 7224324 7490506 7693526 7881998 8003837 8084878 8149028 8221750 8304000
4178 8304000 8474480 8698366 8968869 9269674 9596492 9867869 10111071 10315753 10539446 10795389
4168 10795389 11123894 11547450 12015468 12591223 13319164 14127149 15016552 15969992 16873900
4159A6873900P11573K83102k94576o56590q20502o87676m99377l10953j69305
4150A4429596q3173R095J09441J36241J98000K43819K66275K56490K56298K26188
4140A6048270K54537K97289L47474L97145L88932M59452N36173N06461N24293
4131A9760026M86872M99938N30489M84864N37392O15314P22223P68561R06403
4122B5312082R78328J111902J254007J388450J400770J413892J378971J365688
4114C5604090J454060J637063J788061J954692K160045K446603K732421L139964
4106E2916999L544433M003541M428174M790596N229278N772975O418981P393248
4098I4498225Q707924J0583208J3084997J6205226J9997351K4023506K7549779
$$ plain form
4159 16873900 17585473 17868575 17573999 16917409 16096907 15409231 14909854 14598901 14429596
4150 14429596 14346423 14355518 14464959 14601200 14799200 15043019 15309294 15565784 15822082 16048270
4140 16048270 16302807 16600096 16947570 17344715 17733647 18193099 18729272 19235733 19760026
4131 19760026 20246898 20746836 21277325 21762189 22299581 22914895 23637118 24405679 25312082
4122 25312082 26290410 27402312 28656319 30044769 31445539 32859431 34238402 35604090
4114 35604090 37058150 38695213 40483274 42437966 44598011 47044614 49777035 52916999
4106 52916999 56461432 60464973 64893147 69683743 74913021 80685996 87104977 94498225
4098 94498225 103206149 113789357 126874354 143079580 163076931 187100437 214650216
4091B14650216K9931733L0142714K5940753J3796039n039865k4843813l7191246
4084B47386531l9138360l4161571k6791710k0576279j5854158j2665433j0392802
4077H7806218q755005p307749o085291m994234m089037l429219k987045k678803
4069D7479835k474388k286968k182960k063029j908108j695969j517586j328770
4061C2022057j196184j076713r54750q29215p88411p01481p16759p51612p53792
4052B4253140p94510p68323p24595o38315n88785n58798m50100m17417l72040
4043A8940257k61963k70873k68846k18923j98422j92599k29716k10038j64565
4034A6924312k08564j85029j32808j18288n0871j8439l406J0083M8534N1805K4465
$$ plain form
4091 214650216 244581949 274724663 300665416 314461455 309421590 284577777 247386531
4084 247386531 208248171 174086600 147294890 126718611 110864453 98199020 87806218
4077 87806218 79051213 71743464 65658173 60663939 56574902 53145683 50158638 47479835
4069 47479835 45005447 42718479 40535519 38472490 36564382 34868413 33350827 32022057
4061 32022057 30825873 29749160 28794410 27965195 27176784 26475303 25758544 25006932 24253140
4052 24253140 23458630 22690307 21965712 21327397 20738612 20179814 19729714 19312297 18940257
4043 18940257 18678294 18407421 18138575 17919652 17721230 17528631 17298915 17088877 16924312
4034 16924312 16715748 16530719 16397911 16279623 16228752 16210313 16206907 16216990 16265524 16317329 16341794
4023A6341794Q1610Q9749P9597J15844J36558O9118L3859Q659J2645l3938R071
4012A6944566M0382M9694Q5598J25522J40045R4826J6310M0718N0505Q5264R3383
4001A7766813R7080J96839K00844K44130K85790L28298L09494K86870L32247L69356
3991B0417761L62831M08790M41558N22938O02515O78554P53127P99758Q54685
3982B5842517R55591J014350J104754J182344J192365J185326J206331J277806
3974C4961384J381555J525092J722843J963626K220300K472243K848442L198131
3966E2293616L589443M086313M684036N446707O400044P640709R191927J1092361
3958A04425156J3357196J5802194J8116712J9860036K0091597J8010581J4098970
$$ plain form
4023 16341794 16423404 16513153 16592750 16708594 16845152 16914270 16948129 16956788 16969433 16935495 16944566
4012 16944566 16984948 17034642 17120240 17245762 17385807 17480633 17496943 17537661 17588166 17673430 17766813
4001 17766813 17863893 18060732 18261576 18505706 18791496 19119794 19429288 19716158 20048405 20417761
3991 20417761 20780592 21189382 21630940 22153878 22756393 23434947 24188074 24987832 25842517
3982 25842517 26798108 27812458 28917212 30099556 31291921 32477247 33683578 34961384
3974 34961384 36342939 37868031 39590874 41554500 43774800 46247043 49095485 52293616
3966 52293616 55883059 59969372 64653408 70100115 76500159 84140868 93332795 104425156
3958 104425156 117782352 133584546 151701258 171561294 191652891 209663472 223762442
3951B23762442Q373912J80544q697551j5797125k0033864k1472490k0875211j8829341
3943A26611316j5917381j2956337j0336873q337033o768709n533126m473542l645680
3935E8642635k943258k421983k040713j752608j528521j324425j216526j060614
3927D4353987q94639p45050n47853l45268j15800J08899K73467M46636O55977
3918D3190356Q92526J147785J369794J654335J976132K293903K713863K999042
3910E8237736L206811L229877K984047K291965J184736J58893l12967l34504j56146
3901G0490448k05087m95665j117501j940577k812051l531961m001267m177844
3893E2208495m083650l756943l427411l001403k627055k355686k024910j831077
$$ plain form
3951 223762442 232136354 232316898 223619347 207822222 187788358 166315868 145440657 126611316
3943 126611316 110693935 97737598 87400725 79063692 72294983 66761857 62288315 58642635
3935 58642635 55699377 53277394 51236681 49484073 47955552 46631127 45414601 44353987
3927 44353987 43459348 42714298 42166445 41821177 41705377 41814276 42087743 42534379 43190356
3918 43190356 44082882 45230667 46600461 48254796 50230928 52524831 55238694 58237736
3910 58237736 61444547 64674424 67658471 69950436 71135172 71294065 70981098 70646594 70490448
3901 70490448 70285361 69789696 68672195 66731618 63919567 60387606 56386339 52208495
3893 52208495 48124845 44367902 40940491 37939088 35312033 32956347 30931437 29100360
3885B9100360j533797j373203j226541j083049r68277q40211p54941o93896n65542
3876B0060903n35306m26671l45245k50438j75233m2263K5146L6964l0006k20581
3866A8097270n76109r11350r96460r48672p85562o37542n85907n04146m16315
3857A1735207l65340l21872k90297k87191k61085j92445j64323j50568j33586
3848I568500j15441j09206q8590r2937o5126l0332j1280J6255n855M429J4997
3837I085414Q0451Q0254P1323R3738R3400J49250J43230J59730K35758K37744
3827A0430292L18752L76938L54965M57328N45595O30061P24085Q06724R35030
3818A5579770J157710J310946J496412J645518J774580J828705J743831J446094
$$ plain form
3885 29100360 27566563 26193360 24966819 23883770 22915493 22075282 21320341 20626445 20060903
3876 20060903 19525597 19098926 18753681 18503243 18328010 18285747 18310893 18347857 18317851 18097270
3866 18097270 17521161 16609811 15613351 14664679 13879117 13241575 12655668 12151522 11735207
3857 11735207 11369867 11047995 10757698 10470507 10209422 10016977 9852654 9702086 9568500
3848 9568500 9453059 9343853 9255263 9162326 9097200 9066868 9055588 9071843 9065988 9070417 9085414
3837 9085414 9165865 9246119 9317442 9411180 9504580 9653830 9797060 9956790 10192548 10430292
3827 10430292 10749044 11125982 11480947 11938275 12483870 13113931 13838016 14644740 15579770
3818 15579770 16737480 18048426 19544838 21190356 22964936 24793641 26537472 27983566
3810B7983566Q86841m2928j138871j985211k296520k268952k004997j734162j415762
3801A5983004j190739r73222q13857p06048o90643p15323o93433o33195n95778
3792H970766n23552m02084l96136l16522k54883k44129k03947j62692j44936j66788
3782F155097j83243k05243k87151k34241k28702j79039j66988j68063j16523j05745
3772D280159j33787j32229j09517j00854n2635n4007n6024k3095m2043k4791k1310
3761C529867r732k3094q2918j3187p6510p4303j3417o8098l2837m4091m9998l6016
3749C005666L183l7511n1087j4535J8335m8479j1148n2870o6903l401j5986m9420
3737B675844k9096k2223n1130l4855p2912m3535l6117k0338k0527J8999j652j5313
$$ plain form
3810 27983566 28870407 28827479 27688608 25703397 23406877 21137925 19132928 17398766 15983004
3801 15983004 14792265 13819043 13005186 12299138 11608495 10893172 10199739 9566544 8970766
3792 8970766 8447214 8045130 7648994 7332472 7077589 6833460 6629513 6466821 6321885 6155097
3782 6155097 5971854 5766611 5479460 5245219 5016517 4837478 4670490 4502427 4385904 4280159
3772 4280159 4146372 4014143 3904626 3803772 3751137 3697130 3641106 3618011 3575968 3551177 3529867
3761 3529867 3520135 3497041 3414123 3400936 3324426 3250123 3236706 3168608 3135771 3091680 3041682 3005666
3749 3005666 3008849 2971338 2920251 2905716 2924051 2875572 2864424 2811554 2744651 2741250 2725264 2675844
3737 2675844 2646748 2624525 2573395 2538540 2465628 2422093 2385976 2365638 2345111 2364110 2362458 2347145
3725B347145j3114l4773o5259k4636j8882k8497o6096k7521m4705r0146n1388
3714A882128m7208m3616m5450n1769k1184k3473l9917L583l8248J52K6808j2357
3702A589449l3790o976Q383L0614l9651J7433M850m1897k2856k2528j1884O877
3690A478024k5716K2504K1326J1033j393r657R285k156N086M3898j381j8664n229
3677A526960J9902J8973j6442L2824k7851k034N7257R385M046L3200O6493N5858
3665A778571M8559O8845R6417P4816Q8047J41381R1810J05562N2112q161m7950
3654B490009q4393j19784r7627j25805j36375j32853j00257q8997n4789p1166
3644A477963p5328m6100l2744j7922n9001l5125n9378j2400J7448j8726k9219
$$ plain form
3725 2347145 2334031 2299258 2233999 2209363 2190481 2161984 2095888 2068367 2023662 1933516 1882128
3714 1882128 1834920 1791304 1745854 1694085 1672901 1649428 1609511 1613094 1574846 1574998 1601806 1589449
3702 1589449 1555659 1548683 1557066 1587680 1548029 1565462 1570312 1528415 1505559 1483031 1471147 1478024
3690 1478024 1452308 1474812 1496138 1507171 1505778 1496121 1505406 1503250 1508336 1552234 1550853 1532189 1526960
3677 1526960 1546862 1565835 1549393 1582217 1554366 1552332 1609589 1618974 1623020 1656220 1722713 1778571
3665 1778571 1827130 1895975 1992392 2067208 2155255 2296636 2388446 2494008 2546120 2537959 2490009
3654 2490009 2405616 2285832 2188205 2062400 1926025 1793172 1692915 1603918 1549129 1477963
3644 1477963 1402635 1356535 1323791 1305869 1246868 1211743 1152365 1139965 1157413 1138687 1109468
3633A109468k6313l572L0039l4569k2645K78l2453k573j6104M071j5422M817k6038
3620I68984p112j5695M5605r99q185j2848K5024Q460K6382L760k2393q843j7527
3607I84613K1359R247O080k3338l6510j7156m2327o0619j612J0003o2617j8878
3595G68245l0455l5564K1632o248R134j6400K2463K8227M4191R378O0643K326
3583H77572l4014l3805j0221M077J0717K4062j4497j3503j585J5598J5403k7156
3571H12648m89k9393m1325k1165m835k1329j8822O690K4201k78q344j9081k7163
3558F51315P774j2429j6100l1060M0216l479j0324q443k3344J3663k0485k92p487
3545E79525J0830j7969J1789J6366L8997J0828k6676m758k9310N8314j7377o869
$$ plain form
3633 1109468 1083155 1079583 1109622 1075053 1052408 1052686 1020233 1017660 1001556 1005627 990205 995022 968984
3620 968984 961872 946177 991782 990783 982598 969750 994774 1003234 1029616 1033376 1010983 1002140 984613
3607 984613 1005972 1015219 1021299 997961 961451 944295 901968 841349 839737 849740 787123 768245
3595 768245 737790 702226 723858 717610 726744 710344 732807 761034 805225 814603 875246 877572
3583 877572 843558 809753 799532 803609 814326 838388 823891 810388 808803 824401 839804 812648
3571 812648 812159 782766 741441 720276 715441 694112 675290 681980 706181 705903 697559 678478 651315
3558 651315 659089 646660 630560 599500 639716 636237 625913 617470 594126 607789 587304 587012 579525
3545 579525 590355 572386 584175 600541 639538 650366 623690 618932 589622 647936 630559 623690
3533F23690M9650l3263O2779N4869M7392J4248L0795J7579M615J202k3832k1456
3521H28268j2975L9521k1393L3050K384j1792p539O84k3859n3375l1321j520j6959
3508G23174m5418k4607l7229j4068l692K4132J1019j709J9250o956J243K4477
3496F69616J5304m875o736M4898j7982j519j9140l888J092o419P01m2726j9863
3483F08463l7221N294k3509k1198J04k8307m6186k0930M247l0527j0550J3361
3471D13041o10k2550j1340K6724q399J5217J1261j2550M629L5724k8599p524Q944
3458D23968j7336j1036Q016J9002M996Q93k8360j3887J5022L9033M530K547l8588
3445D08800n069K7642N2943o907m0732J4192k891K2175J4638K294j6344J7261
$$ plain form
3533 623690 673340 640077 702856 757725 805117 819365 850160 867739 872354 873556 849724 828268
3521 828268 815293 854814 833421 866471 868855 857063 849524 850208 826349 772974 741653 740133 723174
3508 723174 677756 653149 615920 601852 598160 622292 633311 631602 650852 643896 645139 669616
3496 669616 684920 680045 673309 718207 700225 698706 679566 675678 676770 670351 671052 628326 608463
3483 608463 571242 576536 553027 531829 531933 503626 457440 436510 440757 410230 399680 413041
3471 413041 412431 389881 378541 405265 396866 412083 423344 410794 415423 451147 422548 415024 423968
3458 423968 406632 395596 403612 422614 427610 428503 400143 386256 401278 440311 444841 447388 408800
3445 408800 403731 431373 484316 477409 436677 450869 447978 470153 484791 487085 470741 488002
3433D88002L1281j816L4380N3049J0370O5583L756K0578J5819K460k9520j1499
3421F82443K6958j7927l3170k8160J9111K2257M518J1152K3015j8803J0956J2393
3409G14743l694M2350N2690K368q961M3494j808J3709L7193K0184M2866J7228
3397I72362O6436K6669J3979M9903M1715L0836K2880O9269P0506N6261K2891R778
3385A453485K0295M7819k8952j8756j6007l0736m0821K4963K0003K0425L8971
3374A490689L8908N5856O4180P2561N2866L9724j4374o0732q9121q7333j12338
3363A450886p3167n7210k0331r2211m4166K6096l250m5524k0367j2247q138R106
3351A109477j781K5817P6099K8650L1952K7501O4152M1668M4177L9998J14794
$$ plain form
3433 488002 519283 517467 551847 604896 615266 680849 684605 705183 721002 723462 693942 682443
3421 682443 709401 691474 658304 630144 649255 671512 676030 687182 710197 691394 702350 714743
3409 714743 711049 753399 806089 808457 799496 842990 841182 854891 892084 912268 955134 972362
3397 972362 1038798 1065467 1079446 1129349 1171064 1201900 1224780 1294049 1364555 1420816 1443707 1453485
3385 1453485 1473780 1521599 1492647 1473891 1457884 1427148 1386327 1411290 1431293 1451718 1490689
3374 1490689 1529597 1585453 1649633 1722194 1775060 1814784 1800410 1739678 1650557 1563224 1450886
3363 1450886 1377719 1320509 1300178 1207967 1163801 1189897 1186647 1141123 1120756 1108509 1100371 1109477
3351 1109477 1107696 1133513 1209612 1238262 1270214 1297715 1361867 1403535 1447712 1487710 1602504
3340A602504J36960J87219J70852J75818J33051l3705j23386j84419j89324j37603
3330A737967o4822p0578k6958n8457J8639J2955K3334R254K5128L8643l2406R858
3318A622557L2658K7673n314K9184p162L9262L0088P6225O4193M3608N2170O0944
3306B066086J29189R3520O4433N8399M5323k1994r7098k5952j66j3106o0604n7196
3294B180834K5097m2893j6733k2690K8396M1363L7198K0727N1955N1630O1839
3283B416723L3207O9495J07336R5710O7502Q8067R2318J07801R2879P1886J23054
3272C365978J43223J32408J03590O2233J05409J67698J89891J81206J78470K49563
3262D879669K32229K61751K65028K85737K89668K81531K71762K50226K27088K30186
$$ plain form
3340 1602504 1739464 1926683 2097535 2273353 2406404 2372699 2249313 2064894 1875570 1737967
3330 1737967 1673145 1602567 1575609 1517152 1535791 1548746 1572080 1581334 1606462 1645105 1612699 1622557
3318 1622557 1655215 1682888 1677574 1706758 1699596 1738858 1768946 1845171 1909364 1952972 2005142 2066086
3306 2066086 2195275 2288795 2353228 2411627 2456950 2434956 2337858 2311906 2311740 2298634 2238030 2180834
3294 2180834 2205931 2163038 2146305 2123615 2152011 2193374 2230572 2251299 2303254 2354884 2416723
3283 2416723 2449930 2519425 2626761 2722471 2789973 2878040 2970358 3078159 3171038 3242924 3365978
3272 3365978 3509201 3641609 3745199 3807432 3912841 4080539 4270430 4451636 4630106 4879669
3262 4879669 5111898 5373649 5638677 5924414 6214082 6495613 6767375 7017601 7244689 7474875
3252G474875J94234J09451Q3883k1479j42529l27330m27599n12604m66334m65943
3242E498625l97036l38565k91945k32114k26940j58613j68190j29220r5240q6872
3232C373890q7489o6178k6023n0930l8248j8517l3686o560M228q467o3451j23013
3220B855556j40217j31225j53655r0744j11864r9811p1028o7451r4026p3225n0608
3209A771702p8404n5664k5579l6704l6084j8565k9394k0939m3297Q390j8161O344
3197A423645Q069O519K1696M964K450j737J7031k3068m4105m9784n6888k8204
3185A280588n6885l4655j6534n8212k5246j8750n4217k3361K4922J6962R494j9528
3173A024578n5742n4359J1177n281J6316j4449j5999j9689j5538l481J2231l4532
$$ plain form
3252 7474875 7669109 7778560 7862443 7840964 7698435 7371105 6943506 6430902 5964568 5498625
3242 5498625 5101589 4763024 4471079 4238965 4012025 3853412 3685222 3556002 3460762 3373890
3232 3373890 3286401 3220223 3194200 3143270 3105022 3086505 3052819 3046259 3050487 3042020 2978569 2855556
3220 2855556 2715339 2584114 2430459 2339715 2227851 2128040 2057012 1989561 1895535 1822310 1771702
3209 1771702 1693298 1637634 1612055 1575351 1539267 1520702 1491308 1470369 1427072 1435462 1417301 1423645
3197 1423645 1431714 1438233 1459929 1464893 1467343 1465606 1482637 1459569 1415464 1365680 1308792 1280588
3185 1280588 1223703 1189048 1172514 1114302 1089056 1070306 1016089 992728 1017650 1034612 1044106 1024578
3173 1024578 968836 914477 925654 920373 936689 922240 906241 886552 871014 867533 879764 845232
3161H45232n9288k7135Q713k6950m312m697j8986O247l6326j4493K7100O139j8381
3148F82863K6218J5571J8273k199k6490K843L1995M943m1107j7275j2042j9965
3136F63628k276J2284k9048k9315k39J6536j4922m1218J7642K116r022N07k5095
3123E61578j4792J7106r668l0680j9037l628l6338m237l303L6597k3502j5465
3111D54631K7654n231J0654k7743q112J3716L2786K0966r025K2484k08l1974M9664
3098E50262K4942o171l840o044J3776P746L0001L8092J0911n83M5417K4396k7637
3085G01268j4699n545R80k2531j4133k3259k40l0631q221K3250r393m2604m0098
3072E14144L0454J7665O7758K0305J3939J8572j9838J5802Q699J2900K1697K5095
$$ plain form
3161 845232 785944 758809 767522 740572 736260 731563 712577 718824 682498 668005 695105 701244 682863
3148 682863 709081 724652 742925 740726 714236 717079 749074 754017 712910 695635 683593 663628
3136 663628 661352 673636 644588 615273 615034 631570 616648 575430 593072 595188 586166 586673 561578
3123 561578 546786 563892 554224 523544 504507 500879 464541 460304 457001 493598 470096 454631
3111 454631 482285 477054 487708 459965 451853 465569 498355 519321 510296 532780 532572 500598 550262
3098 550262 575204 569033 565193 559149 572925 580671 610672 648764 659675 659092 704509 728905 701268
3085 701268 686569 681024 682004 659473 645340 622081 621841 591210 582989 606239 596846 554242 514144
3072 514144 544598 562263 630021 650326 664265 682837 662999 678801 687500 700400 722097 747192
3060G47192N5019N7329K7866O2852L6566k096J2925L3376Q573l4635n6793r2773
3048H55401n7802l0272n0336j4197k2975J337j2802m6070P545P759J6294K832
3036F56714p649M2954k0263m108M0742K3155l1939L462K2684J2541K8476Q229
3024G74998K2449J2238M0403m7829j4374J7514J2564m2230m9064o828L2749M273
3012G56863k0964k0191J343j9484j1933L3978L2961k1720J9341N292L9638O3327
3000H58451k394Q909J8787N29K208r74o5229l1624k1136j724J1643j0361R616
2987G76701L7159J0787l1062j5999L2663J3770o797j3829m8788K1371J5883l1756
2975G60103j8651L925K3958k7589j2651L0569K5326l5496l409L023p885k9299
$$ plain form
3060 747192 802211 859540 887406 950258 986824 984728 997653 1031029 1039602 1004967 948174 855401
3048 855401 797599 767327 716991 702794 679819 681156 668354 622284 629829 637588 653882 656714
3036 656714 649065 692019 671756 667648 708390 731545 699606 703068 725752 738293 766769 774998
3024 774998 797447 809685 850088 802259 787885 805399 817963 775733 726669 719841 752590 756863
3012 756863 735899 715708 717051 697567 685634 719612 752573 730853 750194 755486 795124 858451
3000 858451 856057 864966 883753 884282 886490 885516 820287 788663 767527 765803 777446 767085 776701
2987 776701 813860 824647 793585 777586 810249 824019 817222 803393 754605 775976 791859 760103
2975 760103 741452 745377 769335 741746 729095 759664 784990 749494 746085 749108 741223 711924
2963G11924J2200K1874L9459K5366k4860m716M2756R813l764m196j6716l4783
2951G74357j1217j919K0967j4354K133J300K5594K764J4740K7607m1883K3800
2939H23889j4428k3819J0212O966L7844l79j0973J3536K613l911L2729k017L7538
2926I09800N3933m1302k6114L856L6287J9933J9105M85M370M5379L0183p231K3530
2913A072214j2781O394M9509O9100P696l576K3672N6612L2933Q49L61M6294k216
2900A347061J058J4083j4364j5461o3284l6824m1206m4211j1663l0639k4496l3056
2888A046998L3059l153l0812M2638L4069M460l4097J462J4238n2405q483j731
2876A046243j6494j8099l1119M1758r996j088m4435M0431k6329l1919m4866m9841
$$ plain form
2963 711924 724124 745998 785457 810823 785963 781247 824003 833816 830052 825856 809140 774357
2951 774357 763140 761221 782188 767834 769967 771267 796861 799625 814365 841972 800089 823889
2939 823889 809461 785642 795854 802820 840664 840285 829312 842848 845461 841550 874279 872262 909800
2926 909800 963733 922431 896317 900173 936460 956393 975498 975983 980353 1025732 1055915 1048684 1072214
2913 1072214 1059433 1065827 1115336 1184436 1192132 1188556 1212228 1268840 1301773 1302622 1302983 1349277 1347061
2900 1347061 1348119 1362202 1347838 1332377 1269093 1232269 1191063 1146852 1135189 1104550 1080054 1046998
2888 1046998 1080057 1076904 1046092 1088730 1122799 1127259 1093162 1094624 1108862 1056457 1047974 1046243
2876 1046243 1029749 1011650 980531 1022289 1012293 1011205 966770 1007201 980872 948953 904087 854246
2864H54246l8866j8215K3808j6514k0622n5384k2832k4258r575k3820k8107k1394
2852E98467q926l5042j3517j1120k8332m2610k0375k4804l4102k3692k1886J4791
2840C48852j888m6147l894R19j9902R937j8398l0395O727K720l1262q527K087
2827B10829n799j0123Q384j9009n670l2556m709J3366j2675J1216m929k1675j1785
2814A14865P971O338o876k566K16J3080j2399l4186O173q50J0566n3201J1288
2801F0419M6013k2745p52o564l8280o024j9970K4220j2590M902j0292k5420J618
2788e465R155k4813p133M0662J3830N286j6096j1864R028k469m689K2572j3571
2775A4433j1495j5326q863k2325K4357L72J3552J1744k1064Q840K821j849L1561
$$ plain form
2864 854246 815380 797165 820973 804459 783837 728453 705621 681363 671788 647968 619861 598467
2852 598467 589541 554499 540982 529862 501530 458920 438545 413741 379639 355947 334061 348852
2840 348852 346964 300817 296923 297842 277940 287877 269479 239084 245811 248531 217269 208742 210829
2827 210829 205030 194907 203291 184282 178612 146056 141347 154713 142038 153254 148325 126650 114865
2814 114865 122836 129174 122298 119732 119948 133028 120629 86443 92616 91766 102332 49131 60419
2801 60419 106432 83687 82935 76371 38091 32067 12097 36317 23727 28629 18337 -7083 -5465
2788 -5465 3690 -21123 -28256 12406 26236 31522 15426 3562 12590 10121 5432 28004 14433
2775 14433 2938 -12388 -21251 -43576 -19219 -18847 -5295 6449 -14615 -5775 -2954 -4803 26758
2762B6758l1524J3337q588k2417j0496K373J2269q100q501k1343J0149J0686K743
2749c2654J2138J5426k2341k609J0687j9105J3389J5122R32j3381j7517J5355
2737b4558j5852J2764m4919P200k3184l52J0520K9634p654r850P442q257L5902
2724c1164m0368J5552j1669J6954J4731k9722L952k0277K5847p739o602Q007n776
2711f8274N0060J0645k8731r374l8349K1794j4604N6569N27k4178J4284j136J5598
2698a5169j00r952k3653M215j4327L4507J349L259J7231j1541k0J5040j0833r255
2684a9249m444L172p681M3271k2344J0658K5601K7918k4495Q498j5885K4182M254
2671E3456j5008K258m83M934N919O918k6651p39L1418J1791m627J4399J8715p435
$$ plain form
2762 26758 -4766 8571 -17 -22434 -32930 -30557 -18288 -26388 -34889 -56232 -46083 -35397 -32654
2749 -32654 -20516 -5090 -27431 -30040 -19353 -38458 -25069 -9947 -9015 -22396 -39913 -24558
2737 -24558 -40410 -27646 -72565 -65365 -88549 -88901 -78381 -48747 -56401 -66251 -58809 -67066 -31164
2724 -31164 -71532 -55980 -67649 -50695 -35964 -65686 -61734 -82011 -56164 -63903 -70505 -62498 -68274
2711 -68274 -18214 -7569 -36300 -45674 -84023 -62229 -76833 -20264 -19737 -43915 -29631 -30767 -15169
2698 -15169 -15269 -25221 -48874 -44659 -58986 -24479 -23130 -19871 -2640 -14181 -14201 839 -9994 -19249
2684 -19249 -23693 -20521 -28202 15069 -7275 3383 28984 56902 32407 40905 25020 49202 53456
2671 53456 38448 40706 40223 45157 51076 57994 31343 30604 62022 73813 69186 83585 102300 94865
2657I4865J133P246k2789J8985j744j2628n191O422j6610r004j0463J3932L0257
2644I4411j0234r881J7296p40M803L7611J274l588K3142j6708R034j634O773j4768
2630A36791j8593K7992L9257m2106k2075O1737K0620m2578J0787J8543k5346l865
2618A61164K811j2076o768j1003M01J3888m6604j772J2140l6454K277l154J4931
2605H9781j9770K237L9392K538j916J7644r40J4448J9324O821j9297j0007J0810
2592A51065o853k3113m9452K0502p298o778j4311k6278M255M3930r780k5861M4220
2579I4248j1081k9958k1016k5920l77L044l611K4938j7573n347P360k1818j4611
2566b1722R610M414l269K4909q276k629k3845j7331L3063K0812k624r635M19j6114
$$ plain form
2657 94865 95998 103244 80455 99440 97696 85068 79877 86299 69689 60685 50222 64154 94411
2644 94411 84177 74296 91592 90852 95655 133266 134540 130952 154094 137386 146420 144786 151559 136791
2630 136791 118198 146190 185447 143341 121266 183003 203623 161045 171832 190375 165029 161164
2618 161164 163975 151899 145131 134128 134529 148417 101813 100041 112181 75727 78004 74850 89781
2605 89781 70011 72248 111640 114178 112262 129906 128966 143414 162738 169559 150262 140255 151065
2592 151065 144212 121099 71647 92149 84851 78073 63762 37484 41739 85669 75889 50028 94248
2579 94248 83167 53209 32193 6273 5896 8940 5329 30267 12694 7347 14707 -7111 -21722
2566 -21722 -12112 -7698 -10967 13942 5666 3037 -20808 -38139 -5076 15736 13112 3477 3896 -12218
2552a2218J9137J0868r070k0161j045l9241N42L420k9320K4704M422j9503O508
2539f0957J9999J5551m7084P638J4261M37j9618O973K8442k9417j0624K3086J8736
2526c2577j1165l6808k9012J4654J1488K5901l2571q970K4008J1881m6586k1437
2514a31194L7231J1132o082o926k81R192j5733L5755j3196j6787p258n415p96
2501a10358l658J7414o548q292j2216o16K8977J3739J2955j1472j7021R205l2009
2488a19900k2538L2240N99r553O583N3040J6767j4336m6409k9001J4079L3398
2476h5031j0010J3253K5711l9530M835M510O571N0191j1021j4606j032p471m27
2463f4057j9474K3129r591l0646K784K3562j1126j0916M445P478o177P613J77
$$ plain form
2552 -12218 6919 17787 8717 -11444 -12489 -51730 -51188 -47768 -77088 -52384 -47962 -67465 -60957
2539 -60957 -40958 -25407 -72491 -64853 -50592 -50155 -69773 -62800 -34358 -63775 -74399 -51313 -32577
2526 -32577 -43742 -80550 -109562 -94908 -83420 -57519 -90090 -99060 -75052 -63171 -109757 -131194
2514 -131194 -93963 -82831 -88913 -95839 -96120 -86928 -102661 -66906 -80102 -96889 -104147 -109562 -110358
2501 -110358 -114016 -96602 -103150 -111442 -123658 -124274 -95297 -81558 -68603 -80075 -97096 -87891 -119900
2488 -119900 -142438 -110198 -109599 -119152 -112569 -59529 -42762 -57098 -103507 -132508 -118429 -85031
2476 -85031 -95041 -81788 -56077 -95607 -90772 -86262 -79691 -29500 -40521 -55127 -56159 -63630 -64057
2463 -64057 -83531 -60402 -69993 -100639 -97855 -74293 -85419 -96335 -91890 -84412 -90589 -82976 -82799
2450h2799n352O05j022q098j2058K5513J0141J0772r52j8292K1716J0354m8073
2437i7545j5866j0267L4640Q350j4705j6136J8638K0352l5739L5233J9196j521
2425e5370j8650l321l8222K2378K1555k7656R516K4881o721L045j289p288k5290
2412a02432o995J2281k39M0497J6798j8623m601l7713j3458k958L72n373L3201
2399h9243j0081K9410m085j3032j8255M511j3625r424J3993l946J8272M328K5867
2386f5310J2698p377j1653j698L0374k4155l924l608j9847M8810J5344l3793N014
2373e9125J4655j7200K7151j947o599l2558q776p65k703j6817J0130J0352J2079
2360g2123j5359K3811J600p677p794o11m627J2276J9249J2828j3613o5278L430
$$ plain form
2450 -82799 -88151 -87546 -88568 -96666 -108724 -83211 -73070 -62298 -63250 -81542 -59826 -49472 -97545
2437 -97545 -113411 -123678 -89038 -80688 -95393 -111529 -92891 -72539 -108278 -73045 -53849 -55370
2425 -55370 -74020 -77341 -115563 -93185 -71630 -99286 -89770 -64889 -71610 -68565 -69854 -77142 -102432
2412 -102432 -109427 -97146 -97385 -56888 -40090 -58713 -63314 -101027 -114485 -117443 -117071 -122444 -89243
2399 -89243 -99324 -69914 -73999 -87031 -105286 -100775 -114400 -123824 -109831 -113777 -95505 -91177 -65310
2386 -65310 -52612 -59989 -71642 -73340 -42966 -67121 -71045 -74653 -94500 -45690 -30346 -64139 -59125
2373 -59125 -44470 -61670 -34519 -36466 -43065 -75623 -84399 -85164 -87867 -104684 -94554 -84202 -72123
2360 -72123 -87482 -63671 -62071 -69748 -77542 -78153 -82780 -70504 -51255 -38427 -52040 -117318 -113888
2347a13888J7428M9312Q43m0175o392j3026J2494j4115M0250p350R194k1906J4857
2334g2474O638P502k7528k0850N1001N763k5349K1755J3505j3339k5468m1945
2322a20789M6333N84o8346k4432M0434M802K2908N6048K3421j6451l2628j7370
2310h5486o122R525K9522k7768p713k7454J2945K0670J2195o970J1995N12L17
2297f3832J2257j0723J3265j0245K7802r266q495l1673J2864J9363p405K582k3230
2284g6736J5768R39K1339j5879n998L973k1765J269K5284n145N412K9235n65l6024
2270e8893r741J8748N260j1553J1124K1677J1599J6818j7332k6361j1357J9051
2258c0960j0250j5693J7769o857Q195k6926J6586m828L200K0410L677m6938m95
$$ plain form
2347 -113888 -96460 -47148 -46305 -86480 -92872 -105898 -93404 -107519 -67269 -74619 -65425 -87331 -72474
2334 -72474 -65836 -58334 -85862 -106712 -55711 -49948 -75297 -53542 -40037 -53376 -78844 -120789
2322 -120789 -74456 -73872 -142218 -166650 -126216 -121414 -98506 -42458 -19037 -35488 -68116 -85486
2310 -85486 -91608 -82083 -52561 -80329 -88042 -115496 -102551 -81881 -69686 -76656 -64661 -64149 -63832
2297 -63832 -51575 -62298 -49033 -59278 -31476 -40742 -49237 -80910 -68046 -48683 -56088 -53506 -76736
2284 -76736 -60968 -60029 -38690 -54569 -60567 -56594 -78359 -77090 -51806 -56951 -51539 -22304 -22869 -58893
2270 -58893 -68634 -49886 -44626 -56179 -45055 -23378 -11779 5039 -12293 -38654 -50011 -30960
2258 -30960 -41210 -56903 -39134 -45991 -37796 -64722 -48136 -52964 -49764 -29354 -25677 -72615 -73110
2245g3110J0781J3869R325j5663K25o185O4775j6249L443J5915k5642j8840j2618
2232d9974P083J6777K6986K3490j4875r7q851O790L4450n1318j5691r220J2465
2219b1985J9357m026M0218j0619M74j4827O101p353r244M927k1715J4632J0565
2206F505J842r391O585O762O607O1535j9300r766K79L744j6391o305J6377j709
2192D7374J8622J5896j4942k9259J5524j7509J1019R416J0663j138M3111J0465
2180A19242k5274N834K8312k0430k5K8354O0n989O75K0229k9116J5436K1317J0992
2166A69617J6539K7364k638K0876n280L756L545q103J1752J7256j768J4413L1550
2153B98879J6182M6772k6860K6974k1170q803J7563J3840L4331K9697M0280j4127
$$ plain form
2245 -73110 -62329 -48460 -39135 -54798 -54573 -60758 4017 -12232 -8789 7126 -18516 -37356 -49974
2232 -49974 -42891 -26114 872 24362 9487 9390 539 7329 41779 -9539 -25230 -34450 -21985
2219 -21985 -2628 -6654 33564 22945 23419 8592 14693 7340 -1904 3023 -18692 -4060 6505
2206 6505 8347 -1044 5541 12303 18910 80445 61145 51379 51658 55402 39011 32706 49083 47374
2192 47374 65996 81892 66950 37691 53215 35706 46725 56141 66804 65666 108777 119242
2180 119242 93968 99802 128114 107684 107659 136013 136073 130084 130759 150988 121872 137308 158625 169617
2166 169617 186156 213520 210882 231758 226478 230234 233779 225676 237428 254684 252916 267329 298879
2153 298879 315061 361833 334973 361947 340777 331974 349537 363377 397708 427405 467685 453558
2141D53558J7054n494J3623L2949N4942K2731J0181M5401P5353J3158J5165K5174
2129G73795P4961M8769N7913O0312P0615J29258J08612J24663J46011J19758J33883
2118A848550J38555J16538J98242K26784L40815M75620O44084Q33582R40168J086322
2108F849260J197980J397657Q51794o04528j616904j863737j446485r08629o47882
2099C208526m63115l31390k82242k50673j70903j70118j35067r6491m6863n0317
2089A211347q8625j07856j02641m0954m4676o1598n4963l5606k5329l8422k9711
2078E80966l1818m8510J5780j4726n0719l3616L7743m4429j4821k2k0278n0923
2066C24627k8295j8133k7510l0941O845l2429l534n887K1876k428j463N746K30
$$ plain form
2141 453558 470612 465118 478741 511690 566632 589363 599544 644945 720298 733456 748621 773795
2129 773795 848756 897525 955438 1015750 1086365 1215623 1324235 1448898 1594909 1714667 1848550
2118 1848550 1987105 2103643 2301885 2528669 2869484 3345104 3989188 4822770 5762938 6849260
2108 6849260 8047240 9444897 10296691 9692163 8075259 6211522 4765037 3856408 3208526
2099 3208526 2745411 2414021 2131779 1881106 1710203 1540085 1405018 1308527 1261664 1211347
2089 1211347 1122722 1014866 912225 871271 826595 764997 710034 674428 649099 610677 580966
2078 580966 549148 500638 516418 501692 450973 417357 455100 410671 395850 395828 375550 324627
2066 324627 296332 278199 250689 219748 226593 194164 190630 184743 206619 204191 202728 208474 208704
2053B08704j0k0612n1283m2331K2699K7513J1410j0163j9205o74K8880p559k5373
2040A21996k7923K7444k7081M332J386j4716m367l674J4752k2605l3154K1821
2028E8211p205J4542j705L5477n777k0582k3758j250j7347R745l81k1866J7195
2015C5299k5922L897J7768j6997J8906n157k049l4574j1636L3750j7261l718K040
2002e654O11K534k5589m265L4874M071k4201k2201J9048J3338j9151r700j542
1989c7827K0378P782k5524r540q587J3408M4903N977j3232o809j2256J7071K0972
1976A6716N85q493N184n064M353j815J7287j4617N321L125J1745l5820l0713K1493
1962a0713L6496n1266j9504J5929J3656m316J0250k773l6794r36K7002K2472Q997
$$ plain form
2053 208704 208694 188082 136799 94468 117167 144680 156090 145927 126722 126048 154928 147369 121996
2040 121996 94073 121517 94436 98768 100154 85438 81071 77397 92149 69544 36390 58211
2028 58211 51006 65548 63843 99320 93543 72961 49203 47953 30606 40351 39970 18104 35299
2015 35299 9377 13274 31042 14045 32951 27794 25745 -8829 -20465 13285 -3976 -7694 -5654
2002 -5654 -5043 -2509 -28098 -32363 2511 6582 -17619 -39820 -20772 -7434 -26585 -36285 -37827
1989 -37827 -17449 -9667 -35191 -44731 -53318 -39910 4993 10970 -2262 -9071 -21327 -4256 16716
1976 16716 17301 8808 13992 8928 13281 11466 28753 14136 19457 22582 34327 -1493 -32206 -10713
1962 -10713 25783 -25483 -44987 -29058 -15402 -19718 -9468 -12241 -49035 -49971 -22969 -497 8500
1949H500n193k8870j4005K6675K5596m5616L98j8651J1330J0365L756p718J957
1936c1476k807J3426k4414k2075K2860L0051k0435o25L5856L075k7042J0426j3046
1923b6226p555j6488J2448N0689j3300k301Q813j8281j1073J5751p652j3879J2737
1910a6317n606L107k2649j5455k961O208K1950L3664k5419k8086J0549j70L27
1897d0858P108M132N90K2270j3159l0726j0467K1704k1209Q295L8729K4559j6035
1884e067K0734n975k4852n310j2582O007L1925p395k1421M111l7586K5308M4638
1871A2535k4483l0790j2964J4758j0944j5922R410Q350J4365K6565j871j1973
1859b2964K28J5849J622K3309l916j1166j6839k9989j0163L864L306J7878J0535
$$ plain form
1949 8500 3307 -25563 -39568 -12893 12703 -32913 -32515 -51166 -39836 -29471 -25715 -33433 -31476
1936 -31476 -34283 -20857 -45271 -67346 -44486 -14435 -34870 -35495 361 3436 -23606 -13180 -26226
1923 -26226 -33781 -50269 -37821 12868 -432 -2733 6080 -12201 -23274 -7523 -15175 -29054 -16317
1910 -16317 -21923 -18816 -41465 -56920 -59881 -53673 -31723 1941 -23478 -51564 -41015 -41185 -40858
1897 -40858 -33750 -29618 -29028 -6758 -19917 -50643 -61110 -39406 -60615 -52320 -13591 10968 -5067
1884 -5067 15667 9692 -15160 -20470 -33052 -27045 4880 -2515 -23936 -19825 -57411 -32103 12535
1871 12535 -11948 -42738 -55702 -40944 -51888 -67810 -58400 -50050 -35685 -9120 -10991 -22964
1859 -22964 -22736 -6887 -5265 18044 14128 2962 -13877 -43866 -54029 -50165 -46859 -28981 -18446
1846a8446K872K4904l892k7789J925J122J2459J1181L496m364J1835n254j1886
1833a837J8347N78o871j3258n366K1790n07k8234l174j8472j2469J0740o673p149
1819e2555K962j830J9315k0701k3627K1506O174K4870m213m1950N201L7385j264
1806b8727L8309j7375q365q38o946J1556Q56j8083q352j7072p268L1814K9840
1793f51k1253k6467J5754j5321J4284K8740j7817J4781R783k0602L0401j9753
1781h121J6202L93k2692l1049K4381j6711j8334O524n682M455N917j3705J1796
1768d6626K3470j9668j2922K3973R872J2899Q357k8006J617L1774J0896J764m3121
1755b5721j2163K6906j53j6904J6719K0726o70l4539o300K5062J0659r96k0534
$$ plain form
1846 -18446 -15574 9330 5438 -22351 -20426 -19304 -6845 4336 7832 3468 15303 10049 -1837
1833 -1837 16510 17088 10217 -3041 -8407 13383 12876 -15358 -18532 -37004 -49473 -38733 -45406 -52555
1819 -52555 -49593 -51423 -32108 -52809 -76436 -54930 -48756 -23886 -28099 -70049 -64848 -27463 -28727
1806 -28727 9582 -7793 -16158 -16996 -23942 -12386 -11530 -29613 -37965 -55037 -62305 -30491 -651
1793 -651 -21904 -48371 -32617 -47938 -33654 -4914 -22731 -7950 1833 -18769 11632 -8121
1781 -8121 8081 8474 -14218 -45267 -20886 -37597 -55931 -49407 -55089 -50634 -44717 -58422 -46626
1768 -46626 -23156 -42824 -55746 -31773 -21901 -9002 -645 -28651 -27034 4740 15636 17400 -25721
1755 -25721 -37884 -10978 -11131 -28035 -11316 9410 8740 -25799 -32099 -7037 3622 2626 -17908
1742a7908l0878R283j8045M2154P340l7414q693K4542j5865j2201J8620J5485
1730b3580J9462m656j0988k6714m137J5519K1664J0556k4504l8000L75L0961L6739
1717B697k2215k0739m717k6056N098L9030k9708K9453n635K364q674K6445N399
1704g258K9306k1544q074j0549k5537M4282r13k1959k8415M760J3593J9908N715
1691f685o6688j5243P080o828L1207K725J9884j1559l289K3753r566l0289J5263
1678e0235R680J8723J0629O590N602j3528L736m8206L367L9173J3726m1082j9495
1665f1320K3313N771J3574o151l0193K0024K7864j9479m093n904j2378K3417N5128
1652B9573q576l4836m262k5606r978J9166L6761M240n1305J1832j9838J7095K2785
$$ plain form
1742 -17908 -48786 -39503 -57548 -15394 -8054 -45468 -54161 -29619 -45484 -57685 -39065 -23580
1730 -23580 -4118 -8774 -19762 -46476 -50613 -35094 -13430 -2874 -27378 -65378 -65003 -34042 2697
1717 2697 -19518 -40257 -44974 -71030 -65932 -26902 -56610 -27157 -32792 -30428 -39102 -12657 -7258
1704 -7258 22048 504 -7570 -18119 -43656 626 -287 -22246 -50661 -45901 -32308 -12400 -6685
1691 -6685 -73373 -88616 -81536 -88364 -57157 -54432 -34548 -46107 -49396 -25643 -35209 -65498 -50235
1678 -50235 -40555 -21832 -11203 -4613 989 -12539 -8803 -57009 -53642 -14469 -743 -41825 -61320
1665 -61320 -38007 -32236 -18662 -24813 -55006 -34982 -7118 -26597 -30690 -36594 -48972 -25555 29573
1652 29573 20997 -13839 -18101 -43707 -53685 -34519 2242 6482 -44823 -32991 -52829 -35734 -12949
1639a2949j1555q131k7045K1212J6168j3991J5057J7570l3004j2065Q537J1138
1627b9058K007j442J9965J9091l6047k003r878L7672N049k2686P927k0542k9872
1614e9817R185K5557K7650J683k0452l131j8695O496J964J3319J4338n523n386
1601a2812k796J9255K6534m9032j7875P129j045J0758n424J84L97j3112Q414j491
1587c0916J8511k143k58n436O697J3425j9522n563J9194P315m0616K2450N2523
1574C5661j4170m11J608o270j5797k2746M239J1131l303Q20j3979p095l445J3342
1560b0415L5384m962k539o209j2531p071J5717m60m843J5860r920j4496N899K519
1546h067N749Q829l2037L860K4450J2655L3797N203k1750q028j2964k523l4254
$$ plain form
1639 -12949 -24504 -32635 -59680 -38468 -22300 -36291 -21234 -3664 -36668 -48733 -40196 -29058
1627 -29058 -27051 -28493 -8528 10563 -25484 -27487 -37365 307 5356 -17330 -9403 -29945 -59817
1614 -59817 -50632 -25075 2575 4258 -16194 -19325 -38020 -31524 -29560 -16241 -1903 -7426 -12812
1601 -12812 -15608 3647 30181 -18851 -36726 -29597 -30642 -19884 -25308 -25124 -24727 -37839 -29425 -30916
1587 -30916 -12405 -14548 -14806 -20242 -13545 -120 -19642 -25205 -6011 1304 -39312 -16862 35661
1574 35661 21491 21080 22688 16418 621 -22125 -17886 -6755 -10058 -9238 -23217 -30312 -33757 -20415
1560 -20415 14969 10007 7468 1259 -11272 -18343 -2626 -3086 -7929 7931 -1989 -16485 -10586 -8067
1546 -8067 -2318 6511 -25526 -21666 2784 15439 49236 54439 32689 24661 11697 9174 -25080
1533b5080k4873K83K0447j2487J021J1431l712k036K8242j156k9638J1640J445
1520b4473q215L495J4631K6212j0272j7563L1372Q404k1722m4455J6951J1658
1508a3977J8151J922k3586j3090L6478K5195l1560j1698M316K8385L399j5691
1496H244J1510k2786j1918j3987q04L678L91P37K430r865O43k626L0942k224k517
1481h152L5948j2628j1297k996K083r810Q549L31j04m2236p874L4800l27m0014
1467e3727K859L2792k4112k435J5366L905m413N011J9043J2835M135R113K1071
1454D1443n973l2425K6293k0642J7441j5645j8739P546k7883L2452j803o020J6238
1441A2283M633k4510j2087Q120J035J0517N104m039j0256N676J1111o293l636
$$ plain form
1533 -25080 -49953 -49670 -29223 -41710 -40689 -29258 -32970 -35006 -6764 -7920 -37558 -25918 -24473
1520 -24473 -32688 -29193 -14562 11650 1378 -16185 15187 23591 1869 -42586 -25635 -13977
1508 -13977 4174 6096 -17490 -30580 5898 31093 -467 -12165 -7849 20536 23935 8244
1496 8244 19754 -3032 -14950 -28937 -29741 -26063 -25672 -24935 -22505 -32370 -31727 -34353 -3411 -5635 -8152
1481 -8152 27796 15168 3871 875 2958 -6852 1697 2028 1924 -40312 -48186 -13386 -13713 -53727
1467 -53727 -50868 -18076 -42188 -44623 -29257 -25352 -29765 -24754 -5711 7124 11259 20372 41443
1454 41443 35470 3045 29338 8696 26137 10492 -8247 -701 -28584 3868 2065 -3955 12283
1441 12283 16916 -7594 -19681 -11561 -10526 -9 5095 1056 -9200 -3524 7587 1294 -2342
1428b342j1955j3742P828J9331L463j9750L211L9937j6147k1927j9642J3993K6321
1415H579j0866k1917J6706l297p184j0484L235q343J6484M762k1537J8301j5206
1402c0767K0074Q94l155L5613l5479Q891K0399j0622j8158p557P031N652Q7P179
1388H2J1310J5620j8125j9205q753J6659j9535j0951L177l4157K0589J0655L8223
1375E589k3553k6026J5460J5353r135J9224j760l607n165k4391K2960J0946k2529
1362b6634k5565J6578J933N67R756k1288M0856J7147m009o971K45j1029K4408
1349A5994M001M861m6316R600O293k6692r273P910J3557K0566P716r492J2787
1336A1512M395k47n3391K552k5734L6732Q180N188J0823K2664K7575j4686k6447
$$ plain form
1428 -2342 -14297 -28039 -20211 -880 2583 -17167 -13956 25981 9834 -12093 -31735 -17742 8579
1415 8579 -2287 -24204 -7498 -10795 -17979 -28463 -25228 -33571 -17087 -12325 -33862 -15561 -30767
1402 -30767 -10693 -9799 -12954 22659 -12820 -3929 16470 5848 -12310 -19867 -12836 -7184 -7097 82
1388 82 11392 27012 8887 -10318 -19071 -2412 -21947 -32898 -29721 -63878 -43289 -32634 5589
1375 5589 -17964 -43990 -28530 -13177 -22312 -3088 -4848 -8455 -13620 -38011 -15051 -4105 -26634
1362 -26634 -52199 -35621 -33688 -33121 -23365 -44653 -3797 13350 9341 2370 2615 -8414 15994
1349 15994 19995 24856 -21460 -11860 -5567 -32259 -41532 -33622 -20065 501 8217 -1275 11512
1336 11512 15907 15660 -37731 -35179 -60913 -24181 -16001 -10813 10 22674 50249 35563 9116
1323I116N817k196k9486M779j6389j9832L948K0136O949K1122l723o123j569k5602
1309c3053k278R817j312R359J1325L308K099O251J5947m0135Q836p645K4839K353
1295I711j8833K3207j8118K3420k1710l101K4896K278J4662j7019j6073j9290
1283a5970m913O928L5745N549m0953K172L438K6746k0120j8891R863j9341J4463
1270a5284m033L9330J543l4123o910J3584l1885M808J7556M976K9501j4421Q554
1257A3196J1948N604m2407Q427K6088m73l1399J680L2707k5078J3406N316m1311
1244b2296J7274J2529j4033K5784r600k1970n357K2663M8038m3134J0064o218
1232A3744k3136J465K3m828k6423k1487O84L5522J4098j745K5319L0053k4543
$$ plain form
1323 9116 14933 12737 -16749 -11970 -28359 -48191 -44243 -24107 -17158 3964 241 -5882 -7451 -33053
1309 -33053 -35331 -25514 -26826 -17467 -6142 -2834 -735 5516 21463 -18672 -9836 -17481 7358 9711
1295 9711 -9122 14085 -4033 19387 -2323 -5424 19472 21750 36412 19393 3320 -15970
1283 -15970 -20883 -13955 21790 27339 -13614 -11442 -8004 18742 -1378 -20269 -10406 -29747 -15284
1270 -15284 -19317 20013 21556 -12567 -19477 -5893 -37778 -32970 -15414 -10438 19063 4642 13196
1257 13196 25144 30748 -11659 -3232 22856 22383 -9016 -7336 25371 293 13699 19015 -22296
1244 -22296 -5022 7507 -6526 19258 9658 -12312 -17669 4994 53032 9898 19962 13744
1232 13744 -9392 -7927 -7904 -12732 -39155 -60642 -59958 -24436 -10338 -12083 13236 43289 18746
1219A8746k7409J5481Q898J3482L351l8229o390k4323j9206J9545J5799J2911
1207g344K6303j1887k0189K6079J5045m5879Q87l375N376L2680J7312l355j5090
1194A6563j0119R502J3854j1303j3757j3505j307J6937J3062j3202j0293J4639
1182A1071O729J4251M072j683J2772m7254O268Q807l0157j1309K6396k207J1241
1169H997J8885l3195J3510L1058j6224j1974K6964j7760j1183J1418k0152J1680
1157A2024o568N247R669J3620n120l1538J8497O838j401k0947K0921P053J1739
1144D0034J8859m1614P240L8496m592n0937K1451j3258K0212n1425k2263M5378
1132G581j677j4879j8582L6829l4936Q626M8798k4737j7394K2400j8783P096L9632
$$ plain form
1219 18746 -8663 6818 15716 29198 32549 -5680 -12070 -36393 -55599 -36054 -20255 -7344
1207 -7344 18959 7072 -13117 12962 28007 -17872 -16985 -20360 -14984 17696 35008 31653 16563
1194 16563 6444 15946 29800 18497 4740 -8765 -10072 6865 19927 6725 -3568 11071
1182 11071 17800 32051 36123 34440 47212 -42 6226 15033 -15124 -26433 -37 -2244 8997
1169 8997 27882 -5313 8197 39255 23031 11057 38021 20261 9078 20496 344 12024
1157 12024 5456 10703 20372 33992 28872 -2666 15831 22669 21268 321 21242 28295 40034
1144 40034 58893 17279 24519 63015 58423 7486 28937 15679 35891 -15534 -37797 7581
1132 7581 5904 -8975 -27557 9272 -25664 -17038 31760 7023 -10371 12029 -6754 342 39974
1119C9974J865J462m3922o984L763J5798J5686k0735o835J733j0446k153M1994
1106C1200n33k784k2977m685k5737r277J9392m936K1356J5417J9212k3049n93
1093A2006J7124k6819q300n263L3259J0388m3615k250M7195j4143J1429P629N831
1080D4471k3174O009k0337n0511L4172J2471o981J3602j595J5317L4520l669j13
1067E4182L947O275m3049j1335O879k3692M3908J4217l9679P698M1727j6129l5536
1054I413J822n799j7333k9226R724K7916j447n150Q028K4151j3258l895L8955
1041D3901l2052m7563J1932K3797L3699k992k6831N10K4917J281n789P286J3672
1028D5768l2051j9871K5070K6892j7821k8084J9864Q176k0060j491m448l562J3211
$$ plain form
1119 39974 41839 43301 -621 -7605 -3842 11956 27642 6907 72 1805 -8641 -10794 31200
1106 31200 30667 27883 4906 221 -25516 -34793 -15401 -20337 1019 16436 35648 12599 12006
1093 12006 29130 2311 -5989 -11252 22007 32395 -11220 -13470 33725 19582 31011 38640 44471
1080 44471 21297 27306 6969 -43542 -9370 3101 -3880 9722 8127 23444 57964 54295 54182
1067 54182 58129 64404 21355 10020 16899 -6793 37115 51332 11653 19351 61078 44949 9413
1054 9413 11235 5436 -11897 -41123 -31399 -3483 -4930 -10080 -2052 22099 8841 4946 43901
1041 43901 11849 -35714 -23782 15 33714 30722 3891 4401 29318 30599 24810 32096 45768
1028 45768 13717 -6154 18916 45808 27987 -97 19767 27943 7883 6392 1944 -1618 11593
1015A1593K5145j3141O001K1238n2815P217J4128L8165j1890k144J336k3588k5810
1002d565r766J3875K2642l518m9969J7829O351J1804L2661J054o9201k1879L1952
989b0730L3466r774m4150J5146L6723J8478j9754R282j1393k8216N616K2966J0430
976A8090j20P692k9185J0550M2049l977J391l5464J6993J5867j5145l7185R598
963A154K3714O975j1583l1695R254N042P392j1393O746n088J4856j6096l8899
950c9621j1916J4680J4772K5910J0180K3916j1424l2421R939m705Q983q387L4939
937C4845j2747m1251J3855m91K3459L1330k8743j5469K9988L1573n1579o498R393
924A7665j7406N610K8508J083k696J128k858j1223j6538o031K867K8579n371M454
$$ plain form
1015 11593 36738 23597 29598 50836 -1979 5238 19366 57531 45641 43497 44833 21245 -4565
1002 -4565 -14331 -456 22186 18668 -31301 -13472 -7121 4683 37344 38398 -30803 -52682 -20730
989 -20730 12736 2962 -41188 -26042 10681 29159 9405 18687 7294 -20922 -15306 7660 18090
976 18090 17970 25662 -3523 7027 49076 45099 46490 11026 28019 43886 28741 -8444 1154
963 1154 24868 31843 20260 -11435 -2181 2861 10253 -1140 5606 518 15374 -722 -39621
950 -39621 -51537 -36857 -22085 3825 14005 37921 26497 -5924 4015 -690 8293 -94 34845
937 34845 22098 -19153 -5298 -5789 17670 49000 20257 4788 34776 66349 14770 8272 17665
924 17665 259 5869 34377 35460 32764 33892 31034 19811 3273 -2758 109 28688 23317 27771
910B7771K8287j5208K0440J839j1625k1091k1917j1561l5363L8563J7077j0880
898F332Q52n311L4669j8440N85p881j0774K2862m171K477o679Q630K1179p736
884C6594J2817j644m7632J0669k7196M4311j8363p181K4687j288K726L0013o516
871E1997P692k1634j8082j1182m399j4006m523J0212J6208j9636j2487J0133m639
858a4346N998L258k7281K0768L4444l1007K4697J9827j5153Q113p711j1751L736
845A3592l25K647j9341J14K7545K2284l9117j6767J7959k671m0813j166K5486
832a0573J8274N417j7190n754N572k812K5312J7055l5268L4176K6895n5499n835
819b30p387j1067M212L0859l684Q742j423J0652j4708j5275m672j981k659K5933
$$ plain form
910 27771 56058 40850 61290 63129 51504 30413 8496 -3065 -38428 135 17212 6332
898 6332 7184 1873 36542 18102 18687 10806 32 22894 18723 21200 14521 23151 44330 36594
884 36594 49411 47767 135 10804 -16392 27919 9556 2375 27062 25774 28500 58513 51997
871 51997 59689 38055 19973 8791 4392 -9614 -14137 -3925 12283 -7353 -19840 -9707 -14346
858 -14346 -8348 -5090 -32371 -11603 22841 -8166 16531 36358 21205 29318 21607 9856 13592
845 13592 13267 15914 -3427 -3313 24232 46516 7399 -9368 8591 5920 -34893 -36059 -10573
832 -10573 7701 13118 -4072 -9826 -4254 -7066 18246 35301 33 34209 61104 5605 -230
819 -230 -7617 -18684 -14472 16387 12703 21445 20022 30674 15966 691 -3981 -5962 -8621 17312
805A7312Q406J5941J7436j9468j8379L442l631l1490J8375m488M64j770j728J6204
791A6626q226j2465J9663k4470K2737M673l1616J4303J9046l484j4574P532l2164
778b2419L639J2991M4317k1032K0385j2806k9580J7571j2737J4891j1217P628
766A1631K668j6994j7794K0021K3079J2670K8222j2998j2968j7251l5385r332
754b4431J9051L2943j8189j8028k1138r57J7042K6015k0209J3791l024N736J9927
741B8529m152j9840K233j484R514k3185R077L6187K99j0901j3378n484L920j1940
727f05O105l81K4020J6075l4838j2148J2375q828l0619J1269K001L8692o29k1733
713G56K098J5047P387J4189k0714j118o83J4036j4401J4518Q031N271M647O997
$$ plain form
805 17312 25718 41659 59095 39627 21248 24690 21059 -10431 7944 3456 3920 2150 422 16626
791 16626 8400 -4065 15598 -8872 13865 18538 -13078 1225 20271 16787 2213 9745 -22419
778 -22419 -18780 -5789 38528 17496 37881 25075 -4505 13066 329 15220 4003 11631
766 11631 14299 -2695 -20489 -468 22611 35281 63503 50505 37537 20286 -15099 -24431
754 -24431 -5380 27563 9374 -8654 -29792 -30749 -13707 12308 -7901 5890 2866 8602 28529
741 28529 24377 4537 6770 5286 14800 -8385 692 36879 37178 26277 12899 7415 11335 -605
727 -605 5500 5119 29139 45214 10376 -1772 10603 1775 -28844 -17575 -15574 23118 22489 756
713 756 2854 17901 25288 39477 18763 17645 16962 30998 16597 31115 39146 44417 49064 56061
699E6061j4440L034k3904k4245J8882K6174j1807j4956j5805j1840P100J0468
687D722P530J3779O872k6756r341L1865M0324k6952l4209M787j7924R010o934
674c227j0491K2530j127J2594M557J2354k6210k4831j7669K9630Q258l1628n649
661c0909Q940J5666O002r729J6056K837L4091n880k7627j4709n378K0344j7408
$$ plain form
699 56061 41621 44655 20751 -3494 15388 41562 29755 14799 -1006 -12846 -5746 4722
687 4722 12252 26031 32903 6147 -3194 28671 68995 42043 7834 12621 -5303 3707 -3227
674 -3227 -13718 8812 7685 20279 24836 37190 10980 -13851 -31520 -1890 6368 -25260 -30909
661 -30909 -21969 -6303 -301 -10030 6026 8863 42954 37074 9447 -5262 -10640 9704 -7704
$$ [...]
##END NTUPLES=NMR SPECTRUM
##END=
