##TITLE=1H_CA-8965-1
 CDCl3
 8 sc, 
 14.1.2022
##JCAMPDX= 6.0         $$ Bruker NMR JCAMP-DX V2.0
##DATA TYPE= NMR SPECTRUM
##DATA CLASS= NTUPLES
##ORIGIN= UXNMR, Bruker Analytische Messtechnik GmbH
##OWNER= root
$$ XWIN-NMR		Version 3.5
$$ Fri Jan 14 14:20:42 2022 Russian Standard Time (UT+4h)  she@DPX200
##.OBSERVE FREQUENCY= 200.131346
##.OBSERVE NUCLEUS= ^1H
##.ACQUISITION MODE= SIMULTANEOUS
##.ACQUISITION SCHEME= undefined
##.AVERAGES= 8
##.DIGITISER RES= 18
##SPECTROMETER/DATA SYSTEM= spect
##.PULSE SEQUENCE= zg30
##.SOLVENT NAME= CDCl3
##.SHIFT REFERENCE= (INTERNAL, CDCl3, 0, 15.726)
##AUDIT TRAIL= $$ (NUMBER, WHEN, WHO, WHERE, WHAT)
$$ ##TITLE= Audit trail, XWIN-NMR		Version 3.5
$$ ##JCAMPDX= 5.01
$$ ##ORIGIN= Bruker BioSpin GmbH
$$ ##OWNER= she
$$ F:/spectra/data/she/nmr/H-F/1/pdata/1/auditp.txt
$$ ##AUDIT TRAIL=  $$ (NUMBER, WHEN, WHO, WHERE, WHAT)
(   1,<2022-01-14 14:19:38.92 +0400>,<she>,<DPX200>,
      <created by zg, POWCHK disabled, PULCHK disabled
       configuration hash MD5:
       00 E9 B6 7A A2 85 ED C7 34 08 36 98 17 FE 4E 26
       data hash MD5: 16K
       52 1F 03 C8 B7 8A C3 C6 FB E7 D1 E9 A2 F0 50 04>)
(   2,<2022-01-14 14:19:41.95 +0400>,<she>,<DPX200>,
      <Start of raw data processing
       efp BC_mod = 2 LB = 0.24 FT_mod = 6 PKNL = 1 PHC0 = -15870.6 PHC1 = 14.60078 SI = 16K 
       data hash MD5: 16K
       3D 5E 02 93 B0 AB 4C AB C1 17 1F 59 26 0F 1F B8>)
(   3,<2022-01-14 14:19:56.06 +0400>,<she>,<DPX200>,
      <pk PHC0 = -0.1091575 PHC1 = -1.2 
       data hash MD5: 16K
       0C C8 E2 F4 7D 6B 80 50 CD 28 5D 17 DB 95 E9 D3>)
(   4,<2022-01-14 14:19:59.04 +0400>,<she>,<DPX200>,
      <abs ABSG = 5 
       data hash MD5: 16K
       03 7F A0 1F 71 23 D3 BA 84 BA 3E C4 15 8A DF F6>)
$$ ##END=
$$ 
$$ hash MD5
$$ 87 2C 40 7D B1 04 2C CC 7B 92 22 E0 F4 AB EA C8
##$RELAX= 
##$RELAX= 
##$RELAX= 
##$RELAX= 
##$RELAX= 
##$RELAX= 
$$ Bruker specific parameters
$$ --------------------------
##$DU= <F:/spectra>
##$EXPNO= 1
##$NAME= <H-F>
##$PROCNO= 1
##$TYPE= <nmr>
##$USER= <she>
##$AMP= (0..31)
100 100 100 100 100 100 100 100 100 100 100 100 100 100 100 100 100 100 
100 100 100 100 100 100 100 100 100 100 100 100 100 100 
##$AQSEQ= 0
##$AQ_mod= 1
##$AUNM= <au_zg>
##$AUTOPOS= <>
##$BF1= 200.13
##$BF2= 200.13
##$BF3= 200.13
##$BF4= 200.13
##$BF5= 200.13
##$BF6= 200.13
##$BF7= 200.13
##$BF8= 200.13
##$BYTORDA= 1
##$CFDGTYP= 0
##$CFRGTYP= 5
##$CHEMSTR= <none>
##$CNST= (0..31)
1 1 145 1 1 1 1 1 1 1 1 1 1 1 1 1 1 1 1 1 1 1 1 1 1 1 1 1 1 1 1 1 
##$CPDPRG= <>
##$CPDPRG1= <>
##$CPDPRG2= <>
##$CPDPRG3= <>
##$CPDPRG4= <mlev>
##$CPDPRG5= <mlev>
##$CPDPRG6= <mlev>
##$CPDPRG7= <mlev>
##$CPDPRG8= <mlev>
##$CPDPRGB= <>
##$CPDPRGT= <>
##$D= (0..31)
0 1.2 0 0 0 0 0 0 0 0.06 0 0.03 0 0 0 0 0.0002 0 0 0 0 0 0 0 0 0 0 0 0 
0 0 0 
##$DATE= 1642155578
##$DBL= (0..7)
120 120 120 120 120 120 120 120 
##$DBP= (0..7)
150 150 150 150 150 150 150 150 
##$DBP07= 0
##$DBPNAM0= <>
##$DBPNAM1= <>
##$DBPNAM2= <>
##$DBPNAM3= <>
##$DBPNAM4= <>
$$ [...]
##$SUBNAM2= <"">
##$SUBNAM3= <"">
##$SUBNAM4= <"">
##$SUBNAM5= <"">
##$SUBNAM6= <"">
##$SUBNAM7= <"">
##$SUBNAM8= <"">
##$SUBNAM9= <"">
##$SW= 18.0517287032376
##$SWIBOX= (0..15)
0 0 2 0 0 0 0 0 0 0 0 0 0 0 0 0 
##$SW_h= 3612.71676300578
##$TD= 16384
##$TD0= 1
##$TE= 0
##$TE2= 300
##$TE3= 300
##$TEG= 300
##$TL= (0..7)
0 120 120 120 120 120 120 120 
##$TP= (0..7)
150 150 150 150 150 150 150 150 
##$TP07= 0
##$TPNAME0= <>
##$TPNAME1= <>
##$TPNAME2= <>
##$TPNAME3= <>
##$TPNAME4= <>
##$TPNAME5= <>
##$TPNAME6= <>
##$TPNAME7= <>
##$TPOAL= (0..7)
0.5 0.5 0.5 0.5 0.5 0.5 0.5 0.5 
##$TPOFFS= (0..7)
0 0 0 0 0 0 0 0 
##$TUNHIN= 0
##$TUNHOUT= 0
##$TUNXOUT= 0
##$USERA1= <user>
##$USERA2= <user>
##$USERA3= <user>
##$USERA4= <user>
##$USERA5= <user>
##$V9= 5
##$VALIST= <valist>
##$VCLIST= <CCCCCCCCCCCCCCC>
##$VD= 0
##$VDLIST= <DDDDDDDDDDDDDDD>
##$VPLIST= <PPPPPPPPPPPPPPP>
##$VTLIST= <TTTTTTTTTTTTTTT>
##$WBST= 1024
##$WBSW= 4
##$XGAIN= (0..3)
0 0 0 0 
##$XL= 0
##$YL= 0
##$YMAX_a= 256892
##$YMIN_a= -361688
##$ZGOPTNS= <>
##$ZL1= 120
##$ZL2= 120
##$ZL3= 120
##$ZL4= 120
##$ABSF1= 15.72265
##$ABSF2= -2.3292
##$ABSG= 5
##$ABSL= 3
##$ALPHA= 0
##$AQORDER= 0
##$ASSFAC= 0
##$ASSFACI= 0
##$ASSFACX= 0
##$ASSWID= 0
##$AUNMP= <proc_1d>
##$AZFE= 0.1
##$AZFW= 0.1
##$BCFW= 0
##$BC_mod= 2
##$BYTORDP= 0
##$COROFFS= 0
##$CY= -3
##$DATMOD= 1
##$DC= 0
##$DFILT= <>
##$DTYPP= 0
##$F1P= 0
##$F2P= 0
##$FCOR= 1
##$FTSIZE= 16384
##$FT_mod= 6
##$GAMMA= 0
##$GB= 0
##$INTBC= 1
##$INTSCL= 0
##$ISEN= 128
##$LB= 0.24
##$LEV0= 0
##$LPBIN= 0
##$MAXI= 10000
##$MC2= 0
##$MEAN= 0
##$ME_mod= 0
##$MI= 1.114404
##$NCOEF= 0
##$NC_proc= -7
##$NLEV= 6
##$NOISF1= 3.799351
##$NOISF2= 2.8
##$NSP= 0
##$NTH_PI= 0
##$NZP= 0
##$OFFSET= 15.72596
##$PC= 1
##$PHC0= -15870.71
##$PHC1= 13.40078
##$PH_mod= 1
##$PKNL= yes
##$PPARMOD= 0
##$PSCAL= 0
##$PSIGN= 0
##$REVERSE= no
##$SF= 200.130005122054
##$SI= 16384
##$SIGF1= 3
##$SIGF2= 2
##$SINO= 5.538805
##$SIOLD= 16384
##$SREGLST= <1H.CDCl3>
##$SSB= 0
##$STSI= 16384
##$STSR= 0
##$SW_p= 3612.71676300578
##$SYMM= 0
##$S_DEV= 0
##$TDeff= 16384
##$TDoff= 0
##$TI= <>
##$TILT= no
##$TM1= 0
##$TM2= 0
##$TOPLEV= 0
##$USERP1= <user>
##$USERP2= <user>
##$USERP3= <user>
##$USERP4= <user>
##$USERP5= <user>
##$WDW= 1
##$XDIM= 16384
##$YMAX_p= 486982494
##$YMIN_p= -439305
$$ End of Bruker specific parameters
$$ ---------------------------------
##NTUPLES= NMR SPECTRUM
##VAR_NAME=  FREQUENCY,     SPECTRUM/REAL,   SPECTRUM/IMAG
##SYMBOL=    X,             R,               I
##VAR_TYPE=  INDEPENDENT,   DEPENDENT,       DEPENDENT
##VAR_FORM=  AFFN,          ASDF,            ASDF
##VAR_DIM=   16384,         16384,           16384
##UNITS=     HZ,            ARBITRARY UNITS, ARBITRARY UNITS
##FACTOR=    0.220516191357247, 1,           1
##FIRST=     3147.23641088674, 0,            0
##LAST=      -465.480352119041, 0,           0
##MIN=       -465.480352119041, -439305,     0
##MAX=       3147.23641088674, 486982494,    0
$$ Real data points
##PAGE= N=1
##DATA TABLE= (X++(R..R)), XYDATA
$$ [...]
8953H244464j9114L4264r9528j33089J62985J72016P30n9794P3371r3178k64414
$$ 8244464 8225350 8259614 8160086 8026997 8189982 8361998 8362728 8302934 8376305 8283127 8018713
8942H018713j54295j78973j20721p7679Q2985J49462l08825p1332q5394o6739
$$ 8018713 7864418 7685445 7564724 7487045 7570030 7719492 7410667 7339335 7253941 7187202
8932G187202O7911J3842j26714n0469J25913k83717J09225J85464J11702l6859
$$ 7187202 7255113 7268955 7142241 7091772 7217685 6933968 7043193 7228657 7340359 7303500
8922G303500P1065L9982M5604j16107J70515M9344q0341K59936J77173j11762
$$ 7303500 7374565 7414547 7460151 7344044 7514559 7563903 7483562 7743498 7920671 7808909
8912G808909J17154L75306p0289K7841K03326J13469L790K43253J84478J39455
$$ 7808909 7926063 8301369 8231080 8258921 8462247 8575716 8579506 8822759 9007237 9146692
8902I146692k51604p6275j20349R4277K90327L23839j08381l9912L13669j80790
$$ 9146692 8895088 8818813 8698464 8792741 9083068 9406907 9298526 9258614 9572283 9391493
8892I391493J9461J96942L21601J87650J82309L02402K49322J4629R4575J53837
$$ 9391493 9410954 9607896 9929497 10117147 10299456 10601858 10851180 10865809 10960384 11114221
8882A1114221L1676K32950J93965J59570L32817L70076M85264L05036M51211O51315
$$ 11114221 11145897 11378847 11572812 11732382 12065199 12435275 12920539 13225575 13676786 14328101
8872A4328101L57314K04038K31046K3502n8055j31410q4531J71704K51055K27709
$$ 14328101 14685415 14889453 15120499 15144001 15085946 14954536 14870005 15041709 15292764 15520473
8862A5520473Q2614L74440L82363L06707m2211N87351N28829L96216N16172L47996
$$ 15520473 15603087 15977527 16359890 16666597 16624386 17211737 17740566 18136782 18652954 19000950
8852A9000950N12315N36985L54578Q05041P61611P70781R56424J049053R96149
$$ 19000950 19513265 20050250 20404828 21209869 21971480 22742261 23698685 24747738 25743887
8843B5743887P93203J100983J166647J082888J110957J246159J097349J003208
$$ 25743887 26537090 27638073 28804720 29887608 30998565 32244724 33342073 34345281
8835C4345281R51363J285741R97765P29357Q93661N77185M51789R05788J293443
$$ 34345281 35296644 36582385 37580150 38309507 39203168 39780353 40232142 41137930 42431373
8826D2431373J682004K116843J926045J964974K442716K758160L429295L168397
$$ 42431373 44113377 46230220 48156265 50121239 52563955 55322115 58751410 61919807
8818F1919807K908703K753879K229515J849345K81137j535122k168947k210313
$$ 61919807 64828510 67582389 69811904 71661249 71942386 70407264 68238317 66028004
8810F6028004j286831J12121R52489J499681J413752J002417O49956P93025R29333
$$ 66028004 64741173 64853294 65805783 67305464 68719216 69721633 70371589 71164614 72093947
8801G2093947J408426J810595J783373K079597J739209K099284K379406L155769
$$ 72093947 73502373 75312968 77096341 79175938 80915147 83014431 85393837 88549606
8793H8549606L420242L705284L861864M383451N644036O836901P895337Q846739
$$ 88549606 91969848 95675132 99536996 103920447 109564483 116401384 124296721 133143460
8785A33143460R341990Q667075P612701N574896J685384k622497n926415p290533
$$ 133143460 142485450 151152525 158765226 164340122 166025506 163403009 157476594 150186061
8777A50186061o647362n121051l713631l888643n140235n201920n002888m208842
$$ 150186061 143538699 138417648 134704017 130815374 125675139 120473219 115470331 111261489
8769A11261489l617595k906562k104918j358041m34269L83971J191638J414823
$$ 111261489 107643894 104737332 102632414 101274373 100840104 101224075 102415713 103830536
8761A03830536J838975K162194K794273L039154L772256M957369O083669P123204
$$ 103830536 105669511 107831705 110625978 113665132 117437388 122394757 128478426 135601630
8753A35601630P690618P333982P083506O855378P180125P058842N956528M064634
$$ 135601630 143292248 150626230 157709736 164565114 171745239 178804081 184760609 188825243
8745A88825243K23377l681725o415360r225658j0347318r911033r227959q103790
$$ 188825243 189048620 185366895 178951535 169725877 159378559 149467526 140239567 132135777
8737A32135777p645666o392946n529090n079452m600512l770818l278140k499350
$$ 132135777 124490111 118097165 112568075 107488623 102888111 99117293 95839153 93339803
8729I3339803j519057j107057k53432M74994J123095J411701K435483K962641
$$ 93339803 91820746 90713689 90460257 90935251 92058346 93470047 95905530 98868171
8721I8868171L159919L679835M688266N499515N743720N154962J493194j364842
$$ 98868171 102028090 105707925 110396191 115895706 121639426 126794388 128287582 126922740
8713A26922740k502365k995314j832085j523308j848414k918306l705666m766791
$$ 126922740 124420375 121425061 119592976 118069668 116221254 113302948 109597282 104830491
8705A04830491m826814m428155m088284l466574k778089k189858j930087j597004
$$ 104830491 100003677 95575522 91487238 88020664 85242575 83052717 81122630 79525626
8697G9525626j570269j309873j137278j136835r40669m88054p5164Q5103K17106
$$ 79525626 77955357 76645484 75508206 74371371 73430702 72942648 72867484 72952587 73169693
8688G3169693N58971M02183L44327K29306j13093q60055r92065n97622r11655
$$ 73169693 73728664 74130847 74475174 74704480 74591387 73731332 72739267 72141645 71229990
8679G1229990n28340k8043M1100R22671J587112J819642K162116J790237J158308
$$ 71229990 70701650 70673607 70714707 71637378 73224490 75044132 77206248 78996485 80154793
8670H0154793J129987K009914K312618K037669L14763j225611j614194j222364
$$ 80154793 81284780 83294694 85607312 87644981 87959744 86734133 85119939 83897575
8662H3897575q47055j256308k401332k996050k938107k549474j824563r68103
$$ 83897575 83050520 81794212 79392880 76396830 73458723 70909249 69084686 68116583
8654F8116583l97790q5698r7339K15J54699K0281j0924j80492k37708j98774l00910
$$ 68116583 67718793 67633095 67535756 67535971 67690670 67710951 67700027 67519535 67281827 67083053 66782143
8643F6782143k64949m91011n29959K2827P36912K073066K799103L353296K703361
$$ 66782143 66517194 66026183 65496224 65519051 66255963 68329029 71128132 74481428 77184789
8634G7184789J304465l01839k211757l929232m290188l851003k796372k239992
$$ 77184789 78489254 78187415 75975658 72046426 67756238 63905235 61108863 58868871
8626E8868871j785079j591320j476340j751864k063295j691519j478194j451838
$$ 58868871 57083792 55492472 54016132 52264268 50200973 48509454 47031260 45579422
8618D5579422j046847r06610n31270l83628k70178Q9394L23458N39674O13409
$$ 45579422 44532575 43625965 43094695 42711067 42440889 42530283 42853741 43393415 44006824
8609D4006824P54328J048559J502693J268551Q86533R49127J562575K063332K503091
$$ 44006824 44761152 45809711 47312404 48580955 49467488 50416615 51979190 54042522 56545613
8600E6545613K361565J546798J107932J267974J179019J033821N98465K03574
$$ 56545613 58907178 60453976 61561908 62829882 64008901 65042722 65641187 65844761
8592F5844761o1371o07414r29897p89949j396124k068245k231608k359659k294376
$$ 65844761 65783390 65175976 64246079 63456130 62060006 59991761 57760153 55400494 53106118
8583E3106118k324974k129420j893028j741513j518006j062627r07580o53138
$$ 53106118 50781144 48651724 46758696 45017183 43499177 42436550 41528970 40875832
8575D0875832k07955l7011Q8208O50090R89164R78695J416441J614881J952506
$$ 40875832 40667877 40630866 40719074 41369164 42358328 43337023 44753464 46368345 48320851
8566D8320851K107210K019832J915117J932856K244775K238369K382395J949391
$$ 48320851 50428061 52447893 54363010 56295866 58540641 60779010 63161405 65110796
8558F5110796J360876R7400n94623j619534k479083l118163l091542k828020k674164
$$ 65110796 66471672 66569072 65974449 64354915 61875832 58757669 55666127 52838107 50163943
8549E0163943k455699k167830k189339j879081j396813j431168j096730p71797
$$ 50163943 47708244 45540414 43351075 41471994 40075181 38644013 37547283 36775486
8541C6775486m96807m06064j10823j2236L4636O0398M52072K10516K25333K75859
$$ 36775486 36278679 35872615 35761792 35749556 35784192 35844590 36296662 36507178 36732511 37008370
8531C7008370M68069K88225O75890O48796N65178N33288K37230J65210l70243
$$ 37008370 37476439 37764664 38440554 39089350 39654528 40187816 40425046 40590256 40220013
8522D0220013l77879p27422q36130j146347j271345j226397j452999j358739j352784
$$ 40220013 39842134 39114712 38278582 37132235 35860890 34634493 33181494 31822755 30469971
8513C0469971j274779j100521j168102j039810q92229o42883l68280q3786j97608
$$ 30469971 29195192 28094671 26926569 25886759 24994530 24351647 23983367 23899581 23701973
8504B3701973j35840j18764j46492j46452m47659m6357m5048O1061J47987P3067
$$ 23701973 23566133 23447369 23300877 23154425 22706766 22660409 22615361 22676422 22824409 22897476
8494B2897476l1786n4943J6944K87952j4831J6985N5804N1336k6493q5986m94059
$$ 22897476 22865690 22810747 22827691 23115643 23100812 23117797 23173601 23224937 23198444 23112458 22618399
8483B2618399o82763j014004r74602q92033r96901p34941n90911k69181m48736
$$ 22618399 21935636 20921632 19947030 19054997 18058096 17323155 16732244 16463063 16014327
8474A6014327p26851l32217l75367r4364j54405j70022j64219j3368P0135N8946
$$ 16014327 15287476 14955259 14579892 14485528 14331123 14161101 13996882 13983514 14053649 14112595
8464A4112595J05130R647J45885J60605l951N2133M28712K22627J69644N9037
$$ 14112595 14217725 14227372 14373257 14533862 14529911 14582044 15010756 15233383 15403027 15462064
8454A5462064J96222j05919j39203k49731n29460l27427n72210l32008j92356
$$ 15462064 15658286 15552367 15413164 15163433 14633973 14306546 13734336 13402328 13209972
8445A3209972j64097l06672j62798k52895l71335J2339n491K63616N96921M59729
$$ 13209972 13045875 12739203 12576405 12323510 11952175 11964514 11959023 12222639 12819560 13279289
8435A3279289L40684O04437O14389N85487N92580R40253O68059L52838K64935
$$ 13279289 13619973 14224410 14838799 15424286 16016866 16957119 17625178 17978016 18242951
8426A8242951J58298r5316J24948J38743r5827J39207j73121m22068p00385r78014
$$ 18242951 18401249 18305933 18430881 18569624 18473797 18613004 18439883 18017815 17317430 16339416
8416A6339416r01968j051000o79458m34273o18732m83883m67803m42418k88116
$$ 16339416 15437448 14386448 13706990 13272717 12653985 12170102 11702299 11259881 10971765
8407A0971765l14593k62788j1607J14462J94938J91419L26140K44109J37218K13448
$$ 10971765 10657172 10394384 10382777 10497239 10692177 10883596 11209736 11453845 11591063 11804511
8397A1804511K18803J73103J81135K98812L11012N17086L28783J45707k74111
$$ 11804511 12023314 12196417 12377552 12676364 12987376 13504462 13833245 13978952 13704841
8388A3704841m17309n95638m55828k82941n08247q42501p46443p94171o87386
$$ 13704841 13287532 12691894 12236066 11953125 11444878 10602377 9855934 9061763 8374377
8379H374377o79910o49095m62618k33241m91564k31845l97384k64399j52216k83460
$$ 8374377 7694467 7045372 6582754 6349513 5857949 5626104 5228720 4964321 4812105 4528645
8369D528645k43206n0867j34771k18444k86464l12321M810j40089j92236k76734
$$ 4528645 4285439 4234572 4099801 3881357 3594893 3282572 3287382 3147293 2955057 2678323
8359B678323J19753R2487j69050k33425k61253K82103K43547k94596k39718O2897
$$ 2678323 2798076 2890563 2721513 2488088 2226835 2508938 2752485 2457889 2218171 2281068
8349B281068J35633j42278j59056j74214r1056Q3749J25197o5835k64263k2518
$$ 2281068 2416701 2274423 2115367 1941153 1850097 1933846 2059043 1993208 1728945 1706427
8339A706427L12055J6144j97915j77388o4256K2959n2051n2329r4065l48760L3517
$$ 1706427 2018482 2034626 1836711 1659323 1595067 1618026 1565975 1513646 1419581 1070821 1104338
8328A104338J5121R9821L6047j38064j43502O2634K7440m0977K10549m7860j47087
$$ 1104338 1119459 1219280 1255327 1117263 973761 1036395 1063835 1022858 1233407 1185547 1038460
8317A038460J2520J01746j87289p5490P4576J66279J48588k17172N498j8344Q5812
$$ 1038460 1050980 1152726 965437 889947 964523 1130802 1279390 1062218 1067716 1049372 1135184
8306A135184M8574k85142k630J13824M5740R4751j98284N1161O8610k23446l7472
$$ 1135184 1183758 898616 895986 1009810 1055550 1150301 952017 1003178 1071788 848342 810870
8295H10870o1756J24060k17323j02765J05658j7952n9401j32661N0797j29170
$$ 810870 749114 873174 655851 553086 658744 640792 581391 448730 499527 370357
8285C70357L67513J00788j80306j64435j48758J49598J84667K1545J18843o5989
$$ 370357 737870 838658 658352 493917 345159 494757 679424 700969 819812 753823
8275G53823N3084j30037J86630K917n0025j06188K3668Q3927K5974p2201j70037
$$ 753823 806907 676870 863500 866417 816392 710204 733872 817799 843773 771572 601535
8264F01535o0955Q8338j10602k22307J20859J19607k48096L4898N7519K5066J3966
$$ 601535 540580 628918 518316 296009 416868 536475 288379 323277 380796 405862 419828
8253D19828l1916l9713J65991P3742k28174N5181n3795P5071j1480l6857j14709
$$ 419828 387912 348199 514190 587932 359758 414939 361144 436215 424735 387878 273169
8242B73169K15699R6238l2051n8205Q0977k739M9089m2105R1630j81591p9383
$$ 273169 488868 585106 553055 494850 575827 573088 622177 580072 671702 490111 410728
8231D10728Q6389P7627M6098O4326Q9762j06757k41141K6577o7196O4139k63644
$$ 410728 497117 574744 620842 685168 774930 668173 427032 453609 386413 450552 186908
8220A86908M5133n2803K05293J71080j31267j72886k59796m6034M9061Q0659J28085
$$ 186908 232041 179238 384531 555611 424344 251458 -8338 -54372 -5311 75348 203433
8209B03433L19904r4860j07695J7030r1148K6900J65140p8902L7474J82968k74981
$$ 203433 523337 428477 320782 337812 246664 273564 438704 359802 397276 580244 305263
8198C05263r8366K97197R067r9145P9942P9351p45131L17153N3269k54504O317
$$ 305263 206897 504094 513161 414016 493958 573309 -171822 145331 198600 -55904 -49587
8187d9587r8138k0126r8058K21379N6100N257J61895N2398M1730J7547l9518p7034
$$ -49587 -147725 -167851 -265909 -44530 11570 16827 178722 231120 272850 290397 250879 173845
8175A73845Q520n1079Q5743J13947j9658O4360j00083J06941j11369O7454k43070
$$ 173845 182365 131286 217029 330976 311318 375678 275595 382536 271167 338621 95551
8164I5551L3110J78069J48342j89102p5009L14552j93798p5320r8828Q7061l5088
$$ 95551 128661 306730 455072 265970 190961 505513 311715 236395 137567 224628 189540
8153A89540j2430P9563q3007k15301J53144L3054j87681N6031l7837K01534j43392
$$ 189540 177110 256673 173666 -41635 111509 144563 -43118 12913 -24924 176610 33218
8142C3218R0355M2628J14577J06534M9652q3717j69222J60354L4694N2908j96582
$$ 33218 123573 166201 280778 387312 436964 353247 184025 344379 379073 431981 235399
8131B35399j98124o624O9990P1188N1261j6903j56331K83537k1890k06829O6978
$$ 235399 37275 30651 100641 171829 223090 206187 49856 333393 311503 104674 171652
8120A71652j47498n1854L8293k9840J39146O6304L2285l4695Q2456j26711k6624
$$ 171652 24154 -27700 10593 -19247 119899 186203 218488 183793 266249 139538 112914
8109A12914o4032J26401J13743k10347J37628p6986j17523l0315j04304K33409
$$ 112914 48882 175283 289026 78679 216307 139321 21798 -8517 -112821 120588
8099A20588J78496p7598J22778j77805M7601P0102j58649r7982M7792p0472j6996
$$ 120588 299084 221486 344264 166459 214060 284162 125513 27531 75323 4851 -12145
8088a2145K11252J07118j34759p7880o2189K04948K0306j73104l7674m0531K03400
$$ -12145 199107 306225 171466 93586 31397 236345 256651 83547 45873 5342 208742
8077B08742m6395q2836J02470o2855k5429j64504Q1121J74781r223l6207M1574
$$ 208742 162347 79511 181981 119126 93697 -70807 10314 185095 175872 139665 181239
8066A81239n8024L633j05350N1460O1811l3628j28777J07225j83744r0814O5509
$$ 181239 123215 126848 21498 72958 134769 101141 -27636 79589 -104155 -194969 -129460
8055a29460o4383k9412m0490o538K09697K8648N4734N5011J34441j41935p5515
$$ -129460 -193843 -223255 -263745 -270283 -60586 -31938 22796 77807 212248 70313 -5202
8044e202p4172Q0309q5163M2609n3546k49767J07089J68147K2314j73755J92304
$$ -5202 -79374 935 -84228 -41619 -95165 -344932 -237843 -69696 -47382 -221137 -28833
8033b8833J16791J1567o9882Q2488k5527p3318k4534R9903j16044o7635L1224
$$ -28833 87958 99525 29643 112131 86604 13286 -11248 88655 -27389 -95024 -63800
8022f3800J82467M883j55857k4570R6128L5287j31444k14290P874L23868J33032
$$ -63800 118667 123550 -32307 -56877 39251 74538 -56906 -271196 -263322 60546 193578
8011A93578j20575j46147M9272K50017j09973k40233p2966M4809K2730K35206
$$ 193578 73003 -73144 -23872 226145 116172 -124061 -197027 -152218 -129488 105718
8001A05718J9601j73254j40342K06160J8965j59542q9781J86368J74983q7829
$$ 105718 125319 -47935 -188277 17883 36848 -122694 -212475 -26107 148876 61047
7991F1047j82684J43047m5418K30519J01097k03455J762j93739O7111k3063J6943
$$ 61047 -121637 21410 -24008 206511 307608 104153 105915 -87824 -20713 -43776 -26833
7980b6833k102K43087K00195k76812P0389J48807j89467j34792N5337R9535R4674
$$ -26833 -28935 214152 414347 137535 207924 356731 167264 32472 87809 187344 282018
7969B82018j16409o1798j78661q5950Q6480L6809J58183r3584o0613J05423J2254
$$ 282018 165609 103811 -74850 -160800 -74320 -37511 120672 27088 -33525 71898 84152
7958H4152m7677J0784R715l7803J32735k12835J82989q2535K75994j0139r436
$$ 84152 36475 47259 56974 19171 151906 -60929 122060 39525 315519 305380 295944
7947B95944j94855j59534J57127j03102K545J43759J49806j29457J13892Q3788
$$ 295944 101089 -58445 98682 -4420 -1875 141884 291690 162233 276125 359913
7937C59913l915j5847J93162O6271k59032N5968Q854L0924l7804q6961K35622
$$ 359913 355998 340151 533313 599584 340552 396520 405374 436298 398494 311533 547155
7926E47155L0310J79484j18955K3088N9186j78792k53338J75483R4628P9120j15253
$$ 547155 577465 756949 637994 661082 720268 541476 288138 463621 558249 637369 522116
7915E22116j3370j40766J54496j8171K111k67753l0895J36126Q4272j20196j42376
$$ 522116 508746 367980 522476 504305 506416 238663 207768 343894 428166 307970 165594
7904A65594j0208k13391R3745J29592n9052n3334L0882j3467j16843l7221J01285
$$ 165594 155386 -58005 35740 165332 106280 52946 83828 70361 -46482 -83703 17582
7893A7582J0603J99199m762J4948j11508j82104O5631k62132p8057L93359K30754
$$ 17582 28185 227384 222622 237570 126062 -56042 9589 -252543 -330600 62759 293513
7882B93513l01434j64457O8397p4913R9972J65814M2792J9378J28764p8072j50098
$$ 293513 -7921 -172378 -103981 -178894 -78922 86892 129684 149062 277826 199754 49656
7871D9656Q2439O0232j19671m2432N3098k05986K17696j14929P6627J03652k47408
$$ 49656 132095 192327 72656 30224 83322 -122664 95032 -19897 56730 160382 -87026
7860h7026m3999q294K8951R666K21600q1366n2323j93232J46668L59402k5410
$$ -87026 -131025 -139319 -110368 -100702 120898 39532 -12791 -206023 -59355 300047 274637
7849B74637k19220J54977j4757O321J13462k05029J42577k91009j71143L22779
$$ 274637 55417 210394 195637 201958 315420 110391 252968 -38041 -209184 113595
7839A13595J536J17366J96448q0246j77804j02994N0923k0091R817J6430j12734
$$ 113595 115131 232497 428945 348699 170895 67901 118824 98733 108550 124980 12246
7828A2246R6526K95238j1911k56241N4190j24542K49p7195k6465Q9582k7865P0458
$$ 12246 108772 404010 392099 135858 190048 65506 65755 -11440 -37905 51677 23812 94270
7816I4270J24653j48930O8042K9151q2965j40754N7715K45886m9345n0604J4568
$$ 94270 218923 69993 138035 167186 84221 -56533 1182 247068 197723 147119 161687
7805A61687O7755J19450M107j46062j1949Q3737r6501Q5692j84671j53374J5067
$$ 161687 229442 348892 352999 206937 194988 278725 182224 267916 83245 -70129 -55062
7794e5062L204J23313L7143j26650K1750O3584m1399k9281K62377P4434j2920
$$ -55062 -51858 71455 108598 -18052 3698 67282 25883 -3398 258979 333413 320493
7783C20493M4678j96433J22828M1779j15237o3373J06238R3954O0286j11442j49332
$$ 320493 365171 168738 291566 333345 218108 154735 260973 354927 415213 303771 154439
7772A54439l1376R3938j79111J60157O2513j28185M5718K7532m0210J43019k38547
$$ 154439 123063 217001 37890 198047 260560 132375 178093 205625 165415 308434 69887
7761F9887q8520J05978j02655J79057j13823Q5128N3492R1402l3859l1747M7744
$$ 69887 -18633 87345 -15310 163747 49924 135052 188544 279946 246087 214340 262084
7750B62084o2108l9100K7038r1601J35739Q4940J19844Q2446j57958j42196l2480
$$ 262084 199976 160876 187914 96313 232052 316992 436836 519282 361324 219128 186648
7739A86648J17087P0993j33682q0768R2166K851J95576r6431j64313K25994O3253
$$ 186648 303735 374728 241046 160278 252444 255295 450871 354440 190127 416121 479374
7728D79374k40563J71946q4417J2141N0250k63110j09094L0791K9985O7812K03340
$$ 479374 238811 410757 326340 338481 388731 125621 16527 47318 77303 145115 348455
7717C48455J8313j19376j91720k0610K13363O9614M7717j7063j86850l1307O6003
$$ 348455 366768 247392 55672 35062 248425 318039 365756 348693 161843 130536 196539
7706A96539m0095j74250L8943J815J22046O4436n041L9565n4057l7348J42201
$$ 196539 156444 -17806 21137 22952 144998 209434 204393 243958 189901 152553 294754
7695B94754j56443l0765K33339J3435J18481l40146p0391m913J3694J04065p0253
$$ 294754 138311 107546 340885 354320 472801 132655 62264 57351 71045 175110 104857
7684A04857p0977M39159O5738r0806p2515j40770N6609J31532k7221j30900J13599
$$ 104857 33880 473039 538777 447971 375456 234686 291295 422827 395606 264706 378305
7673C78305j11715q0579J97451k30280J6323N150K9329J556J2879P9115K5063
$$ 378305 266590 186011 383462 153182 169505 174655 203984 205540 218419 297534 322597
7662C22597J06229o8612J8259J29123l6333j77101J8813M7620n6593p2565M301
$$ 322597 428826 360214 378473 507596 471263 294162 312975 360595 304002 231437 235738
7651B35738L6208J27526n6383m5731L427k7666K17531J69860k16616k2040j46168
$$ 235738 271946 399472 343089 297358 300785 273119 490650 660510 443894 421854 275686
7640B75686j26227J454J21823o4618J49083q9737R1919L6499k0404j16440J21330
$$ 275686 149459 150913 272736 208118 357201 267464 359383 395882 375478 259038 380368
7629C80368J28532m2279r3911r7137J52069l9986q1576P8975Q8955P3580R99p6615
$$ 380368 508900 466621 372710 275573 427642 387656 306080 385055 474010 547590 548589 471974
7617D71974J3462J93119k60803r8636N6114K07340J21902j84322M9354j05486
$$ 471974 485436 678555 417752 319116 375230 582570 704472 520150 569504 464018
7607D64018p3755j22243K025P1268J42779J21995L082k36556O0295K94884p6641
$$ 464018 390263 268020 270045 341313 484092 606087 609169 372613 432908 727792 651151
7596F51151j17953J01556j79245n88J90466q7031j74688L6619j71462M8730J74078
$$ 651151 533198 634754 455509 454921 645387 558356 383668 420287 248825 297555 471633
7585D71633K2922n1995k5915J41614K57499L1216q5331k1377k74250m4082k7011
$$ 471633 494555 442560 416645 558259 815758 846974 761643 740266 466016 421934 394923
7574C94923r0429J85786R5334J08994j39152J6919p1127l7032k51202l3432J69788
$$ 394923 304494 490280 585614 694608 555456 572375 501248 464216 213014 179582 349370
7563C49370K01923p834k1713Q1406j4957N7015j50062n5995k91200K02041J62018
$$ 349370 551293 543459 521746 603152 588195 645210 495148 439153 147953 349994 512012
7552E12012J03386l3668q3525K7880M1056j87849r2004J90918K33075j80678j8291
$$ 512012 615398 581730 498205 526085 567141 379292 287288 478206 711281 530603 512312
7541E12312j6425R056J78279j88146K0815P9531j5385J33815r5384j7135K87456
$$ 512312 495887 504943 683222 495076 515891 595422 580037 713852 618468 601333 888789
7530H88789j77154O0321j09644N4995O8439j8812j4588J55955k578k79763j65894
$$ 888789 711635 771956 662312 717307 785746 766934 752346 908301 905723 625960 460066
7519D60066K79874J675j33249K34735r4803J20637o0326L2289j407j53916k9127
$$ 460066 739940 741615 608366 843101 748298 868935 808609 840898 839491 685575 656448
7508F56448r5484K07841p6330P099J92406o3775j35442j13338J77518k4333l9815
$$ 656448 560964 768805 692475 699574 891980 828205 692763 579425 756943 732610 692795
7497F92795K9590J41632J15364J03434m1087k04104m5692J36177n1330p0913L2110
$$ 692795 722385 864017 979381 1082815 1041728 837624 791932 928109 876779 805866 837976
7486H37976L5535r249Q1922j37110J01104J74224N1867L2631o100j03702j94901
$$ 837976 873511 864262 946184 809074 910178 1084402 1136269 1168900 1162800 1059098 864197
7475H64197j44331K8910J84411r3584j34086n4237O7880Q4655K17572l4708k18580
$$ 864197 719866 748776 933187 839603 705517 651280 719160 803815 1021387 986679 768099
7464G68099J10792J14179j74735K17814P4172r7929k7813L6596q8817j10078k8488
$$ 768099 878891 993070 818335 1036149 1110321 1012392 984579 1021175 932358 822280 793792
7453G93792K64674J27756p8303J67047r2344r4564P7379J38746L6162J27364K9110
$$ 793792 1058466 1186222 1107919 1274966 1182622 1088058 1165437 1304183 1340345 1467709 1496819
7442A496819O5228R6771j58582k09122n1634J0654K6992j73471m7851r6877k1077
$$ 1496819 1562047 1658818 1500236 1291114 1239480 1250134 1277126 1103655 1055804 958927 937850
7431I37850k1851q256J70724j11956P8535L7472Q6116o921O502J44735o3617j71348
$$ 937850 915999 907743 1078467 966511 1045046 1082518 1168634 1161713 1168215 1312950 1249333 1077985
7419A077985p7969Q6830n6038L8579J35493k39320k5857J97331k86000n5924J06167
$$ 1077985 1000016 1086846 1030808 1069387 1204880 965560 939703 1137034 851034 795110 901277
7408I01277m9052J70746J15364N6093k402r778r4859k1610J50007R6756J0684
$$ 901277 852225 1022971 1138335 1194428 1192026 1182248 1087389 1065779 1215786 1312542 1323226
7397A323226j00524N8019K4757Q4032j09912k61636K0867m6921J6663o1588J0286
$$ 1323226 1222702 1280721 1305478 1389510 1279598 1017962 1038829 991908 1008571 946983 957269
7386I57269J37453R0305J34195j53442Q5526j05276L2258N8664m6954J86198k0478
$$ 957269 1094722 1185027 1319222 1165780 1251306 1146030 1178288 1236952 1189998 1376196 1355718
7375A355718N5476j66376m961o5903J31837O3373K2769q6487j39874O3133Q7692
$$ 1355718 1411194 1244818 1239857 1173954 1305791 1369164 1391933 1305446 1165572 1228705 1316397
7364A316397j33353J74628J88460m7697m2042k70578R5904P732J55810j3959M8681
$$ 1316397 1183044 1357672 1546132 1498435 1456393 1185815 1281719 1289451 1445261 1431302 1479983
7353A479983L2007l0581p1626J19837r733j54557P3546r5437j85770K15928R5602
$$ 1479983 1511990 1481409 1409783 1529620 1519887 1365330 1438876 1343439 1157669 1373597 1469199
7342A469199j69038n9971m0607J05984O3849K4466R5753j64k7878Q3671J59239
$$ 1469199 1300161 1240190 1199583 1305567 1369416 1393882 1489635 1489471 1461593 1545264 1704503
7331A704503K08533j38699j79261k1121K6300J435r3929M4514K4897J70165P6804
$$ 1704503 1913036 1774337 1595076 1573955 1600255 1601690 1507761 1552275 1577172 1747337 1824141
7320A824141k10270l074J19512O9360j13918P839L02439K48255k26385j12301
$$ 1824141 1613871 1610797 1730309 1799669 1685751 1693590 1996029 2244284 2017899 1905598
7310A905598K24409J35165N0555k4626j02723j04335k30120l3906J01232J32635
$$ 1905598 2130007 2265172 2315727 2291101 2188378 2084043 1853923 1820017 1921249 2053884
7300B053884k08836k6419J05783j75967j11564l4147O3285m8842N5826p3300J01028
$$ 2053884 1845048 1818629 1924412 1748445 1636881 1602734 1666019 1617177 1673003 1599703 1700731
7289A700731O1686o2313r998O8408M8610j33714R2234k7165j02621L99021j7308
$$ 1700731 1762417 1700104 1690106 1758514 1807124 1673410 1765644 1738479 1635858 2034879 2017571
7278B017571j20096j01662j8716Q2093j24522O7396K03719K26015j94021j27603
$$ 2017571 1897475 1795813 1777097 1859190 1734668 1802064 2005783 2231798 2037777 1910174
7268A910174q9924J25059K52285j2667j84967L1724N3521o6511K585l2041J0619
$$ 1910174 1820250 1945309 2197594 2184927 1999960 2031684 2085205 2018694 2021279 1989238 1999857
7257A999857k2480j22145J63710M321o6623J69816J68354j52518n2797J85698
$$ 1999857 1977377 1855232 2018942 2023263 1956640 2126456 2294810 2142292 2089495 2275193
7247B275193o9376j81098J98482L8487n1417O7886n2206K8280J97333P0647k33299
$$ 2275193 2205817 2024719 2223201 2261688 2210271 2278157 2225951 2254231 2451564 2522211 2288912
7236B288912J02117J67055q5254o9446o3776j23300m3881R4099n5947K6945M0445
$$ 2288912 2391029 2558084 2472830 2403384 2339608 2216308 2172427 2266526 2210579 2237524 2277969
7225B277969K37339J34147P3781n0068k36600R8573L2116j56180Q6538J24169
$$ 2277969 2515308 2649455 2723236 2673168 2436568 2535141 2567257 2411077 2497615 2621784
7215B621784l9664M0413j26306Q4472L1488o1369J32792J40045P238q2889J9486
$$ 2621784 2582120 2622533 2496227 2580699 2612187 2550818 2683610 2823655 2830893 2748004 2767490
7204B767490k69791O6319K02827p5489j66979m9475K94257m1063j25634J36295
$$ 2767490 2497699 2564018 2766845 2691356 2524377 2474902 2769159 2728096 2602462 2738757
7194B738757J59754q1119J45107J01281L4234l36544J82512o9717O412N9124O0424
$$ 2738757 2898511 2817392 2962499 3063780 3098014 2761470 2943982 2874265 2880677 2939801 3000225
7183C000225J0052J4788J53037k05765P0014J60035p3904O4974Q7719j22413J08954
$$ 3000225 3010277 3025065 3178102 2972337 3042351 3202386 3128482 3193456 3281175 3158762 3267716
7172C267716J40974K8913J71363k9510j24028r2012K9430Q4196P9614L1724M4239
$$ 3267716 3408690 3437603 3608966 3579456 3455428 3363416 3392846 3477042 3556656 3588380 3632619
7161C632619l9784K73267k00677n2128J75059J22327N3603k16002M7755J73052
$$ 3632619 3592835 3866102 3665425 3613297 3788356 3910683 3964286 3748284 3796039 3969091
7151C969091J0686m7839J70493k1795K06224j43651k7811M3113K8709M4967K6550
$$ 3969091 3979777 3931938 4102431 4080636 4286860 4143209 4115398 4158511 4187220 4232187 4258737
7140D258737O4664j70620o2579K88983K45990J26804k44913k00177j7408J07950
$$ 4258737 4323401 4152781 4090202 4379185 4625175 4751979 4507066 4306889 4289481 4397431
7130D397431K23788J21975r1845j33370J21755K69224Q1996J09025N4530j08912
$$ 4397431 4621219 4743194 4651349 4517979 4639734 4908958 4990954 5099979 5154509 5045597
7120E045597L00349J68289j84060J06963R2238Q1358J62944J35532J23959J24998
$$ 5045597 5345946 5514235 5330175 5437138 5529376 5610734 5773678 5909210 6033169 6158167
7110F158167K11500R3615K19003J43088j74881L18398K4767k0147K3242k4235
$$ 6158167 6369667 6463282 6682285 6825373 6650492 6968890 6993657 6973510 6996752 6972517
7100F972517M0603J03681L3685J22492l4119J70346J46935L0185J50167J63565
$$ 6972517 7013120 7116801 7150486 7272978 7238859 7409205 7556140 7586325 7736492 7900057
7090G900057K0030K66638J39313K71088J90221J19968L70307K36116J22573J69772
$$ 7900057 7920087 8186725 8326038 8597126 8787347 8907315 9277622 9513738 9636311 9806083
7080I806083L22130L71295L05816J96724J81854L55442K85720K63315L21936M73128
$$ 9806083 10128213 10499508 10805324 11002048 11183902 11539344 11825064 12088379 12410315 12883443
7070A2883443L63667L85394O43759L48622M88680P33382P65108Q62335Q87133
$$ 12883443 13247110 13632504 14276263 14624885 15113565 15846947 16612055 17474390 18361523
7061A8361523R52260J200336J255959J523976J903014K304914K662177K807338
$$ 18361523 19313783 20514119 21770078 23294054 25197068 27501982 30164159 32971497
7053C2971497L281321L999326M735791N909247P524696R516107J1188510J1595091
$$ 32971497 36252818 40252144 44987935 50897182 58421878 67937985 79126495 90721586
7045I0721586R723554M337384k213302q755484j3027660j3545053j2100277r442384
$$ 90721586 100445140 104782524 102569222 93813738 80786078 67241025 55140748 45698364
7037D5698364p117582n022647l931294k647466k411432j614450j390916j138850
$$ 45698364 38580782 33558135 29626841 26979375 24567943 22953493 21562577 20423727
7029B0423727j054972r11069q25421p73560p11972p15590n11461m10129m81214
$$ 20423727 19368755 18457686 17632265 16858705 16146733 15431143 14919682 14509553 14028339
7020A4028339n01381l92562k08777k62738l58003j47216j83884l59217j04553
$$ 14028339 13526958 13134396 12925619 12662881 12304878 12157662 11973778 11614561 11510008
7011A1510008k82738j14453k83913k35615m1044j96311j43693n5814j35518j16385
$$ 11510008 11227270 11112817 10828904 10593289 10552245 10355934 10212241 10156427 10020909 9904524
7001I904524J13409l79036j26298J70522M1438l04772N5357N9794k43249m0993
$$ 9904524 10017933 9638897 9512599 9683121 9724559 9419787 9475144 9534938 9291689 9250696
6991I250696p1597J04212j207j56372K57976J22446j21253k26200J34615K64714
$$ 9250696 9179099 9283311 9282104 9125732 9383708 9506154 9384901 9158701 9293316 9558030
6981I558030j71468J48579p1325R1398N8111K37241j6524j38613N0274J52853
$$ 9558030 9386562 9535141 9463816 9555214 9613325 9850566 9834042 9695429 9745703 9898556
6971I898556Q1457k35598k282j28975M1227J39155L44957R5787J13002r9423l6241
$$ 9898556 9980013 9744415 9742133 9613158 9654385 9793540 10138497 10234284 10347286 10247863 10211622
6960A0211622Q2971q1108K54654n6510m2988K16813j3082R0632J81551J35369
$$ 10211622 10294593 10213485 10468139 10411629 10368641 10585454 10572372 10663004 10844555 10979924
6950A0979924P7421K67857L0194Q1321K14058K23001M7642L49225M38295L92517
$$ 10979924 11057345 11325202 11355396 11436717 11650775 11873776 11921418 12270643 12708938 13101455
6940A3101455P4965J65968N53902J48351J56643M95419K78384L86290L36537L14885
$$ 13101455 13176420 13342388 13896290 14044641 14201284 14696703 14975087 15361377 15697914 16012799
6930A6012799L67614O45302O94837Q23449N14966R75144J053538J224811J316815
$$ 16012799 16380413 17025715 17720552 18544001 19058967 20034111 21087649 22312460 23629275
6921B3629275J700465J842947K458958K428209K872599L798398M607203N696955
$$ 23629275 25329740 27172687 29631645 32059854 34932453 38730851 43338054 49035009
6913D9035009P629994R822248J3934083J6253416J6040469M000278j1797372j7518799
$$ 49035009 56665003 66487251 80421334 96674750 112715219 116715497 104918125 87399326
6905H7399326j9656556j4255704r467891o594908m733150l593423k922431j991037
$$ 87399326 67742770 53487066 44019175 37424267 32691117 29097694 26175263 24184226
6897B4184226j727947r21726r30006o87328n50857q04308q55951o24427m09075
$$ 24184226 22456279 21534553 20604547 19917219 19366362 18562054 17706103 17081676 16672601
6888A6672601j09040l80324o26430n07788k73423k49553k88796j80179k32042
$$ 16672601 16563561 16183237 15556807 15049019 14775596 14526043 14237247 14057068 13825026
6879A3825026j57923k86449k05245l56010j15343j37355j7515j82643l08540k44516
$$ 13825026 13667103 13380654 13175409 12819399 12704056 12566701 12549186 12366543 12058003 11813487
6869A1813487n6806j91320Q0758l4886j70310r4332j91227M0193Q2828j39577
$$ 11813487 11756681 11565361 11646119 11611233 11440923 11346591 11155364 11195557 11278385 11138808
6859A1138808j6431J02056k26294J7344k16232L2274O1918J55696j35206p1640
$$ 11138808 11122377 11224433 10998139 11015483 10799251 10831525 10893443 11049139 10913933 10842293
6849A0842293J3417j42940j96888O5224K38278Q935k13427k48178J51781J53119
$$ 10842293 10855710 10712770 10515882 10581106 10819384 10828319 10614892 10366714 10518495 10671614
6839A0671614J72512q0170j37551j69463J15769Q8723j00182o399O0463J34616
$$ 10671614 10844126 10763956 10626405 10456942 10572711 10661434 10561252 10554853 10615316 10749932
6829A0749932P380n7222J04051j57041j08422m3357O167m2851m788M3762l21602
$$ 10749932 10757312 10700090 10804141 10647100 10538678 10495321 10501488 10458637 10453849 10497611 10176009
6818A0176009j55107K56209l4663L8127N5448j5795K18139j13640o7480J79371
$$ 10176009 10020902 10277111 10242448 10280575 10336023 10320228 10538367 10424727 10357247 10536618
6808A0536618k50205l43104J47757M4893j86446L03824J94121j22008N2657Q9754
$$ 10536618 10286413 9943309 10091066 10135959 9949513 10253337 10447458 10325450 10378107 10467861
6798A0467861r2192m3595j36255J62803n085J65600J51044j47442J20550j0879
$$ 10467861 10375669 10332074 10195819 10358622 10353537 10519137 10670181 10522739 10643289 10632410
6788A0632410J08674j47471p7264K35515n8185N2171n8070K8369q8576j13929
$$ 10632410 10741084 10593613 10516349 10751864 10693679 10745850 10687780 10716149 10627573 10513644
6778A0513644J15238n9885p334N271K20806o0457R456K1295n8582R2832K5523
$$ 10513644 10628882 10568997 10561663 10566934 10787740 10727283 10736739 10758034 10699452 10792284 10817807
6767A0817807L7907J52840j35700r3089p3914Q7108J30893J14533m3514m8100
$$ 10817807 10855714 11008554 10872854 10779765 10705851 10792959 10923852 11038385 10994871 10946771
6757A0946771q1875o1559J49098J07272J11111q8274r7475n2617J05298N1136
$$ 10946771 10864896 10803337 10952435 11059707 11170818 11082544 10985069 10932452 11037750 11088886
6747A1088886l9647J48491j82474L3091J11816p4917q31j37860K66724L0158o6490
$$ 11088886 11049239 11197730 11015256 11048347 11160163 11085246 11084415 10946555 11213279 11243437 11176947
6736A1176947j65091K5436J19609K4956J4524k3920K4734J56237r2370O015K29860
$$ 11176947 11011856 11037292 11156901 11181857 11196381 11172461 11197195 11353432 11261062 11267077 11496937
6725A1496937r0192J11413j63480J2684Q2941j0378P3677j44270O6491j33225
$$ 11496937 11406745 11518158 11354678 11367362 11450303 11439925 11513602 11369332 11435823 11302598
6715A1302598l5553M0985J01883O0754j14295o8041l6579J60347j1162j39561
$$ 11302598 11267045 11308030 11409913 11470667 11356372 11288331 11251752 11412099 11400937 11261376
6705A1261376J99148M4442J9426M896k1630Q1500p9901K31511j0627j25538N3243
$$ 11261376 11460524 11504966 11524392 11529288 11507658 11589158 11509257 11740768 11730141 11604603 11657846
6694A1657846K0660j64086k15301M853Q0608J11625r3181m026M8535J64602p7530
$$ 11657846 11678506 11514420 11299119 11303972 11384580 11496205 11403024 11398998 11447533 11612135 11534605
6683A1534605R812o4979J85723l7536j76705J18896m891n66l1994J62467k7665
$$ 11534605 11544417 11479438 11665161 11627625 11450920 11569816 11564925 11564359 11532365 11694832 11667167
6672A1667167l6980L0003L8836j11644J7269o343J46406Q2289Q4482j50872m7999
$$ 11667167 11630187 11660190 11699026 11587382 11604651 11598308 11744714 11827003 11911485 11760613 11712614
6661A1712614P5220k8588m5588N1234k9951O645j3558L8774l7806K10599K6400
$$ 11712614 11787834 11759246 11713658 11764892 11734941 11741586 11728028 11766802 11728996 11939595 11965995
6650A1965995j07601l5547j55286K20741J13034J53143j59862q581Q9646l2381
$$ 11965995 11858394 11822847 11667561 11888302 12001336 12154479 11994617 11986036 12075682 12043301
6640A2043301j56018m0127O1850M3307r1612j5707N7602k4144J42401j90594J21715
$$ 12043301 11887283 11847156 11909006 11952313 11860701 11844994 11902596 11878452 12020853 11830259 11951974
6629A1951974j80929j46922j2977j08536Q5759o0578q3468J85549J91964q0175
$$ 11951974 11771045 11624123 11611146 11502610 11588369 11527791 11444323 11629872 11821836 11741661
6619A1741661L0263k0817N4827r0381r3650J71914n7043k07633L9458O1290J0091
$$ 11741661 11771924 11751107 11805934 11715553 11621903 11793817 11736774 11529141 11568599 11629889 11639980
6608A1639980J68371r1193j85985q3459o9037K14016m4669J7905J3229J01087
$$ 11639980 11808351 11717158 11531173 11447714 11378677 11592693 11548024 11565929 11579158 11680245
6598A1680245J93667l6169m9209k02501j14469M7827O6813M5994j79310o2303
$$ 11680245 11873912 11837743 11788534 11586033 11471564 11519391 11586204 11632198 11452888 11390585
6588A1390585O1723k0158L0608R1128n8868K6737J0303r3003k1977Q1310j00703
$$ 11390585 11452308 11432150 11462758 11553886 11495018 11521755 11532058 11439055 11417078 11498388 11397685
6577A1397685q1850N8337R2598J14689j41676K9070m4669j27480r5264P6392L43848
$$ 11397685 11315835 11374172 11466770 11581459 11439783 11468853 11424184 11296704 11201440 11277832 11621680
6566A1621680k42797m0908J43632l0236n7489J09539p7232J67732j53757L3843
$$ 11621680 11378883 11337975 11481607 11451371 11393882 11503421 11426189 11593921 11440164 11474007
6556A1474007J22927k077O1303q8351M3008M0937j69284j01710P6519K7158J32683
$$ 11474007 11596934 11594857 11656160 11567809 11610817 11651754 11482470 11380760 11457279 11484437 11617120
6545A1617120l3112P0820l00685J47732J04300Q8460L4163J95007K06396o1009
$$ 11617120 11584008 11654828 11354143 11501875 11606175 11694635 11728798 11923805 12130201 12069192
6535A2069192k87991P9099R4726j39013K1999J6456O2754M7594J6630K43070R9702
$$ 12069192 11781201 11860300 11955026 11816013 11838012 11854468 11917222 11964816 11981446 12224516 12324218
6524A2324218R5010P3504Q8975R6902m0849K80305K43236K3120M1156L98565J59121
$$ 12324218 12419228 12492732 12581707 12678609 12637760 12918065 13161301 13184421 13225577 13624142 13783263
6513A3783263K36794L90482K31207N20348L49468N00951O23510Q80070R32981
$$ 13783263 14020057 14410539 14641746 15162094 15511562 16012513 16636023 17516093 18449074
6504A8449074R11244J178291J090234J121336Q47478O80455N73040L62301q9869
$$ 18449074 19360318 20538609 21628843 22750179 23597657 24278112 24851152 25213453 25123584
6495B5123584o04126j416049j127437j138072j318445j203512j081855p14853
$$ 25123584 24519458 23103409 21975972 20837900 19519455 18315943 17234088 16519235
6487A6519235p31176p73598n40298m30800k75570l13834k68246k67285n03448
$$ 16519235 15788059 15014461 14474163 14043363 13767793 13453959 13185713 12918428 12414980
6478A2414980O7390K9382k15672p8236o97j6833p1145j12900j58073o7543j78583
$$ 12414980 12482370 12511752 12296080 12217844 12217147 12200314 12129169 12016269 11858196 11790653 11612070
6467A1612070j20817o3968p7163k5048j65614K21189j76349J2351k76310j93807
$$ 11612070 11491253 11427285 11350122 11325074 11159460 11380649 11204300 11216651 10940341 10746534
6457A0746534K36992o8590j70070J25522M39479M5049o4018j69106o5804K0213
$$ 10746534 10983526 10914936 10744866 10870388 11309867 11354916 11290898 11121792 11055988 11076201
6447A1076201J3465J62298K86749K03499J59944R2014n0851j54337j83818k1519
$$ 11076201 11089666 11251964 11538713 11742212 11902156 11994170 11943319 11788982 11605164 11583645
6437A1583645k56074k46813R2758j04842n4642m8269r8306j38828j38809L3612
$$ 11583645 11327571 11080758 11173516 11068674 11014032 10965763 10867457 10728629 10589820 10623432
6427A0623432k53311j49453J43378j07219O3405R8269k29628j17338J70324j38559
$$ 10623432 10370121 10220668 10364046 10256827 10320232 10418501 10188873 10071535 10241859 10103300
6417A0103300L3406l11915j0887O9197O5140J13139j50500J59118l2501L7356
$$ 10103300 10136706 9824791 9813904 9883101 9948241 10061380 9910880 10069998 10037497 10074853
6407A0074853R1562M5943j79734j21118P1027q9123R0991n3035k9098R1010r5930
$$ 10074853 10166415 10212358 10032624 9911506 9982533 9893410 9984401 9931366 9902268 9993278 9897348
6396I897348m0010j9660l26885N6223K13843P559k83614j73294J59902K1471m9975
$$ 9897348 9857338 9837678 9510793 9567016 9780859 9788418 9504804 9331510 9491412 9512883 9462908
6385I462908j58472O5380O9681p6060j92256M8515P4424j19636L2022L0851P8787
$$ 9462908 9304436 9369816 9439497 9363437 9171181 9219696 9294120 9174484 9206506 9237357 9316144
6374I316144J32810k6159k91048p5338l9003M7816m401k34664J19808J34056J09655
$$ 9316144 9448954 9422795 9131747 9056409 9017406 9065222 9060821 8826157 8945965 9080021 9189676
6363I189676j34406J95827N7775J02676k02356j79014P5550j3180j78220k6939
$$ 9189676 9055270 9251097 9308872 9411548 9209192 9030178 9105728 9092548 8914328 8887389
6353H887389Q3477P872l2680j37627J03956L4019J50581j39164J12359P5172o1726
$$ 8887389 8970866 8978738 8946058 8808431 8912387 8946406 9096987 8957823 9070182 9145354 9083628
6342I083628n3104j20301O9218J51724Q1640m1439j92348Q8366L5835k07881J13737
$$ 9083628 9030524 8910223 8979441 9131165 9212805 9171366 8979018 9067384 9103219 8895338 9009075
6331I009075R8325j9156p2929j1461K57931J78368l55015K1641K04466k65631
$$ 9009075 9107400 9088244 9015315 9003854 9261785 9440153 9085138 9106779 9311245 9045614
6321I045614j45595N9532J82531J25174j99247j83270J10341q1871O5613J16427
$$ 9045614 8900019 8959551 9142082 9267256 9068009 8884739 8995080 8913209 8978822 9095249
6311I095249r7190o2453j21808P6755J07013R5008j80607L05j9995K33044p8652
$$ 9095249 8998059 8935606 8813798 8890553 8997566 9092574 8911967 8912272 8892277 9125321 9046669
6300I046669n9172N085j31958J5049k741L7694K1548l8298J20695J79856l3162
$$ 9046669 8987497 8992582 8860624 8875673 8872932 8910626 8932174 8893876 9014571 9194427 9161265
6289I161265O3347m2974o5692P4502J34664l7056Q800r9781R9897J93839j1516
$$ 9161265 9224612 9181638 9115946 9190448 9325112 9288056 9296856 9197075 9296972 9490811 9479295
6278I479295j05043l84381m3894J49740O3967p5016J47587N6286l6207R4492m7
$$ 9479295 9374252 8989871 8945977 9095717 9159684 9084668 9232255 9288541 9252334 9346826 9346779
6267I346779J23645J1385J21238j75595p9864j22196J38656J34163j72126l676
$$ 9346779 9470424 9481809 9603047 9427452 9347588 9225392 9364048 9498211 9326085 9322409
6257I322409K00218j33342M8885K7289K03957N2317m776o9843j90020K1629N7902
$$ 9322409 9522627 9389285 9438170 9465459 9669416 9721733 9716957 9647114 9457094 9478723 9536625
6246I536625m9673j97594M0099O0834j47723J08251J34053J83116K00964l545
$$ 9536625 9486952 9289358 9329457 9390291 9242568 9350819 9484872 9667988 9868952 9865407
6236I865407M7257M4342p1958J15918j19264J4031P3742L375J7968o1426L6698
$$ 9865407 9912664 9957006 9885048 10000966 9881702 9895733 9969475 9972850 9990818 9929392 9966090
6225I966090O5126N9675k82221J35286l0638n4187J19258J19744K10685J74806
$$ 9966090 10031216 10090891 9808670 9943956 9913318 9859131 9978389 10098133 10308818 10483624
6215A0483624p74j03733j42428L80228P456r8789J38918O0844r6494j05839L1542
$$ 10483624 10482850 10379117 10236689 10616917 10624373 10525584 10664502 10725346 10628852 10523013 10554555
6204A0554555J80127J97856M4435j84006J50337J57921N6658J052J18992K50743
$$ 10554555 10734682 10932538 10976973 10792967 10943304 11101225 11157883 11158935 11277927 11528670
6194A1528670J43043K47174K79855O6967R75l6838J72045K18124N0945R5829n7081
$$ 11528670 11671713 11918887 12198742 12265709 12266684 12229846 12401891 12620015 12670960 12766789 12709708
6183A2709708M7070K49955Q3259q0054J15303J51207J46265K52684j29518J64725
$$ 12709708 12756778 13006733 13089992 13009938 13125241 13276448 13422713 13675397 13545879 13710604
6173A3710604L56232j0244K57571J10196j38869J23227L06629j73357N9113K57004
$$ 13710604 14066836 14056592 14314163 14424359 14285490 14408717 14715346 14541989 14601102 14858106
6163A4858106K40323L49563L7048J36189L36679K48310K77994J06204M23404L12249
$$ 14858106 15098429 15447992 15485040 15621229 15957908 16206218 16484212 16590416 17013820 17326069
6153A7326069J50160L76968K18524L52578N61764K92839L16697P3370L64540J63737
$$ 17326069 17476229 17853197 18071721 18424299 18986063 19278902 19595599 19668969 20033509 20197246
6143B0197246J64037L19208M61909L67384J50742M00856K28136O25043M17102
$$ 20197246 20361283 20680491 21142400 21509784 21660526 22061382 22289518 22914561 23331663
6134B3331663K85879N62148M05705M20211M48413N76669M55074N07394R36871
$$ 23331663 23617542 24179690 24585395 25005606 25454019 26030688 26485762 26993156 27930027
6125B7930027M52920Q16357R69501P81303Q89654J027005J223846J347614J234539
$$ 27930027 28382947 29199304 30168805 30950108 31839762 32866767 34090613 35438227 36672766
6116C6672766J324354J455908J485454J512445J202965J652855J744802J924051
$$ 36672766 37997120 39453028 40938482 42450927 43653892 45306747 47051549 48975600
6108D8975600J741095J863784K097097K472755L091156L361652L404900M065233
$$ 48975600 50716695 52580479 54677576 57150331 60241487 63603139 67008039 71073272
6100G1073272M894379N804682O921920Q539936R990779J1409797J2626560J4634560
$$ 71073272 75967651 81772333 88694253 97234189 107224968 118634765 131261325 145895885
6092A45895885J7715912K1187736K5538068L2946914M2650167N3852910O0288547
$$ 145895885 163611797 184799533 210337601 243284515 285934682 339787592 400076139
6085D00076139N4486746J7422922l3600690o2933032p2736709o1089199m4418863
$$ 400076139 454562885 471985807 438385117 375452085 302715376 241626177 197207314
6078A97207314l2339462k4023583j8698553j4903361j1680275q901530o731114
$$ 197207314 164867852 140844269 122145716 107242355 95562080 86660550 79929436
6071G9929436n076670m318809m032372m018942l720880l441629k528507k420644
$$ 79929436 74852766 70533957 66501585 62482643 58761763 55320134 52791627 50370983
6063E0370983k184585k123374k244639j787765j779450j042226j377742j216244
$$ 50370983 48186398 46063024 43818385 42030620 40251170 39208944 37831202 36614958
6055C6614958j220501j251051p76722j132196j071382r01656q24262q42111p77712
$$ 36614958 35394457 34143406 33366684 32234488 31163106 30261450 29437188 28595077 27817365
6046B7817365q09216p47906m86251n46647p65529o38825o00682o60142p37886
$$ 27817365 27008149 26260243 25773992 25227345 24461816 23822991 23222309 22562167 21824281
6037B1824281n68361l68354l69594k71170k91737l22651k13995l44231j97071
$$ 21824281 21255920 20887566 20517972 20246802 19955065 19632414 19418419 19074188 18877117
6028A8877117j84553n14623l86102k09909l91417k93829j76509j79720l32754
$$ 18877117 18692564 18177941 17791839 17581930 17190513 16896684 16720175 16540455 16207701
6019A6207701O9460k48323j43785k81465k54076p3005m4555K5427l7341k26891
$$ 16207701 16277161 16028838 15885053 15603588 15349512 15276507 15231952 15257379 15220038 14993147
6009A4993147l44884q2967j86033o3635j1941k37686j54104Q267l19800l16132
$$ 14993147 14648263 14565296 14379263 14315628 14303687 14066001 13911897 13920164 13600364 13284232
5999A3284232k07179j59493j95335k89347k49285j71867q0385n7816J10120m2506
$$ 13284232 13077053 12917560 12722225 12432878 12183593 12011726 11931341 11873525 11983645 11941139
5989A1941139k83370l36303l71887m8239L6017j28233k49152J13390K14714j01958
$$ 11941139 11657769 11321466 10949579 10901340 10937357 10809124 10559972 10673362 10888076 10786118
5979A0786118p8856J43558J6259Q8636J60979J63783l3563k60156J27178j73848
$$ 10786118 10707262 10850820 10867079 10955715 11116694 11280477 11246914 10986758 11113936 10940088
5969A0940088n2878M0077J5578n2577M8142j01265j11273m1316j52269l56568
$$ 10940088 10887210 10927287 10942865 10890288 10938430 10837165 10725892 10684576 10532307 10175739
5959A0175739r1489r5745J69001L5400J6816Q3571J52213Q3822k7313O2889P6350
$$ 10175739 10084250 9988505 10157506 10192906 10209722 10293293 10445506 10529328 10502015 10564904 10641254
5948A0641254j03925j72590R775m2943L1132J82301j66748l07542J24245J31486
$$ 10641254 10537329 10364739 10374514 10331571 10362703 10545004 10378256 10070714 10194959 10326445
5938A0326445K785P5417J87951k45769q1857j05534M4471J01459J43350J98809
$$ 10326445 10329230 10404647 10592598 10346829 10264972 10159438 10203909 10305368 10448718 10647527
5928A0647527Q3700k6441J22251N141m13228O7946J86466j73387m8071Q9192J2022
$$ 10647527 10731227 10704786 10827037 10832178 10418950 10486896 10673362 10499975 10451904 10541096 10553118
5917A0553118k08486j62361J23902K40759q5149n620R60R9558M3240J1804N3208
$$ 10553118 10344632 10182271 10306173 10546932 10461783 10456163 10457123 10556681 10599921 10611725 10664933
5906A0664933k3804R9113J89656M9752p0880P3253j9281l4530P8349m5737K04182
$$ 10664933 10641129 10740242 10929898 10979650 10908770 10982023 10962742 10928212 11006561 10960824 11165006
5895A1165006j26150J6090K20259k2159n8184m4511m0312K13272K72426M8882
$$ 11165006 11038856 11054946 11275205 11253046 11194862 11150351 11110039 11323311 11595737 11644619
5885A1644619J20858o9960K6819J81416J52174k0212J03546J26675J65029K67776
$$ 11644619 11765477 11695517 11722336 11903752 12055926 12035714 12139260 12265935 12430964 12698740
5875A2698740q1160l02L90164R7846K4159J34180K7582K43252m4879n7138k33086
$$ 12698740 12617580 12617278 13007442 13105288 13129447 13263627 13291209 13534461 13489582 13432444 13199358
5864A3199358K40894K73164J40734K47326P2055L0170K09098n2189J09862K78359
$$ 13199358 13440252 13713416 13854150 14101476 14173531 14203701 14412799 14360610 14470472 14748831
5854A4748831K09183Q3033J12272K54185L33496J91236J67596L64796J95829J71167
$$ 14748831 14958014 15041047 15153319 15407504 15741000 15932236 16099832 16464628 16660457 16831624
5844A6831624L23289M97330M79336M47898L69457O35311L83849M20089L88600
$$ 16831624 17154913 17652243 18131579 18579477 18948934 19584245 19968094 20388183 20776783
5835B0776783N68331O48815O03088O30425M43794O58990Q77922J087931J107747
$$ 20776783 21345114 21993929 22597017 23227442 23671236 24330226 25208148 26296079 27403826
5826B7403826J443269J573244J604513K109402K039681K478544L026013L544422
$$ 27403826 28847095 30420339 32024852 34134254 36173935 38652479 41678492 45222914
5818D5222914L609738L963395L430849K679567R44966n89708j223124j929815
$$ 45222914 48832652 52796047 56226896 58906463 59851429 59261721 58038597 56108782
5810E6108782j707915j225475p03795K43310O46209J076445J366600J184638K235081
$$ 56108782 54400867 53175392 52471597 52714907 53361116 54437561 55804161 56988799 59223880
5801E9223880L233244M063319M897430N412943N843720M901930K969176N65767
$$ 59223880 62457124 66520443 71417873 76830816 82674536 87576466 90545642 91111409
5793I1111409j546742l102433l520926l255868l307803l656922m368536m246604
$$ 91111409 89564667 86462234 82941308 79685440 76377637 72720715 68352179 64105575
5785F4105575l287760k288694j336918k75258L40730Q61541J217667J387444J661455
$$ 64105575 60817815 58529121 57192203 56916945 57257675 58119216 59336883 60724327 62385782
5776F2385782K567005K869955K912461K184469J39195k241002m472812n819199
$$ 62385782 64952787 67822742 70735203 72919672 73058867 70817865 66345053 60525854
5768F0525854n762520n190786m766568l801091l390314k719055k219342j967115
$$ 60525854 54763334 49572548 44805980 41004889 37614575 34895520 32676178 30709063
5760C0709063j603542j387161j239254q60618p30556r15022o64098o25467o57754
$$ 30709063 29105521 27718360 26479106 25618488 24887932 23972910 23308812 22683345 22025591
5751B2025591m22076o38986m96253n28146m55415k27284n38352k95877l78771
$$ 22025591 21603515 20964529 20468276 19940130 19484715 19257431 18719079 18423202 18044431
5742A8044431j91312j53000k42315j49762k65923l1691k98707j90082m7384j96215
$$ 18044431 17853119 17700119 17457804 17308042 17042119 17010428 16711721 16521639 16474255 16278040
5732A6278040J63277l14266j26237O0818k75109k51384j53750P6276j28215k79470
$$ 16278040 16441317 16127051 16000814 16061632 15786523 15535139 15381389 15457665 15329450 15049980
5722A5049980j70846k33714m767j68958j71569k93237j66370k57896k81586j28802
$$ 15049980 14879134 14645420 14640653 14471695 14300126 14006889 13840519 13582623 13301037 13172235
5712A3172235l04060k9232J20112M9762J5470n7313k39790j25202k7448k2043
$$ 13172235 12868175 12838943 12959055 13008817 13024287 12966974 12727184 12601982 12574534 12552491
5702A2552491q1063j27207M8897K031M696J26244M3902n6096J62929r358j02407
$$ 12552491 12471428 12344221 12393118 12395149 12399845 12526089 12569991 12513895 12676824 12667466 12565059
5691A2565059m627J6732N3589j41439r9148j63649J2253L4752m06881j1960O5253
$$ 12565059 12560432 12577164 12630753 12489314 12390166 12226517 12238770 12273522 11866641 11854681 11919934
5680A1919934J02806P6122q263r11j09365Q2576j09716k0259O9376J11929J68742
$$ 11919934 12022740 12098862 12090599 12089688 11980323 12062899 11953183 11932924 12002300 12114229 12282971
5669A2282971j75040p1160K15122K83929n4849J30741L8433j19356L73929J72581
$$ 12282971 12107931 12036771 12251893 12535822 12480973 12611714 12650147 12530791 12904720 13077301
5659A3077301o5412K6463j04948Q8872K80514J33427r5683p3198M8806n6595J36985
$$ 13077301 13011889 13038352 12933404 13022276 13302790 13436217 13340534 13267336 13316142 13259547 13396532
5648A3396532K58897J42891l2388J81258J08978K70439q2702Q6195K71842j91799
$$ 13396532 13655429 13798320 13765932 13947190 14056168 14326607 14243905 14330100 14601942 14410143
5638A4410143Q5217L80432k1747r006J18322Q1501K48496K42397L36282K49986
$$ 14410143 14495360 14875792 14854045 14845039 14963361 15044862 15293358 15535755 15872037 16122023
5628A6122023J54745P3261L65766L73386K45341K59448N01651R6838O6039M76430
$$ 16122023 16276768 16350029 16715795 17089181 17334522 17593970 18095621 18192459 18258498 18734928
5618A8734928L56573L36653L15820M45786J10779M43104M21989L90547P01926
$$ 18734928 19091501 19428154 19743974 20189760 20300539 20743643 21165632 21556179 22258105
5609B2258105N76945O13706R93798P89235Q02210J077508J312368J384668J631339
$$ 22258105 22835050 23448756 24442554 25231789 26033999 27111507 28423875 29808543 31439882
5600C1439882J877862J828460J495887J519155J435901R28740O68317M03370M51044
$$ 31439882 33317744 35146204 36642091 38161246 39597147 40525887 41194204 41597574 42048618
5591D2048618L46288O40486J261528J550534J699428K490878L248401L760529
$$ 42048618 42394906 43035392 44296920 45847454 47546882 50037760 53286161 57046690
5583E7046690M334140M941737M927268L924413K093465q9600k251748l338020
$$ 57046690 61380830 66322567 71249835 75174248 77267713 77178113 74926365 71588345
5575G1588345l115702l116424k401195j422624j049689o65603L9819P03006J315894
$$ 71588345 68472643 65356219 62955024 61532400 60482711 59817108 59856927 60559933 61875827
5566F1875827K559169L360621M000168L929951L665503L103914K568162K376498
$$ 61875827 64434996 67795617 71795785 75725736 79391239 82495153 85063315 87439813
5558H7439813K092999Q18470j005758l098326n441488o223024n950838m999493
$$ 87439813 89532812 90351282 89345524 86247198 80805710 74582686 68631848 63632355
5550F3632355l940748l027401j940793r06872o38885l25055j63996L6305O73942
$$ 63632355 59691607 56664206 54723413 53816541 53177656 52852601 52688605 52724910 53398852
5541E3398852J128896J394903J675220J156619L59670j025758k454235l354626
$$ 53398852 54527748 55922651 57597871 58754490 59114160 58088402 55634167 52279541
5533E2279541l931979l696509l542356l091123k492493k170062j819865j390630
$$ 52279541 48347562 44651053 41108697 38017574 35525081 33355019 31535154 30144524
5525C0144524r25360r23612p89169o66609p21370l07317l02657k17278m76912
$$ 30144524 29219164 28295552 27506383 26839774 26118404 25811087 25508430 25291152 24814240
5516B4814240l55026k93441l34134k02438q3263j81298j24116J48547J41535o1329
$$ 24814240 24459214 24165773 23831639 23629201 23545938 23364640 23240524 23389071 23530606 23469277
5506B3469277Q7016p9798m4046j28563O4608L95065J37741K73636R3147K17879
$$ 23469277 23556293 23476495 23432449 23303886 23368494 23763559 23901300 24174936 24268083 24485962
5496B4485962L5881J80541N39017K82453R1862M29330M75167O59467O27619K24267
$$ 24485962 24521843 24702384 25241401 25523854 25615716 26045046 26520213 27179680 27807299 28031566
5486B8031566N42583P49020Q96661R54664R46884J159725J347576J542206J813994
$$ 28031566 28574149 29323169 30219830 31174494 32121378 33281103 34628679 36170885 37984879
5477C7984879J869615J939369K515537K959066L393005L999355M950317N813577
$$ 37984879 39854494 41793863 44309400 47268466 50661471 54660826 59611143 65424720
5469F5424720N944001N262124L599268J998215K91115r80629k609788l830789
$$ 65424720 71368721 76630845 80230113 82228328 82519443 81538814 78929026 75098237
5461G5098237m026459l837795k262027j307950k58767P96275J822088K396062
$$ 75098237 71071778 67233983 64971956 63664006 63405239 64201514 66023602 68419664
5453F8419664L507272M480822N732128P187301Q242904R804689J0408542J0526552
$$ 68419664 71926936 76407758 82139886 89327187 97570091 107374780 117783322 128309874
5445A28309874R589170O440403J609752l591237p591717q857988p315835m951549
$$ 128309874 137899044 144339447 145949199 142357962 134766245 125908257 118592422 113640873
5437A13640873l523939l851138m432538m680602m645107m347246m301595l474989
$$ 113640873 110116934 106265796 101833258 97152656 92507549 88160303 83858708 80383719
5429H0383719k560417j494298N9541J165259K395812M166286N844335P531759
$$ 80383719 77823302 76329004 76388545 77553804 79949616 84115902 89960237 97491996
5421I7491996Q939766R320304P464599L408341k226247p765729j1568059j2348255
$$ 97491996 106431762 115752066 123216665 126625006 124398759 116633030 105064971 92716716
5413I2716716j1585313r697455p787555o130280m797773l953257l367604l005464
$$ 92716716 81131403 71433948 63646393 57516113 52718340 48765083 45397479 42392015
5405D2392015k250272j689987j385673j256488j162332j216353j017028p93714
$$ 42392015 40141743 38451756 37066083 35809595 34647263 33430910 32413882 31620168
5397C1620168m53298o74010o10016n30141o86892l81131j59081k03870q5869j08172
$$ 31620168 31166870 30492860 29882844 29352703 28665811 28284680 28125599 27921729 27835860 27727688
5387B7727688l78931k0076N2161J26485K26574M44376P1517J3955Q6947k41461
$$ 27727688 27348757 27328681 27380842 27507327 27733901 28178277 28249794 28263749 28350696 28109235
5377B8109235n92663p69831q88303q93723m72218k50190k87831k60620l8998l3129
$$ 28109235 27516572 26746741 25858438 24964715 24492497 24242307 23954476 23693856 23654858 23621729
5367B3621729j98098j20932J54202J63323r4270J9187l7769J87159J51550K6563
$$ 23621729 23423631 23302699 23456901 23620224 23525954 23545141 23507372 23694531 23846081 23872644
5357B3872644L0113K79318K79606N33535L51721J87807O78068P75031Q14965Q75037
$$ 23872644 23902757 24182075 24461681 24995216 25346937 25534744 26212812 26987843 27802808 28677845
5347B8677845P33308L26800Q6333l92518j14329k0730L77823M7589J59932O45596
$$ 28677845 29411153 29737953 29824286 29431768 29317439 29296709 29674532 29722121 29882053 30527649
5337C0527649J07636J59266L36899k1178J1716N62386N77733K72321P44835O42495
$$ 30527649 30635285 30794551 31131450 31110272 31121988 31684374 32262107 32534428 33279263 33921758
5327C3921758O18452P15911J006443R94831J173307J169300J257332J237169J534379
$$ 33921758 34540210 35256121 36262564 37257395 38430702 39600002 40857334 42094503 43628882
5318D3628882J734096J965249K321894K634240K769912L072970L298976M063750
$$ 43628882 45362978 47328227 49650121 52284361 55054273 58127243 61426219 65489969
5310F5489969M846814N926748P211949Q887528J0676867J1518076J1023302P342632
$$ 65489969 70336783 76263531 83475480 92363008 103039875 114557951 125581253 132923885
5302A32923885K610567k870171q309956j0576599j0516878q966470o149381m036351
$$ 132923885 135534452 132664281 124354325 113777726 103260848 94294378 88144997 84108646
5294H4108646k388819q34268J025483K317502L793688M909901N628809N511087
$$ 84108646 81719827 80885559 81911042 84228544 88022232 92932133 98560942 104072029
5286A04072029N256064N391105N158023L978705K869981L299322N019370O741781
$$ 104072029 109328093 114719198 119877221 123855926 126725907 130025229 135044599 141786380
5278A41786380O933585L438781j758877o839018j0585643j1943390j1774962j0619492
$$ 141786380 148719965 152158746 150399869 143560851 132975208 121031818 109256856 98637364
5270I8637364q892461o881294n042681l491689k429403j314519m53163N52452
$$ 98637364 89744903 82863609 77820928 74329239 71899836 70585317 70132154 70684606
5262G0684606J154873J703854K615081L504089L873454L759023K372729j66916
$$ 70684606 71839479 73543333 76158414 79662503 83535957 87294980 89667709 89500793
5254H9500793j329457k354056m162937n580683o574957o859782n838855m688354
$$ 89500793 88171336 85817280 81654343 76073660 69498703 62638921 56800066 52111712
5246E2111712l674026k970303k328530k068548j771841j503477j097586j057522
$$ 52111712 48437686 45467383 43138853 41070305 39298464 37794987 36697401 35639879
5238C5639879j077834q79312r68468j067304r47644r61621q59299r53842q54639
$$ 35639879 34562045 33682733 32714265 31646961 30699317 29737696 28878397 27924555 27069916
5229B7069916r65683q86847o32984o66443o79048p50258n62451p95290n91106
$$ 27069916 26104233 25217386 24584402 23917959 23238911 22488653 21926202 21130912 20539806
5220B0539806k46959n69825n77428k60082n85340n39391l93834m52718m42861
$$ 20539806 20292847 19723022 19145594 18885512 18300172 17760781 17366947 16914229 16471368
5211A6471368l65829k85236j59167l95272l10324l95071k81067j50384k95731
$$ 16471368 16105539 15820303 15661136 15265864 14955540 14560469 14279402 14129018 13833287
5202A3833287k51886k39077q6798k20535l36112j52731J61976q0966k19238m19766
$$ 13833287 13581401 13342324 13255526 13034991 12698879 12546148 12708124 12627158 12407920 11988154
5192A1988154k62231j15960o9471k72987j57083O4316j69580l2842k62999p5823
$$ 11988154 11725923 11609963 11540492 11267505 11110422 11174738 11005158 10972316 10709317 10633494
5182A0633494j0292l91433k25166j39745q1094J12413j30311k05417j84038l432
$$ 10633494 10623202 10231769 10006603 9866858 9785764 9898177 9767866 9562449 9378411 9374979
5172I374979J4119l9393r0414M0450M5592q9982j36827J68114k749j88543M832
$$ 9374979 9389098 9349705 9259291 9299741 9345333 9255351 9118524 9286638 9283889 9095346 9100178
5161I100178J0421J32974r5203J11323j11500K7443K3370o6911l9325O7909J24004
$$ 9100178 9110599 9243573 9148370 9259693 9148193 9175636 9199006 9132095 9092770 9160679 9284683
5150I284683L16867J00343l8951L2437L06474M09879m4796J71572K73611M83067
$$ 9284683 9601550 9701893 9662942 9695379 10001853 10411732 10366936 10538508 10812119 11295186
5140A1295186L55119L69018N0064M56976M95105Q39994O44574N55010O29137O68825
$$ 11295186 11650305 12019323 12069387 12526363 13021468 13861462 14506036 15061046 15690183 16359008
5130A6359008P38046Q04291Q13487O35171M16918K15334m04471q99421q18049
$$ 16359008 17097054 17901345 18714832 19350003 19766921 19982255 19577784 18678363 17860314
5121A7860314q83534j040532q91163o81332r18423p92760m47668n09071m10996
$$ 17860314 16976780 15936248 15045085 14363753 13445330 12652570 12204902 11695831 11284835
5112A1284835o36897j81638l67796m25702K9568m04943j94664l28449l01082j79811
$$ 11284835 10647938 10466300 10098504 9672802 9702370 9297427 9102763 8774314 8473232 8293421
5102H293421j91920K20550r7144l17665M6209j54662J7714j19832j92679n9073
$$ 8293421 8101501 8322051 8224907 7907242 7953451 7798789 7816503 7696671 7503992 7444919
5092G444919M1098Q903L02991j06793j79770K7257j07475j14358j04861J84071
$$ 7444919 7486017 7494920 7797911 7691118 7511348 7538605 7431130 7316772 7211911 7395982
5082G395982M7407J5497J31946Q7154o1991j49759J88130P1552R3672K71783J29242
$$ 7395982 7443389 7458886 7590832 7677986 7615995 7466236 7654366 7725918 7819590 8091373 8220615
5071H220615J79265L41468J44527J60702K55916K38351O8752K86605L30181K63868
$$ 8220615 8399880 8741348 8885875 9046577 9302493 9540844 9609596 9896201 10226382 10490250
5061A0490250M43248L32705K81293N13980J75191M26322J48813K96175L94267
$$ 10490250 10933498 11266203 11547496 12061476 12236667 12662989 12811802 13107977 13502244
5052A3502244J48287J14763L796K09828Q5453J5761l16091R789m6464J31888L53728
$$ 13502244 13650531 13765294 13769090 13978918 14064371 14080132 13764041 13773830 13727366 13859254 14212982
5041A4212982J95660J22019M27937L46339l6683J75092J93874J77739r5161k77861
$$ 14212982 14408642 14530661 14958598 15304937 15268254 15443346 15637220 15814959 15719798 15441937
5031A5441937j04000m11486l79611q6406l44910k80172k44017l21228m82685l65696
$$ 15441937 15337937 14926451 14546840 14460434 14115524 13835352 13591335 13270107 12787422 12421726
5021A2421726j69504k80383k34103l04443j50097j21504r4756p7185j92777k28624
$$ 12421726 12252222 11971839 11737736 11433293 11283196 11161692 11066936 10989751 10796974 10568350
5011A0568350l84745j37117q8083l92406m47746l02546k89658j67919l39871l83410
$$ 10568350 10183605 10046488 9958405 9565999 9118253 8815707 8526049 8358130 8018259 7634849
5001G634849j49972k12751n02992j82190j0219j54573k38682l18134r9032j3238
$$ 7634849 7484877 7272126 6769134 6586944 6576725 6422152 6183470 5865336 5766304 5753066
4991E753066j69186l9254j76519J5169j40701o5516j23499k85799k1803l30360
$$ 5753066 5583880 5544626 5368107 5383276 5242575 5177059 5053560 4767761 4745958 4415598
4981D415598o0272Q1606m0717o9531J24981j7854K6824j89006j02023o8223n3002
$$ 4415598 4355326 4436932 4396215 4326684 4451665 4433811 4460635 4271629 4169606 4101383 4048381
4970D048381j13602k9130l2218J5208j20271N8373L0675m6405N5214J32430p0625
$$ 4048381 3934779 3905649 3873431 3888639 3768368 3826741 3857416 3811011 3866225 3998655 3928030
4959C928030j00754k99094j06749K38355j01743m2566j02843r9776J38835K19292
$$ 3928030 3827276 3528182 3421433 3659788 3558045 3515479 3412636 3312860 3451695 3670987
4949C670987O3292k4408n8006M9158p7868L4717k20136o5192R5754m3124P6766
$$ 3670987 3734279 3709871 3651865 3701023 3623155 3657872 3437736 3372544 3468298 3425174 3501940
4938C501940M888j75294k79697m0866L92623P9976k34982p5219q9136j48890j89431
$$ 3501940 3506828 3331534 3051837 3010971 3403594 3483570 3248588 3173369 3084233 2935343 2745912
4927B745912J6661J763o0163j53536p5422K45005J02347j10821L3496n277P6515
$$ 2745912 2762573 2764336 2704173 2550637 2475215 2720220 2822567 2711746 2745242 2739965 2816480
4916B816480j94747J7752Q7563l5270Q938j97033j42535J91024k22856j34492
$$ 2816480 2621733 2639485 2727048 2691778 2700716 2503683 2361148 2552172 2329316 2194824
4906B194824k0254o8429K03248Q4465m9944J0240L4837k00871J18184p3700k37788
$$ 2194824 2174570 2106141 2309389 2393854 2343910 2354150 2388987 2188116 2306300 2232600 1994812
4895A994812j26095J11122o026o0347P4507j3589m8429j07166J38284M295m3333
$$ 1994812 1868717 1979839 1973813 1913466 1987973 1974384 1925955 1818789 1957073 1961368 1918035
4884A918035k12477N6927J16921M98J22942j95321k17666L8831q475O131j8816
$$ 1918035 1705558 1762485 1879406 1879904 2002846 1807525 1589859 1628690 1620215 1626346 1607530
4873A607530J50981P5132O160r0152j42759J52165p1404K2597k2224j21675k7065
$$ 1607530 1758511 1833643 1839803 1749651 1606892 1759057 1687653 1710250 1688026 1566351 1539286
4862A539286J75077m1607j06013j15951Q7960P7133M3622k77520R3088J65535
$$ 1539286 1714363 1672756 1566743 1450792 1538752 1615885 1659507 1381987 1475075 1640610
4852A640610n3303j4772R4844N5435l9604p7143m8553k09596Q1540K99779M9625
$$ 1640610 1587307 1572535 1667379 1722814 1683210 1606067 1557514 1347918 1429458 1729237 1778862
4841A778862l39588r2730J4853l7663O4416j45049R3510K69314l3102j26071j30596
$$ 1778862 1439274 1346544 1361397 1323734 1388150 1243101 1336611 1605925 1572823 1446752 1316156
4830A316156n2529L9827J19393p0664K4844q5024K6685J91740j16959n1162k9142
$$ 1316156 1263627 1303454 1422847 1352183 1377027 1292003 1318688 1510428 1393469 1342307 1313165
4819A313165K3096j244J20701j00878J38072m389r352r0862P8143q4300m3227
$$ 1313165 1336261 1335017 1455718 1354840 1492912 1488523 1479171 1388309 1466452 1382152 1338925
4808A338925j84312o7778K55993J48040M0699M713j78884j55244k0634m4480j5238
$$ 1338925 1154613 1086835 1342828 1490868 1531567 1536280 1357396 1202152 1181518 1137038 1121800
4797A121800J47254N7699q4125O589J43455j39873J62269K16135k49363l3048
$$ 1121800 1269054 1326753 1242628 1249217 1392672 1252799 1415068 1631203 1381840 1348792
4787A348792o5557J24593m9762K1129K3083l0733r7890O6271P0842K6451k35265
$$ 1348792 1283235 1407828 1358066 1379195 1402278 1371545 1273655 1339926 1410768 1437219 1201954
4776A201954q453J15845J83044j14234j50680K7347l5608r5714K24564L9003L1790
$$ 1201954 1193501 1309346 1492390 1378156 1227476 1254823 1219215 1123501 1348065 1387068 1418858
4765A418858Q5546p3089M3152k63188m6974K6105R7427l6993J67585J726J03392
$$ 1418858 1504404 1431315 1474467 1211279 1164305 1190410 1287837 1250844 1418429 1420155 1523547
4754A523547J15739n9143k19709j67020M7024J5430M1378R8322j29067j23411
$$ 1523547 1639286 1580143 1360434 1193414 1240438 1255868 1297246 1395568 1266501 1143090
4744A143090K6538J35241m619J3005r3783j91569j90213J59974L4886Q6674J74453
$$ 1143090 1169628 1304869 1300250 1313255 1219472 1027903 837690 997664 1032550 1119224 1293677
4733A293677l8912k9895L3144Q9765K6606j80615K6334J08744L7815J62835p1019
$$ 1293677 1254765 1224870 1258014 1347779 1374385 1193770 1220104 1328848 1366663 1529498 1458479
4722A458479j32157O6485Q1086j58575j31507J4930L5838o0888J85532J69008
$$ 1458479 1326322 1392807 1473893 1315318 1183811 1198741 1234579 1173691 1359223 1528231
4712A528231P5314m9743j38303K48055J17103j05164j65262k43360K61K06659
$$ 1528231 1603545 1553802 1415499 1663554 1780657 1675493 1510231 1266871 1267132 1473791
4702A473791j8866k4662N5024l0835K5330P190j9113Q4771J62058R8621k26909
$$ 1473791 1454925 1430263 1485287 1454452 1479782 1486972 1467859 1552630 1714688 1813309 1586400
4691A586400j121j6687K11898L50078o6401J456Q9131O6838k68562j59025L6280
$$ 1586400 1585279 1568592 1780490 2130568 2064167 2065623 2154754 2221592 1953030 1794005 1830285
4680A830285N5939j62045J44202m1765m5311j12256J10411N236j46297J56247
$$ 1830285 1886224 1724179 1868381 1826616 1781305 1669049 1779460 1784696 1638399 1794646
4670A794646K932J35890j01720j59595J4070n9857N3779O5730j76765M8225J46071
$$ 1794646 1797578 1933468 1831748 1672153 1686223 1626366 1680145 1745875 1569110 1617335 1763406
4659A763406J71224p0006j28573Q0272k65259J84447K17371o4575q0308l7528
$$ 1763406 1934630 1864624 1736051 1816323 1551064 1735511 1952882 1888307 1807999 1770471
4649A770471J10474K29703J43785p7973j11554J05311J09197N8790J75922R5804
$$ 1770471 1880945 2110648 2254433 2176460 2064906 2170217 2279414 2338204 2514126 2609930
4639B609930j4692K13957K62753p5157j06141P557Q0191N1141J91323J88861L9111
$$ 2609930 2595238 2809195 3071948 2996791 2890650 2898207 2978398 3029539 3220862 3409723 3448834
4628C448834L71093L7943L8633J94480K36340L38299L5424J36617M35209L66672
$$ 3448834 3819927 3857870 3896503 4090983 4327323 4665622 4701046 4837663 5272872 5639544
4618E639544K56797N85377L10429L2506K71943Q2553j40873k21774k71849k11148
$$ 5639544 5896341 6481718 6792147 6824653 7096596 7179149 7038276 6816502 6544653 6333505
4608F333505r7176k91874j272j71860M0109K91712p6296R4484K71737N8002o3353
$$ 6333505 6236329 5944455 5943183 5771323 5811432 6103144 6026848 6121332 6393069 6451071 6387718
4597F387718K67907K38835L36424L15267L66458K47126N74589P46180O16982Q19349
$$ 6387718 6655625 6894460 7230884 7546151 7912609 8159735 8734324 9480504 10097486 10916835
4587A0916835J144215P96057R20526R09374P65689O13679K76048p5964o55768
$$ 10916835 12061050 12857107 13777633 14687007 15452696 16066375 16342423 16266459 15610691
4578A5610691r01910j032534j094759r94928r25569p29736l48042m76937k68122
$$ 15610691 14708781 13676247 12581488 11586560 10660991 9931255 9583213 9106276 8838154
4569H838154l02193l53798o1959j81391J7383L39328J01223l5129K30157M20841
$$ 8838154 8535961 8182163 8120204 7938813 7956196 8295524 8396747 8361618 8591775 9012616
4559I012616M28218N59583P70500O01870O46145O45352J028636J077309Q90460
$$ 9012616 9440834 10000417 10770917 11372787 12018932 12664284 13692920 14770229 15660689
4550A5660689O60249L58617K47808l06463o99777j104637j349223j170886j042582
$$ 15660689 16320938 16679555 16927363 16620900 15921123 14816486 13467263 12296377 11253795
4541A1253795r67022q02462n13494o42934p23318n71742j94387j45232j13835
$$ 11253795 10286773 9484311 8970817 8327883 7604565 7032823 6838436 6693204 6579369
4532F579369j1177k38968k68867O4798L30n1238m508j22664J01168N5430J88208
$$ 6579369 6568192 6329224 6060357 6125155 6125485 6074247 6069739 5947075 6048243 6103673 6291881
4521F291881M64692L57757n772o5247j44216K36089N0772j27257k72155j50202
$$ 6291881 6756573 7114330 7108558 7043311 6899095 7135184 7185956 7058699 6786544 6636342
4511F636342m26983n97826m64911l13389k42533l31099l53436j37898K87976m30071
$$ 6636342 6209359 5611533 5146622 4833233 4590700 4259601 3906165 3768267 4056243 3626172
4501C626172q3325k80241k92319r676k5202m481j36540o6527k26066J21591J33262
$$ 3626172 3542847 3262606 2970287 2960611 2935409 2930928 2794388 2727861 2501795 2623386 2756648
4490B756648P2168m045k1753J6471j79049k0893k79041j83572J24128j4994N0701
$$ 2756648 2828816 2824771 2803018 2819489 2640440 2619547 2340506 2156934 2281062 2266068 2316769
4479B316769O2631M9201k0419l6128j68946Q7906Q4222j22168J85440j05835o9174
$$ 2316769 2379400 2428601 2408182 2372054 2203108 2291014 2375236 2253068 2438508 2332673 2263499
4468B263499P9352j7225O1689j2538J09330K50602J64553K96131m2605K1750K07333
$$ 2263499 2342851 2325626 2387315 2374777 2484107 2734709 2899262 3195393 3152788 3174538 3381871
4457C381871k01543j77982j72620k59462j54314l022k14010j37247M8270L6525
$$ 3381871 3180328 3002346 2829726 2570264 2415950 2412928 2198918 2061671 2109941 2146466
4447B146466K346j44007N0571Q1963J35411k25j15126J66713J1206J13139n4531
$$ 2146466 2148812 2004805 2055376 2137339 2272750 2272525 2157399 2324112 2335318 2448457 2393926
4436B393926j3533K84718N06866J15210N5261K22126j13879k83498k73561q9605
$$ 2393926 2380393 2665111 3171977 3287187 3342448 3564574 3450695 3167197 2893636 2804031
4426B804031p8868k26370l0496k54171j80304l9509L0182r1185J80551l9714j3924
$$ 2804031 2725163 2498793 2468297 2214126 2033822 1994313 2024495 1933310 2113861 2074147 2060223
4415B060223j20970j73873K60039j7252j1397M0419j42867n4686J59508J8916
$$ 2060223 1939253 1765380 2025419 2008167 1996770 2037189 1894322 1839636 1999144 2018060
4405B018060o6657J67062J4859j35326k3731P6532L9698q3687j7798N1876J1522
$$ 2018060 1951403 2118465 2133324 1997998 1974267 2050799 2090497 2006810 1989012 2040888 2052410
4394B052410o4816L42102M9138j47352J44886J03881j16334l975J25576j55278
$$ 2052410 1987594 2329696 2378834 2231482 2376368 2480249 2363915 2359940 2485516 2330238
4384B330238j46180J21475K24913J01640l0372R0905j10707R7910L1043K4876
$$ 2330238 2184058 2305533 2530446 2632086 2601714 2692619 2581912 2679822 2710865 2735741
4374B735741j13877K99884J10891o3939k9263J87450k29358j09617J55556L54282
$$ 2735741 2621864 2921748 3032639 2968700 2939437 3126887 2897529 2787912 2943468 3297750
4364C297750J44900j71430K79527K98567J36431J87919K40923J34139K43197q8840
$$ 3297750 3442650 3271220 3550747 3849314 3985745 4173664 4414587 4548726 4791923 4703083
4354D703083J22836L45812j5381j0025j73131j22407k01947m695l6083k6138r8189
$$ 4703083 4825919 5171731 5156350 5146325 4973194 4850787 4648840 4644145 4608062 4581924 4483735
4343D483735k03218j19414K1771l0881j59562J24460J54408K13018P9666K3987
$$ 4483735 4280517 4161103 4182874 4151993 3992431 4116891 4271299 4484317 4563983 4587970
4333D587970J12497J07434j29219O8325K72985K32976m761K51277K80234L21353
$$ 4587970 4700467 4807901 4678682 4747007 5019992 5252968 5248207 5499484 5779718 6101071
4323F101071q8021L36308L84840J12829L40227N3979l21044n6878k45382j68043
$$ 6101071 6013050 6349358 6734198 6847027 7187254 7241233 6920189 6863311 6617929 6449886
4313F449886k72427j00431N5866l7220j69081l74572M4018K05142L5266O1320
$$ 6449886 6177459 6077028 6132894 6095674 5926593 5552021 5596039 5801181 5836447 5897767
4303E897767j19908M721J5399l6215J98233L97693J13o3167R1712K87419J96042
$$ 5897767 5777859 5782580 5797979 5761764 5959997 6357690 6357803 6294636 6386348 6673767 6869809
4292F869809K79316K41727l0180N7806j50156l3331j60819K2640J46970J00742
$$ 6869809 7149125 7390852 7360672 7418478 7268322 7234991 7074172 7096812 7243782 7344524
4282G344524Q3657J2772o5090N1952j4932K75301K10671j52301R7940R4420M9840
$$ 7344524 7428181 7440953 7375863 7427815 7412883 7688184 7898855 7746554 7844494 7938914 7988754
4271G988754n7350j48264r2116j12646n2206K04175l0058O1566K74194O9764j19820
$$ 7988754 7931404 7783140 7691024 7578378 7526172 7730347 7700289 7761855 8036049 8105813 7985993
4260G985993n941K33229J69774K37480J52137J3313K59114M91927K20775N10694
$$ 7985993 7980052 8213281 8383055 8620535 8772672 8785985 9045099 9537026 9757801 10268495
4250A0268495L31356K47680J08193M21422L80096J88371K81582L67894J81462
$$ 10268495 10599851 10847531 10955724 11377146 11757242 11945613 12227195 12595089 12776551
4241A2776551K14362N5309K45231J60585L28161K52904j07897P7754l6610J45262
$$ 12776551 12990913 13046222 13291453 13452038 13780199 14033103 13925206 14002960 13966350 14111612
4231A4111612K42231l8685J96067K63824L25084K85425Q2480K13667L60131K72323
$$ 14111612 14353843 14315158 14511225 14775049 15100133 15385558 15468038 15681705 16041836 16314159
4221A6314159M6344K47172O4114L68131K55585K14944O12206L47568J70300L72174
$$ 16314159 16360503 16607675 16671789 17039920 17295505 17510449 18122655 18470223 18640523 19012697
4211A9012697L33993N45911J44230R9655J02671J69147J32820R0771K82111K48836
$$ 19012697 19346690 19892601 20036831 20136486 20239157 20408304 20541124 20631895 20914006 21162842
4201B1162842J50153J49478M24062O27172N13888N65136P52860N38028N68723
$$ 21162842 21312995 21462473 21886535 22513707 23027595 23592731 24345591 24883619 25452342
4192B5452342O82297N85782M28879L84226M02290L15244K46210M19566J73160
$$ 25452342 26134639 26720421 27149300 27533526 27935816 28251060 28497270 28916836 29089996
4183B9089996M32679L32193J64309L60306L55752M65383M53224O26133Q95809
$$ 29089996 29522675 29854868 30019177 30379483 30735235 31200618 31653842 32279975 33175784
4174C3175784R72855R06714R60543J120717J306939J361521J735699J702283K090365
$$ 33175784 34148639 35055353 36015896 37136613 38443552 39805073 41540772 43243055 45333420
4165D5333420K421051K555847K864349L112785L210356L282380L485871L721262
$$ 45333420 47754471 50310318 53174667 56287452 59497808 62780188 66266059 69987321
4157F9987321M399684N568416O705589P768381R378889J1224326J3351581J6461159
$$ 69987321 74387005 79955421 86661010 94429391 103808280 115032606 128384187 144845346
4149A44845346K0595111K6288794L2432836L6231931L3211609J7831065m794937
$$ 144845346 165440457 191729251 224162087 260394018 293605627 311436692 306641755
4142C06641755k7631620m0350238m1138154l4950611k6418392j9974312j5105220
$$ 306641755 279010135 238659897 197521743 162571132 136152740 116178428 101073208
4135A01073208j1854727r053343p316389n208043l939974l329804k989800k695146
$$ 101073208 89218481 80165138 72848749 67640706 63700732 60370928 57381128 54685982
4127E4685982k776026k573036k292011j882896j575471j547766j257604j271089
$$ 54685982 51909956 49336920 47044909 45162013 43586542 42038776 40781172 39510083
4119C9510083r15019q88632r19733o75723p31322r34197p02943l01524k73348
$$ 39510083 38595064 37706432 36786699 36110976 35379654 34445457 33742514 33440990 33167642
4110C3167642m13670l87770k29202k70192k98187o7146j06192K2784M1654J82258
$$ 33167642 32753972 32366202 32137000 31866808 31568621 31501475 31395283 31418067 31459721 31641979
4100C1641979j0138K6469N0562K7448K04303J52516J52908M15728K49179J99272
$$ 31641979 31631841 31658310 31708872 31736320 31940623 32093139 32246047 32661775 32910954 33110226
4090C3110226K80730J03048L14655K81679J75368N32171N45121K59786N75115
$$ 33110226 33390956 33494004 33808659 34090338 34265706 34797877 35342998 35602784 36177899
4081C6177899N55945N26018P75293O81337P48055P61741O44176N24881J019346
$$ 36177899 36733844 37259862 38035155 38716492 39464547 40226288 40870464 41395345 42414691
4072D2414691J062321R12881J264736J126229J266606J433178J647775J674206
$$ 42414691 43477012 44389893 45654629 46780858 48047464 49480642 51128417 52802623
4064E2802623J737335J859015K367620K265416K493973K390285K674553K818680
$$ 52802623 54539958 56398973 58766593 61032009 63525982 65916267 68590820 71409500
4056G1409500L088625K967124L220808L748261M084193M407408M560491M716518
$$ 71409500 74498125 77465249 80686057 84434318 88518511 92925919 97486410 102202928
4048A02202928N201908O216379P161202Q251263R746278J1440500J3063834J5247339
$$ 102202928 107404836 113621215 120782417 129033680 138779958 150220458 163284292 178531631
4040A78531631J7341761K0020491K3681801K7545198L2146772L8070210M2858544
$$ 178531631 195873392 215893883 239575684 267120882 299267654 337337864 380196408
4033C80196408M4621109L9176837K2988140m028059l0592354m7408969n1826526
$$ 380196408 424817517 463994354 486982494 482954435 452362081 404953112 353126586
4026C53126586m7237450l9514979l1590631k5217623k0030802j5607165j1749503
$$ 353126586 305889136 266374157 234783526 209565903 189535101 173927936 162178433
4019A62178433q920878o508703m661429l877033k684958k132155j436789j89437
$$ 162178433 153257555 146748852 142087423 138210390 135525432 133393277 131956488 131767051
4011A31767051L02714J346238J994071J724535L63607k437024m655656n842065
$$ 131767051 132069765 133416003 135410074 137134609 137498216 135061192 130405536 124563471
4003A24563471n625720m594765l503126k086599j183642p73808l15292p10113
$$ 124563471 118937751 114342986 110839860 108753261 107569619 106795811 106480519 105770406
3995A05770406j476668k646686l583593m509500n519492n894454n452497n086001
$$ 105770406 104293738 101647052 98063459 93553959 88034467 82140013 76687516 71601515
3987G1601515m643066m141111l497186l240630k975078k434033k094376j734899
$$ 71601515 66958449 62817338 59320152 56079522 53104444 50670411 48576035 46841136
3979D6841136j577056j276694j367534j532759r86698q92079o54401j034022q78469
$$ 46841136 45264080 43987386 42619852 41087093 40100395 39208316 38553915 37519893 36641424
3970C6641424p39748p74220n42043j026275n26376n31535n18072n36679m02077
$$ 36641424 35901676 35127456 34585413 33559138 33032762 32501227 31983155 31446476 31044399
3961C1044399n14801k39451l73279j49044k68965j93729k08119k57338k39462
$$ 31044399 30529598 30290147 29916868 29767824 29498859 29305130 29097011 28839673 28600211
3952B8600211j36499K58957N9440R0371J60516L76706L71099M67934L19114O30896
$$ 28600211 28463712 28722669 28782109 28872480 29032996 29409702 29780801 30248735 30567849 31198745
3942C1198745N86084Q83877J082654J174518J354983R95699N26872l48036j251548
$$ 31198745 31784829 32668706 33751360 34925878 36280861 37276560 37803432 37455396 36203848
3933C6203848k278916k379067j907815j852157j576315j119540q67828q10961
$$ 36203848 33924932 31545865 29638050 27785893 26209578 25090038 24222210 23411249
3925B3411249p34577j84830k30742j96529k96911j17051j00801R7784p0069q9678
$$ 23411249 22676672 22491842 22261100 22064571 21767660 21650609 21549808 21647592 21577523 21487845
3915B1487845K5265k16405j96538R3695O5796K39353J38513P7752J59529J86084
$$ 21487845 21513110 21296705 21100167 21193862 21259658 21499011 21637524 21715276 21874805 22060889
3905B2060889K30898N44942M82204N05002N21094J132228J430340J509383K132227
$$ 22060889 22291787 22836729 23318933 23823935 24345029 25477257 26907597 28416980 30549207
3896C0549207K670142K453178K821682L606663M446172N682252P700252R930653
$$ 30549207 33219349 35672527 38494209 42100872 46547044 52229296 59929548 69860201
3888F9860201J3839251J6354656J6423486N333031j0644890j7053289k0126581
$$ 69860201 83699452 100054108 116477594 121810625 111165735 94112446 73985865
3881G3985865j5340173j0001188o910773n332680m132748l167142k091577j621736
$$ 73985865 58645692 48644504 41733731 36401051 32268303 29101161 27009584 25387848
3873B5387848j655816j053860q39007o71866o93472p53509o11517m77459m61451
$$ 25387848 23732032 22678172 21839165 21167299 20473827 19720318 19108801 18631342 18169891
3864A8169891n29448m26336k02764l56498m67050l39934j75352j40860q8679J0313
$$ 18169891 17640443 17214107 17011343 16654845 16187795 15847861 15672509 15531649 15442970 15453283
3854A5453283N7577j62073l52270m02246l61967n09018k62438k90015k87586l01925
$$ 15453283 15510860 15348787 14996517 14594271 14232304 13723286 13460848 13170833 12883247 12581322
3844A2581322l59867j28484j21345k96175j89612O4046j29328j54689P6786J83821
$$ 12581322 12221455 12092971 11971626 11675451 11485839 11549885 11420557 11265868 11342654 11526475
3834A1526475J21597J33285l5533J37643K43517J93099K75576J20219J25231L70656
$$ 11526475 11648072 11781357 11745824 11883467 12126984 12320083 12595659 12715878 12841109 13211765
3824A3211765L98109K35897N44913O29116P12791M99476P08392O06945P75816
$$ 13211765 13609874 13845771 14390684 15019800 15732591 16232067 16940459 17547404 18323220
3815A8323220P95177J024546J221143J336972J344769J400127J622739J750639
$$ 18323220 19118397 20142943 21364086 22701058 24045827 25445954 27068693 28819332
3807B8819332J831858J197399Q13114L09521K61346L82078N81010R00659J377307
$$ 28819332 30651190 31848589 32661703 32971224 33232570 33614648 34195658 35096317 36473624
3798C6473624J792734K532064K824515L295484L735967L975761M020419L289943
$$ 36473624 38266358 40798422 43622937 46918421 50654388 54630149 58650568 61940511
3790F1940511J217377j971326m305067n699409o162475n096603m380769l863461
$$ 61940511 63157888 61186562 56881495 51182086 45019611 39923008 35542239 31678778
3782C1678778l046538k812671k130357j713522j506296j113610j213883j084967
$$ 31678778 28632240 25819569 23689212 21975690 20469394 19355784 18141901 17056934
3774A7056934j087962o32564p77837o36251n26023n12186n71322n06828l96565
$$ 17056934 15968972 15336408 14558571 13922320 13396297 12884111 12312789 11805961 11409396
3765A1409396m80231l52179m83389l46374k54634j99109l37946k56057k60570
$$ 11409396 10929165 10576986 10093597 9747223 9492589 9293480 8955534 8699477 8438907
3756H438907j36573l05885j0694k26572r7044J9549k48412k26312j04426j6591
$$ 8438907 8302334 7996449 7985755 7759183 7662139 7681688 7433276 7206964 7102538 7085947
3746G085947r6404m5255K13220L06984J6461J6587J09673q7958J18276l52780
$$ 7085947 6989543 6944288 7157508 7464492 7480953 7497540 7607213 7519255 7637531 7284751
3736G284751k67744j03960k20107k86939l54418l54162l25275k44239q7259k78414
$$ 7284751 7017007 6913047 6692940 6406001 6051583 5697421 5372146 5127907 5040648 4762234
3726D762234j13978R560J25940k01537l01430J3580K05331q3573j82768j63230
$$ 4762234 4648256 4657816 4783756 4582219 4280789 4294369 4499700 4416127 4233359 4070129
3716D070129j01346J4244j34130l3181r1552J73469j34704k01284j15534j27703
$$ 4070129 3968783 3983027 3848897 3815716 3724164 3897633 3762929 3561645 3446111 3318408
3706C318408q5774K660p9327k62198k36391J08839K6176J84288m7969j24633L4270
$$ 3318408 3232634 3235294 3155967 2893769 2657378 2766217 2792393 2976681 2928712 2804079 2838349
3695B838349Q6347Q3525k01611j98495j36177l1317Q3991o3013k66728j49264
$$ 2838349 2924696 3008221 2806610 2608115 2471938 2440621 2524612 2461599 2194871 2045607
3685B045607J04068J7327K57865r0045N5857r4490K6469K5477j27225K266J36163
$$ 2045607 2149675 2167002 2424867 2334822 2390679 2296189 2322658 2348135 2220910 2223176 2359339
3674B359339j8333k45466M2526j1110j36767m4842P7125k29323k8658P8220o8899
$$ 2359339 2341006 2095540 2138066 2126956 1990189 1945347 2022472 1793149 1764491 1842711 1773812
3663A773812j97068O9325J22164J07800K3438o8044j23995M5152K59779p6067
$$ 1773812 1576744 1646069 1768233 1876033 1899471 1831427 1707432 1752584 2012363 1936296
3653A936296j69978Q0484j69055k60925J65181j48623l9955J78242J44245J4989
$$ 1936296 1766318 1846802 1677747 1416822 1582003 1433380 1393425 1571667 1715912 1730901
3643A730901j25932P5388q6629Q9491O4756j89685N3969O9126o2252k51884j0764
$$ 1730901 1604969 1680357 1593728 1683219 1747975 1558290 1612259 1681385 1619133 1367249 1356485
3632A356485P7305O632O7040J44299n4384j8354k11799n584J06828L2829J12884
$$ 1356485 1433790 1440422 1507462 1651761 1597377 1579023 1367224 1361640 1468468 1501297 1614181
3621A614181r2620J10569k06355k9769n6050J70267k2778l40997P4253J09406
$$ 1614181 1521561 1632130 1425775 1396006 1339956 1510223 1487445 1146448 1220701 1330107
3611A330107r2001K80139J06940Q804o6434q908j33699r2036J11976j27732j27683
$$ 1330107 1238106 1518245 1625185 1633989 1567555 1558647 1424948 1332912 1444888 1317156 1189473
3600A189473J80356r9897K8276J40398k11j49978k2955R0155j22303M9095m1773
$$ 1189473 1369829 1269932 1298208 1438606 1438395 1288417 1265462 1355617 1233314 1282409 1240636
3589A240636r6821j4458J16643J83292k8384q4990l4894l2774K0812L48669r1148
$$ 1240636 1143815 1129357 1246000 1429292 1400908 1315918 1281024 1248250 1269062 1617731 1526583
3578A526583m4538J02694K2054J19739L1164j06888j45405o1196O1610M6244k60002
$$ 1526583 1482045 1584739 1606793 1726532 1757696 1650808 1505403 1444207 1505817 1552061 1292059
3567A292059R332J06622j33486j79964J23240j4347L30536l633k25311J57226
$$ 1292059 1301391 1408013 1274527 1094563 1217803 1203456 1533992 1530359 1305048 1462274
3557A462274k9304k08212K39182P9386O8768k73613K30184J13960l9254J97452
$$ 1462274 1432970 1224758 1463940 1543326 1612094 1338481 1568665 1682625 1643371 1840823
3547A840823l0079K1853j03921J7750J84051k07150q1816n1808M3146L82095q3843
$$ 1840823 1810744 1832597 1728676 1746426 1930477 1723327 1641511 1589703 1632849 2014944 1931101
3536A931101k11293M6573j17785l8545J62064k2684K50316J76724j91082J44559
$$ 1931101 1719808 1766381 1648596 1610051 1772115 1749431 1999747 2176471 1985389 2129948
3526B129948R6623Q4047p2906k7981J51222N6303L8997j15008J78403R6888j9995
$$ 2129948 2226571 2310618 2237712 2209731 2360953 2417256 2456253 2341245 2519648 2616536 2596541
3515B596541k50437k3034J81096K0445p4864j1278k07364l51560m7135J16087
$$ 2596541 2346104 2323070 2504166 2524611 2449747 2438469 2231105 1879545 1832410 1948497
3505A948497p6831n4285L8932K2614J15137p2185K67r4392k07138j37398O6698
$$ 1948497 1871666 1817381 1856313 1878927 1994064 1921879 1922146 1827754 1620616 1483218 1549916
3494A549916o500J09951p1045j91656r5326P2027J48770N6670m6117j86577J42323
$$ 1549916 1543416 1653367 1582322 1390666 1295340 1367367 1516137 1572807 1526690 1340113 1482436
3483A482436J72480j30722P7733p4852m8040o5469L678J27795J05549L0517j06628
$$ 1482436 1654916 1524194 1601927 1527075 1479035 1413566 1417244 1545039 1650588 1681105 1574477
3472A574477j32910j5247o0395n3818J3831K99037m5296q0799J73319j11924j144
$$ 1574477 1441567 1426320 1365925 1312107 1325938 1624975 1579679 1498880 1672199 1560275 1559131
3461A559131L7278L69190j81656K30996k00607k34241J15574K08557o5631O3315
$$ 1559131 1596409 1965599 1783943 2014939 1814332 1580091 1695665 1904222 1838591 1901906
3451A901906l00504L6883K50846K0542k62551j30078n5096j4689J19065J9358
$$ 1901906 1601402 1638285 1889131 1909673 1647122 1517044 1461948 1447259 1566324 1585682
3441A585682L389K69288R4405P836j67052j69830O9113Q5489k56327p5024P4211
$$ 1585682 1589071 1858359 1952764 1960600 1793548 1623718 1692831 1778320 1521993 1446969 1521180
3430A521180j10950J8112n4417o5798K4771K32334j43248j2728l9413p8084n4447
$$ 1521180 1410230 1428342 1373925 1308127 1332898 1565232 1421984 1409256 1369843 1291759 1237312
3419A237312l1781j37455J01836j51372O4155L04876j54347O1861J23970J42247
$$ 1237312 1205531 1068076 1169912 1018540 1082695 1387571 1233224 1295085 1419055 1561302
3409A561302M6940J15293k4566P0202K01663j17902j70755j34571r1241k44352
$$ 1561302 1608242 1723535 1698969 1769171 1970834 1852932 1682177 1547606 1456365 1212013
3399A212013n4190m3730p2263Q6674j25232j04372Q8564j6170K53225k2372J19664
$$ 1212013 1157823 1114093 1041830 1128504 1003272 898900 987464 971294 1224519 1202147 1321811
3388A321811Q3207q2968J099P822j53797J66680o3851n7292R3991r1532j63877
$$ 1321811 1405018 1322050 1323149 1330971 1177174 1343854 1280003 1222711 1316702 1225170 1061293
3377A061293p3305K71011L17917K1262R6005k13813j92570k6083o325j30901R0081
$$ 1061293 987988 1258999 1576916 1598178 1694183 1480370 1287800 1261717 1255392 1124491 1214572
3366A214572j44374k76560N2811J56176Q4223l5343J87754M8914j47549L9273
$$ 1214572 1070198 793638 846449 1002625 1086848 1051505 1239259 1288173 1140624 1179897
3356A179897K15161J9351l8638p3448q7616r5508p2194n8689K0477j03801r5200
$$ 1179897 1395058 1414409 1375771 1302323 1214707 1119199 1047005 988316 1008793 904992 809792
$$ [...]
##END NTUPLES=NMR SPECTRUM
##END=
