##TITLE=1H_CA-8964-1
 CDCl3
 8 sc, 
 13.1.2022
##JCAMPDX= 6.0         $$ Bruker NMR JCAMP-DX V2.0
##DATA TYPE= NMR SPECTRUM
##DATA CLASS= NTUPLES
##ORIGIN= UXNMR, Bruker Analytische Messtechnik GmbH
##OWNER= root
$$ XWIN-NMR		Version 3.5
$$ Thu Jan 13 11:27:09 2022 Russian Standard Time (UT+4h)  she@DPX200
##.OBSERVE FREQUENCY= 200.131346
##.OBSERVE NUCLEUS= ^1H
##.ACQUISITION MODE= SIMULTANEOUS
##.ACQUISITION SCHEME= undefined
##.AVERAGES= 8
##.DIGITISER RES= 18
##SPECTROMETER/DATA SYSTEM= spect
##.PULSE SEQUENCE= zg30
##.SOLVENT NAME= D2O
##.SHIFT REFERENCE= (INTERNAL, D2O, 0, 15.7171)
##AUDIT TRAIL= $$ (NUMBER, WHEN, WHO, WHERE, WHAT)
$$ ##TITLE= Audit trail, XWIN-NMR		Version 3.5
$$ ##JCAMPDX= 5.01
$$ ##ORIGIN= Bruker BioSpin GmbH
$$ ##OWNER= she
$$ F:/spectra/data/she/nmr/H-F/1/pdata/1/auditp.txt
$$ ##AUDIT TRAIL=  $$ (NUMBER, WHEN, WHO, WHERE, WHAT)
(   1,<2022-01-13 11:26:00.23 +0400>,<she>,<DPX200>,
      <created by zg, POWCHK disabled, PULCHK disabled
       configuration hash MD5:
       00 E9 B6 7A A2 85 ED C7 34 08 36 98 17 FE 4E 26
       data hash MD5: 16K
       CD AF 3C CB EB A1 1F 31 70 B2 8B D7 DE B2 A7 F0>)
(   2,<2022-01-13 11:26:03.14 +0400>,<she>,<DPX200>,
      <Start of raw data processing
       efp BC_mod = 2 LB = 0.24 FT_mod = 6 PKNL = 1 PHC0 = -15865.75 PHC1 = 11.80079 SI = 16K 
       data hash MD5: 16K
       56 5D 7D 54 D8 3A ED 32 27 1B A8 83 43 12 88 3D>)
(   3,<2022-01-13 11:26:15.34 +0400>,<she>,<DPX200>,
      <pk PHC0 = 1.95422 PHC1 = -6.4 
       data hash MD5: 16K
       A4 E3 17 69 9A 23 7E 29 CE F4 83 45 E5 2F 55 41>)
(   4,<2022-01-13 11:26:19.06 +0400>,<she>,<DPX200>,
      <abs ABSG = 5 
       data hash MD5: 16K
       D9 55 7B 91 CE A9 A9 70 DA CF B7 23 A8 1D 17 A3>)
$$ ##END=
$$ 
$$ hash MD5
$$ F3 E9 52 7F A7 67 62 A9 A8 21 51 56 00 42 8D FA
##$RELAX= 
##$RELAX= 
##$RELAX= 
##$RELAX= 
##$RELAX= 
##$RELAX= 
$$ Bruker specific parameters
$$ --------------------------
##$DU= <F:/spectra>
##$EXPNO= 1
##$NAME= <H-F>
##$PROCNO= 1
##$TYPE= <nmr>
##$USER= <she>
##$AMP= (0..31)
100 100 100 100 100 100 100 100 100 100 100 100 100 100 100 100 100 100 
100 100 100 100 100 100 100 100 100 100 100 100 100 100 
##$AQSEQ= 0
##$AQ_mod= 1
##$AUNM= <au_zg>
##$AUTOPOS= <>
##$BF1= 200.13
##$BF2= 200.13
##$BF3= 200.13
##$BF4= 200.13
##$BF5= 200.13
##$BF6= 200.13
##$BF7= 200.13
##$BF8= 200.13
##$BYTORDA= 1
##$CFDGTYP= 0
##$CFRGTYP= 5
##$CHEMSTR= <none>
##$CNST= (0..31)
1 1 145 1 1 1 1 1 1 1 1 1 1 1 1 1 1 1 1 1 1 1 1 1 1 1 1 1 1 1 1 1 
##$CPDPRG= <>
##$CPDPRG1= <>
##$CPDPRG2= <>
##$CPDPRG3= <>
##$CPDPRG4= <mlev>
##$CPDPRG5= <mlev>
##$CPDPRG6= <mlev>
##$CPDPRG7= <mlev>
##$CPDPRG8= <mlev>
##$CPDPRGB= <>
##$CPDPRGT= <>
##$D= (0..31)
0 1.2 0 0 0 0 0 0 0 0.06 0 0.03 0 0 0 0 0.0002 0 0 0 0 0 0 0 0 0 0 0 0 
0 0 0 
##$DATE= 1642058759
##$DBL= (0..7)
120 120 120 120 120 120 120 120 
##$DBP= (0..7)
150 150 150 150 150 150 150 150 
##$DBP07= 0
##$DBPNAM0= <>
##$DBPNAM1= <>
##$DBPNAM2= <>
##$DBPNAM3= <>
##$DBPNAM4= <>
##$DBPNAM5= <>
$$ [...]
##$SUBNAM2= <"">
##$SUBNAM3= <"">
##$SUBNAM4= <"">
##$SUBNAM5= <"">
##$SUBNAM6= <"">
##$SUBNAM7= <"">
##$SUBNAM8= <"">
##$SUBNAM9= <"">
##$SW= 18.0517287032376
##$SWIBOX= (0..15)
0 0 2 0 0 0 0 0 0 0 0 0 0 0 0 0 
##$SW_h= 3612.71676300578
##$TD= 16384
##$TD0= 1
##$TE= 0
##$TE2= 300
##$TE3= 300
##$TEG= 300
##$TL= (0..7)
0 120 120 120 120 120 120 120 
##$TP= (0..7)
150 150 150 150 150 150 150 150 
##$TP07= 0
##$TPNAME0= <>
##$TPNAME1= <>
##$TPNAME2= <>
##$TPNAME3= <>
##$TPNAME4= <>
##$TPNAME5= <>
##$TPNAME6= <>
##$TPNAME7= <>
##$TPOAL= (0..7)
0.5 0.5 0.5 0.5 0.5 0.5 0.5 0.5 
##$TPOFFS= (0..7)
0 0 0 0 0 0 0 0 
##$TUNHIN= 0
##$TUNHOUT= 0
##$TUNXOUT= 0
##$USERA1= <user>
##$USERA2= <user>
##$USERA3= <user>
##$USERA4= <user>
##$USERA5= <user>
##$V9= 5
##$VALIST= <valist>
##$VCLIST= <CCCCCCCCCCCCCCC>
##$VD= 0
##$VDLIST= <DDDDDDDDDDDDDDD>
##$VPLIST= <PPPPPPPPPPPPPPP>
##$VTLIST= <TTTTTTTTTTTTTTT>
##$WBST= 1024
##$WBSW= 4
##$XGAIN= (0..3)
0 0 0 0 
##$XL= 0
##$YL= 0
##$YMAX_a= 487601
##$YMIN_a= -561040
##$ZGOPTNS= <>
##$ZL1= 120
##$ZL2= 120
##$ZL3= 120
##$ZL4= 120
##$ABSF1= 15.71164
##$ABSF2= -2.340209
##$ABSG= 5
##$ABSL= 3
##$ALPHA= 0
##$AQORDER= 0
##$ASSFAC= 0
##$ASSFACI= 0
##$ASSFACX= 0
##$ASSWID= 0
##$AUNMP= <proc_1d>
##$AZFE= 0.1
##$AZFW= 0.1
##$BCFW= 0
##$BC_mod= 2
##$BYTORDP= 0
##$COROFFS= 0
##$CY= -3
##$DATMOD= 1
##$DC= 0
##$DFILT= <>
##$DTYPP= 0
##$F1P= 0
##$F2P= 0
##$FCOR= 1
##$FTSIZE= 16384
##$FT_mod= 6
##$GAMMA= 0
##$GB= 0
##$INTBC= 1
##$INTSCL= 0
##$ISEN= 128
##$LB= 0.24
##$LEV0= 0
##$LPBIN= 0
##$MAXI= 10000
##$MC2= 0
##$MEAN= 0
##$ME_mod= 0
##$MI= 1.114404
##$NCOEF= 0
##$NC_proc= -5
##$NLEV= 6
##$NOISF1= 3.799351
##$NOISF2= 2.8
##$NSP= 0
##$NTH_PI= 0
##$NZP= 0
##$OFFSET= 15.71714
##$PC= 1
##$PHC0= -15863.8
##$PHC1= 5.40079
##$PH_mod= 1
##$PKNL= yes
##$PPARMOD= 0
##$PSCAL= 0
##$PSIGN= 0
##$REVERSE= no
##$SF= 200.130006887804
##$SI= 16384
##$SIGF1= 3
##$SIGF2= 2
##$SINO= 5.538805
##$SIOLD= 16384
##$SREGLST= <1H.CDCl3>
##$SSB= 0
##$STSI= 16384
##$STSR= 0
##$SW_p= 3612.71676300578
##$SYMM= 0
##$S_DEV= 0
##$TDeff= 16384
##$TDoff= 0
##$TI= <>
##$TILT= no
##$TM1= 0
##$TM2= 0
##$TOPLEV= 0
##$USERP1= <user>
##$USERP2= <user>
##$USERP3= <user>
##$USERP4= <user>
##$USERP5= <user>
##$WDW= 1
##$XDIM= 16384
##$YMAX_p= 356445566
##$YMIN_p= -300787
$$ End of Bruker specific parameters
$$ ---------------------------------
##NTUPLES= NMR SPECTRUM
##VAR_NAME=  FREQUENCY,     SPECTRUM/REAL,   SPECTRUM/IMAG
##SYMBOL=    X,             R,               I
##VAR_TYPE=  INDEPENDENT,   DEPENDENT,       DEPENDENT
##VAR_FORM=  AFFN,          ASDF,            ASDF
##VAR_DIM=   16384,         16384,           16384
##UNITS=     HZ,            ARBITRARY UNITS, ARBITRARY UNITS
##FACTOR=    0.220516191357247, 1,           1
##FIRST=     3145.47137603307, 0,            0
##LAST=      -467.24538697271, 0,            0
##MIN=       -467.24538697271, -300787,      0
##MAX=       3145.47137603307, 356445566,    0
$$ Real data points
##PAGE= N=1
##DATA TABLE= (X++(R..R)), XYDATA
$$ [...]
7098A683477O4966J1590N5305N3029M064R0478L7505Q7321J00070R0598J12644
7087B391047J47134J00544N8198O3759P5041J15939J20633K60327J45456J75232
7077C653310J89513K15088L11091K92740L53820L57675M26262N59772N92010P07868
7067G659149Q85232R60286J156302J386234J660928K012758K337586K600832K654706
7058B3314013K388912J611071L88937r58491k286417l075263l293115l057477
7050A5032170k490573j906139j411184j118596q77787p06155n98879m47745m29818
7041E045294l59699k89937k36637l00862k11937j83866j30240k32629k12917j22845
7031B763725j16751j41367j00790p7189j16729p5397p9001r0076r8623o4031p9460
$$ plain form
7098 1683477 1748443 1760033 1815338 1868367 1872431 1962909 2000414 2087735 2187805 2278403 2391047
7087 2391047 2538181 2638725 2696923 2760682 2835723 2951662 3072295 3332622 3478078 3653310
7077 3653310 3842823 4057911 4369002 4661742 5015562 5373237 5799499 6359271 6951281 7659149
7067 7659149 8544381 9504667 10660969 12047203 13708131 15720889 18058475 20659307 23314013
7058 23314013 25702925 27313996 27702933 26744442 24458025 21382762 18089647 15032170
7050 15032170 12541597 10635458 9224274 8105678 7227891 6521736 5922857 5475112 5045294
7041 5045294 4685595 4395658 4159021 3858159 3646222 3462356 3332116 3099487 2886570 2763725
7031 2763725 2646974 2505607 2404817 2327628 2210899 2135502 2056501 1966425 1867802 1803771 1724311
7020A724311o9065n5505n7000l7137l8707p6813n4844o3313n3693m7097l8709
7009A132428j0967k7563k0739j5826o2907p0484k3698k5172n7341p065m7959o930
6997G55777N0684P78o1359j3326o880P484j8921l0344k4176j3780J9912n024o8370
6984E92455L2299j8139k4089M6000k760o591k6156J968m0422J1757K3319J9055
6972F08696j5952j1519N5784n9161l0835K955P2790k5964n5601K7958M2911l112
6960F08950k0158j1684j7894j3252K8880J198k112L7382J8349j5624q141M607
6948F10501j4508l495M139O778q408K75M1636J2289R394K1303R573M4237j00503
6935F33211r709J9095N2429L3079l0386M065O106J2346J5983M6560j1787j8671
$$ plain form
7020 1724311 1655246 1599741 1542741 1505604 1466897 1390084 1335240 1271927 1218234 1171137 1132428
7009 1132428 1121461 1093898 1073159 1057333 994426 923942 900244 875072 817731 810666 762707 755777
6997 755777 806461 807239 745880 732554 725674 733158 714237 683893 659717 645937 665849 660825 592455
6984 592455 624754 606615 582526 628526 625766 619175 593019 594987 554565 566322 589641 608696
6972 608696 592744 581225 637009 577848 547013 549968 622758 596794 541193 569151 612062 608950
6960 608950 588792 577108 559214 545962 574842 576040 573928 611310 629659 614035 605894 610501
6948 610501 595993 592498 596637 603415 595007 595282 636918 649207 658601 679904 689477 733714 633211
6935 633211 623502 642597 695026 728105 697719 701784 707890 720236 736219 782779 770992 752321
6923G52321Q155m3070O3456N1404j506l963M4479O4363J4634l79J6338J7742M8831
6910A032805M7482Q055L5786Q3578J03013L3969L0872Q1802Q3398P7045J08687
6899A726492Q8754J17926J93196J93006K10453K27314L19090L72380M31055O05380
6889D485046O94436R08084J067962J188103J059326M69449n52401r31112j375341
6880G013552j456824j028347p00359n18760m10943k73471k15050j91080j99583
6871B019135j24659o5095j9684q5570j18309o3946l1295l1707o559n7794m185
6860A410332k965n9350j643Q2194r936q8141j1176N1129L179O3206n5091k3628
6848A358110R0999P1784K6806O4893j4680K4025J22416J11056O6531O6484J32189
$$ plain form
6923 752321 760476 717406 780862 832266 830760 826797 871276 935639 950273 949894 966232 983974 1032805
6910 1032805 1080287 1088342 1124128 1207706 1310719 1344688 1375560 1457362 1540760 1617805 1726492
6899 1726492 1815246 1933172 2126368 2319374 2529827 2757141 3076231 3448611 3879666 4485046
6889 4485046 5179482 6087566 7155528 8343631 9402957 9872406 9320005 8388893 7013552
6880 7013552 5556728 4528381 3828022 3309262 2898319 2624848 2409798 2218718 2019135
6871 2019135 1894476 1829381 1809697 1724127 1605818 1541872 1510577 1478870 1472311 1414517 1410332
6860 1410332 1407367 1348017 1346374 1428568 1418632 1330491 1319315 1370444 1373623 1436829 1381738 1358110
6848 1358110 1449109 1520893 1547699 1612592 1597912 1621937 1744353 1855409 1921940 1988424 2120613
6837B120613J65296K01970K07848J77121K78804L21467K79738L25974M17403L44097
6827D840331K61750J99139Q7712p7854j99941l28131l45614m12441m53913m34743
6817C136295l18142k69585k10411j77972j64497j61776j40349o8058j05931j09080
6807A410494o6043p7824K045p2104q0280j8905n3085l7689k2890n9128o4183l0477
6795H29931k3513L5257l9792n1636l3773k4523l1679m521N3518j939r154o3305
6783F34871l7179R991l0605j247l8905K9559m0598r039k4732J4298P520n3836
6771D60098m8987J9854j937M1831J2298J6307j5612n0024m4433J9912J6118k9417
6759C96008J5410J8922k0645n5695n693K2351O666M4172k5432m5550k395P762
$$ plain form
6837 2120613 2285909 2487879 2695727 2872848 3151652 3473119 3752857 4078831 4496234 4840331
6827 4840331 5102081 5301220 5388932 5311078 5111137 4783006 4437392 4024951 3571038 3136295
6817 3136295 2818153 2548568 2338157 2160185 1995688 1833912 1693563 1625505 1519574 1410494
6807 1410494 1344451 1266627 1268672 1196568 1116288 1097383 1044298 1006609 983719 924591 860408 829931
6795 829931 806418 841675 801883 750247 716474 691951 660272 655751 709269 707330 698176 634871
6783 634871 597692 607683 577078 575831 536926 566485 525887 516848 492116 506414 513934 460098
6771 460098 411111 430965 429028 470859 483157 499464 483852 433828 389395 409307 425425 396008
6759 396008 411418 430340 409695 354000 348307 370658 377324 421496 396064 350514 348119 355881
6747C55881K8516K560o9936j7622K7431K48q262O290j0773J987O645j1710K551
6734C13806L68l5967K5728R066J5948J3621L7275k5402j4188L6785O923o3430
6722C20533P941K8047m8509K0173k9476j3146P058J0463K4767j242j0686q331
6710C07592J0321N3956J2616l6228q986k5397o120N5538k7065J0072K9702k7672
6698C48329K4530J9895m0741l7489K6481L6209m795j1367m3778N7597J6492M5232
6686D36595m9354J6160M7912r385P956o626j694N1971k8986l7172K3698K3567
6674D74642M8859j1452R52j0321q089m0008m2681K6714j022N2817L1640P998k3003
6661E07046Q0063l469j5515k7371M6428N3420l0062k3667j2844J0039j2453L8377
$$ plain form
6747 355881 384397 386957 317021 299399 326830 327078 318816 325106 314333 316320 322965 311255 313806
6734 313806 314174 278207 303935 313001 328949 342570 379845 354443 340255 377040 383963 320533
6722 320533 328474 356521 308012 328185 298709 285563 292621 303084 327851 326609 315923 307592
6710 307592 317913 371869 384485 348257 339271 313874 307754 363292 336227 346299 376001 348329
6698 348329 372859 392754 352013 314524 341005 377214 372419 361052 317274 374871 391363 436595
6686 436595 387241 403401 451313 441928 449884 443258 441564 493535 464549 427377 451075 474642
6674 474642 523501 512049 513001 502680 494591 454583 411902 438616 437594 490411 522051 530049 507046
6661 507046 587109 583640 568125 540754 587182 640602 610540 586873 574029 584068 571615 609992
6649F09992Q381o3328m893l564K9094O9426R935m3441k7j471K1356k2791K9175
6636F37844M0010K1051Q7574N1687L7477L2595M9180K7661P9088P2951R9969Q6060
6624A323147J06621K3694J19235J40765J25112J03997J46304J61035O9135l3688
6614B285357l8618j5333n3860q2065o5596r7941j01802j80162j21876q8354r8120
6603A341630r3412m3155p1174l2973k9867j3804Q975m1901m5312k4246j9712R896
6591I44945l2027J2791L1808j4444J7082M2043k437J4713N9168P2307Q3833J8629
6579A248411N9583o246j18334o2032m0785r3651m703M4705j3115j5500J8067O399
6567A022799L0861j4185L8111m472m6675N2270N7175R9525J13952K2194K5431
$$ plain form
6649 609992 618373 555045 550152 546588 575682 645108 655043 611602 611575 610104 631460 608669 637844
6636 637844 677854 698905 786479 838166 875643 908238 957418 985079 1064167 1137118 1237087 1323147
6624 1323147 1429768 1453462 1572697 1713462 1838574 1942571 2088875 2249910 2319045 2285357
6614 2285357 2246739 2231406 2177546 2095481 2029885 1931944 1830142 1649980 1528104 1439750 1341630
6603 1341630 1248218 1205063 1133889 1100916 1071049 1057245 1066220 1024319 979007 954761 935049 944945
6591 944945 912918 925709 957517 943073 960155 1002198 999761 1014474 1073642 1145949 1229782 1248411
6579 1248411 1307994 1301748 1183414 1121382 1080597 986946 982243 1026948 1013833 998333 1016400 1022799
6567 1022799 1053660 1039475 1077586 1073114 1026439 1078709 1135884 1235409 1349361 1371555 1396986
6556A396986J27135Q3230J57098J55673J66072L5635p4658n5241k36615j39308
6546A616007r6209j16111q0293k8387k4805l8936l9629J5090n069L5991J6463
6535A254112p21N1033Q5198N6544P6980P3582P3807R2819J91992K00971K10419
6524B366736J57767J39872P134q5436j79121k43620k15067k06464j39216o8858
6514A533727n5817j4378l155k4763k170k4628m500M0217J08j2677r571j2966M1455
6501A450882Q1833J24863Q7958J24402J49683J82508P0405N1923m1527j75717
6491B107213j91318j14052j24101p9967o2219l3444n3082k6356n2218j864j1982
6480A356610n3697l1227l0757M1273q894K2391N2189M4829K4142Q8944L9527N0890
$$ plain form
6556 1396986 1524121 1607351 1764449 1920122 2086194 2121829 2047171 1991930 1755315 1616007
6546 1616007 1519798 1403687 1323394 1295007 1270202 1231266 1191637 1206727 1201658 1237649 1254112
6535 1254112 1253391 1304424 1389622 1446166 1523146 1596728 1670535 1763354 1955346 2156317 2366736
6524 2366736 2524503 2664375 2671509 2586073 2406952 2163332 1948265 1741801 1602585 1533727
6514 1533727 1477910 1463532 1460377 1435614 1433444 1408816 1404316 1444533 1444641 1431964 1422393 1409427 1450882
6501 1450882 1532715 1657578 1745536 1869938 2019621 2202129 2272534 2324457 2282930 2107213
6491 2107213 1915895 1801843 1677742 1597775 1535556 1502112 1449030 1422674 1370456 1368592 1356610
6480 1356610 1302913 1271686 1240929 1282202 1273308 1295699 1347888 1392717 1416859 1505803 1545330 1596220
6468A596220M9571R9939Q4827K1240l6688m9794N0000P511K9694N2605l392k5719
6456A876014K9660l5903k503J0772k3679n053l2782J5340k0609n1460m1274Q201
6444A726724J8770j580l1164k673K7597n26L3312M7944R7521R4994J16404O5565
6432B192888O4501J39956K16809J60957K02720L25258M01119M62715L25139J85211
6422D677273r4384m04970n34953n54492m68023l18938k44301k04173k06498j34304
6412A512237n9433j8485N4772p8526j04713l2354K0589n1011p7003k8024j4508
6401A123541q4820n9669m3335n0408l0701J2271k5368o4861l7829K3231j8298
6390G43754o79J3841q4595n6889K2322N5230j9195m3132N007L599l1316m8061
$$ plain form
6468 1596220 1645791 1745730 1830557 1851797 1815109 1765315 1815315 1822826 1852520 1905125 1901733 1876014
6456 1876014 1905674 1869771 1867268 1878040 1854361 1849308 1816526 1831866 1811257 1759797 1718523 1726724
6444 1726724 1745494 1743914 1712750 1710077 1737674 1737148 1770460 1818404 1915925 2010919 2127323 2192888
6432 2192888 2257389 2397345 2614154 2775111 2977831 3303089 3704208 4166923 4492062 4677273
6422 4677273 4582889 4177919 3642966 3088474 2620451 2301513 2057212 1853039 1646541 1512237
6412 1512237 1452804 1434319 1489091 1410565 1305852 1273498 1294087 1243076 1166073 1138049 1123541
6401 1123541 1038721 979052 935717 885309 854608 866879 841511 776650 738821 762052 743754
6390 743754 743075 756916 672321 615432 637754 692984 673789 630657 635664 639263 607947 559886
6378E59886R299J9805N929j8802o0090N0769N1835j1138n2086k6281m1528J6003
6366E03601j5694N1446O0239J9144n1031l6003K5626l0208n2201N6833N1675p056
6354E76371l536l5743m5800K7295m5401J9777K8949J3384K9528j4290k0622j2067
6342E17845q628M3243m81J740R063K4063j0158M1121n628P4482M6192m3841j1044
6329F77969R423l1263l7031l036J4401j8778k190K9621o0881R931k8951P522N0785
6316F17522L7014J728M1759L4697L0342M6570L9165l4673M6191M1946N7197l6852
6304I22606j9855k8343o9566o7190j14117j6640l0698m4704N823m8595N2336n908
6292E35149k0906m1254l7545m7048M9757J7161O238M7245J526k7793L232j8050
$$ plain form
6378 559886 569185 588990 594919 576117 516027 566796 618631 607493 555407 529126 487598 503601
6366 503601 487907 539353 599592 618736 567705 531702 557328 527120 474919 531752 583427 576371
6354 576371 572835 537092 491292 518587 473186 492963 521912 535296 564824 550534 529912 517845
6342 517845 509217 552460 551979 553719 562782 586845 576687 617808 612180 686662 732854 689013 677969
6329 677969 687392 656129 619098 616062 630463 611685 609495 639116 578235 588166 559215 566737 617522
6316 617522 654536 656264 698023 732720 763062 809632 848797 814124 860315 902261 959458 922606
6304 922606 902751 874408 804842 737652 623535 606895 576197 531493 537316 488721 541057 535149
6292 535149 514243 472989 435444 388396 438153 455314 461552 508797 510323 482530 485762 467712
6280D67712K1913m485m0563J1439M4762r264m5647j9580j3658J8153K0540o708
6268D44614n540j486N3612M26k2774M500l1107N0158L5296l3436M3691l299l9102
6255D95553k4307p823J7174p7108O7379N0469j0611j2435o703k0432N73M8066
6243E19795l8327k8061M9888j3655K1247L277l5903j6406p515J7398P529r248
6231D70019R4720q514l3959J7419K0135j9388J6551q414l7138K8925l1186k3135
6219D86035M930j8623K0318j539L788M7461j3138L8760K9555n6255q148j8022
6207E15122P0846l129N9355l6214j171l3967q076O1324M9713k8706Q2880k9028
6195F98949n2263Q2479n8729J6376j2879n4138k3857N0052j9031K2100j9524K76
$$ plain form
6280 467712 489625 485140 444577 456016 500778 491514 445867 426287 412629 430782 451322 444614
6268 444614 439074 437588 491200 491626 468852 473352 442245 492403 527699 494263 537954 534655 495553
6255 495553 471246 463423 480597 403489 470868 521337 510726 498291 491588 471156 471729 519795
6243 519795 481468 453407 503295 489640 510887 514164 478261 461855 454340 471738 479267 470019
6231 470019 564739 556225 522266 539685 559820 540432 556983 548569 511431 540356 509170 486035
6219 486035 490965 472342 492660 491121 494909 542370 529232 567992 597547 541292 533144 515122
6207 515122 585968 582839 642194 605980 604809 570842 562766 624090 673803 645097 727977 698949
6195 698949 646686 729165 670436 686812 673933 619795 595938 645990 626959 649059 629535 629811
6183F29811K3740j2325J7909L807j6404J801l2594l6491k7565O1067J3658L0902
6171F57316J1993j5676L0690K0873k924L5407m2082l3597M3689N624k1970m2783
6159F46560J2143Q3553J0878o5160p231L0125K695k3094k6310M7437M774J8903
6147G35273k7880K2705R175L0649l170Q059q086j2806L893O897k7246m0996J9137
6134G15604k8299j0316J6950K4180l0163m839N9548K9981p0520m1326L2249N3373
6122G46422J6033l9551j8977L4300L9042J0432L5218J559j5206j5483n3319J7737
6110G58207O8770P1046K9373k4798j7268O381M3324L3703r544J1202J3583N6991
6098A040970L8357L124M4589J6837O6325J20310L0961J01943J10308J34039J56456
$$ plain form
6183 629811 653551 641226 659135 662942 646538 648339 615745 579254 551689 612756 626414 657316
6171 657316 669309 653633 684323 705196 702272 737679 695597 662000 705689 711313 689343 646560
6159 646560 658703 742256 753134 687974 680743 710868 713563 690469 664159 711596 716370 735273
6147 735273 707393 730098 739273 769922 766752 774811 766725 753919 757812 764709 737463 696467 715604
6134 715604 687305 676989 693939 718119 687956 683117 742665 772646 702126 660800 693049 746422
6122 746422 762455 722904 703927 738227 777269 787701 822919 824478 809272 793789 740470 758207
6110 758207 826977 898023 927396 902598 885330 891711 935035 968738 959194 970396 983979 1040970
6098 1040970 1079327 1082451 1127040 1143877 1210202 1330512 1361473 1463416 1573724 1707763 1864219
6087A864219K52358J89705K05600J68376r3458j31627k16901k58072k06805j80137
6077A593258j43506j13637o300l8700j4170j317q542n7595j3348K4763j7903k0831
6065A182172q738p2564k1213l5204K2561J7864L5252K26o7750N8597M6259k4362
6053A133100L5098O0948j6203J9742K1378L629L4085M9034M9040k5918o4250K7811
6041A327494N9511m375J7225j6389m3526J0602j4981k9808M244M7947p544O6931
6029A417331j2980K2156l2238j6351j7530k7883m613p815O4990p773K4377M1295
6017A442966O182J5926J3815J4174K0629Q2075K2258j2120J6061J3637m2219K4887
6005A618271l9313l3074k4489q295k8468L0511j6774m468J8178j1113k0523K1344
$$ plain form
6087 1864219 2116577 2306282 2511882 2680258 2586800 2455173 2238272 1980200 1773395 1593258
6077 1593258 1449752 1336115 1329815 1291115 1276945 1275628 1267086 1209491 1196143 1220906 1203003 1182172
6065 1182172 1173434 1100870 1079657 1044453 1067014 1084878 1120130 1120356 1052606 1111203 1157462 1133100
6053 1133100 1168198 1229146 1212943 1232685 1254063 1257692 1291777 1340811 1389851 1363933 1299683 1327494
6041 1327494 1387005 1382630 1399855 1383466 1339940 1350542 1335561 1305753 1309997 1357944 1350400 1417331
6029 1417331 1404351 1426507 1394269 1377918 1360388 1332505 1327892 1320077 1385067 1377294 1401671 1442966
6017 1442966 1449148 1465074 1478889 1493063 1513692 1595767 1618025 1605905 1621966 1635603 1593384 1618271
6005 1618271 1578958 1545884 1521395 1513100 1484632 1515143 1498369 1493901 1512079 1500966 1480443 1501787
5993A501787m40j4914P7842Q010L2157J773M9739Q953R6378N6317j6591L7820
5981A838831N2713R110k0723L9859k0690M3864P019P5490L2596P188K7489l366
5969B089380L2016K785R1905O5720o20K3234J00037N2877L4677M3816N2303L9885
5957B628015M8038O0075R2015O3951O2318Q8784J04936J03560R0909J52080J48481
5946C643162J26067O4478J14234K18873K29452K37428L08151L56746L73491M58165
5936F130247L07999K29360M2078q9828j77286j11272r9632o0881P7471O5221J01547
5925F415024J58147K28386K50246K71926L39313L90168L70699L57733L41882K64536
5915I388060J35238m5713j63047k58423k52760j86604l0240k8736j1288K7262
$$ plain form
5993 1501787 1501347 1486433 1564275 1572285 1604442 1606215 1655954 1664907 1761285 1817602 1801011 1838831
5981 1838831 1891544 1900654 1879931 1919790 1899100 1942964 1949983 2025473 2058069 2065257 2092746 2089380
5969 2089380 2121396 2124181 2216086 2281806 2281186 2304420 2404457 2457334 2492011 2535827 2588130 2628015
5957 2628015 2676053 2736128 2828143 2892094 2954412 3043196 3148132 3251692 3342601 3494681 3643162
5946 3643162 3769229 3833707 3947941 4166814 4396266 4633694 4941845 5298591 5672082 6130247
5936 6130247 6438246 6667606 6709684 6619856 6442570 6331298 6231666 6170785 6248256 6313477 6415024
5925 6415024 6573171 6801557 7051803 7323729 7663042 8053210 8423909 8781642 9123524 9388060
5915 9388060 9523298 9477585 9314538 9056115 8803355 8616751 8586511 8557775 8546487 8573749
5905H573749l63k5683M7531J30119J42944J25461K38611M42572M24530M70173
5895A0569644N03447L47935J47772j62195l78178m42357n10446m19732k17830
5886I438060n7479q5007r5582k24432j81340j09571j14880r4837l5423k1515M0268
5875H458262J02769P8626Q1886K26941K02355L41550M37975N08874N92471O91382
5865A1723091P99735Q68094R44410R76125J034844R49944P31631L79916j2138
5856A8395652l54873m00988m22721l05341j22722J08454L26881M58141N85150
5847A8267633Q17636R11492J005659J168674J183053J231042J106202R30918M20775
5838B7043084j34999n40302r48887r99457j009281j017854j051327j082687r97425
$$ plain form
5905 8573749 8573386 8547703 8595234 8725353 8868297 8993758 9232369 9674941 10099471 10569644
5895 10569644 11073091 11421026 11568798 11406603 11028425 10586068 10075622 9655890 9438060
5886 9438060 9380581 9295574 9199992 8975560 8794220 8684649 8569769 8474932 8439509 8417994 8458262
5875 8458262 8561031 8639657 8721543 8948484 9150839 9492389 9930364 10439238 11031709 11723091
5865 11723091 12522826 13390920 14335330 15311455 16346299 17296243 18027874 18407790 18395652
5856 18395652 18040779 17639791 17217070 16911729 16789007 16897461 17224342 17682483 18267633
5847 18267633 19085269 19996761 21002420 22171094 23354147 24585189 25691391 26622309 27043084
5838 27043084 26908085 26367783 25418896 24419439 23410158 22392304 21340977 20258290 19260865
5829A9260865q89654o79226l88535r6998K45413M79526N89336P38752P79236R50440
5819B0989155R67777P97833N56038L3557o65338j256908j605862j772826j750732
5810A6292694j577456j322741j060990q82027q16853p56004p05834o19218n51176
5801H000395m55458l39764l53138l09296k59295k11381j15790j59841j71917j21988
5791E502527j11990p9299n9347l5245l20m8914M2521L3120K2168P1755O3581M9411
5779E449968L8506n649n1347p2297r5232j43182j71324j74602j52400j22607j35480
5768D364354j63706j09861l7218j41499j10190o4058j03743q4385o9554K480k8404
5757C454216q0016k8991l9691K8830p479L2486n189Q625l3378j9720P5723M0800
$$ plain form
5829 19260865 18371211 17691985 17303450 17206452 17451865 17931391 18520727 19259479 20038715 20989155
5819 20989155 21956932 22754765 23310803 23344360 22679022 21422114 19816252 18043426 16292694
5810 16292694 14715238 13392497 12331507 11449480 10632627 9876623 9170789 8551571 8000395
5801 8000395 7544937 7205173 6852035 6542739 6283444 6072063 5956273 5796432 5624515 5502527
5791 5502527 5390537 5311238 5251891 5216646 5216326 5167412 5209933 5243053 5265221 5336976 5400557 5449968
5779 5449968 5488474 5482825 5431478 5359181 5263949 5120767 4949443 4774841 4622441 4499834 4364354
5768 4364354 4200648 4090787 4053569 3912070 3801880 3737822 3634079 3549694 3480140 3482620 3454216
5757 3454216 3374200 3345209 3305518 3334348 3326869 3359355 3354166 3362791 3329413 3309693 3385416 3426216
5745C426216M708j10076j5445l9599l3538j9369k889L766M9299M6227J3110k0692
5733C301718j20468p3275k2446k1213k1433m7914j7397L2059n6062L4315M7542
5722C035426M2850N1250L8848L4916K2678K8966O8936R737n7122p248m2574j7550
5710C209113l6433n6256P674k2251k3203m6659k6635m0274J6110p448N3374M4266
5698C071378J2552l6463P4512P4579k8029N3460L7822O9644O4942M3080M2650
5687C480127Q7569K6519J06039L1702M1419K8239Q3484L2036J9827k9421M5639
5676C953179N111P6329P8868l933R2779R1937J07855L7065M8080P9433M0506J35623
5664D742832J20590J26070J12210J04073J77524J80021J80849J12163J69610J37047
$$ plain form
5745 3426216 3430924 3320848 3305403 3265804 3232266 3212897 3210008 3213774 3263073 3309300 3322410 3301718
5733 3301718 3181250 3107975 3085529 3064316 3042883 2994969 2977572 3009631 2953569 2987884 3035426
5722 3035426 3078276 3129526 3168374 3203290 3225968 3254934 3323870 3333607 3276485 3269237 3226663 3209113
5710 3209113 3172680 3116424 3124098 3101847 3078644 3031985 3005350 2965076 2981186 2973738 3027112 3071378
5698 3071378 3083930 3047467 3121979 3196558 3168529 3221989 3259811 3329455 3394397 3437477 3480127
5687 3480127 3567696 3594215 3700254 3731956 3773375 3801614 3885098 3917134 3936961 3907540 3953179
5676 3953179 3958290 4034619 4113487 4109554 4202333 4294270 4402125 4439190 4487270 4566703 4607209 4742832
5664 4742832 4863422 4989492 5101702 5205775 5383299 5563320 5744169 5856332 6025942 6162989
5654F162989K26860K19998K51159K74460L03469L99132M37928M24500N46932N75156
5644I822583O73237P56724R34290J055542J160880J376825J482122J602912J346028
5635B0211143Q88978K68970l13671q45323j026749r63137p42358n59574k92516
5626A6625763j03278L6377J61161L87507O48302Q18328R85666J103968J016865
5617B1680659R21892R35691Q06975O12371K72428j46203p36646j207065j509863
5608B1630239j526989j412707j085133p46281m27852k84870j50495j34467J7756
5599A5879201M2210R3630K20427K60086L44092K48589K4891l16700p29972j018407
5589A5048047j067439j073592q56077p48701m80644k75153j81205p2449j6967
$$ plain form
5654 6162989 6389849 6609847 6861006 7135466 7438935 7838067 8275995 8700495 9247427 9822583
5644 9822583 10495820 11252544 12186834 13242376 14403256 15780081 17262203 18865115 20211143
5635 20211143 21100121 21369091 21055420 20210097 19183348 18220211 17477853 16918279 16625763
5626 16625763 16522485 16558862 16720023 17107530 17755832 18574160 19559826 20663794 21680659
5617 21680659 22602551 23538242 24345217 24957588 25230016 25083813 24347167 23140102 21630239
5608 21630239 20103250 18690543 17605410 16859129 16431277 16146407 15995912 15861445 15879201
5599 15879201 15921411 16015041 16235468 16495554 16839646 17088235 17113126 16796426 16066454 15048047
5589 15048047 13980608 12907016 12050939 11302238 10821594 10546441 10365236 10292787 10275820
5580A0275820L0363l4996j01790l01062l66601k88536k62626k96961k13827j71867
5570H267917j26559j46952j88127j10690m6608N2978J16147J28318K82069L97775
5560H626268M61672M44067M14382K16306M9794m9938j08837j35249j91855j56294
5550I570316k84379l28097k79332k80815j68386j23323r8741j2213q734l943P7107
5539H059460J78210J47128K00092N3226q7295j03305k20942l91546l27579k72899
5529G234550k56323k06648k36600j75537j24649j77032j23618r0453K1735N1725
5519E917150J12299K06953K43737J87747Q9420j30811k65484l37126l83300l33584
5509E307001k61987k33723j38512j66797j73456j13758j09729j06468j71258m3645
$$ plain form
5580 10275820 10306183 10271187 10169397 9868335 9501734 9213198 8950572 8653611 8439784 8267917
5570 8267917 8141358 7994406 7806279 7695589 7648981 7701959 7818106 7946424 8228493 8626268
5560 8626268 9087940 9532007 9946389 10162695 10212489 10162551 10053714 9918465 9726610 9570316
5550 9570316 9285937 8957840 8678508 8397693 8229307 8105984 8007243 7995030 7986296 7982353 8059460
5539 8059460 8237670 8384798 8584890 8638116 8550821 8447516 8226574 7835028 7507449 7234550
5529 7234550 6978227 6771579 6534979 6359442 6234793 6057761 5934143 5843690 5865425 5917150
5519 5917150 6029449 6236402 6480139 6667886 6757306 6626495 6361011 6023885 5640585 5307001
5509 5307001 5045014 4811291 4672779 4505982 4332526 4218768 4109039 4002571 3831313 3787668
5499C787668q3389j03005r0135m6569j00448p7661r43l1163Q230j3677k5081J2891
5487C236718l2152n4323K331p824n8797j8911p836N1899M0106J4544o1980L3848
5475C137623M997k9767j6098j2278k2378j4019N386n7128J425J9147J3450Q4701
5463C115061J2493n920Q4400R6885M3407N2572N6763J42574J21129Q7058J52864
5452C959286J39791K50207J85745K68711K66203L42526L63413L18126L44963K28243
5442F667214J77698M9751j56150k67899l18205k89650l30682j83170j12209l6000
5432E200698K2194l3392K7757L4231K132J23553J84731K08303K54251K27423J93899
5421F445780J68747J20146Q5905N3371J29165J78900J01049K753j54471k46316
$$ plain form
5499 3787668 3704279 3601274 3511139 3464570 3364122 3286461 3285518 3254355 3262585 3248908 3223827 3236718
5487 3236718 3204566 3150243 3152574 3144750 3085953 3067042 3059206 3111105 3151211 3165755 3103775 3137623
5475 3137623 3142620 3112853 3096755 3084477 3062099 3048080 3053466 2996338 2997763 3016910 3030360 3115061
5463 3115061 3127554 3121634 3206034 3302919 3346326 3398898 3455661 3598235 3719364 3806422 3959286
5452 3959286 4099077 4349284 4535029 4803740 5069943 5412469 5775882 6094008 6438971 6667214
5442 6667214 6844912 6894663 6738513 6470614 6152409 5862759 5532077 5348907 5236698 5200698
5432 5200698 5222892 5189500 5217257 5251488 5253620 5377173 5561904 5770207 6024458 6251881 6445780
5421 6445780 6614527 6734673 6820578 6873949 7003114 7182014 7283063 7285816 7131345 6885029
5411F885029k85997k97993k66533r7258o3619r8405p6944n9404j07107m3731j9697
5400E468341l8163L5956L1871L3125J44147Q0957N3310J7913k1890J3844p0163
5389E749248j95904j58417j61754j88040j24491q5060k7371j3562n8613l7661
5379D698375J4685j17200j52614j07404j15611q4445r5363j48739j33210j46635
5369C611839q3647j32229K484P057r5587n5499n2264n2276n1943m4073p303l0082
5357C016477m8945J991j6297n1153j1297o175J1588l570k4476m5318K413J0112
5345B835350j685J01432q573L8603O6151O1443M3484Q2167J10578O5197K4461
5334C418608k9189o8433q323p2045m6622M0061L8545m8032K8768J4808k2988l954
$$ plain form
5411 6885029 6599032 6301039 6034506 5937248 5873629 5775224 5698280 5638876 5531769 5488038 5468341
5400 5468341 5430178 5466134 5498005 5531130 5675277 5756234 5809544 5827457 5805567 5819411 5749248
5389 5749248 5553344 5394927 5233173 5045133 4920642 4835582 4808211 4794649 4736036 4698375
5379 4698375 4713060 4595860 4443246 4335842 4220231 4135786 4040423 3891684 3758474 3611839
5369 3611839 3528192 3395963 3398447 3405504 3309917 3254418 3202154 3149878 3097935 3053862 3046559 3016477
5357 3016477 2967532 2969523 2953226 2902073 2890776 2884601 2896189 2892619 2868143 2822825 2825238 2835350
5345 2835350 2833665 2935097 2926524 2965127 3031278 3092721 3136205 3218372 3328950 3394147 3418608
5334 3418608 3389419 3320986 3312663 3240618 3193996 3234057 3272602 3224570 3253338 3268146 3245158 3241204
5322C241204m096l2329J5311k0827N0941K0678p4822P3086N3636M4162K7385K520
5310C396849L562K2922n1043q2589r9385p0504n4077p6032j8149o4986m9540l4581
5298B822447p5773K7553j1085o224L0884K7829m42O4299J9707L7198K1465k9149
5286B928709M3038J2998r601N056M562j1518q516K3115N2859j5967O3522J1232
5274C099489L0439M6125J6621j2333K3519Q017j3524J8387M44M1109J5038j5889
5262C257442O066J8633r176N738O8496M2746k6456L0821j3752J5377Q3871J09147
5250C588953j7801k6850O8196J08206L2259M6739K9551Q2005R9986J1638P4634
5239D097516Q8215N2175Q6875O7247L8498J10398J12361M7895J34993J35635J43718
$$ plain form
5322 3241204 3237108 3204779 3220090 3199263 3250204 3270882 3196060 3269146 3322782 3366944 3394329 3396849
5310 3396849 3400411 3423333 3372290 3289701 3190316 3119812 3065735 2989703 2971554 2906568 2857028 2822447
5298 2822447 2746674 2774227 2763142 2756918 2787802 2815631 2815189 2879488 2899195 2936393 2957858 2928709
5286 2928709 2971747 2984745 2975144 2980200 2984762 2973244 2964728 2987843 3040702 3024735 3088257 3099489
5274 3099489 3129928 3176053 3192674 3180341 3203860 3211877 3198353 3216740 3217184 3258293 3273331 3257442
5262 3257442 3263508 3282141 3272965 3278703 3347199 3389945 3363489 3394310 3380558 3395935 3479806 3588953
5250 3588953 3571152 3544302 3612498 3720704 3752963 3799702 3829253 3911258 4011244 4022882 4097516
5239 4097516 4185731 4237906 4324781 4392028 4430526 4540924 4653285 4701180 4836173 4971808 5115526
5228E115526J56797J73522Q2035J39643J72485K76306K67539J82659K10348J99703
5218F976563J64820K01789K41143K18740K04751J86476K05300J30990J71907J65708
5208H868187J51960J85217K35871J55223J98846K35936K18090K48320K43324K16872
5198A0957846K36761K63864L37140K96118K50957K53191L10189L63835M25997
5189A3695898L76527L23907L50270L87981M37092L93079M30769M44792M69360
5180A7309675N51735O07676O45686P41232P20277P73307R10285R42902R90578
5171B4193353J042760J102046J232736J341061J425211J644040J769301J876022
5163C5626530K179987K489096K758151L156308L613569M139619M728839N488928
$$ plain form
5228 5115526 5272323 5445845 5527880 5667523 5840008 6116314 6383853 6566512 6776860 6976563
5218 6976563 7141383 7343172 7584315 7803055 8007806 8194282 8399582 8530572 8702479 8868187
5208 8868187 9020147 9205364 9441235 9596458 9795304 10031240 10249330 10497650 10740974 10957846
5198 10957846 11194607 11458471 11795611 12091729 12342686 12595877 12906066 13269901 13695898
5189 13695898 14072425 14396332 14746602 15134583 15571675 15964754 16395523 16840315 17309675
5180 17309675 17861410 18469086 19114772 19856004 20576281 21349588 22259873 23202775 24193353
5171 24193353 25236113 26338159 27570895 28911956 30337167 31981207 33750508 35626530
5163 35626530 37806517 40295613 43053764 46210072 49823641 53963260 58692099 64181027
5155F4181027O350088P437064Q661397J0237106J2128056J4305418J6180573J7442078
5147A56922807J8003664J7398630J4929281R664877L992277q25301p714885j4588731
5139A97782619j7344337j8976440k0491390j9279783j6479294j4060472j1605312
5132G9545591r241248p418176n965564m959707m244936l553089l110839k766979
5124C8285053k420044k132972j981908j771038j580665j479215j347056j250811
5116B4321344j122209j049482j000898r74108r11201q83730p99350o97029o54431
5107A6228906p04771o22706o18585n97424n84788n14145m79455n36539m54437
5098A1116056l95418m37810l92448l52880k98220l24555k75344k72585k52722
$$ plain form
5155 64181027 70531115 77968179 86629576 96866682 108994738 123300156 139480729 156922807
5147 156922807 174926471 192325101 207254382 216919259 220911536 220086235 212371350 197782619
5139 197782619 180438282 161461842 140970452 121690669 105211375 91150903 79545591
5132 79545591 70304343 62886167 56920603 51960896 47715960 44162871 41052032 38285053
5124 38285053 35865009 33732037 31750129 29979091 28398426 26919211 25572155 24321344
5116 24321344 23199135 22149653 21148755 20174647 19263446 18379716 17580366 16883337 16228906
5107 16228906 15524135 14901429 14282844 13685420 13100632 12586487 12107032 11570493 11116056
5098 11116056 10720638 10282828 9890380 9537500 9239280 8914725 8639381 8366796 8114074
5089H114074k80635k93113k65986j91994k70472j85473j19109j79287j51572j71914
5079F004519j15350j93945j68058j09421q2677j37683j50034r4534r7121j29883
5069D725813q4963j4134o7730j19125l6400r1530j30265p7771m8563p6587k6075
5058C952670j8260p7546k9983p9407p9778n0547m5807n5759j21807p6961m8514
5047C268301P494j15545m1687n8207o1258j04775r7390N585K743l9063n1758p8494
5035B635946p385j9860j01146r4842o760o258n1170k4299r2120n1174m0203k2970
5023B117759k5134k9293m5441m9718j2933j48552q3780j3690m8669m3018n156
5012A612375l4554k4462K4950j4673j03264l1642L6408k8536n1070l0403Q30J7252
$$ plain form
5089 8114074 7833439 7540326 7274340 7082346 6811874 6626401 6507292 6328005 6176433 6004519
5079 6004519 5889169 5695224 5527166 5417745 5335068 5197385 5047351 4952817 4855696 4725813
5069 4725813 4640850 4626716 4558986 4439861 4403461 4311931 4181666 4103895 4055332 3978745 3952670
5058 3952670 3934410 3856864 3826881 3747474 3667696 3617149 3571342 3515583 3393776 3316815 3268301
5047 3268301 3275795 3160250 3118563 3060356 2999098 2894323 2796933 2802518 2805261 2766198 2714440 2635946
5035 2635946 2628561 2608701 2507555 2412713 2405953 2399695 2348525 2324226 2232106 2180932 2140729 2117759
5023 2117759 2092625 2063332 2017891 1968173 1955240 1806688 1722908 1709218 1660549 1617531 1612375
5012 1612375 1577821 1553359 1578309 1563636 1460372 1428730 1465138 1436602 1385532 1355129 1355959 1373211
5000A373211k1047o2517J9893j7475M1223O720l3277M8312q1820o4850M277J3001
4988A225651m2794j2254J4574m0932l2132n075M7299p7938m4859k6872K1459o570
4976A019557M4623k7723o9055Q960l011O8973J2610k1227l9335M181m311l5846
4964I58396J8504O641j6876j3484K9736K0480K5913J3575k3571k2508n2084L1596
4952I76318n458l4251K0410J0663j8563M2076l107K9505j2822n4249k4790O2120
4940I87852j1175j03965j584j7635o183j7932Q0244n0923j6424k3784l1002R69
4928G88458k9779J3933n229L7079N2323n4795m3970l7886R230J3872m1118l9232
4916F62886j2542K251j835J5657J2483o7660M453J1152O648J0400o372l7394J4924
$$ plain form
5000 1373211 1352164 1289647 1309540 1292065 1333288 1340008 1306731 1355043 1273223 1208373 1212650 1225651
4988 1225651 1182857 1170603 1185177 1144245 1112113 1107038 1154337 1076399 1031540 1004668 1026127 1019557
4976 1019557 1064180 1036457 967402 976362 973351 1042324 1054934 1033707 994372 998553 994242 958396
4964 958396 976900 983541 966665 953181 982917 1003397 1029310 1042885 1019314 996806 944722 976318
4952 976318 970860 936609 957019 967682 949119 991195 988088 1017593 1004771 950522 925732 987852
4940 987852 976677 872712 871128 853493 847310 829378 909622 858699 842275 818491 787489 788458
4928 788458 758679 772612 767383 804462 856785 801990 758020 720134 729364 743236 702118 662886
4916 662886 650344 652595 650760 666417 678900 611240 615693 626845 633493 643893 637521 600127 615051
4903F15051o861O3574l0113k1504j4464r715P0509N2789j4970k4474r764n3130
4891F16928l811j7428L367l0517k7458O8038j7057l1625M532N413j3370m8367
4879E08645Q2108P930l26J8676n9445k8736J7070M8931N1867L0485J5281k742
4867F89744k0534j6082O882j1601K0387p174L8510j7377L5627L7432K176K9694
4855G87684M5836o209N833M6426P6005M8661O6302L7541O9540M3961J5866R9457
4843A336903P3291R4066J03485L3493N1566j4446j285o8435j16219j05292q2116
4832A305011r0597n7480q3297j1636r2498n3035l2703l4493m3168J9037Q967l9616
4820G94492k8778m9102m1339K6578p809n6982j0488j9314J5833n2071O4703m154
$$ plain form
4903 615051 608190 671764 641651 620147 605683 595968 666477 719266 704296 679822 670058 616928
4891 616928 613117 595689 599056 568539 541081 609119 592062 560437 564969 570382 557012 508645
4879 508645 590753 598683 598357 617033 557588 528852 545922 594853 646720 677205 692486 689744
4867 689744 669210 653128 660010 648409 668796 661622 700132 682755 718382 755814 757990 787684
4855 787684 833520 827311 833144 879570 955575 1004236 1070538 1108079 1177619 1221580 1237446 1336903
4843 1336903 1410194 1504260 1607745 1641238 1692804 1678358 1677073 1608638 1492419 1387127 1305011
4832 1305011 1214414 1156934 1073637 1062001 969503 916468 883765 849272 806104 825141 834108 794492
4820 794492 765714 716612 675273 701851 694042 637060 626572 607258 623091 571020 635723 631569
4808F31569K6764m2308M574M9885J9478l6223k9912j8472l0991l6693j3761K4482
4796E48392L2588J862K622k7281n1031l714K7680K1163l4602M5857L1815l1514
4784E63837M8251l0966k008J1782j9453J1581O197k8151j9705J2536k0412M3616
4772E77105P288K3308J03842P618j5164n283K962l1874K0517L6082K9188N0559
4760H06148l9594O9458N69J8580J0451R082Q2347J05695P9215l4971n6707K3648
4748A073921k0276j03701m2744k4964m5363m8629J8346k1179k9975p151r213M1239
4736G80311k3464m2421q078J4144o731k1617J2317p893K1928K2783j7965p6171
4724F47143K1335K9745O5311j5628j9988k2363m7773K3920j0355q478Q139k3046
$$ plain form
4808 631569 658333 616025 620599 670484 689962 653739 623827 605355 574364 537671 523910 548392
4796 548392 580980 582842 585464 558183 507152 503438 531118 552281 517679 563536 595351 563837
4784 563837 612088 581122 579114 590896 571443 583024 589221 561070 541365 553901 533489 577105
4772 577105 584393 607701 711543 719161 703997 698714 701676 669802 690319 726401 755589 806148
4760 806148 766554 836012 836581 855161 865612 874694 957041 1062736 1141951 1106980 1050273 1073921
4748 1073921 1053645 949944 907200 882236 836873 788244 806590 785411 755436 748285 739072 780311
4736 780311 756847 714426 706348 720492 713761 692144 704461 696568 718496 741279 723314 647143
4724 647143 668478 698223 763534 747906 727918 705555 657782 681702 671347 662869 671008 647962
4712F47962N2040k6336J6410J3463l5517o7579l0468N0643l7915K5867L0188o326
4700F32432J2897R794j9997M127j0274q4445Q802L2286L422m585j5132K5198P598
4687F02123j9338L6605m2690k322j5378L2544M3500m3902k139k9489K1304j0914
4675E69904R44P80O7997j6425j5374p80J8613k8157M2313K5451K7172j2301m9554
4662F30583K3936q098j452j5709J0018O5373N60n8455M5645M0995P021K1602L206
4649G65225k6154q284M9713J06J5545K5304p8745n7909j2220L702P595k2398k2668
4636F38812m91M3531P0804R677l0263J604k5193l1191K2211m712k5557L4246N8478
4623G61956j1304N7542l5603j2913K2509j6338j4649j4067O6332l45O682k8857
$$ plain form
4712 647962 700002 673666 690076 703539 668022 600443 569975 620618 582703 608570 638758 632432
4700 632432 645329 655123 635126 639253 628979 544534 553336 585622 589044 584459 569327 594525 602123
4687 602123 582785 619390 576700 574378 559000 591544 635044 591142 589003 559514 580818 569904
4675 569904 570848 571628 639625 623200 607826 607046 625659 597502 639815 665266 692438 680137 630583
4662 630583 654519 646421 644969 629260 639278 704651 705211 646756 692401 733396 740417 762019 765225
4649 765225 739071 730787 780500 780606 796151 821455 742710 684801 672581 676283 683878 661480 638812
4636 638812 638321 681852 752656 762333 732070 733674 708481 677290 699501 694789 669232 703478 761956
4623 761956 750652 808194 772591 759678 782187 765849 751200 737133 803465 803120 809802 780945
4611G80945K4840Q685R506J6807j4768R939k748j3740j8695k1283j2560J1680
4599G78608k0282J3938J7731o8324K4180P4936l8189m7260j1364M8230N6363n4266
4587G74301p728K4633k2813J04L9717J6744m3151M0051K3257o245K2298m5828
4575H15340j0177J4612k731o071J6351K2818k4058q710P3155O264j371l0695K5721
4562H90448k5272L4570Q2979K6335r278l4438l235L5815J8378k1002L5923M2246
4550A073469N876j6899n2321K9735O9908N6364Q6004M414J9101N924q073l9808
4538A233694N1466O1804J3953L9775N3871K7960J10704P3421l9874M8561J5053
4527A690388j6118k5933n8892k2409p3734k0158n332L4011K0470K1981n0464O903
$$ plain form
4611 780945 805785 814470 823976 840783 826015 835954 833206 819466 800771 779488 766928 778608
4599 778608 758326 772264 789995 721671 745851 820787 782598 735338 723974 772204 828567 774301
4587 774301 766573 791206 768393 768497 808214 824958 781807 821858 845115 838870 861168 815340
4575 815340 805163 819775 817044 810973 827324 850142 826084 817374 890529 896793 895422 864727 890448
4562 890448 865176 899746 982725 1009060 999782 965344 962109 997924 1016302 995300 1031223 1073469
4550 1073469 1079345 1062446 1010125 1039860 1109768 1166132 1252136 1256550 1275651 1281575 1273502 1233694
4538 1233694 1285160 1346964 1360917 1400692 1454563 1482523 1593227 1666648 1626774 1675335 1690388
4527 1690388 1674270 1648337 1589445 1567036 1493302 1473144 1467812 1501823 1522293 1544274 1493810 1500713
4515A500713K0528N7257O2056J6699J2630Q5539L263K6052J33914q900M0244O9724
4503B019719N2347N4809O2480J12762Q6820R5471O0313M9990N0353K3528L4064
4492B702656J08092M1141J05528R7240Q6324J30367P4590l8865j11482o8640j74935
4481B952016k05323j52265r3930l6141n024l6670L6008o359J0430k51O7782Q1028
4469B611301J14395M1009k4973j5186q1178o2368q011R971J2167j2081K895N4499
4457B642440O5933P4282O1779Q2935N4527O1416L7194L183J1634R9306J33293
4446C327922J27079J57932J64556K41953K56190L57839M14810M65653N22231N63356
4436F599521O62150O34683N92200M10896J60194k36144n62219p87556q88239p01856
$$ plain form
4515 1500713 1521241 1578498 1640554 1657253 1669883 1755422 1758685 1784737 1918651 1909751 1949995 2019719
4503 2019719 2072066 2126875 2189355 2302117 2388937 2484408 2544721 2594711 2645064 2668592 2702656
4492 2702656 2810748 2851889 2957417 3054657 3140981 3271348 3345938 3307073 3195591 3126951 2952016
4481 2952016 2746693 2594428 2500498 2464357 2459333 2422663 2458671 2452312 2462742 2462491 2530273 2611301
4469 2611301 2725696 2766705 2741732 2726546 2645368 2583000 2574989 2584960 2597127 2585046 2587941 2642440
4457 2642440 2708373 2782655 2844434 2927369 2981896 3043312 3080506 3083689 3095323 3194629 3327922
4446 3327922 3455001 3612933 3777489 4019442 4275632 4633471 5048281 5513934 6036165 6599521
4436 6599521 7261671 7896354 8488554 8899450 9059644 8823500 8261281 7473725 6585486 5883630
4426E883630o05084m64829l13107k95013k37402k77663k42451n8633j20234j70197
4416C099017p9857j23646m8090k6819j18675o5641j1434k726n1815M927r241M3007
4404B609007J2432K0789m8608l2565M3081J2936q924J2711L3846M8893N3709L2116
4392B789423j9035j01221p9112o8642j01050o200j2957q803k299L508K6489K1522
4380B441623K0683j9227L7677N8122O4183J2754Q621q849j9230n9698p2621l1915
4368B432123o5358j1646k3310l4660j1433K8021J6017m3858P82L1770p102M167
4356B315513K456L3248L6288K9379Q5003N6613k8985m2454M9268N6468J08037
4345B700834O0586R1952K6946r880j8215k6852l6195K2746N8439J9694J9054J18497
$$ plain form
4426 5883630 5278546 4813717 4500610 4205597 3968195 3690532 3448081 3389448 3269214 3099017
4416 3099017 3019160 2895514 2847424 2820605 2701930 2636289 2624855 2622129 2570314 2575241 2566000 2609007
4404 2609007 2621439 2642228 2593620 2561055 2604136 2617072 2608148 2620859 2654705 2703598 2757307 2789423
4392 2789423 2770388 2669167 2590055 2521413 2420363 2414163 2401206 2392403 2390104 2393612 2420101 2441623
4380 2441623 2462306 2443079 2480756 2538878 2603061 2615815 2624436 2615587 2596357 2536659 2464038 2432123
4368 2432123 2366765 2355119 2331809 2297149 2285716 2313737 2329754 2285896 2286678 2318448 2311346 2315513
4356 2315513 2317969 2351217 2387505 2416884 2501887 2558500 2529515 2487061 2536329 2592797 2700834
4345 2700834 2761420 2853372 2880318 2870438 2852223 2825371 2789176 2811922 2870361 2890055 2909109 3027606
4333C027606K6198J01845Q2246N9345J24085J28974J57250J96400K04501K01378
4323D309828K05631J21684P4016Q3507p564j42885n1272j60053j79376j53154
4313D100362r8570o7407l2393j6279M2418k8995r849Q7663K2437M7204R7773J03519
4301D247883M3105N2116P9364M6467J19901P3405N6973R2412J05910J21782J68939
4290E208257J69718J53494K27054K58063K69783L24198M12291M42278M62335N55972
4280H483443N19706L83993K08909n5791k13891l65963l92433l51151k97154j50614
4270G769054p4019m3785K7687K2019O4946J9535k4075l274N5950O1314R6324J37178
4258H108854J27771J98612K39254K41134K88508L88873L71351M82194N77509O48214
$$ plain form
4333 3027606 3053804 3155649 3237895 3297240 3421325 3550299 3707549 3903949 4108450 4309828
4323 4309828 4515459 4637143 4711159 4794666 4787102 4644217 4592945 4432892 4253516 4100362
4313 4100362 4001792 3934385 3901992 3885713 3928131 3899136 3889287 3976950 3999387 4046591 4144364 4247883
4301 4247883 4290988 4343104 4422468 4468935 4588836 4662241 4719214 4811626 4917536 5039318 5208257
4290 5208257 5377975 5531469 5758523 6016586 6286369 6610567 7022858 7465136 7927471 8483443
4280 8483443 9003149 9387142 9596051 9540260 9326369 8960406 8567973 8216822 7919668 7769054
4270 7769054 7695035 7651250 7678937 7700956 7765902 7785437 7761362 7758088 7814038 7875352 7971676 8108854
4258 8108854 8236625 8435237 8674491 8915625 9204133 9593006 9964357 10446551 11024060 11672274
4248A1672274P59392P76985Q19580Q15440N84959J23290j57371l24461l82879
4239A4687209l79353j93576k5698K02032L28441L62274M87437N70367M61083K80628
4229A6780844J96206j3725l9066r0435J2187R0526K33432L22342M38775N47991
4219A8479077O80124Q18134R48892J143329J339574J537049J807241K084183K415800
4210C1253403K805432L314196L929713M616290N356659N851173N574700L912405
4202F6613971P22418k943234n158364o762653o959594n681464m251174l197474
4194C2382432k386877j878301j473650j012255q85942n93348m58668l25338j49611
4185B3218442L580M2407K13567M25557N43684O53937Q00263Q09791P00421N25684
$$ plain form
4248 11672274 12431666 13208651 14028231 14843671 15428630 15551920 15394549 15070088 14687209
4239 14687209 14307856 14114280 14088582 14290614 14619055 14981329 15468766 16039133 16500216 16780844
4229 16780844 16977050 16963325 16924259 16833824 16846011 16936537 17169969 17492311 17931086 18479077
4219 18479077 19159201 19977335 20926227 22069556 23409130 24946179 26753420 28837603 31253403
4210 31253403 34058835 37373031 41302744 45919034 51275693 57126866 62701566 66613971
4202 66613971 67336389 64393155 59234791 52472138 45512544 39831080 35579906 32382432
4194 32382432 29995555 28117254 26643604 25631349 24745407 24152059 23693391 23368053 23218442
4185 23218442 23222022 23264429 23477996 23903553 24447237 25101174 25901437 26711228 27411649 27937333
4175B7937333J51410j57291l04870m57976m24955k28550q0824J52404L08049M66512
4165B7361242O30910Q17401J016669J245326J428442J793397K178643K604104
4157C9076134L091224L539138M050575M447250M896082N555238O199851P226231
4149G8081723P829832P269541M529897K4138m808856q725206j0250533j0154356
4141F3796180q338317o385298n078355m092054l364962k802046k347816j816801
4133B9570531j419378j144301r73158q02895o19273n69446n00202n37295n13518
4124B2491065m79511m23607l89301l44764l31017k63296j76946j19152m9943l6527
4114A9877001L5012J01044J46805K08697K08202K61299L68905L82693M11914M50876
$$ plain form
4175 27937333 28088743 27931452 27626582 27168606 26743651 26515101 26434277 26586681 26894730 27361242
4165 27361242 27992152 28809553 29826222 31071548 32499990 34293387 36472030 39076134
4157 39076134 42167358 45706496 49757071 54204321 59100403 64655641 70855492 78081723
4149 78081723 85911555 93181096 97710993 97735131 92926275 84201069 73950536 63796180
4141 63796180 55457863 49072565 43994210 39902156 36537194 33735148 31387332 29570531
4133 29570531 28151153 27006852 26033694 25230799 24611526 24042080 23541878 23004583 22491065
4124 22491065 22011554 21587947 21198646 20853882 20522865 20259569 20082623 19963471 19913528 19877001
4114 19877001 19912013 20013057 20159862 20368559 20576761 20838060 21206965 21589658 22001572 22452448
4104B2452448M41045N42788N17166O13870Q03550R36219J157002J356566J652930
4095C0473584J838172K065558J970459J395777J50724q31427j349038j763517
4087C3950292j404948r32601n12320k71033j98800o4148N0457K09488L49202L27987
4077C1503576J25380N470j29883k16557k34021o5556J05628K28967L05245M34991
4067C2063240N93009O49596P86334R61303J025453J111061J235378J277057J312544
4058D1014975J431506J568903J690524J865140K115389K265806K523783K801661
4050E7277687L087741L463145L922876M411594N001307N633155O529975P518510
4042I6845990Q767300J0232386J2233680J4545500J7395221K0929860K4881007
$$ plain form
4104 22452448 22893493 23436281 23953447 24567317 25370867 26307086 27464088 28820654 30473584
4095 30473584 32311756 34377314 36347773 37743550 37894274 37062847 35713809 33950292
4087 33950292 32545344 31612743 31100423 30829390 30630590 30566442 30616899 30826387 31175589 31503576
4077 31503576 31628956 31634426 31504543 31287986 31053965 30988409 31094037 31323004 31628249 32063240
4067 32063240 32656249 33305845 34092179 35053482 36078935 37189996 38425374 39702431 41014975
4058 41014975 42446481 44015384 45705908 47571048 49686437 51952243 54476026 57277687
4050 57277687 60365428 63828573 67751449 72163043 77164350 82797505 89327480 96845990
4042 96845990 105613290 115845676 128079356 142624856 160020077 180949937 205830944
4035B05830944K8637320L0949990L0248223K7004945K1715268J2058876l187983
4028C53257583j5195016k2408230l1907732l6032706l3013458k9585901k5892753
4021A59221787k0590936j5774346j2251049r467979p371016n863946m693906l934655
4013G9273954l397679l200126l318182l496891l659397l815467l855486l577019
4005E0953707l247117k917601k663843k357586k075318j867600j773101j639386
3997C2412155j513193j325935j225827j196281j130455j108517j016040r86346
3989B2909561r62841r21625q85600q38198o53511o34408n82511m66263m93682
3980A6470922m78619l98486m48248m52255m03965l84606l92702l86692l86443
$$ plain form
4035 205830944 234468264 265418254 295666477 322671422 344386690 356445566 353257583
4028 353257583 338062567 315654337 283746605 247713899 214700441 185114540 159221787
4021 159221787 138630851 122856505 110605456 101137477 93766461 87902515 83208609 79273954
4013 79273954 75876275 72676149 69357967 65861076 62201679 58386212 54530726 50953707
4005 50953707 47706590 44788989 42125146 39767560 37692242 35824642 34051541 32412155
3997 32412155 30898962 29573027 28347200 27150919 26020464 24911947 23895907 22909561
3989 22909561 21946720 21025095 20139495 19301297 18647786 18013378 17430867 16964604 16470922
3980 16470922 15992303 15593817 15145569 14693314 14289349 13904743 13512041 13125349 12738906
3971A2738906m42955l09921l49324l55716l64698k51174k35010k65864k13905
3962I950339k02937j11926k03154j94956j48173j11717p7736j00668p9147j21827
3952H598098r3607Q69q7937k7335m3854n3637l0735J0796l623K099L7906J5700
3940H324740M9331P6618K4068l8120p256M3627N5068O3085J07076J43401J93333
3929I034971J84617K23211K02152J25014R0414K9865q2123j98364l51465m15334
3919H842958l90049l61400l80203l85746k92505k35863k13658k37649k46009k38252
3909E861624j66765j55100j98041j91508j55155j71559j26010j35424q0650o6326
3899D415086j44577p1049j04492j33258k4215m8911q1771p1307o5853m6196p4057
$$ plain form
3971 12738906 12295951 11986030 11636706 11280990 10916292 10665118 10430108 10164244 9950339
3962 9950339 9747402 9635476 9432322 9237366 9089193 8977476 8899740 8799072 8719925 8598098
3952 8598098 8504491 8505360 8417423 8390088 8346234 8292597 8261862 8272658 8269035 8271134 8309040 8324740
3940 8324740 8374071 8450689 8474757 8436637 8429381 8473008 8528076 8591161 8698237 8841638 9034971
3929 9034971 9219588 9442799 9644951 9769965 9860379 9890244 9808121 9609757 9258292 8842958
3919 8842958 8452909 8091509 7711306 7325560 7033055 6797192 6583534 6345885 6099876 5861624
3909 5861624 5694859 5539759 5341718 5150210 4995055 4823496 4697486 4562062 4481412 4415086
3899 4415086 4270509 4199460 4094968 3961710 3937495 3888584 3806813 3735506 3669653 3623457 3549400
3888C549400l4843l9526k3062l9463n2595k7000k2460k2528Q352m920Q214j2517
3876C287052k3833m5184j9053M8138R160j3545j6247P625O4999O1725N8406J07406
3864C526649J47888J47106J06048J41815J51383K47805K70870J56614J51485J98470
3854E246133J88569Q6703J27346O6804N1150M1401n5923j26716j86196k58230
3844E181041k88336l03033k96403k65212j59850j81985j85169j03572j37698j9273
3834C240510j01903j00952r6482n8733k9132q8095m8113m4581k1609j0572k2661
3823B617677k9476j0011l0583j9612r474j1832k4850K301k3149O5194L267r4268
3811B435184m2011r506l6902p2701J8162J8746n6893L36j9100m3275j9093K0571
$$ plain form
3888 3549400 3514557 3475031 3451969 3412506 3359911 3332911 3310451 3287923 3296275 3291355 3299569 3287052
3876 3287052 3263219 3218035 3198982 3247120 3256280 3242735 3226488 3234113 3299112 3360837 3419243 3526649
3864 3526649 3674537 3821643 3927691 4069506 4220889 4468694 4739564 4896178 5047663 5246133
3854 5246133 5434702 5521405 5648751 5715555 5766705 5808106 5752183 5625467 5439271 5181041
3844 5181041 4892705 4589672 4293269 4028057 3868207 3686222 3501053 3397481 3259783 3240510
3834 3240510 3138607 3037655 2941173 2882440 2853308 2765213 2717100 2672519 2650910 2640338 2617677
3823 2617677 2588201 2578190 2547607 2527995 2518521 2506689 2481839 2484140 2460991 2526185 2529452 2435184
3811 2435184 2393173 2383667 2346765 2274064 2292226 2310972 2254079 2254415 2235315 2192040 2172947 2193518
3799B193518R602M7327L2247L8035L2737J2846J7256L6488O2754J15364N8300
3788B656474O3234r280P8373J27422O3551N9954L6146Q063j9713K0746j4290k2130
3776C048550q1892p5450r751J1012n2957k0954o155P0l5253l2664K6636N2441
3764B823633l9799k285J5894m842j6098J9456J8049n231J1883Q8197J08324O1124
3752C078305N1331J60974J29110J23491J94343J80827J16695K22038J47276R7128
3742D501518J56840J50166J79019L14j3608q919j09453j33516j94984j94561l18005
3731D014811l08571k34823j99328k10844j27067j12337n4956n7405j25231m4706
3721B539543j232j00969m6548j1783l3189j9715q545n35o565l2349j02133R673
$$ plain form
3799 2193518 2203120 2250447 2282694 2320729 2353466 2366312 2383568 2420056 2482810 2598174 2656474
3788 2656474 2719708 2710428 2788801 2916223 2979774 3039728 3075874 3083937 3064224 3084970 3070680 3048550
3776 3048550 2966658 2891208 2881457 2892469 2839512 2818558 2812403 2812473 2777220 2744556 2771192 2823633
3764 2823633 2783834 2781549 2797443 2792601 2776503 2795959 2814008 2808777 2820660 2908857 3017181 3078305
3752 3078305 3129636 3290610 3419720 3543211 3737554 3918381 4035076 4257114 4404390 4501518
3742 4501518 4658358 4808524 4987543 4987857 4974249 4965330 4855877 4722361 4527377 4332816 4014811
3731 4014811 3706240 3471417 3272089 3061245 2934178 2821841 2766885 2709480 2584249 2539543
3721 2539543 2538311 2437342 2390794 2379011 2345822 2326107 2317562 2317027 2310462 2278113 2175980 2185653
3709B185653l091L4733K0795N1235m3658L9059L4220N9422O0154N8729J21858
3698B619109J32591J55061J36278J69222K19788L04027L17619L24362L17214J71742
3688D867013L5607p2243l08988m01238m14560l48244l19114l02710j90709j54457
3678B390357r9309n3424o9682q2721n1826j4859o646l5495p724j3946j4169k6731
3666A913825p607K8154m4457J591l2272j1018K0670k7037k029M3078m1149J5630
3654A857379N4441J5877O548m632q716l5630J0458o332J8193j7413N8912K5773
3642A974858L5642N7413j2341l4590N4315J5860J6394M2086k3809k5939M6895
3631B146784P2067N0314M5691M5623P326K5862O9665K1286O7704P6322J19056
$$ plain form
3709 2185653 2182562 2217295 2238090 2289325 2245667 2284726 2318946 2378368 2438522 2497251 2619109
3698 2619109 2751700 2906761 3043039 3212261 3432049 3736076 4053695 4378057 4695271 4867013
3688 4867013 4902620 4830377 4521389 4120151 3705591 3357347 3038233 2735523 2544814 2390357
3678 2390357 2291048 2237624 2167942 2085221 2033395 2018536 2011890 1976395 1968671 1954725 1940556 1913825
3666 1913825 1906218 1934372 1889915 1891506 1859234 1848216 1868886 1841849 1839820 1882898 1841749 1857379
3654 1857379 1911820 1927697 1934245 1929613 1920897 1885267 1895725 1889393 1907586 1890173 1949085 1974858
3642 1974858 2010500 2067913 2055572 2020982 2075297 2091157 2107551 2149637 2125828 2099889 2146784
3631 2146784 2218851 2269165 2314856 2360479 2367805 2393667 2463332 2484618 2552322 2628644 2747700
3620B747700P4200J11512J74068K38734K52816K54442L21887K91765L91320L90663
3610E249107L21087J29433M2008q2369k63435l63003l63627k29080j58911j10935
3600D170275n1839L4120M6316L9589N1419K8793L2985o9903j12908m2761n3872
3589D072214j46329j75462j32960j53451j55555j48469n7416j42194r1566q0617
3579B788195r1909o0099p1713l6343j12185o6087m0874p9700n4751m8072n8649
3568B067813l1843m6930o5732j9876M9381n7641n9431j8606l0684J0661M3045
3557A840157j7448k7627j1854k5777r481m1559m2263N4947K0767j3586J4446l7665
3545A703057q084m3822L2433L4902R238q7018k40j365P323J2296o295j367m0318
$$ plain form
3620 2747700 2821900 2933412 3107480 3346214 3599030 3853472 4175359 4467124 4858444 5249107
3610 5249107 5570194 5699627 5741635 5659266 5395831 5032828 4669201 4440121 4281210 4170275
3600 4170275 4118436 4152556 4198872 4238461 4289880 4318673 4351658 4281755 4168847 4126086 4072214
3589 4072214 3925885 3750423 3617463 3464012 3308457 3159988 3102572 2960378 2868812 2788195
3579 2788195 2696286 2636187 2564474 2528131 2415946 2349859 2308985 2229285 2174534 2126462 2067813
3568 2067813 2035970 1989040 1923308 1903432 1952813 1895172 1835741 1817135 1786451 1797112 1840157
3557 1840157 1822709 1795082 1783228 1757451 1747970 1706411 1664148 1719095 1739862 1726276 1740722 1703057
3545 1703057 1694973 1651151 1683584 1718486 1727724 1640706 1640466 1639101 1646424 1658720 1652425 1651058 1610740
3532A610740L5380k4789m1630L7809M795j1297J2897k7357L0851j8569j1242M5821
3520A643409j8176J0303M8673o0251q870K7717k0870K6249q2702k5939N09q440
3508A531612N4613K4477M4787M165P072J379m3702R281M4049k7386O5548R3177
3496A809072J0757j1260n2306M3302N2894N7398j8269J0584k9508k359J9649l1405
3484A858549M8307j0499j0029O4534M6613J8818K3055M9079L8895J8747J6952
3473B163021k3176P9097K9415N077P1245K9710M3474j3035O1779M2444K2217O1375
3461B572643J11381N5819M6969L7974J2763M860k3869q275J8551O3008M7296Q0109
3449C019229J01286O3332L7263J09989J04718J53509J40190J11818J27906J78694
$$ plain form
3532 1610740 1646120 1621331 1579701 1617510 1622305 1611008 1623905 1596548 1627399 1608830 1597588 1643409
3520 1643409 1625233 1635536 1684209 1623958 1615088 1642805 1621935 1648184 1565482 1539543 1540052 1531612
3508 1531612 1586225 1610702 1655489 1659654 1666726 1668105 1624403 1633684 1677733 1650347 1715895 1809072
3496 1809072 1819829 1808569 1756263 1799565 1852459 1909857 1891588 1902172 1872664 1870305 1889954 1858549
3484 1858549 1906856 1896357 1886328 1950862 1997475 2016293 2039348 2088427 2127322 2146069 2163021
3473 2163021 2139845 2218942 2248357 2253434 2324679 2354389 2397863 2384828 2446607 2489051 2511268 2572643
3461 2572643 2684024 2739843 2786812 2824786 2837549 2842409 2818540 2810265 2828816 2891824 2939120 3019229
3449 3019229 3120515 3183847 3221110 3331099 3435817 3589326 3729516 3841334 3969240 4147934
3439D147934J24591J94201J62232P4678O3718P9103M2945P2373N0015P1079J68509
3428E251378N4050P6584L7943J1607O8736J16697J32519J01400K03152J72604
3418F226670J29368J4522j27932j35881k11037j66525n5584j25683K8543R5350
3408E671811M9088P3737P8196K3894O8797O1226J01651J23847J44187M3274K8793
3397F468501R9663P0435J4406O7339J17752J74155L13415L83627M16019M40245
3387H565557N53689L90881K42089r9732l30632m16005l58041k14708j65804p5736
3377H091558l4368L1431R4928J07287L2458L5379M3940P7592J29525J29101J50668
3366H889499K28883K27797L77617M18839M74253O13857O56495Q26283R91612J089436
$$ plain form
3439 4147934 4272525 4466726 4628958 4703636 4767354 4846457 4889402 4961775 5011790 5082869 5251378
3428 5251378 5305428 5382012 5419955 5431562 5500298 5616995 5749514 5850914 6054066 6226670
3418 6226670 6356038 6370560 6242628 6106747 5895710 5729185 5673601 5547918 5576461 5671811
3408 5671811 5720899 5794636 5872832 5896726 5965523 6026749 6128400 6252247 6396434 6439708 6468501
3397 6468501 6568164 6638599 6653005 6720344 6838096 7012251 7325666 7709293 8125312 8565557
3387 8565557 9119246 9510127 9752216 9652484 9321852 8905847 8547806 8333098 8167294 8091558
3377 8091558 8057190 8088621 8183549 8290836 8323294 8358673 8402613 8480205 8609730 8738831 8889499
3366 8889499 9118382 9346179 9723796 10142635 10616888 11230745 11887240 12713523 13705135 14794571
3356A4794571J273459J364704J395276J205029Q66964M21155l8931m70253r82183
3347A9829791j108815j212685j155860r58076p37214o43685n56813n11627m73511
3338A2471505l10555k61386k66524j40142j61425j20967o5373j58962j55065j71299
3328A0659807j01573k4616p1751K0406N9705Q8026J06810K46752K08973K12035
3318A1404574K79027K38091J19741J07218J38598J35436N7926P5023j2135Q1264
3308A2624763P2158J79912K12896K49954K44139K19410K53630L85277M94082N37064
3298A5473285O99116Q11344R00019J026202J238881J359083J492396J780519K079559
3289B6860404K348552K558819K167444R29746o90778j657713k461977k418145
$$ plain form
3356 14794571 16068030 17432734 18828010 20033039 20900003 21321158 21282227 20811974 19829791
3347 19829791 18720976 17508291 16352431 15394355 14657141 14013456 13456643 12945016 12471505
3338 12471505 12160950 11899564 11633040 11492898 11331473 11210506 11145133 10986171 10831106 10659807
3328 10659807 10558234 10533618 10461867 10482273 10541978 10630004 10736814 10983566 11192539 11404574
3318 11404574 11683601 11921692 12041433 12148651 12287249 12422685 12480611 12555634 12543499 12624763
3308 12624763 12696921 12876833 13089729 13339683 13583822 13803232 14056862 14442139 14936221 15473285
3298 15473285 16172401 16983745 17883764 18909966 20148847 21507930 23000326 24780845 26860404
3289 26860404 29208956 31767775 33935219 34864965 34174187 32516474 30054497 27636352
3281B7636352j754714j090672o23712m38767l16215j84708k6759Q5647K66915
3272B3553367N37172P57571R34569J143845J345821J488613J774321K026340K365133
3263C5926752K607663K901827L070941L102167K575407J189025r27795k688390
3255D7757597l934495m618138m229665l543351k926230k425737j988310j654681
3247B2436990j439674j194724j095234r41471p33352o77011o29933n06403m71530
3238A4747658l91235m35910l55487k57003k87601k56384j83751j50923j65934
3229A2263430j67827j77191k53216k68940l02709k27151k29438k02916j30131
3220A0303911j52926p1152r2225k1590l2748O732O5985L3348J96846K63406L17719
$$ plain form
3281 27636352 25881638 24790966 24167254 23728487 23412272 23227564 23200805 23286452 23553367
3272 23553367 24090539 24848110 25782679 26926524 28272345 29760958 31535279 33561619 35926752
3263 35926752 38534415 41436242 44507183 47609350 50184757 51373782 50445987 47757597
3255 47757597 43823102 39204964 34975299 31431948 28505718 26079981 24091671 22436990
3247 22436990 20997316 19802592 18707358 17765887 17032535 16355524 15725591 15219188 14747658
3238 14747658 14356423 13920513 13565026 13308023 13020422 12764038 12580287 12429364 12263430
3229 12263430 12095603 11918412 11665196 11396256 11093547 10866396 10636958 10434042 10303911
3220 10303911 10150985 10079833 9987608 9966018 9933270 9940002 10005987 10039335 10236181 10499587 10817306
3209A0817306M20397M83850O22671P02386Q87031R99379J035556R46666Q53106
3200A7768348M53215L464m86105q62292j227110j396251j261483j107186q86856
3191A0997744p11048n27577l55430l07779q6307k2886m3748M9078J05812R8738
3181I196597K8284r4617k67830m07435l60805m11618m37835m73568m24138l04323
3171F042712l15816k11929j26550j30801j65097j45539q6057r8160j20032p0807
3161D571924k6529q9827n7588k1728l1528J0972N7514m4285K538l7454j04699
3150D229310p0427j41556j33295j34313j51287o9943r0787j28385m5985N058K9526
3139C297916n8167o4876j0269K2070k8605J1422m348P0605l890q388J19832M4807
$$ plain form
3209 10817306 11237703 11721553 12344224 13046610 13933641 14933020 15968576 16915242 17768348
3200 17768348 18221563 18225027 17738922 16876630 15649520 14253269 12991786 11884600 10997744
3191 10997744 10286696 9759119 9403689 9095910 9009603 8986717 8942969 8992047 9097859 9196597
3181 9196597 9224881 9130264 8862434 8454999 8094194 7682576 7244741 6771173 6347035 6042712
3171 6042712 5726896 5514967 5388417 5257616 5092519 4946980 4860923 4762763 4642731 4571924
3161 4571924 4545395 4455568 4397980 4376252 4344724 4355696 4413210 4368925 4371463 4334009 4229310
3150 4229310 4158883 4017327 3884032 3749719 3598432 3528489 3437702 3309317 3263332 3268390 3297916
3139 3297916 3239749 3174873 3164604 3186674 3158069 3169491 3165143 3235748 3231858 3223470 3343302 3388109
3127C388109P7522J02336J04105J64575J03194R9268J10639N8062k5912r7395
3117D084503j62679j82027j19862k17753j77052j04665n2591j33383j29534L1816
3107B836773n8388n8500p928N483l311m5501m0267l6755O3858O9958m7821m463
3095B673138M4397M5797P0708L3390M4370N1822N8544M659J5661j2989p7474r3186
3083B858837j41261n8684m4726m6606o5930J4762l9733r856M150N540k4756k9396
3071B422341O1923L742j7211L517k2849M9719L7215q888N7083J2543M3337L9653
3059B682125M6003M7194K0745L4808n7067j6904K1172R9080Q3469L6861m005Q6457
3047C079938J25758Q5157R8993O9141J77698J27598O8392J80427J90974J67162
$$ plain form
3127 3388109 3465631 3567967 3672072 3836647 3939841 4039109 4149748 4207810 4181898 4084503
3117 4084503 3921824 3739797 3619935 3402182 3225130 3120465 3067874 2934491 2804957 2836773
3107 2836773 2778385 2719885 2711957 2717440 2714129 2668628 2628361 2591606 2655464 2725422 2677601 2673138
3095 2673138 2717535 2763332 2834040 2867430 2911800 2963622 3022166 3026825 3042486 3029497 2952023 2858837
3083 2858837 2717576 2658892 2614166 2567560 2501630 2516392 2476659 2466803 2470953 2476493 2451737 2422341
3071 2422341 2484264 2488006 2470795 2474312 2451463 2501182 2538397 2529509 2586592 2599135 2642472 2682125
3059 2682125 2728128 2775322 2796067 2830875 2773808 2756904 2778076 2877156 2960625 2997486 2993481 3079938
3047 3079938 3205696 3290853 3389846 3458987 3636685 3764283 3832675 4013102 4204076 4371238
3037D371238J62295K09871J40485K08390K24649J67376Q6037L3528p926j4749
3027E581194o3227J5327k5001r5556j0584n1573K5778N5484O6436M8127M6546
3016E592951Q3595M8773K6865N1213K6518J1727N7356J3248N9411R5530R2735
3005F159922K15690K70943K78923L14623L52373L47003M12949M52391M31932L53558
2995I590307K72118O2883q9711k60368l37412m28455l36351k72427j87864j41368
2985G871352L9874L6962L7237P312M079q0334p9178j88401k59546k88313k84748
2974F816296k90523k71432k01378j05330l883K7112O5669Q3413J41586J48378
2964F409908K15111J99824J82238J82524R4349J7677J6350p0275j29907k13928
$$ plain form
3037 4371238 4533533 4743404 4883889 5092279 5316928 5484304 5570341 5603869 5595943 5581194
3027 5581194 5517967 5533294 5508293 5412737 5402153 5350580 5376358 5431842 5498278 5546405 5592951
3016 5592951 5676546 5725319 5752184 5803397 5829915 5841642 5898998 5912246 5971657 6067187 6159922
3005 6159922 6375612 6646555 6925478 7240101 7592474 7939477 8352426 8804817 9236749 9590307
2995 9590307 9862425 9925308 9835597 9575229 9237817 8809362 8473011 8200584 8012720 7871352
2985 7871352 7911226 7948188 7985425 7992737 7996816 7916482 7837304 7648903 7389357 7101044 6816296
2974 6816296 6525773 6254341 6052963 5947633 5943750 5970862 6036531 6119944 6261530 6409908
2964 6409908 6625019 6824843 7007081 7189605 7283954 7301631 7317981 7247706 7117799 6903871
2954F903871j55811j47870j50671o8262j7337j561k6325k4879L7697k5443j25700
2943F197709j66148j68246j93806k42753j96688j75391j81648j20151j40988o5580
2933D546310j9780k2813n4988r614Q261N7905M1320N261P2731Q3358J1009J08333
2921D827293J21629R9770M6587N9311O7404M4138L0797l2790j7273j29847j60692
2910D956327j31915j41760j20434n0495m3080r6024l1579J0590l7149j2004M4451
2899D346928J8777o1867P9487K5968k8897P727J883P4539k4156p0502m1212q1401
2887D247274q3695L3479j50540m5871r1675j49010p2502j32627n0916K919p2882
2876C433954r1956r8161m8895m68j2272r0379o2423n0196p9737q9013o1018o4911
$$ plain form
2954 6903871 6748060 6600190 6449519 6381257 6363920 6362359 6336034 6311155 6348852 6323409 6197709
2943 6197709 6031561 5863315 5669509 5426756 5230068 5054677 4873029 4752878 4611890 4546310
2933 4546310 4526530 4503717 4448729 4439115 4447376 4505281 4546601 4551862 4624593 4707951 4718960 4827293
2921 4827293 4948922 5048692 5095279 5154590 5221994 5266132 5296929 5264139 5246866 5117019 4956327
2910 4956327 4824412 4682652 4562218 4511723 4468643 4372619 4341040 4351630 4314481 4302477 4346928
2899 4346928 4365705 4303838 4383325 4409293 4380396 4388123 4390006 4464545 4440389 4369887 4328675 4247274
2887 4247274 4163579 4197058 4046518 4000647 3908972 3759962 3687460 3554833 3503917 3506836 3433954
2876 3433954 3341998 3243837 3194942 3194474 3182202 3091823 3029400 2979204 2899467 2810454 2749436 2684525
2864B684525j18904r3600j11388j02757r4250p1793r7481p1732m2628o1700j00141
2853A718151k116o2483n5706q3884n2148j1590n5982m182j8846l8299p7264q152
2841A247499j3476R511m1572o3382k2151j5033Q056l7923k1406l0827q2901l3869
2829I02526L90n0743N334L567l2119n1035n2273p281O4655O470q1797l2932N1366
2816G26128o7061l5296J2541j9537L7188n2466k1768j5435j7767K2903j4924q0454
2804D74052L0647N5655m7891p541o2975j3003L1966N405k2353J5609m8264j7602
2792C93705m8076N9797J2814n8023m923M1295j5111l8384K0476K2528p399j9483
2780C59216J9605n0712j0387J8973O2826l158l0866k7850j6473k6129O585L5398
$$ plain form
2864 2684525 2565621 2472021 2360633 2257876 2163626 2091833 1994352 1922620 1879992 1818292 1718151
2853 1718151 1716035 1653552 1597846 1513962 1461814 1450224 1394242 1390060 1371214 1332915 1255651 1247499
2841 1247499 1234023 1243534 1201962 1138580 1116429 1101396 1109452 1071529 1050123 1019296 936395 902526
2829 902526 902916 852173 857507 861074 828955 777920 725647 718366 783021 789491 707694 674762 726128
2816 726128 659067 623771 636312 616775 653963 601497 579729 564294 546527 569430 554506 474052
2804 474052 504699 560354 512463 504922 441947 428944 460910 466315 443962 459571 411307 393705
2792 393705 345629 405426 418240 360217 355294 396589 381478 343094 363570 386098 378699 359216
2780 359216 378821 328109 317722 336695 399521 396363 365497 337647 321174 295045 301630 337028
2768C37028j8170J9226l0449J3608m2664k0718j8402r687j3653K9818o204j1092
2756B28641K6673M0867M2309n9004l4827p728m00o053j4309L3969O1484J0801
2744C22423m1093l0800M4700J8448K7155j048n3639N734K2295J2278j8512p427
2732C00514M4947K2977K4967n1662O027j3533L0194O893l7276j6594N9009L2265
2720D08728J4071l438j9267N3678K848L7564L5059k9882K0667o4191J7953N5893
2708E29683N7239l3841k0386N2779K2644K642J959N0592J1550k7772O8388q186
2696G07291k8261K4385N6286L8693K4927J8276L9168l5518K7255Q0520J3260L7598
2684A003880K4028Q0827K3543O1905K1232L1104M7913M6047K0650O5139Q5603
$$ plain form
2768 337028 318858 338084 307635 321243 278579 257861 239459 229772 216119 245937 239733 228641
2756 228641 255314 296181 338490 279486 244659 236931 236531 230478 216169 250138 311622 322423
2744 322423 281330 250530 295230 313678 340833 339785 286146 291880 314175 326453 307941 300514
2732 300514 345461 368438 393405 341743 347770 334237 364431 371324 334048 317454 376463 408728
2720 408728 422799 419361 400094 453772 456620 494184 529243 499361 520028 455837 473790 529683
2708 529683 586922 553081 532695 585474 608118 610760 612719 663311 674861 647089 715477 707291
2696 707291 679030 703415 759701 798394 823321 841597 880765 845247 872502 953022 966282 1003880
2684 1003880 1027908 1108735 1132278 1194183 1215415 1246519 1294432 1340479 1361129 1426268 1511871
2673A511871L8843K9481R1550N8711L2828Q6048L4488m1080K8371K3073m749M5441
2661A934876O9921K3594L1351J03005J19140J15622K7221L0361P7674N0766n0162
2650B533369k6281N6066j0199p028L3654n2250k1793L2510M1642J05407L5170
2639B720267P6048J50101Q9495N2600J00561N0494J1827L8529R1480l1868l4072
2628C315462Q908J3455N5787N9463O6920O1051R2739N7742N1318J38159R9635
2617D020639o3590r3617p0979l5577j32630p7050j20670j81293q2586o2327j10966
2606B989354q2828l1870J7367M7863K6244M6153J9310M6567N2449M134m0032k8758
2594C065953J757L7073j2651k8555o2218j1064k0065j2756O2357M0444O851j9133
$$ plain form
2673 1511871 1550714 1580195 1671745 1730456 1763284 1849332 1883820 1842740 1871111 1894184 1889435 1934876
2661 1934876 2004797 2028391 2059742 2162747 2281887 2397509 2424730 2455091 2532765 2583531 2533369
2650 2533369 2507088 2563154 2552955 2545927 2579581 2527331 2505538 2538048 2579690 2685097 2720267
2639 2720267 2796315 2946416 3035911 3088511 3189072 3239566 3251393 3289922 3381402 3349534 3315462
2628 3315462 3324370 3337825 3393612 3453075 3519995 3581046 3673785 3731527 3782845 3921004 4020639
2617 4020639 3957049 3863432 3792453 3756876 3624246 3547196 3426526 3245233 3162647 3100320 2989354
2606 2989354 2906526 2874656 2892023 2939886 2966130 3012283 3031593 3078160 3130609 3134743 3094711 3065953
2594 3065953 3067710 3104783 3092132 3063577 3001359 2990295 2970230 2957474 3019831 3060275 3067126 3047993
2582C047993J4390p939p2273j56771j63767j44069j31545j14536p7106j36487
2572B057890j37796r4207j37286o2933n8646o9807n028J6737l2600P466m6712
2561A437078L2420J6600j2081R787n247m6134q0441n3053o5120r200r0247r505
2549A124857k9638l321m004k4448n5717k6055J1430m2900l9137q3964j3610o0506
2537G52987r7314n8917k3766p3003k4421j5518k8083k4042k9229O484k2234n0850
2525C12094k068j4109o742J8143n1774m0099L2508p675J581r940n2710J3139K4883
2512B17231n6462j8690j2909p813J3833j4557p1045l4066J2965k8990L3650m815
2500B8332M532J5979J8035n3684K9653P683j6097j9764L6793k3218k9847J651
$$ plain form
2582 3047993 3062383 3054444 2982171 2825400 2661633 2517564 2386019 2271483 2194377 2057890
2572 2057890 1920094 1825887 1688601 1625668 1567022 1497215 1492187 1508924 1476324 1483790 1437078
2561 1437078 1469498 1486098 1474017 1483804 1478557 1432423 1351982 1298929 1233809 1224609 1134362 1124857
2549 1124857 1095219 1091898 1087894 1063446 1007729 981674 993104 950204 911067 827103 813493 752987
2537 752987 655673 596756 572990 499987 475566 460048 431965 407923 378694 385178 362944 312094
2525 312094 310026 295917 289175 307318 255544 215445 247953 240278 241859 231919 179209 192348 217231
2512 217231 160769 142079 129170 121357 135190 120633 49588 15522 28487 -503 33147 28332
2500 28332 32864 48843 66878 13194 42847 50530 34433 14669 51462 28244 -1603 48
2488D8j5541j9697O261J1219P370Q1851k9849m8983k3382p272J5220p554j9695
2475e0004k2211L0092L2261j03804O2593M3526j7361K6650J8223j9280m1068L8761
2463a622l2430M1678j534l9478r216J5407J7132L485p8912L5006j8713q835L6077
2450d1955K7399j0913j040L893m7257L6719J4051m4476k5138J2880l9920K9846
2438h5911J9111o96L287J0299n2518M1429k4367Q34j0028J6284P206K6580J8534
2425b9956m1532J1113q932K3517J6373k4396l9507N574K6611J2314k5692J5855
2413e8658K2023l228J7392K7933m4786M2546q594m5679J5376m6976Q213L2052
2401d2386J0592j7043o368J6093l1898J3809N4246j059k2501r521p934N800J0263
$$ plain form
2488 48 -15493 -35190 -28929 -17710 -10340 71511 41662 -7321 -30703 -37975 -22755 -30309 -50004
2475 -50004 -72215 -42123 -9862 -113666 -51073 -7547 -24908 1742 19965 685 -40383 -1622
2463 -1622 -34052 7626 6092 -33386 -42602 -27195 -10063 -6578 -85490 -50484 -69197 -78032 -41955
2450 -41955 -14556 -25469 -26509 -22616 -69873 -33154 -19103 -63579 -88717 -75837 -115757 -85911
2438 -85911 -66800 -67496 -64209 -53910 -106428 -64999 -89366 -88532 -98560 -82276 -75070 -48490 -29956
2425 -29956 -71488 -60375 -69307 -45790 -29417 -53813 -93320 -87746 -61135 -48821 -74513 -58658
2413 -58658 -36635 -39863 -22471 5462 -39324 3222 -5372 -51051 -35675 -82651 -74438 -42386
2401 -42386 -31794 -48837 -55205 -39112 -71010 -57201 -2955 -4014 -26515 -36036 -43970 -38170 -27907
2388b7907j7372J4927L9982L5477k9537r770M473m5115n023l3632o595j8626N848
2375i2870K9646m295K2912m932J3831M565k6300j758J5344K0938M8418m0401m1218
2362e6120Q7550k5112l2217R643j9364j8704j686k4055M042J2871k6889P949l275
2349h5367N5706n13J8623k4909N813m7860K3490l0722j1182N6476L6127L207n5164
2336e6275J2567m1160j2681L6772R380l7059M0771J444K8605o9361L5301K9484
2324b2212m7961J2531P406L6235k2393n867n8349m6683P8056J6482m1727l5289
2312a29771M1255m80L9854J9659j4575k1372q494P5814n6204R123K8425o496k1848
2299d5110L847j4456K7349j0562R298q5111j8322K7388M5223L8606J7592P316
$$ plain form
2388 -27907 -45279 -30352 9630 45107 15570 5800 10273 -34842 -39865 -73497 -80092 -98718 -92870
2375 -92870 -63224 -67519 -44607 -49539 -35708 -31143 -57443 -59201 -43857 -22919 25499 -14902 -56120
2362 -56120 31430 6318 -25899 -16256 -35620 -54324 -56010 -80065 -76023 -63152 -90041 -82092 -85367
2349 -85367 -29661 -30174 -11551 -36460 -30647 -78507 -55017 -85739 -96921 -40445 -4318 -1111 -56275
2336 -56275 -43708 -84868 -97549 -60777 -51397 -88456 -47685 -46241 -17636 -86997 -51696 -22212
2324 -22212 -70173 -57642 -50236 -14001 -36394 -42261 -100610 -147293 -69237 -52755 -94482 -129771
2312 -129771 -88516 -88996 -49142 -29483 -44058 -65430 -73924 1890 -54314 -45191 -16766 -23262 -45110
2299 -45110 -41263 -55719 -28370 -38932 -29634 -114745 -133067 -105679 -60456 -21850 -4258 3058
2287C058J1419J3849m4023l7490J5038l8001J3792K1620J2111N2656l9759r391
2275b5121o65N7017n347p1832k0558M0682K2448k0305N4056L2447m6653K3493
2263C9662n8152R813O144K6766j6754j6801L2600L5162J553j70l1482o766J8870
2250D0445J2783j9478j8425l9887P2237l626l4331j1340K8675N2413j2528j3239
2238E3699m928R633J1082l9291q351Q865P69J9378N766l5066j5969j0191M9845
2225D5241K7464n4308M5630L8302K818q413k4812P9180k2220l7110k764L7171
2213A26179J9363j3357M7523p1485L410m641M8797M8545K1571K75M9563m963l3449
2200B37331J4081L2742r881n4293L1012R7973J6327J6979J2860J0179k3611m139
$$ plain form
2287 3058 14477 28326 -15697 -53187 -38149 -76150 -62358 -40738 -28627 24029 -15730 -25121
2275 -25121 -25786 31231 25884 -45948 -66506 -25824 -3376 -23681 30375 62822 16169 39662
2263 39662 -18490 -8677 -2533 24233 7479 -9322 23278 58440 59993 59823 28341 21575 40445
2250 40445 53228 33750 15325 -24562 47675 44049 9718 -1622 27053 79466 66938 53699
2238 53699 48771 58404 69486 30195 21844 30709 31478 50856 56622 21556 5587 -4604 45241
2225 45241 72705 18397 64027 102329 105147 96734 71922 151102 128882 91772 89008 126179
2213 126179 145542 132185 179708 108223 111633 106992 155789 204334 225905 226180 275743 270780 237331
2200 237331 251412 284154 274273 219980 250992 348965 365292 382271 395131 405310 381699 377560
2188C77560j8282k2672K9081N7827o273N7984L8579j0688k7907O777J18452L6814
2176F37252k8443o3104J9517K5473K9098Q2651j8476n346k6919P1363O414J3617
2164G43097L7384J1584J8849N7004L7526J7563L3260L4789J4451M2436L3451P4322
2152A155716O1081J3312J00620K6441q076J19230Q3390J7923J29334M4155J26893
2141A870019P6260J15618J05818J38708K28516K38739K35757K53860K38186K08587
2131C710068K91095L35456L16878N03932N85775P08498R00432J129715J360077
2122I841926J605389J945883K236906K016040P05950j152432k105353k907052
2114A2187257k718366j832268j256030q19840p24570n73817m78119k91322k22171
$$ plain form
2188 377560 359278 336606 365687 423514 417241 475225 513804 503116 475209 481986 600438 637252
2176 637252 608809 545705 565222 590695 619793 702444 683968 678622 651703 723066 729480 743097
2164 743097 780481 792065 810914 867918 905444 923007 956267 991056 1005507 1047943 1081394 1155716
2152 1155716 1216797 1230109 1330729 1357170 1349094 1468324 1551714 1569637 1698971 1743126 1870019
2141 1870019 1946279 2061897 2167715 2306423 2534939 2773678 3009435 3263295 3501481 3710068
2131 3710068 4001163 4336619 4653497 5157429 5743204 6451702 7352134 8481849 9841926
2122 9841926 11447315 13393198 15630104 17646144 18352094 17199662 15094309 12187257
2114 12187257 9468891 7636623 6380593 5560753 4836183 4262366 3784247 3492925 3270754
2105C270754j74677k00652j59887j84074j86481k23740j28376j45888j11883j21263
2095A633833q2512j28021p4301o4596k5554j6588q8967j02183j11965J6847J1093
2084I67086o3235p3864n0039l5368o4603l9249o7683J7377K635p0323m8570k6572
2072D47592j8249o3566O8210N0952l4861n6419l3033l6243j0965J6333K0615q812
2060C41554n7085l0773k6290n292k2327M4028j1498J0066n3309p5301N7618K4817
2048A96208j1118k3255k1229o158l415L6423J9678j01254M5323L0380r060j146
2036A51377N9109n6215k3052j8655l4379K6107J9008L2024m3531k6119K6508o862
2024A05320J2402m9616J5753q619j4607O975k9578k309O339P132k1659n823M0590
$$ plain form
2105 3270754 3096077 2895425 2735538 2551464 2364983 2141243 2012867 1866979 1755096 1633833
2095 1633833 1551321 1423300 1348999 1284403 1258849 1242261 1153294 1051111 939146 955993 967086
2084 967086 903851 829987 779948 744580 679977 640728 573045 590422 593057 522734 474164 447592
2072 447592 429343 365777 433987 484939 450078 393659 360626 324383 313418 329751 350366 341554
2060 341554 284469 253696 227406 222114 199787 243815 232317 242383 189074 113773 171391 196208
2048 196208 185090 161835 140606 134448 131033 167456 187134 85880 131203 161583 152523 151377
2036 151377 210486 154271 131219 112564 78185 104292 123300 155324 111793 85674 112182 105320
2024 105320 117722 68106 83859 75240 60633 67608 38030 35721 42060 49192 27533 21710 62300
2011F2300K8872o5597r516K7890M2464J9565n0190o944j5625J4138l9159O02j7078
1998h278r207j0274J5114K3232j337n663k6392L6535j1682K1708K6554n3950r97
1985d637K5568n2926m790p945J5611J8819m962J8461j0477J1138K3949j6158j2465
1972h14j3209K4055o0985j7462N3809M7094k5276m191m5393j1903J6321k9770
1960f7724m259J8475J328j1454j6606O8115k5374J3609j3692p564L6087k7442
1948c6501J6879J0130K55K8303l4893l196K6188j6789J561m174r29j7964K6083
1935e047n9115K5636j2936j055l5619K4163O5560j8080l8288J0540m331k7165
1923g5737K8327L537N0973O329k38M284l7662l1357J0693K0294k9103m0014K7158
$$ plain form
2011 62300 91172 25575 16059 43949 86413 105978 55788 48844 33219 47357 8198 8800 -8278
1998 -8278 -17485 -27759 -12645 10587 9250 3587 -22805 13730 2048 23756 50310 -3640 -4637
1985 -4637 20931 -31995 -36785 -44730 -29119 -10300 -15262 3199 -7278 3860 27809 11651 -814
1972 -814 -14023 10032 -50953 -68415 -14606 32488 7212 3021 -42372 -54275 -37954 -67724
1960 -67724 -71983 -53508 -52180 -63634 -80240 -12125 -37499 -23890 -37582 -45146 -9059 -36501
1948 -36501 -19622 -9492 -9237 19066 -15827 -19023 7165 -9624 -8063 -12237 -13166 -31130 -5047
1935 -5047 -64162 -38526 -51462 -52517 -88136 -63973 1587 -16493 -54781 -44241 -48572 -75737
1923 -75737 -47410 -43873 7100 13429 13191 17475 -20187 -51544 -40851 -20557 -49660 -89674 -62516
1910f2516K2071J3075k0789l1455j0705L5220n9678k5458L604N0229j9269K9242
1898g6429N3673n8630p59J8781J7791K1449J088l2287K5983J914L533p537J3097
1885a8333m070N945j9798n5112l936L3628N598j0288P0522l4886j0437M3036m9404
1872d7535k0701j7332N5540n015J5524J9744j9078k0266k391L2534q326l8362
1860e5664M7906L0471Q519N269l9368K4205l1685n003L2849J6034N5050n8480
1848C0103j510K827l2331P113K1090l6048K804m0965p059N0424l7466l646j4492
1835e9156P2325r66n6948j8728L4800J8444k0069j6958k9835q526K9414m023L5570
1822b4656k9469J5640J532l2100M9407j1327l696k6998l649M3394j9403L359J1726
$$ plain form
1910 -62516 -40445 -27370 -48159 -79614 -90319 -55099 -114777 -140235 -136631 -86402 -105671 -76429
1898 -76429 -22756 -81386 -82145 -63364 -45573 -24124 -23036 -55323 -29340 -27426 -23893 -31430 -18333
1885 -18333 -22403 -16458 -36256 -91368 -95304 -61676 -56078 -66366 4156 -30730 -41167 1869 -47535
1872 -47535 -68236 -85568 -30028 -35043 -19519 225 -18853 -39119 -41510 -8976 -17302 -55664
1860 -55664 -7758 22713 31232 36501 -2867 21338 -10347 -15350 17499 33533 88583 30103
1848 30103 28593 31420 -911 6202 27292 -8756 -5952 -46917 -53976 -3552 -41018 -44664 -59156
1835 -59156 13169 12203 -44745 -63473 -28673 -10229 -30298 -47256 -77091 -85617 -56203 -60226 -24656
1822 -24656 -54125 -38485 -36953 -69053 -19646 -30973 -34669 -61667 -65316 -21922 -41325 -37966 -26240
1809b6240K676K0165l0451j4519L057j669l5176k4344J0102M3241o216n3452M414
1796a08412M0729L1784J1429n0315L9035K379J3505k0525o5398R831Q459k6737
1784a14236Q248L8190o3599J6542L9145K8778J4147k0638M9502k4379j7263l125
1772d8688O040j7226j1198j6988p884J1484M9749K1974n2784n0180M635J6717
1760i4349L3231K9097m642p160j6414k7374k2918P8727j3602k4053r408j7640
1748i6505n2425L4773Q962K2628L3910M3558l1725k0702o937k2285L0896J1982
1736d3870k6400j3356L9495r32k4101l7240Q2880P322j4039k3505k6436J8869
1724f1313L8947q208j8891L8224l4958j5633j1250j4819K5611J5470j3606m8633
$$ plain form
1809 -26240 -23564 -3399 -33850 -48369 -45312 -46981 -82157 -106501 -96399 -53158 -59374 -112826 -108412
1796 -108412 -67683 -35899 -24470 -74785 -35750 -33371 -19866 -40391 -105789 -95958 -87499 -114236
1784 -114236 -105988 -67798 -131397 -114855 -75710 -46932 -32785 -53423 -3921 -28300 -45563 -48688
1772 -48688 -42648 -59874 -71072 -88060 -95944 -84460 -34711 -12737 -65521 -115701 -111066 -94349
1760 -94349 -61118 -32021 -36663 -43823 -60237 -87611 -110529 -31802 -45404 -69457 -78865 -96505
1748 -96505 -148930 -114157 -105195 -82567 -48657 -5099 -36824 -57526 -64463 -86748 -55852 -43870
1736 -43870 -70270 -83626 -44131 -45063 -69164 -106404 -23524 -16202 -30241 -53746 -80182 -61313
1724 -61313 -22366 -30574 -49465 -11241 -46199 -61832 -73082 -87901 -62290 -46820 -60426 -109059
1712a09059K9056j2124J2365M2991Q554N9838q6955L0494l8504l8573K8266O5231
1700h420J2628m0346k6736O5498M2434p1711m3565j8574J289N9202m959j6115
1688d9375L8359n7113m2190N7193K8810M555m0164m3716J8635l8521N5938K0772
1676d6817j1704J6887j8316Q981K1970o1462m447R64J8872o152M5099j4456q187
1663e8768J4701j148M566k1038j9369J9345N5334j0753J6163K3450r2926K0444
1651d9999N6514m5911R394J6333L0755m2970o3099N0510M7643k6453j4533j3309
1639d5125p0739N6861M3117J98l7788n5J2666n485K0378O026j6950m1320j693
1626g9909J4796j715J7123O7256j6705J4018n926j8275P787L468J3093k8495L537
$$ plain form
1712 -109059 -80003 -92127 -79762 -36771 -28217 31621 -55334 -24840 -63344 -101917 -73651 -8420
1700 -8420 4208 -36138 -62874 2624 45058 -26653 -70218 -88792 -87503 -28301 -33260 -49375
1688 -49375 -11016 -68129 -110319 -53126 -24316 -19761 -59925 -103641 -85006 -123527 -67589 -46817
1676 -46817 -58521 -41634 -59950 -50969 -28999 -90461 -94908 -93944 -75072 -81224 -36125 -50581 -58768
1663 -58768 -44067 -45215 -40649 -61687 -81056 -61711 -6377 -17130 -967 22483 -70443 -49999
1651 -49999 6515 -39396 -30002 -13669 17086 -25884 -88983 -38473 9170 -17283 -31816 -45125
1639 -45125 -115864 -59003 -15886 -15688 -53476 -53531 -40865 -46350 -25972 -19946 -36896 -78216 -79909
1626 -79909 -65113 -66828 -49705 17551 846 14864 8938 -9337 -1550 1918 15011 -13484 -9947
1613i947m1552j7963L5592L9372m5253j1340N4839j0083K2157o2464J8088J4431
1601a4123J1514n4163J7342J2112l4719J2990j6434k0006J3170K8146K2578j0371
1589c1964m183j9088k7228L3314J429M5449K3138Q62J542l7080K6335M3565k8214
1576B7877o4702q7419Q130K0183P7999j1459N685J2102m4434K2980L4278j0256
1564i036k9693K1209l1660J0429j1709l387R4454j4945J018N024J5895l1871o2785
1551d7057L3014j5873k922K204r989k4231k7672N7912r327j1649J2635K818L7943
1538b194J6282m1143L9672L763m9182Q036k6452J0775K1838k869l3290K0749k50
1525c4265j8145P094L9582n1866M8111J1596n9086L6068L8763r521O726J8742
$$ plain form
1613 -9947 -51499 -69462 -33870 5502 -39751 -51091 3748 -6335 15822 -46642 -28554 -14123
1601 -14123 -2609 -56772 -39430 -27318 -62037 -49047 -65481 -85487 -72317 -44171 -21593 -31964
1589 -31964 -36147 -55235 -82463 -49149 -47720 -2271 20867 21729 23271 -13809 12526 56091 27877
1576 27877 -36825 -124244 -116114 -95931 -17932 -29391 -23706 -11604 -56038 -33058 1220 -9036
1564 -9036 -38729 -17520 -49180 -38751 -50460 -53847 40607 25662 26680 31704 47599 15728 -47057
1551 -47057 -14043 -29916 -32838 -30634 -40623 -64854 -92526 -34614 -43941 -55590 -42955 -40137 -2194
1538 -2194 14088 -27055 12617 16380 -32802 -24766 -51218 -40443 -18605 -21474 -54764 -34015 -34265
1525 -34265 -52410 -45316 -5734 -57600 -9489 2107 -56979 -20911 17852 8331 15057 33799
1513C3799k6218l506L395k0055o619Q101L9703l0470R518o8679l8184R6667K7581
1500B5033j0257P649p590K3831J1292q4132k8244j2386N2006K1765m6157o60K9979
1487a7871L3540k4369k0815k5215k1149L1966j4654p511l2671L7016N078N8360
1475A705n1698j9485N8559j8138o476M967K2323k1465m2443L0805K3462M1166
1463B3282k1442j15341L9767L1973j3955m573J9489L2257j426J4224K7808J179
1451C3242P26j8927K4546j5011k6791L5537J1818M4661l6364k6129L3682k1236
1439C9754R580m6064m2207l3374P930J8027m224J2476R405M0104j58l8993L660
1426b4084J1339J4736k6916j220J182J814O382r431m028J1998M0562J7484k3275
$$ plain form
1513 33799 7581 4075 7470 -12585 -19204 -11103 28600 -1870 7648 -61031 -99215 -2548 25033
1500 25033 14776 22425 14835 38666 49958 -34174 -62418 -74804 -22798 -1033 -47190 -47850 -17871
1487 -17871 15669 -8700 -29515 -54730 -75879 -43913 -58567 -66078 -98749 -61733 -56655 1705
1475 1705 -49993 -69478 -10919 -29057 -35533 -30566 -8243 -29708 -72151 -41346 -17884 23282
1463 23282 1840 -113501 -73734 -41761 -55716 -60289 -40800 -8543 -9969 4255 32063 33242
1451 33242 33968 15041 39587 24576 -2215 33322 45140 89801 53437 27308 60990 39754
1439 39754 49334 3270 -38937 -72311 -64381 -46354 -50578 -38102 -28697 11407 11249 -27744 -24084
1426 -24084 -12745 1991 -24925 -26145 -24963 -23149 -16767 -26198 -30226 -18228 22334 39818 16543
1413A6543k6205K914j2269L2744j5806j1198N1355J6387K0362l7458m2719K0032
1401A4682j5230K087l3747K2251O1343q4107l7709J08526k1995j9858j3852N0073
1389C2464K6056m1755J5397k7482k2463j0431J6057j2681k5091L9413M1340o663
1377B4161M437k4570k4302j9206J2853K0778K3249L7837l7164r067J7830m7449
1365b0613P920l284k148j0585k0201k193L3458l1248k4409O2075N5256m0627m0035
1352c6634L1164K985L657Q658l9500M4671q280j0861l73j488j8308K3500K8080
1339B7271l7749m922n835M7010n2955J0744l656j4449M841N8207J918J8229l6357
1326A2297m5413K2440M0577K6606m4609L3046k3081l7700K7381o49K1923j5552
$$ plain form
1413 16543 -9662 -6748 -19017 13727 -2079 -13277 38078 54465 74827 37369 -5350 14682
1401 14682 -548 1539 -32208 -9957 51386 -32721 -70430 38096 16101 -3757 -17609 32464
1389 32464 58520 16765 32162 4680 -17783 -28214 -12157 -24838 -49929 -10516 30824 24161
1377 24161 28598 4028 -20274 -39480 -26627 -5849 17400 55237 18073 9006 26836 -20613
1365 -20613 -12693 -15977 -18125 -28710 -48911 -51104 -17646 -48894 -73303 -11228 44028 3401 -36634
1352 -36634 -5470 -2485 1172 9830 -29670 15001 6721 -4140 -4513 -6001 -24309 -809 27271
1339 27271 -10478 -15400 -21235 25775 -27180 -16436 -20092 -34541 -29700 28507 30425 48654 12297
1326 12297 -33116 -10676 29901 56507 11898 44944 21863 -15837 11544 10895 32818 17266
1314A7266m956m7440J5041j4806l1444j2642O1845M1280l3494Q05K902M766K1848
1301B0971R345m3325K6160P198j6061r082M83l0332k2653J9381K2060N0658O7933
1288A02736p2942j0716M027l4277o841J3929k6082J771j9044n895J1480K4568
1276a7286R169O7614P679l9433N221l705n5963M4943O3820J0403J946k5746n2627
1263A6035K066r950k200K7557l3463Q842k8102k5984K1339J4506q566J3984L5006
1250C1070q533M011K6838k7026L5257L1847n0325m5835K0672R991J604k9471J4989
1237A5089k9690J699K6932K985l1843k6912J0861q292m1696K0259O2055k8678
1225b7231L0600K0972j2681j3544J4793K1709j9503l1690L910m357O2263j067
$$ plain form
1314 17266 12310 -35130 -20089 -34895 -66339 -78981 -17136 24144 -9350 -8545 -5643 -877 20971
1301 20971 30316 -13009 13151 20349 4288 -4794 -4311 -34643 -57296 -37915 -15855 34803 102736
1288 102736 29794 19078 23105 -11172 -18013 -4084 -30166 -28395 -47439 -53334 -41854 -17286
1276 -17286 -8117 59497 67176 27743 32964 29259 -26704 18239 82059 92462 94408 68662 16035
1263 16035 18101 8151 5951 33508 45 8887 -19215 -45199 -23860 -9354 -17920 -3936 31070
1250 31070 22537 26548 53386 26360 61617 93464 43139 -2696 17976 27967 29571 100 15089
1237 15089 -14601 -12902 14030 17015 -14828 -41740 -30879 -39171 -80867 -60608 1447 -27231
1225 -27231 3369 24341 11660 -1884 12909 34618 15115 -16575 -12665 -17022 45241 44174
1213D4174o5515L0005k3287P172k6722N3047j1338R749k7295J5917j0108k9993
1201c4194L3532l0270J4715M283j2141L3008L7185O895n8715N083J3874p633n174
1188D48R19K8679J489r571n6667M822k2892K1600K3440Q822k460l6746J5179L7024
1174A4086k2267m5839N2074o803q0909M6553N0294O968j2582J6206L1161l1466
1162A7476L9371N089l390k45k684J235j8334n0537K929N8636m0004l38l3555L2706
1148H355o9655O105K4844N5636m096J944o7315K5920M8400J996n986m5499K5052
1135E701m775k38l2831J7950k3148N3266J9997k6235j6256L0837L038j7537K2651
1122C2420R062M447J1895j0030k4720n918m2088j6358O036k0937j0704k7214K7611
$$ plain form
1213 44174 -21341 8664 -14623 -7451 -34173 18874 7536 17285 -10010 5907 -4201 -34194
1201 -34194 -662 -30932 -16217 -11934 -24075 8933 46118 53013 -5702 -619 13255 5622 448
1188 448 1367 30046 31535 21964 -34703 -29881 -52773 -31173 -7733 1089 -1371 -38117 -22938 14086
1174 14086 -8181 -54020 -1946 -8749 -89658 -43105 7189 14157 1575 17781 48942 17476
1162 17476 56847 61936 58546 58301 55617 56852 38518 -12019 -9090 49546 9542 9204 -24351 8355
1148 8355 -61300 -55195 -30351 25285 21189 23133 -44182 -18262 30138 32134 26148 -19351 5701
1135 5701 926 688 -32143 -14193 -37341 15925 35922 9687 -6569 24268 27306 9769 32420
1122 32420 41482 45929 57824 47794 23074 17156 -24932 -41290 -35254 -56191 -66895 -94109 -66498
1109f6498J8824J2429j4002O0099J1289Q012J6950M2447K1225j9118K9733q560
1097A12830q1171j2248J4748K8647q766o2808K4858N605k512J992Q079K0651k6413
1084B3492k7692K9741K2184L657j8290L345L6332J2116m2497K5939J4552N89n1165
1071C2303m1618L2829m6254j5872L9056K2547m9234m0747R575M5315J8031J5841
1059B1772q831K559l3218L2604J2834l4595R612J1398J4324j3753L3301L226k5505
1046B5728l6063j2009K2315K9213n247k4506K7734p864n576n7645M013K6212k5843
1033c9538L9077L851J7906l4148p91n0295O7953K9194j4324j4705K062r266L8339
1020C5315m2018K9321J5593Q149N6253k2416j9748l0962m167L0948K2049j795
$$ plain form
1109 -66498 -47674 -35245 -49247 10852 22141 30153 47103 89550 110775 91657 121390 112830
1097 112830 31659 19411 34159 62806 54040 -8768 16090 21695 19183 21175 29254 49905 23492
1084 23492 -4200 25541 47725 51382 33092 36437 72769 84885 42388 68327 82879 83468 32303
1071 32303 -9315 23514 -22740 -38612 444 22991 -26243 -66990 -57415 -12100 5931 21772
1059 21772 12941 15500 -17718 14886 27720 -6875 2737 14135 28459 14706 48007 51233 25728
1046 25728 -10335 -22344 -29 29184 23937 -569 27165 19301 13725 -43920 -39907 -13695 -39538
1033 -39538 -461 3390 21296 -12852 -13643 -63938 4015 33209 18885 4180 6242 -3024 35315
1020 35315 -6703 22618 38211 46360 102613 80197 60449 29487 25320 56268 78317 76522
1008G6522m348M569l0698n4836L5950J2127k2535K1410k8985n6016N1975k793
996B342K5527L5352l2983o8746N7483N3833k8783j1702n093Q532l5711o555N2063
983D5559p3962r473J4470L3430k0027J5759Q156j6871J4332m5552k2117N0358
971e938j1371J4030K9175k3784L4702j8006K5249l433L6147L5247p3275n8756
959b0013o134J5877j4734K5586K1709N461j4369J4357n0945k7581M5794j641k3068
946b9701N0769l2114l548M691N4603K4598p1250j4201k8092l3351J111K899P3866
933B80O381j5236J1511j9080J0840J8634r632k3054q555M3691L571j3013n354
920I84K3927K7634j5745n047J431j5949j5730M8818m7443n601P79R771M4431J8086
$$ plain form
1008 76522 72174 76743 46045 -8791 27159 39286 16751 38161 9176 -46840 5135 2342
996 2342 27869 63221 30238 -38508 18975 72808 44025 32323 27230 35762 51 -6504 45559
983 45559 -28403 -37876 -23406 10024 -10003 5756 13912 -2959 11373 -34179 -56296 -5938
971 -5938 -17309 -3279 25896 2112 36814 18808 44057 40624 76771 112018 38743 -20013
959 -20013 -26147 -10270 -25004 582 22291 27752 13383 27740 -23205 -50786 -4992 -6633 -29701
946 -29701 21068 -11046 -14594 -9903 44700 69298 -1952 -16153 -44245 -77596 -76485 -73586 280
933 280 6661 -8575 2936 -16144 -5304 13330 3698 -19356 -27911 15780 19351 6338 984
920 984 24911 52545 36800 31753 33184 17235 1505 50323 2880 -2721 -1942 7829 52260 70346
906G0346l0560k4825n7478O8311K6194K0610o206k9989l6599L8219m1268k6017
894b9262J6522L8926J8649l4541l1899L0914J4346r421L2701N349k2349L1995
882F1930r369K6663l9333k7223J382j1169N6476j452K4640o6452o576k5009j5336
869c0828N9286q367M2811K0272k9947m1563K842N0751l7008r745M2224m567j2528
856D3633J5306n762l3571l7091K7747l177n732R223J3159j7207j1135J7370J4456
843B7219O958j0397l2738O632K9556r884K0874k7827k7510P218q66k7215K0267
830a7713L5687j4477K2278L802L8560m8912l2598j2291J5169K862K7543l1339
818a1429J340L8822l562l1740L491R0982m666r5121n7707K0257J8409L0118N6494
$$ plain form
906 70346 39786 14961 -42517 25794 51988 72598 66392 36403 -196 38023 -3245 -29262
894 -29262 -12740 26186 44835 10294 -21605 9309 23655 14234 46935 52284 29935 61930
882 61930 52561 79224 39891 12668 14050 2881 59357 57905 82545 16093 9517 -15492 -30828
869 -30828 28458 20091 62902 83174 53227 11664 14506 65257 28249 18504 60728 56161 43633
856 43633 58939 53177 19606 -17485 10262 7085 1353 10576 23735 6528 -4607 12763 27219
843 27219 34177 23780 -8958 -2326 27230 17346 38220 10393 -17117 -9899 -10765 -37980 -17713
830 -17713 17974 3497 25775 29577 68137 19225 -13373 -25664 -10495 -7633 19910 -11429
818 -11429 -10089 28733 25171 -6569 -3078 87904 83238 -11883 -69590 -49333 -30924 -806 55688
805E5688K0864M869m3201p7210J8911J1406L4100o0593k7476J10224r518l0892
793G172m532K4811K2639N794P686n6983p465K8379J4504K1906j5568Q035J5952
780G2330p054j8941j0651n7217r286L3915K458n590K3064l2133N1398J8640k5226
767C5707j7397j2748k3025k0819J8161M0059k2820L9427j8135k2439N7145M5593
$$ plain form
805 55688 76552 81421 38220 -38990 -20079 -8673 25427 -35166 -62642 47582 38064 7172
793 7172 2640 27451 50090 55884 63570 6587 -878 27501 42005 63911 48343 56378 72330
780 72330 65276 46335 35684 -21533 -30819 3096 5554 -36 23028 -9105 42293 60933 35707
767 35707 18310 5562 -17463 -38282 -20121 19938 -2882 36545 18410 -4029 53116 98709
$$ [...]
##END NTUPLES=NMR SPECTRUM
##END=
