##TITLE=1H_CA-8963-1
 CDCl3
 8 sc, 
 11.1.2022
##JCAMPDX= 6.0         $$ Bruker NMR JCAMP-DX V2.0
##DATA TYPE= NMR SPECTRUM
##DATA CLASS= NTUPLES
##ORIGIN= UXNMR, Bruker Analytische Messtechnik GmbH
##OWNER= root
$$ XWIN-NMR		Version 3.5
$$ Tue Jan 11 11:13:01 2022 Russian Standard Time (UT+4h)  she@DPX200
##.OBSERVE FREQUENCY= 200.131346
##.OBSERVE NUCLEUS= ^1H
##.ACQUISITION MODE= SIMULTANEOUS
##.ACQUISITION SCHEME= undefined
##.AVERAGES= 8
##.DIGITISER RES= 18
##SPECTROMETER/DATA SYSTEM= spect
##.PULSE SEQUENCE= zg30
##.SOLVENT NAME= CDCl3
##.SHIFT REFERENCE= (INTERNAL, CDCl3, 0, 15.7458)
##AUDIT TRAIL= $$ (NUMBER, WHEN, WHO, WHERE, WHAT)
$$ ##TITLE= Audit trail, XWIN-NMR		Version 3.5
$$ ##JCAMPDX= 5.01
$$ ##ORIGIN= Bruker BioSpin GmbH
$$ ##OWNER= she
$$ F:/spectra/data/she/nmr/H-F/1/pdata/1/auditp.txt
$$ ##AUDIT TRAIL=  $$ (NUMBER, WHEN, WHO, WHERE, WHAT)
(   1,<2022-01-11 11:11:39.20 +0400>,<she>,<DPX200>,
      <created by zg, POWCHK disabled, PULCHK disabled
       configuration hash MD5:
       00 E9 B6 7A A2 85 ED C7 34 08 36 98 17 FE 4E 26
       data hash MD5: 16K
       36 98 85 F7 97 62 FD A9 26 60 4C CD 91 02 C4 DA>)
(   2,<2022-01-11 11:11:41.46 +0400>,<she>,<DPX200>,
      <Start of raw data processing
       efp BC_mod = 2 LB = 0.24 FT_mod = 6 PKNL = 1 PHC0 = -15873.29 PHC1 = 15.80079 SI = 16K 
       data hash MD5: 16K
       63 9D 25 BB 51 DB 46 58 48 45 2B D1 52 5E EA 66>)
(   3,<2022-01-11 11:12:06.43 +0400>,<she>,<DPX200>,
      <pk PHC0 = 7.864452 PHC1 = -8 
       data hash MD5: 16K
       F7 8A 33 ED B2 F0 56 71 DA F1 67 9A 3E D4 F3 99>)
(   4,<2022-01-11 11:12:09.37 +0400>,<she>,<DPX200>,
      <abs ABSG = 5 
       data hash MD5: 16K
       2A 8A 4F 9F A2 C1 43 2E 06 22 AA B7 D3 89 94 18>)
$$ ##END=
$$ 
$$ hash MD5
$$ C2 B1 36 AF F9 53 A3 E0 10 57 03 DB 45 62 2C 99
##$RELAX= 
##$RELAX= 
##$RELAX= 
##$RELAX= 
##$RELAX= 
##$RELAX= 
$$ Bruker specific parameters
$$ --------------------------
##$DU= <F:/spectra>
##$EXPNO= 1
##$NAME= <H-F>
##$PROCNO= 1
##$TYPE= <nmr>
##$USER= <she>
##$AMP= (0..31)
100 100 100 100 100 100 100 100 100 100 100 100 100 100 100 100 100 100 
100 100 100 100 100 100 100 100 100 100 100 100 100 100 
##$AQSEQ= 0
##$AQ_mod= 1
##$AUNM= <au_zg>
##$AUTOPOS= <>
##$BF1= 200.13
##$BF2= 200.13
##$BF3= 200.13
##$BF4= 200.13
##$BF5= 200.13
##$BF6= 200.13
##$BF7= 200.13
##$BF8= 200.13
##$BYTORDA= 1
##$CFDGTYP= 0
##$CFRGTYP= 5
##$CHEMSTR= <none>
##$CNST= (0..31)
1 1 145 1 1 1 1 1 1 1 1 1 1 1 1 1 1 1 1 1 1 1 1 1 1 1 1 1 1 1 1 1 
##$CPDPRG= <>
##$CPDPRG1= <>
##$CPDPRG2= <>
##$CPDPRG3= <>
##$CPDPRG4= <mlev>
##$CPDPRG5= <mlev>
##$CPDPRG6= <mlev>
##$CPDPRG7= <mlev>
##$CPDPRG8= <mlev>
##$CPDPRGB= <>
##$CPDPRGT= <>
##$D= (0..31)
0 1.2 0 0 0 0 0 0 0 0.06 0 0.03 0 0 0 0 0.0002 0 0 0 0 0 0 0 0 0 0 0 0 
0 0 0 
##$DATE= 1641885098
##$DBL= (0..7)
120 120 120 120 120 120 120 120 
##$DBP= (0..7)
150 150 150 150 150 150 150 150 
##$DBP07= 0
##$DBPNAM0= <>
##$DBPNAM1= <>
##$DBPNAM2= <>
##$DBPNAM3= <>
##$DBPNAM4= <>
$$ [...]
##$SUBNAM2= <"">
##$SUBNAM3= <"">
##$SUBNAM4= <"">
##$SUBNAM5= <"">
##$SUBNAM6= <"">
##$SUBNAM7= <"">
##$SUBNAM8= <"">
##$SUBNAM9= <"">
##$SW= 18.0517287032376
##$SWIBOX= (0..15)
0 0 2 0 0 0 0 0 0 0 0 0 0 0 0 0 
##$SW_h= 3612.71676300578
##$TD= 16384
##$TD0= 1
##$TE= 0
##$TE2= 300
##$TE3= 300
##$TEG= 300
##$TL= (0..7)
0 120 120 120 120 120 120 120 
##$TP= (0..7)
150 150 150 150 150 150 150 150 
##$TP07= 0
##$TPNAME0= <>
##$TPNAME1= <>
##$TPNAME2= <>
##$TPNAME3= <>
##$TPNAME4= <>
##$TPNAME5= <>
##$TPNAME6= <>
##$TPNAME7= <>
##$TPOAL= (0..7)
0.5 0.5 0.5 0.5 0.5 0.5 0.5 0.5 
##$TPOFFS= (0..7)
0 0 0 0 0 0 0 0 
##$TUNHIN= 0
##$TUNHOUT= 0
##$TUNXOUT= 0
##$USERA1= <user>
##$USERA2= <user>
##$USERA3= <user>
##$USERA4= <user>
##$USERA5= <user>
##$V9= 5
##$VALIST= <valist>
##$VCLIST= <CCCCCCCCCCCCCCC>
##$VD= 0
##$VDLIST= <DDDDDDDDDDDDDDD>
##$VPLIST= <PPPPPPPPPPPPPPP>
##$VTLIST= <TTTTTTTTTTTTTTT>
##$WBST= 1024
##$WBSW= 4
##$XGAIN= (0..3)
0 0 0 0 
##$XL= 0
##$YL= 0
##$YMAX_a= 799582
##$YMIN_a= -1035862
##$ZGOPTNS= <>
##$ZL1= 120
##$ZL2= 120
##$ZL3= 120
##$ZL4= 120
##$ABSF1= 15.72705
##$ABSF2= -2.3248
##$ABSG= 5
##$ABSL= 3
##$ALPHA= 0
##$AQORDER= 0
##$ASSFAC= 0
##$ASSFACI= 0
##$ASSFACX= 0
##$ASSWID= 0
##$AUNMP= <proc_1d>
##$AZFE= 0.1
##$AZFW= 0.1
##$BCFW= 0
##$BC_mod= 2
##$BYTORDP= 0
##$COROFFS= 0
##$CY= -3
##$DATMOD= 1
##$DC= 0
##$DFILT= <>
##$DTYPP= 0
##$F1P= 0
##$F2P= 0
##$FCOR= 1
##$FTSIZE= 16384
##$FT_mod= 6
##$GAMMA= 0
##$GB= 0
##$INTBC= 1
##$INTSCL= 0
##$ISEN= 128
##$LB= 0.24
##$LEV0= 0
##$LPBIN= 0
##$MAXI= 10000
##$MC2= 0
##$MEAN= 0
##$ME_mod= 0
##$MI= 1.114404
##$NCOEF= 0
##$NC_proc= -4
##$NLEV= 6
##$NOISF1= 3.799351
##$NOISF2= 2.8
##$NSP= 0
##$NTH_PI= 0
##$NZP= 0
##$OFFSET= 15.74579
##$PC= 1
##$PHC0= -15865.43
##$PHC1= 7.80079
##$PH_mod= 1
##$PKNL= yes
##$PPARMOD= 0
##$PSCAL= 0
##$PSIGN= 0
##$REVERSE= no
##$SF= 200.130001153211
##$SI= 16384
##$SIGF1= 3
##$SIGF2= 2
##$SINO= 5.538805
##$SIOLD= 16384
##$SREGLST= <1H.CDCl3>
##$SSB= 0
##$STSI= 16384
##$STSR= 0
##$SW_p= 3612.71676300578
##$SYMM= 0
##$S_DEV= 0
##$TDeff= 16384
##$TDoff= 0
##$TI= <>
##$TILT= no
##$TM1= 0
##$TM2= 0
##$TOPLEV= 0
##$USERP1= <user>
##$USERP2= <user>
##$USERP3= <user>
##$USERP4= <user>
##$USERP5= <user>
##$WDW= 1
##$XDIM= 16384
##$YMAX_p= 275242154
##$YMIN_p= -167671
$$ End of Bruker specific parameters
$$ ---------------------------------
##NTUPLES= NMR SPECTRUM
##VAR_NAME=  FREQUENCY,     SPECTRUM/REAL,   SPECTRUM/IMAG
##SYMBOL=    X,             R,               I
##VAR_TYPE=  INDEPENDENT,   DEPENDENT,       DEPENDENT
##VAR_FORM=  AFFN,          ASDF,            ASDF
##VAR_DIM=   16384,         16384,           16384
##UNITS=     HZ,            ARBITRARY UNITS, ARBITRARY UNITS
##FACTOR=    0.220516191357247, 1,           1
##FIRST=     3151.20487637546, 0,            0
##LAST=      -461.511886630323, 0,           0
##MIN=       -461.511886630323, -167671,     0
##MAX=       3151.20487637546, 275242154,    0
$$ Real data points
##PAGE= N=1
##DATA TABLE= (X++(R..R)), XYDATA
$$ [...]
9355 720789 737424 725018 745912 764205 776722 759226 750449 755538 771449 750328 738667 709883
9343 709883 702796 698113 687568 685103 683348 681039 712734 726544 734427 723653 718665 733946 739057
9330 739057 732550 747588 763233 785866 798958 794966 808029 813980 842679 817396 806711 833169
9318 833169 866672 874322 857089 894252 909868 922115 956067 962463 983670 1000297 1046880 1050444
9306 1050444 1070251 1071813 1121959 1139226 1161144 1190906 1210617 1273689 1320958 1327120 1350217 1403408
9294 1403408 1436448 1441137 1458528 1490997 1535398 1553597 1568623 1596778 1623848 1673803 1742172 1772570
9282 1772570 1809364 1852634 1897425 1944184 2028301 2094544 2143236 2198327 2280287 2368791 2433997
9271 2433997 2503682 2571745 2649591 2722628 2788755 2884699 2999584 3090189 3218934 3316037 3374658
9260 3374658 3433984 3532909 3671475 3828434 3977710 4118449 4197715 4243057 4348448 4450679
9250 4450679 4574325 4651153 4758484 4829697 4897926 4998483 5082178 5133228 5123490 5106419 5093902
9239 5093902 5090737 5122834 5174959 5250185 5352342 5471224 5567996 5667089 5824362 5967868 6140260
9228 6140260 6346764 6577168 6860284 7153624 7483833 7884345 8327971 8809060 9329882 9978361
9218 9978361 10655347 11433892 12321253 13279735 14269860 15259248 16357454 17711834 19300204
9209 19300204 20794245 21602428 21590585 21584865 22131569 22970519 23638614 23261236 21919243 20213133
9199 20213133 18259051 16591782 15418876 14627582 14185190 13876181 13536617 13028476 12536057
9190 12536057 12172319 11953734 11817155 11772948 11871124 12073066 12408980 12828989 13283939 13782598
9180 13782598 14428535 15263380 16257405 17271005 18225943 19221607 20273034 21155350 21728898
9171 21728898 22545280 23782822 25075550 25619755 25193146 24619076 24075935 23269661 21924143
9162 21924143 19560675 16932712 14899888 13386412 12302215 11487103 10885413 10462131 10137627
9153 10137627 9839809 9560306 9209650 8892918 8635036 8328298 8002737 7711629 7452951
9144 7452951 7142898 6810633 6447265 6087764 5794901 5531267 5350811 5201275 5059144 4937387
9134 4937387 4836565 4718456 4649758 4547260 4462039 4374588 4293555 4244738 4217027 4165565 4112040
9123 4112040 4056830 3998351 3936734 3905921 3899494 3876362 3863514 3864318 3871283 3856514 3877596 3926839
9111 3926839 3920732 3931894 3958374 3998328 4042134 4094461 4122825 4156967 4203188 4220885 4239019 4253860
9099 4253860 4302234 4361379 4388698 4420685 4439512 4491013 4557049 4561703 4597102 4606380 4609336 4628979
9087 4628979 4652328 4663059 4708909 4754259 4802242 4884556 4960757 5013850 5095802 5179669 5260690
9076 5260690 5346796 5467337 5594456 5727422 5846944 5976628 6108460 6246083 6404623 6530248
9066 6530248 6698495 6838553 6976721 7147662 7343992 7529193 7704595 7892412 8094309 8307629
9056 8307629 8523007 8780568 9087012 9361690 9677346 9992324 10318703 10690989 11101972 11564262
9046 11564262 12033690 12563971 13119932 13724695 14389626 15121642 15938884 16823937 17837714
9037 17837714 19012389 20388968 21959230 23742394 25764116 28199219 31011747 34199728
9029 34199728 37417338 40593334 44027345 48010351 52166576 55455463 56852150 57072617
9021 57072617 58158929 60640406 63895080 66391526 65797953 61738022 56051882 50275984
9013 50275984 45743262 42588281 40482497 39115983 38167586 37152799 35767727 34238673
9005 34238673 33041078 32315260 32086422 32154656 32538479 33267915 34388753 36005581 38135502
8996 38135502 40807941 44049353 47735635 51615005 55191945 58506369 61498795 64001837
8988 64001837 66266984 69227215 73466732 78034056 80590440 80202665 79179346 77838064
8980 77838064 75028350 70307976 62964353 54317812 46970844 41357144 37101183 33785503
8972 33785503 31243449 29307418 27873079 26741889 25714065 24532883 23147507 21772769
8964 21772769 20578851 19597687 18753031 17970262 17297977 16705349 16131779 15579604 15019468
8955 15019468 14497660 14030787 13600441 13188011 12819420 12468328 12168044 11903354 11647839
8946 11647839 11433655 11238395 11025798 10873719 10693152 10472353 10264873 10100292 9938593
8937 9938593 9790194 9689346 9595968 9567050 9529859 9528808 9555077 9561529 9586061 9588468 9591406 9635236
8925 9635236 9638391 9621447 9550822 9446845 9331697 9162093 8981480 8732010 8477329 8261621
8915 8261621 8046695 7828670 7682443 7541238 7410176 7289328 7150077 7002852 6891967 6728830
8905 6728830 6527756 6346413 6146302 5966894 5798646 5636110 5522835 5403290 5282534 5190728
8895 5190728 5097109 4995077 4919502 4841774 4746176 4688053 4655124 4633374 4583512 4541571 4483664
8884 4483664 4472915 4447248 4430862 4396723 4365611 4360305 4354980 4352935 4349443 4362754 4367381 4362204 4412040
8871 4412040 4435719 4482789 4531312 4554131 4626777 4665167 4724300 4783370 4842060 4897604 4926669
8860 4926669 4946774 4954790 5001931 5025617 5066699 5142772 5176883 5251526 5347315 5424946 5459663 5544329
8848 5544329 5608316 5714330 5813080 5922460 6047391 6139676 6250417 6385695 6500165 6657777
8838 6657777 6802068 6958717 7111230 7273322 7504264 7707104 7926662 8166231 8413033 8623753
8828 8623753 8854596 9090396 9326751 9555370 9786583 10116286 10497459 10869805 11289330 11776948
8818 11776948 12336928 12997015 13703870 14420609 15093633 15810751 16642134 17658548 18818967
8809 18818967 20015248 21016244 21646852 22104735 22200814 21759021 21037523 20365496 19909177
8800 19909177 19739332 19809774 20025191 20298150 20413433 20403466 20432765 20620814 20957410 21420484
8790 21420484 22014128 22787566 23662745 24721140 26001800 27518382 29251563 31169730 33245436
8781 33245436 35497027 38126301 41145619 44380527 47655282 51177501 55196436 59389273
8773 59389273 62830486 64916131 65706357 66226022 65965356 63983677 60194185 55943166 52543597
8764 52543597 49685446 47145835 45287787 44168249 43251368 42039467 40504118 39194860
8756 39194860 38391599 38143462 38310386 38867175 39782814 41113598 42800517 44910600 47308225
8747 47308225 49830602 52349856 55224660 58842701 63304893 68272755 73477759 79096793
8739 79096793 85073833 90343589 94189743 96334632 95530985 91114312 84220622 77323072
8731 77323072 71729709 67773666 64776519 61496985 57050668 52364418 48554343 45630241
8723 45630241 43165411 40948149 39210156 37934841 37114867 36656428 36478391 36659051 37183308
8714 37183308 37767280 38014364 38336292 39212000 40536217 42259454 44252147 46131903 47433870
8705 47433870 48385185 49776627 51860354 54333636 56394905 57353101 56671704 53880899 49884229
8696 49884229 44965669 39879979 35712478 32523382 30096152 28227235 26795061 25679297
8688 25679297 24645679 23525442 22386425 21412172 20608779 19968909 19392758 18926571 18547034
8679 18547034 18137787 17713446 17287259 16881432 16536375 16196762 15878987 15587437 15348668
8670 15348668 15179431 15032882 14898121 14780937 14607121 14392932 14164902 13938631 13746052
8661 13746052 13631436 13534500 13488440 13481386 13508827 13588549 13652428 13744684 13868954 14023332 14194423
8650 14194423 14410202 14667354 15017369 15355197 15765962 16197495 16723405 17358116 18092301
8641 18092301 18990886 20069303 21345838 22885919 24613342 26606377 28873056 31079347
8633 31079347 32623924 33580675 34731586 36443477 38384134 39751821 39244349 37280979
8625 37280979 35683251 34907867 34626218 34189491 32940111 31313166 30078467 29140426 28386001
8616 28386001 27987105 28020087 28292000 28466902 28158836 27702774 27674888 28095345 28816633 29625371
8606 29625371 30399782 31276909 32033390 32413886 32961407 34207508 36111534 38683116 41725768
8597 41725768 44875294 47206518 48020314 47230079 44614775 40938804 37566583 35072218
8589 35072218 33420016 32313556 31435914 30842108 30491029 30207505 29728415 29219031 28743410
8580 28743410 28130163 27250554 25970934 24495761 23042745 21888634 21184052 20830288 20751732
8571 20751732 20858137 20977448 21116407 21386526 21651439 21710351 21677596 21886255 22352292 22780757
8561 22780757 22634240 21675044 20477751 19515387 18788182 18125430 17283455 16290869 15460016
8552 15460016 14825378 14247046 13617992 13128117 12847295 12664792 12372970 11788110 11122028
8543 11122028 10577242 10148252 9771599 9382774 8873430 8373649 8011835 7727794 7473113
8534 7473113 7257819 7107797 6943337 6812930 6723452 6593565 6442781 6317328 6142964 5922424
8524 5922424 5703758 5487022 5334082 5199398 5022115 4864599 4712068 4503142 4297559 4116654
8514 4116654 3961032 3788847 3677504 3574562 3465094 3364689 3286958 3202116 3122890 3088640
8504 3088640 3017664 2936195 2863656 2779708 2711857 2669430 2623509 2577640 2482857 2414715 2360496
8493 2360496 2271323 2220599 2183668 2153199 2094847 2062691 2044467 2003301 1938164 1875348 1857318
8482 1857318 1820099 1768826 1734007 1718884 1702049 1676718 1653109 1634981 1591824 1522557 1487826
8471 1487826 1456603 1421279 1432819 1403072 1359881 1350486 1320603 1299167 1279332 1298200 1261633 1237148
8459 1237148 1224472 1198683 1189945 1179331 1183665 1186370 1160451 1141599 1127514 1125314 1130219 1109648
8447 1109648 1088335 1070608 1083446 1080074 1058096 1018256 1005587 1006676 1006920 1008046 997600 981425
8435 981425 954274 916548 914084 908847 917952 880551 872761 858618 855005 845070 821670 838865 836218
8422 836218 847309 871375 856231 817885 791855 804675 812445 801239 811682 832103 832060 855554
8410 855554 871153 856520 847091 841921 837016 844340 854345 843606 864360 862866 840788 826798 809596
8397 809596 749335 713963 705899 701083 690366 680686 686833 653126 627480 618963 613336 609872 599612
8384 599612 594296 618313 606709 611547 613161 624957 613050 604474 624760 664554 663967 669565 693513
8371 693513 693427 720200 742881 746674 712808 703552 684113 660337 632115 611140 595338 597050 582910
8358 582910 556455 543629 529975 532982 483604 414709 407723 415017 400375 405582 398404 383492 403996
8345 403996 386097 375505 360225 382419 380972 389704 368195 399776 391813 371676 373629 346676
8333 346676 352577 353912 369197 375079 364724 350792 334376 326759 334371 318516 307077 272911 229993
8320 229993 234701 222199 223764 210845 219718 228839 228420 216066 199456 210239 192664 185921 174498
8307 174498 182051 182308 178180 190268 179405 161868 162896 146466 137942 126581 121409 113446 119910
8294 119910 129025 147238 121704 131988 138919 127607 133827 133939 142751 147132 147108 147166 160331 140258
8280 140258 134431 153888 164309 154501 177740 172559 157101 167005 168112 192271 191625 188403 192179
8267 192179 188355 195661 197728 215279 187332 188970 197947 185227 165722 139633 139863 150752 153064
8254 153064 118537 124951 128436 126495 129460 131706 155220 180808 169217 177419 189086 185013 174662
8241 174662 157491 182401 220822 233977 212240 229168 243519 215965 236801 243362 237287 229779
8229 229779 211837 217883 215850 217783 204473 176861 159590 156121 163526 147349 138891 157403 161352
8216 161352 169785 151312 137452 119114 116792 122452 114087 119966 92981 117806 150726 151037 137113
8203 137113 140362 131845 144349 127808 144320 122805 144327 116247 165211 182096 278596 130624
8191 130624 -122830 -37707 -38137 3329 -30834 -10159 -10710 -21233 -22638 1596 36632 45044 23935
8178 23935 10960 3438 489 2037 -5077 -6823 20318 11770 -36156 -52779 -45730 -41846 -34667 -33936
8164 -33936 -27602 -49579 -48097 -54604 -55699 -57014 -53141 -36078 -37864 -39206 -54865 -74712 -70702 -64530
8150 -64530 -63030 -70064 -62230 -24998 -44619 -63536 -45303 -49507 -61512 -47262 -55394 -43650 -63381
8137 -63381 -71354 -85110 -65194 -85361 -69784 -79084 -76688 -61018 -75836 -76883 -71689 -73555 -90028
8124 -90028 -79011 -89876 -61846 -41821 -30522 -22813 -32622 -31118 -17093 -7813 11703 -6289 13306
8111 13306 28102 26964 37051 26387 8315 7514 18881 -9597 -42471 -56189 -50289 -35975 -34931
8098 -34931 -58376 -82175 -76553 -69599 -45160 -46288 -49284 -65553 -67969 -52834 -60766 -66052 -43594
8085 -43594 -46341 -27124 -5725 -9499 -3400 4247 15882 -4411 7186 18795 16728 45512 21139
8072 21139 14122 21744 -12248 -25725 -52503 -59717 -67034 -83986 -78974 -79197 -107271 -73219 -78284
8059 -78284 -83071 -92861 -83812 -68094 -68078 -82318 -94489 -121739 -104180 -83406 -97300 -102335 -100690
8046 -100690 -100744 -113579 -92110 -90777 -80932 -110573 -122353 -124028 -138431 -140839 -143793 -158639 -131497
8033 -131497 -142044 -148831 -116475 -129792 -129877 -120641 -104977 -90385 -115283 -131715 -117965 -88696 -92436
8020 -92436 -118294 -113440 -121854 -122015 -110002 -136830 -130681 -141203 -122400 -117691 -128459 -125991 -132201
8007 -132201 -131029 -115808 -107655 -130983 -138795 -113246 -129641 -153174 -117585 -110003 -133346 -156536
7995 -156536 -108674 -105716 -97676 -93142 -110560 -106038 -116510 -116694 -115648 -113484 -111367 -101537 -106019 -93603
7981 -93603 -106109 -123102 -135007 -142144 -134942 -130492 -120268 -124224 -141293 -151163 -126450 -128015 -130866
7968 -130866 -127802 -149805 -167671 -160302 -159231 -156329 -136746 -141940 -124354 -133293 -110330 -135329 -148367
7955 -148367 -122294 -119816 -117018 -129177 -119544 -109458 -122236 -138487 -118058 -119165 -137614 -130706 -142539
7942 -142539 -143872 -121964 -128555 -120773 -115248 -126113 -134286 -109141 -114921 -109393 -116021 -124597 -134737
7929 -134737 -134836 -135897 -138180 -159785 -142575 -121722 -111324 -103228 -110596 -116064 -109066 -119980 -134174
7916 -134174 -133885 -140206 -114653 -114030 -104143 -131214 -136957 -138973 -139064 -128193 -114380 -90518 -101920 -119761
7902 -119761 -127380 -101073 -96361 -120927 -123551 -104751 -114787 -108206 -93737 -111807 -116632 -113980 -125366
7889 -125366 -140865 -125202 -128051 -142990 -126157 -122159 -107754 -103645 -110026 -109127 -103462 -91916 -91166
7876 -91166 -114042 -112915 -122613 -137051 -134148 -120498 -120795 -115507 -128492 -133993 -160030 -147072 -142858
7863 -142858 -147460 -135289 -118130 -124487 -102630 -100723 -91791 -115921 -131054 -116197 -142845 -136975 -139176
7850 -139176 -128438 -142954 -135759 -131474 -145395 -133413 -126846 -127226 -109875 -125664 -116371 -137362 -114469
7837 -114469 -108654 -122117 -108148 -97146 -123474 -127161 -128979 -116704 -122453 -126131 -134755 -133271 -138100
7824 -138100 -98610 -101123 -110046 -113738 -126176 -129163 -97034 -90196 -123172 -119227 -100384 -103124 -92230
7811 -92230 -90703 -93906 -113842 -106296 -108429 -97258 -95739 -108525 -123490 -124210 -112495 -74737 -71495
7798 -71495 -107577 -112215 -113500 -111812 -121846 -119986 -112692 -114275 -126923 -124818 -109299 -107120 -110878 -90026
7784 -90026 -92762 -107518 -112577 -77852 -81839 -79365 -89122 -94787 -106782 -69213 -63237 -93504 -103823
7771 -103823 -100495 -110344 -120084 -109818 -105797 -103877 -101149 -116750 -116711 -98416 -79641 -84014 -70316 -71119
7757 -71119 -91725 -93505 -81446 -76483 -62630 -80723 -83072 -65933 -88995 -112741 -85203 -84286 -108154
7744 -108154 -90865 -70890 -79864 -83761 -77361 -75610 -102286 -124184 -102001 -95844 -90430 -85383 -81858
7731 -81858 -62668 -86875 -82715 -58644 -65245 -85330 -72405 -53385 -58200 -66154 -76707 -82540 -88310
7718 -88310 -93690 -79635 -68856 -81001 -85909 -86130 -71212 -77188 -109223 -100085 -75325 -71386 -76429
7705 -76429 -90400 -72374 -65407 -91669 -93186 -109529 -98068 -96114 -108578 -99901 -88625 -62418 -52381
7692 -52381 -78346 -80510 -85529 -81786 -72744 -103558 -115729 -92644 -74766 -64744 -79154 -72401 -74404
7679 -74404 -72920 -81537 -82102 -59161 -70173 -83611 -82879 -67536 -63071 -62081 -55091 -61503 -95928 -93214
7665 -93214 -81569 -49849 -44104 -53955 -53923 -52513 -35249 -29668 -59171 -74276 -70206 -73437 -78769 -89972
7651 -89972 -74061 -78609 -89733 -86651 -57701 -38044 -54452 -62077 -67384 -64799 -65755 -62263 -58215 -38505
7637 -38505 -53380 -61876 -46241 -52143 -41007 -54398 -92981 -72516 -65806 -61453 -55959 -52280 -58022
7624 -58022 -53674 -36657 -22543 -72216 -67584 -63165 -52249 -49524 -52639 -56688 -56129 -74003 -79735 -66120
7610 -66120 -66812 -60080 -58256 -49302 -53314 -67490 -62870 -60738 -68957 -60313 -54158 -54780 -58297 -40571 -41763
7595 -41763 -58421 -68736 -59553 -55485 -60280 -44203 -46991 -74641 -96351 -82053 -52562 -61007 -72331
7582 -72331 -73897 -59441 -50263 -48129 -33582 -76555 -81147 -71507 -80342 -60599 -53016 -54160 -70242
7569 -70242 -98844 -45729 -56582 -56689 -58112 -51509 -26265 4900 -38700 -86297 -41505 -57936 -79629
7556 -79629 -70721 -33582 -68075 -78085 -64472 -76468 -73790 -26801 -24175 -50719 -56305 -60402 -44194
7543 -44194 -45984 -72950 -54268 -55489 -67400 -41532 -39251 -84457 -82047 -79308 -63290 -64488 -44831
7530 -44831 -52067 -51401 -45244 -52643 -50169 -40163 -48747 -31009 -4080 -22070 -39039 -33115 -59869
7517 -59869 -33609 -29007 -53207 -55197 -53151 -72630 -94704 -71990 -27854 -10273 -19182 -31441 -50890
7504 -50890 -63331 -31267 -35303 -36297 -49417 -66778 -57430 -35553 -24241 -29941 -37336 -49181 -47679
7491 -47679 -62885 -44118 -8926 -35042 -61015 -64337 -54192 -34509 -8019 -22954 -34565 -48686
7479 -48686 -37199 -31849 -37646 -28636 -19461 -12593 -19338 -19855 -27826 -25596 -28858 -35404 -24903 1811
7465 1811 -10763 -23964 -54460 -42736 -20234 -27927 -41463 -41776 -30750 -21896 -46623 -44965 -46502
7452 -46502 -41975 -41467 -64999 -67976 -54296 -60396 -64375 -26691 835 -29542 -48865 -53156 -50114
7439 -50114 -40095 -28128 -37376 -35363 -44365 -35009 -39113 -28003 -29155 -42179 -52543 -45423 -26656
7426 -26656 -30903 -10204 -3745 14334 19368 2752 7710 254 -9059 -20928 -20297 -20557 -16803 -25798
7412 -25798 -39963 -35745 -14017 27132 57185 10776 16731 34048 40962 48663 81568 94754 103173
7399 103173 122280 132207 156706 176858 213056 269374 301914 318121 356774 377363 330300 304824
7387 304824 255665 180305 134630 115086 104522 70361 64897 40953 28186 32829 20134 -16354
7375 -16354 -10659 4713 -19470 -26925 -40664 -32360 -9754 -4804 -29855 -45687 -16194 -27035 -39180
7362 -39180 -18899 -18809 -2063 -14924 -8325 -19522 -24306 -346 -32396 -26812 -43588 -47308 -35297
7349 -35297 -37099 -53825 -51757 -26078 -55248 -90588 -68811 -51861 -39010 -24901 -50566 -60429
7337 -60429 -55440 -54446 -61643 -73033 -78724 -84931 -34993 -29388 -24744 -26684 -17979 -15564 -39134 -61679
7323 -61679 -62712 -64758 -66540 -40306 -55972 -39629 -18287 -37549 -19613 -51510 -28331 -29681 -22211
7310 -22211 -18107 -20105 -33364 -33901 -5731 -41792 -42828 -41460 -22380 -8175 -4660 11976 -18797
7297 -18797 -20585 -16897 -12542 -10982 -6424 -28664 -43148 -42124 -42296 -34528 -3277 -5941 -16463 -23118
7283 -23118 -17860 -32231 -24678 -13990 3172 7101 -9749 5544 -20037 -2691 -9924 3141 34874
7270 34874 36467 54639 41727 20366 45395 46824 58403 45397 43320 62913 63723 82011 102234
7257 102234 151793 177712 188436 186323 217847 277772 307128 362115 368226 300014 227370 195757
7245 195757 133404 116298 114600 81572 82859 75721 86789 76810 46130 55202 49290 55306 39944
7232 39944 12867 16793 23829 50179 68046 72832 62591 48899 65820 58881 60065 54948 70604
7219 70604 63034 84982 110661 125850 124463 114269 94604 91609 123512 123308 135682 140372 145635
7206 145635 141226 107714 119498 104890 90871 112797 130336 121972 131191 139798 116921 116702 139851
7193 139851 144533 142645 154603 147989 141748 151361 138686 143706 158642 154099 135106 114896 106001
7180 106001 79242 99150 114673 102112 110109 117982 126094 120597 132103 141914 136011 137647 120343
7167 120343 114628 106760 122597 141319 146253 169557 178294 207077 215768 228275 279368 315330 311204
7154 311204 295339 300717 306760 320088 333547 304343 319142 337588 355212 343952 314182 319309
7142 319309 313340 321143 319327 313011 313926 376215 396949 392548 361734 368829 382853 369485 402866
7129 402866 403113 412963 451248 467268 469560 520586 554943 537139 529162 550917 573326 585206 588854
7116 588854 580247 615995 614466 601924 578914 617401 668185 676929 714832 740208 748785 759601
7104 759601 786888 815039 849249 866462 892400 893117 910471 936556 941401 971866 1012118 1035388
7092 1035388 1046810 1077663 1126416 1137935 1166026 1181106 1230459 1250325 1288662 1350102 1398742
7081 1398742 1425186 1475676 1572721 1617219 1653209 1719645 1790566 1803769 1842712 1894489 1987006
7070 1987006 2021680 2082468 2155612 2184992 2240081 2300960 2355418 2373664 2404264 2446459 2517014
7059 2517014 2576297 2628622 2693843 2774536 2850851 2896684 3011845 3076441 3164614 3246283 3300366
7048 3300366 3362234 3403140 3490709 3607369 3739558 3884292 4037298 4205481 4354932 4529603
7038 4529603 4696842 4825878 4976067 5175670 5359911 5623703 5847511 6039867 6233645 6378894
7028 6378894 6498532 6657682 6801793 6977192 7203611 7489712 7756774 8059587 8366605 8702755
7018 8702755 9026597 9394922 9831257 10295335 10842877 11457304 12104331 12847670 13698312 14673849
7008 14673849 15755174 17031902 18560824 20394179 22478637 24905219 27700233 30953048
7000 30953048 34863110 39671234 45623507 52966368 61675904 71637578 81864104 90363717
6992 90363717 93945636 90713524 81813461 69368618 57263701 47328344 39602382 33642499
6984 33642499 29069576 25470497 22629506 20328270 18452845 16919196 15635436 14492572
6976 14492572 13466423 12518423 11738497 11019089 10394580 9847213 9354259 8919623 8472154
6967 8472154 8049177 7656428 7265493 6923742 6605409 6329362 6060160 5885752 5718483 5600364
6957 5600364 5456791 5306312 5170895 5034469 4942842 4829507 4737613 4612999 4472079 4339027
6947 4339027 4193457 4042207 3910775 3855667 3789639 3747466 3747315 3724802 3696721 3717230 3691327
6936 3691327 3634648 3583435 3533596 3469209 3411789 3356604 3339415 3301433 3270621 3239287 3226779
6925 3226779 3209994 3167115 3132717 3135108 3112660 3049757 2995767 2951167 2899593 2888160 2900330 2880388
6913 2880388 2915758 2947614 2935880 2917015 2932608 2932122 2958872 2929559 2951580 2969284 3028408 3048644
6901 3048644 3077379 3117395 3205883 3245469 3304998 3345710 3398427 3380252 3411664 3408988 3485528 3547285
6889 3547285 3622160 3721940 3863584 3985868 4148517 4292887 4476473 4596042 4775124 4921272
6879 4921272 5154280 5357151 5599173 5776676 5959452 6170692 6437815 6648220 6946593 7249751
6869 7249751 7651626 7989542 8471165 8939014 9558835 10213215 11072915 12059750 13348547
6860 13348547 14775656 16505831 18342190 20566645 23314933 27025247 31595390 37819621
6852 37819621 44801535 53336498 63337084 72275344 70782713 55519509 42227268 33641845
6844 33641845 27668184 23111252 19554633 16794685 14735752 13058350 11726371 10641421
6836 10641421 9777719 9100652 8502559 7945283 7474829 7016213 6621461 6308365 6067398
6827 6067398 5823171 5607708 5387756 5104792 4865345 4621842 4366288 4102430 3947184 3820831
6817 3820831 3715413 3620570 3524965 3402416 3315956 3251152 3207702 3132357 3044522 2942046 2839771
6806 2839771 2715891 2631871 2533925 2453549 2353931 2293302 2272308 2233530 2174838 2157497 2129610
6795 2129610 2124025 2097077 2083481 2024491 1982264 1909354 1855538 1835383 1834829 1770558 1729876 1677331
6783 1677331 1651327 1646983 1626861 1575405 1537235 1497327 1489019 1439512 1439222 1408291 1417803 1426131 1458303
6770 1458303 1449254 1445685 1425821 1417090 1386225 1408992 1436920 1447995 1460456 1468069 1471108 1513563
6758 1513563 1552874 1568725 1625515 1670965 1715194 1818310 1851510 1934543 2054939 2219538 2364375
6747 2364375 2573156 2806235 3118931 3421595 3698221 4007894 4282502 4402381 4390784 4231517
6737 4231517 3952794 3593328 3223673 2837600 2524048 2275731 2047972 1863131 1716563 1589700
6727 1589700 1443410 1348830 1267027 1216494 1154827 1092345 1061799 1028658 990714 940588 923414
6716 923414 906897 855654 844890 841323 835565 816156 782433 741959 709242 697070 694526 665475
6704 665475 673491 648180 626262 611615 613094 577007 583866 584092 555391 574195 589702 570119 566779
6691 566779 532315 516419 487166 483228 486658 460861 466144 474915 493459 501411 506977 517139 526086
6678 526086 518504 500799 490297 485024 496123 472099 438924 434278 451489 409770 392558 392527 407688
6665 407688 419379 414183 391632 399795 384312 399581 390227 363297 334569 334137 330276 347932 341411
6652 341411 341273 358508 329512 333654 339514 310032 308791 327014 308394 304160 307823 309765 331526
6639 331526 307473 296035 308001 298766 291404 274427 298431 319358 309333 273561 259570 268699
6627 268699 280123 282004 273936 282291 283468 308679 299156 311067 299386 285305 295687 304738 328139
6614 328139 364236 350609 348803 354067 351671 362368 368312 359769 368230 378693 390847 392534 386573
6601 386573 411757 450757 457911 439773 448095 496959 532824 573597 600735 625401 678621 710912
6589 710912 717656 670286 619496 581120 546099 518137 481465 462879 447450 404886 418612 390611
6577 390611 343641 337849 343196 352907 361063 344011 318064 330072 345438 343149 347048 345152 345651
6564 345651 350154 325802 321876 321613 296068 310228 305829 314452 308624 295298 277582 279962 269547
6551 269547 268288 254225 259540 262376 287299 258301 260385 267397 271017 281095 294866 294976 288179
6538 288179 328700 328492 311358 317913 297881 295300 266458 272713 276431 274639 288346 299716 289737
6525 289737 288068 296690 305668 273882 274106 289796 289702 266198 273086 303968 288210 279485 300138 287709
6511 287709 285630 296433 294591 295550 298269 299320 308103 307262 311201 311875 328876 320667 313756 304069 320031
6496 320031 330590 337660 351546 319921 333019 319321 325515 304793 306544 322772 295641 286180
6484 286180 295306 326945 308551 317113 341917 335615 327326 330950 326444 339857 344736 380151 412716
6471 412716 389930 388182 398132 414730 416752 419026 428285 417957 419115 444995 409980 413558 436655
6458 436655 440222 452039 453956 413408 416617 444424 460095 465863 483385 525779 571869 596099
6446 596099 669236 718274 790467 830016 830272 745875 656041 600030 549500 517220 498760 498992
6434 498992 509956 497575 521369 501712 501518 471646 501355 488337 499271 531498 521114 535692
6422 535692 555073 566499 583308 580312 617374 603929 626401 638908 626243 627373 650559 649269
6410 649269 625446 613798 600952 589655 589701 589746 600497 633123 641729 648118 648334 682465 712253 721306
6396 721306 736755 734172 732210 749684 792377 827121 880974 931674 995271 1070571 1150480 1269102
6384 1269102 1425313 1565455 1679024 1703939 1612935 1454278 1313971 1205760 1130075 1065453
6374 1065453 1005884 960424 921285 891758 854716 846079 790416 767573 779454 782056 770816 800684
6362 800684 821958 827663 822638 786239 762363 776025 739780 740449 739349 726413 693541 716205 729373
6349 729373 754124 779384 813290 841265 855699 856719 885029 898753 884011 862482 851222 826579
6337 826579 785283 760316 793306 773718 762140 754044 782720 758112 731989 713073 706337 714205
6325 714205 722371 726785 708624 706405 716974 710490 734407 744222 752834 752324 745680 733532 742438 739548
6311 739548 753566 769047 784313 796781 803327 762097 778682 790018 789794 818224 840403 844360
6299 844360 857439 823049 833580 819071 798457 812514 845463 844241 842229 850317 861838 868238
6287 868238 879986 902664 914328 908413 924243 936029 934078 934524 953742 949275 956220 974035 966763
6274 966763 976279 993295 1008877 1005061 981343 991041 1010106 1025282 1037481 1034293 1051314 1033889
6262 1033889 1039120 1055779 1075486 1084443 1116905 1131099 1164402 1181529 1203875 1205181 1183871 1172791
6250 1172791 1188411 1165527 1190068 1208063 1234222 1264060 1271301 1267958 1278953 1271688 1286386 1300811
6238 1300811 1309516 1311682 1339268 1370132 1401121 1404423 1415258 1466604 1547982 1576482 1634638 1685722
6226 1685722 1743780 1775216 1802088 1791294 1783984 1726234 1699482 1637404 1583427 1555554 1537219 1518580
6214 1518580 1502975 1475253 1454096 1432354 1431247 1400655 1416272 1402844 1409376 1404484 1440650 1427729
6202 1427729 1415404 1400887 1423584 1416894 1435621 1436417 1440251 1483276 1522071 1532039 1572210 1622696
6190 1622696 1667836 1682910 1677222 1686855 1721380 1729134 1735021 1702378 1746824 1758318 1799026 1817389
6178 1817389 1831542 1817151 1812990 1797366 1802593 1844109 1847407 1861844 1894512 1915216 1937361 1966204
6166 1966204 1996077 2008258 2006287 2034623 2049169 2071496 2102029 2157039 2180528 2215926 2219907 2277929
6154 2277929 2288966 2296841 2331677 2364843 2404530 2433383 2426255 2437017 2422907 2457738 2492863 2538560
6142 2538560 2622149 2695790 2731646 2789141 2824260 2879091 2919208 2938120 2955855 3018661 3051663
6131 3051663 3099306 3145895 3200752 3233791 3317842 3351402 3416503 3442600 3507345 3534093 3565945
6120 3565945 3621522 3727961 3822612 3948619 4040985 4168940 4267978 4401239 4483735 4563267 4614802
6109 4614802 4749995 4806032 4893978 4946407 5098471 5177269 5286585 5391069 5537949 5659964
6099 5659964 5748039 5780952 5831478 5839899 5905238 5976241 6094982 6184034 6257630 6348698 6471154
6088 6471154 6538309 6680646 6788043 6914650 6954361 7060173 7196665 7392431 7538834 7740992
6078 7740992 7961657 8204796 8389561 8618065 8832945 9025023 9175898 9307160 9433642 9634208
6068 9634208 9838544 10105566 10387824 10754834 11090876 11481693 11936719 12438516 12915126 13394452
6058 13394452 13894463 14443887 14995456 15539902 15997215 16480797 16996201 17597641 18216071
6049 18216071 18917573 19770241 20752621 21773629 22952749 24244477 25654900 27377601 29415467
6040 29415467 31961299 35039814 38811498 43029765 47878570 53242591 59968929 68472614
6032 68472614 78956098 92496840 109446531 128405489 151939337 175439409 185890883
6025 185890883 160195548 122617958 97400718 79622609 67114274 57048251 49510744
6018 49510744 43351800 38576728 34434492 31294236 28657721 26754143 24965453 23513169
6010 23513169 22111426 20953282 19769824 18962310 18173838 17524889 16850703 16292520 15577768
6001 15577768 14961746 14325164 13820399 13219383 12799372 12419337 12239035 11974369 11778775
5992 11778775 11489549 11263930 11011136 10878901 10680815 10533622 10316864 10103414 9816308
5983 9816308 9579735 9286476 9052050 8804311 8640903 8511247 8450824 8350636 8306768 8229487
5973 8229487 8180347 8126896 8090833 7991859 7925268 7801312 7690411 7580097 7527235 7436791 7338982
5962 7338982 7178171 7119524 7035171 6953922 6887248 6817418 6734723 6639216 6496024 6451619 6419960
5951 6419960 6377124 6325934 6308802 6284794 6270764 6217623 6165026 6140482 6102444 6090783 6081312 6061025
5939 6061025 6080526 6082251 6077803 6052047 6046519 6050203 6046747 6033709 5974320 5952922 5913909 5891004
5927 5891004 5897476 5883267 5911681 5910866 5904380 5928884 5912438 5922213 5939138 5945102 5952864 5976955 6006659
5914 6006659 6056217 6085546 6126398 6182112 6239820 6263908 6310732 6329637 6331499 6279008 6273804 6281471
5902 6281471 6311625 6334847 6350505 6359097 6385770 6405522 6431068 6465150 6509673 6557643 6598874 6601344
5890 6601344 6651066 6682083 6723706 6739041 6798865 6831929 6864109 6907915 6955460 6982413 7012689
5879 7012689 7043943 7068381 7055755 7084600 7057633 7046697 7063764 7116520 7167849 7224610 7271152
5868 7271152 7347078 7427708 7506825 7548788 7639891 7723861 7817404 7879976 7981843 8038280 8080559
5857 8080559 8110696 8148030 8196044 8262559 8336432 8458805 8569443 8642823 8704407 8774708 8843479
5846 8843479 8896032 8903291 8955164 8979659 9004965 9031976 9054702 9067890 9069026 9082479 9109455 9121221
5834 9121221 9160347 9146971 9179226 9210734 9259010 9312740 9364478 9391598 9445814 9500394 9606295
5823 9606295 9710925 9818456 9931864 10044736 10153466 10237517 10333681 10418198 10502796 10587172
5813 10587172 10684621 10783795 10904931 11066898 11236873 11373392 11508420 11615149 11783553 11945147
5803 11945147 12105305 12240859 12430575 12677592 12913730 13167726 13436821 13731843 14029888
5794 14029888 14311404 14660108 15025920 15437692 15870267 16359293 16877955 17475591 18123274
5785 18123274 18869511 19732946 20698049 21776881 23019754 24430237 26034767 27841820 29871826
5776 29871826 32173762 34774526 37617282 40709914 43927537 46938298 49398601 50858340
5768 50858340 51118221 50405190 49128809 47856144 46894899 46408809 46470189 47016637 47905156
5759 47905156 49118175 50566205 52363714 54734282 57809785 61490254 65710249 70271385
5751 70271385 74666879 77924316 79157108 78358743 76495110 74267109 72049489 69760158
5743 69760158 66859825 63115500 59148636 55824399 53442319 51946165 51211889 51135460 51567469
5734 51567469 52276124 53180859 54351370 55943578 57870294 59913658 61526528 61987643 60650003
5725 60650003 57362666 52698818 47560133 42655309 38332907 34633603 31473688 28815416
5717 28815416 26593712 24710521 23107667 21740115 20557694 19528752 18667216 17874509
5709 17874509 17174479 16534854 15916427 15335526 14796232 14291621 13809787 13358504 12950622
5700 12950622 12558223 12183522 11833513 11539041 11257960 10993830 10783039 10564443 10348134
5691 10348134 10134685 9920264 9745857 9578341 9431814 9237790 9040288 8894342 8762677
5682 8762677 8658193 8527818 8386846 8275148 8177834 8132813 8077136 7987746 7889804 7812433 7777670
5671 7777670 7694463 7637704 7575297 7488879 7387694 7289047 7154936 7050626 6949991 6911730 6869027
5660 6869027 6818899 6752583 6720432 6685945 6644289 6578924 6521831 6494479 6465128 6433976 6440634 6449631
5648 6449631 6477707 6477106 6460797 6472430 6478251 6434936 6415133 6398958 6399613 6378269 6358274 6359256 6375502
5635 6375502 6353555 6331560 6300887 6280524 6273864 6258726 6251348 6283017 6324245 6383267 6448087 6542831
5623 6542831 6627719 6693231 6720503 6785034 6811390 6819631 6826165 6852685 6869029 6885781 6914187 6946816
5611 6946816 7016408 7054884 7100585 7177045 7266110 7338647 7381466 7430343 7525030 7593534 7679688
5600 7679688 7733566 7785650 7842231 7913398 7999488 8107663 8198406 8303825 8433817 8556072 8700527
5589 8700527 8834022 8981001 9093762 9183071 9253380 9338277 9476651 9595364 9699137 9824248
5579 9824248 10013392 10241569 10470653 10716312 11002388 11307162 11610850 11937487 12251746 12560005
5569 12560005 12870002 13151673 13483868 13828043 14170673 14560807 14926166 15313097 15760640
5560 15760640 16260811 16834947 17457371 18118259 18890836 19793240 20823375 21976323 23259934
5551 23259934 24727655 26370435 28212729 30297050 32662558 35386288 38466348 41971405
5543 41971405 45917118 50150338 54464912 58461598 61543233 62967639 62428522 60303644
5535 60303644 57506784 54860752 52753555 51283278 50381414 49841498 49621938 49853070 50668364
5526 50668364 52129642 54264374 56980184 60227875 63704034 67076811 70073684 72562747
5518 72562747 74606035 76038927 76330473 74910185 71579574 66880637 61700287 56830297
5510 56830297 52671075 49419421 46959050 45164721 43890930 42981633 42325183 41932978 41953267
5501 41953267 42418505 43258835 44362038 45526189 46418302 46603456 45707025 43592366 40540029
5492 40540029 37091614 33740494 30716617 28064515 25809782 23905677 22298291 20968045
5484 20968045 19856527 18878387 18042564 17353125 16755417 16236295 15794660 15454940 15177067
5475 15177067 14989762 14898765 14864962 14918128 15017429 15137702 15189829 15095387 14856063 14543337
5465 14543337 14147346 13649231 13152056 12748802 12414260 12103344 11880059 11712217 11603025
5456 11603025 11541363 11535324 11585840 11671953 11865116 12207064 12652044 13185247 13859168 14661426
5446 14661426 15452809 16113818 16504311 16479125 16033026 15349861 14675320 14110993 13542770 12899836
5436 12899836 12290178 11767439 11287012 10805738 10386364 10084966 9842933 9678377 9602983 9567677
5426 9567677 9650876 9823352 10097378 10459157 10917692 11473122 12119052 12743513 13189349 13218897
5416 13218897 12836032 12078333 11160378 10330311 9634652 9101348 8670823 8303201 7989398
5407 7989398 7725358 7487257 7251202 7023240 6784287 6575969 6380076 6208694 6054752 5931054
5397 5931054 5851241 5807209 5768422 5693958 5646294 5661000 5682546 5735787 5776836 5830542 5837173 5834066
5385 5834066 5765493 5744235 5675489 5572745 5504228 5441932 5320243 5181175 5035924 4933554
5375 4933554 4837276 4721250 4684182 4597772 4536764 4484212 4450497 4403387 4405250 4406673 4375623 4339175
5363 4339175 4312416 4333285 4328278 4321031 4297881 4253761 4219010 4163123 4116817 4051357 3956257 3905606
5351 3905606 3860705 3808701 3776403 3740120 3712119 3673965 3670568 3626061 3627482 3637736 3607049 3569941
5339 3569941 3543901 3497116 3420938 3322891 3229989 3166246 3112770 3066263 3050453 3032868 3019168
5328 3019168 3005340 3017251 3055123 3007838 2988507 3000529 2980411 2941628 2928514 2929142 2903563 2878153
5316 2878153 2877739 2898835 2912500 2935371 2966506 2956312 2947757 2979890 3008027 3033647 3094844 3135135
5304 3135135 3174956 3240134 3290709 3353504 3427113 3468866 3519827 3580336 3639292 3712109 3839173
5293 3839173 4022439 4201070 4404307 4667553 5007499 5407941 5864796 6420126 7051509 7770616
5283 7770616 8543789 9113574 9298046 9160513 8746684 8039436 7298931 6676474 6209693 5903135
5273 5903135 5668458 5484225 5429794 5429286 5506699 5651562 5882684 6180045 6535442 6977844
5263 6977844 7422255 7899743 8439188 9064605 9592624 9880788 10162909 10506195 10689291 10293302
5253 10293302 9570898 8770251 7926441 7077079 6362638 5798915 5376460 5067307 4798084
5244 4798084 4604023 4485868 4412191 4384710 4393435 4428999 4547170 4704721 4896869 5148030
5234 5148030 5440740 5729200 5850100 5777925 5637365 5408302 5077842 4607074 4147220 3756544
5224 3756544 3450362 3193310 2990070 2848227 2741897 2648218 2568922 2509693 2475096 2431674
5214 2431674 2394155 2357799 2310076 2235034 2171052 2135466 2104831 2073753 2060651 2017013 1974584
5203 1974584 1966090 1978394 1966750 1973848 1984487 2002937 1985171 1996903 2017212 2011028 1991542 1948736
5191 1948736 1938811 1947178 1927341 1902760 1865167 1842593 1821605 1795421 1814376 1816526 1831916 1820842
5179 1820842 1843652 1858256 1865149 1903424 1917243 1946368 1998461 2003565 2006605 2016101 2025611 2007327
5167 2007327 2007234 2009783 2003855 2017056 2002682 2007229 2042734 2040906 2053403 2075368 2097393 2116443 2129079
5154 2129079 2133060 2147962 2181326 2188523 2216876 2226838 2243129 2283955 2298888 2326403 2379576 2422783
5142 2422783 2476448 2514484 2563249 2648073 2732783 2796430 2892546 2954108 3007010 3065395 3143888
5131 3143888 3205666 3254700 3307886 3422116 3533132 3646995 3748061 3892067 4048330 4199975
5121 4199975 4389580 4561405 4750881 4980289 5184351 5386795 5615252 5842694 6102105 6378661
5111 6378661 6678092 7007366 7354621 7741382 8180336 8658585 9242904 9908486 10623552 11458648
5101 11458648 12475417 13661941 15021296 16594211 18448698 20645306 23292425 26415931
5093 26415931 30042261 34104629 38271055 42244569 45873724 48408026 48932437 47970305
5085 47970305 46234499 43002281 38320833 33523331 29112112 25035034 21517038 18652047
5077 18652047 16350550 14486787 13006161 11750445 10722788 9856834 9106280 8469285 7882254
5068 7882254 7390384 6931340 6547787 6189807 5868778 5566864 5291020 5013608 4721075 4511007
5058 4511007 4314240 4090215 3898244 3735802 3594052 3467993 3343079 3258405 3165780 3083429
5048 3083429 3001866 2898820 2789596 2720888 2624778 2521056 2449923 2366632 2304808 2240070 2177914
5037 2177914 2090235 2049850 2017748 1989367 1976162 1936129 1891141 1851785 1807831 1737859 1681881
5026 1681881 1637687 1597245 1533056 1501633 1492509 1430353 1368747 1347287 1292000 1276157 1243378 1220650
5014 1220650 1187893 1171385 1137023 1095031 1038981 1036923 1031552 997751 991306 967519 948513 912112
5002 912112 880381 878751 862486 855378 842813 824261 782110 761329 759076 736661 729162 718644
4990 718644 710317 679475 644246 643910 607273 570491 582108 573357 579491 553586 542224 530068 517776
4977 517776 510893 490640 480777 500330 499158 481393 460149 452719 445777 421365 449918 427204 420489
4964 420489 419481 428917 445281 438591 427457 409505 422048 400457 414269 406794 415865 426119 401592
4951 401592 405607 391550 380755 402575 413486 413106 442612 446199 452133 438849 394978 372676 351932
4938 351932 353102 340869 357070 346426 332315 306040 296757 282490 264547 300018 284831 298966
4926 298966 299400 301795 294240 291493 305881 317252 370729 375915 391446 416490 464385 464450 477589
4913 477589 458433 416283 369152 344389 320442 308968 293380 260010 220162 225382 206410 205634
4901 205634 198350 165184 170694 152823 146961 175802 152721 135852 135030 147293 157053 132831 132607
4888 132607 132749 134804 151007 170026 143122 145966 166202 148339 131304 108805 82376 92167 80288
4875 80288 79984 92790 90442 66336 62667 84302 72839 37831 45400 45212 46159 32549 27530 31127
4861 31127 27452 4187 12466 1179 -12875 2415 -5770 -3675 -8464 -3733 -6472 5079 1500
4848 1500 -23233 -20127 -670 -15966 -8799 -16483 -5061 1290 21475 16440 5780 13449 4150
4835 4150 -8904 -12286 -16129 -28629 7293 6765 -7639 4349 -11890 -38737 -34403 -39368 -52543
4822 -52543 -59007 -51694 -46852 -22866 -30559 -25480 -27130 -12142 -6468 -2090 -22227 -6827 -14767 5912
4808 5912 20483 -6165 -19087 -6156 17873 14230 -4626 5826 30823 54264 35176 12696
4796 12696 8700 12156 18507 13129 24025 45803 71239 85445 121542 145772 148624 145032 200084
4783 200084 194389 199622 212613 188470 153797 126159 89390 77971 49764 22719 15688 -6964
4771 -6964 -235 -8616 -31116 -19244 -17339 -22447 -13507 -16528 -18154 -32256 2531 -16795 -29273
4758 -29273 -61443 -52040 -45198 -45054 -34415 -65177 -64612 -54919 -28130 -30646 -63254 -54964 -45814 -48785
4744 -48785 -65816 -59045 -46397 -40500 -65314 -60137 -68527 -62639 -51210 -75639 -71204 -46092 -46243
4731 -46243 -48469 -35886 -44438 -48288 -58324 -37848 -20832 -48339 -55124 -53877 -71311 -50436 -53382
4718 -53382 -46756 -29825 -37659 -65498 -67568 -52460 -35202 -47766 -63086 -45625 -32445 -57176
4706 -57176 -59457 -36265 -30444 -18646 -18927 -39277 -44420 -54218 -52355 -47384 -40362 -44137 -38133 -46872
4692 -46872 -65171 -69957 -48241 -38040 -24468 -19591 -25799 -46691 -58914 -53149 -19759 -17767 -14920
4679 -14920 -26178 -3743 -20488 -46748 -41927 -41618 -19289 -40334 -46441 -23886 -1383 11428 -14371
4666 -14371 -6932 -15979 -19746 -15462 -18263 -12363 -3376 20125 11333 -9131 -28129 -39209 -26615
4653 -26615 -17758 -32757 -45506 -10625 717 -10244 -428 12219 12128 3104 5003 -25030 -17889
4640 -17889 -5094 -2398 -15101 -7558 -15676 -27606 -31378 -42405 -47713 -19211 9768 -17816 -29460
4627 -29460 -19128 -15760 -436 16707 -12228 -17678 -19489 -20055 -36388 -20094 -15706 -23216 -16004
4614 -16004 -10537 -39757 -47386 -28292 -26110 -16965 -27753 -18644 -7881 -27301 -46927 -46695 -19321
4601 -19321 4917 -5194 -11960 -9764 -29237 -23801 -23133 -49162 -50747 -65213 -38223 -39576 -59720
4588 -59720 -59307 -48165 -61238 -65673 -64449 -52259 -45500 -32855 -50181 -63690 -58267 -62329 -67408
4575 -67408 -27832 -14900 -48239 -57121 -32982 -36862 -38338 -21479 -19136 -50722 -34890 -33778 -31721
4562 -31721 -27535 -28770 -25482 3564 -1117 -1717 11081 5288 -1164 11299 -57 -13533 -13289 -19849
4548 -19849 -41797 -50219 -37191 -27391 -14187 -20123 -15944 -19555 -33954 -5506 -12544 -40242 -32355
4535 -32355 -30086 -31177 -39877 -35100 -33705 -7298 -7274 -10661 -24843 -5228 693 11491 9151 -15851
4521 -15851 -1808 -15343 6682 13960 21538 2468 10967 5549 6301 45399 37984 28782 49964
4508 49964 50609 60262 38835 13234 53270 42628 44872 62613 62474 46954 36018 37656 28710
4495 28710 13388 41199 68002 54672 24217 34867 45375 25433 24129 41422 47601 85734
4483 85734 62501 91849 85546 88695 105611 94243 97944 106413 116981 114772 126380 118807 139478
4470 139478 149688 146957 155911 136887 142221 162994 161868 153563 198113 195202 213363 226735 231158
4457 231158 252627 267552 287594 298907 325722 344350 386123 416575 416471 410818 389960 372889
4445 372889 349941 383375 375924 345926 353253 358636 322450 286637 278511 261275 261667 285813 310197
4432 310197 299682 308733 288547 282837 295378 295657 313970 326238 342761 354924 367258 371371 374730
4419 374730 399187 460171 478991 511289 538461 552489 545941 516518 492039 480925 480315 481698
4407 481698 491947 489177 487502 522393 533550 548330 576705 543373 558204 609559 616587 604026
4395 604026 619404 683059 738689 764033 828717 898372 974847 1062549 1207498 1326467 1458138
4384 1458138 1602425 1726272 1771953 1748412 1597530 1411087 1216545 1051709 943828 877422
4374 877422 787592 716207 693121 666542 638109 623537 603557 598994 589496 584066 559365 537891
4362 537891 516597 539005 566737 545484 539256 546430 574284 591405 557977 560153 582428 607258
4350 607258 611016 562924 538026 524657 541357 510770 507136 530562 557081 565380 564896 545801 560638
4337 560638 599569 584803 561004 550091 569798 583310 609753 624106 643632 655330 671017 675334
4325 675334 656157 666162 667034 686616 712144 701393 678685 696871 683450 692036 694502 732467
4313 732467 772868 779887 817435 797154 802521 836546 840955 829828 808709 827079 811698 812805
4301 812805 821960 837532 826215 833683 845130 863449 881818 880059 875228 867388 917908 934658 953949
4288 953949 953251 975234 998198 1007825 1031155 1057074 1063085 1065760 1058243 1092776 1115212 1156795 1200330
4275 1200330 1239529 1284364 1315137 1377671 1400934 1373750 1333856 1320144 1294003 1297204 1302742 1257725
4263 1257725 1246797 1286867 1347541 1451500 1550222 1570236 1633634 1699420 1734879 1781822 1819725
4252 1819725 1882922 1961771 2080857 2196962 2307545 2399588 2429591 2396087 2327804 2249696 2164731
4241 2164731 2099703 2046591 2032779 2038185 2059926 2073493 2079691 2084573 2110193 2145024 2162221 2222418
4229 2222418 2304980 2351821 2392655 2422159 2488891 2555676 2626037 2648994 2708981 2781302 2856622
4218 2856622 2904296 2954190 3000660 3066692 3144973 3219191 3349619 3477247 3656203 3833431 3979147
4207 3979147 4164438 4392589 4602321 4854899 5061562 5278527 5459584 5601195 5683590 5708519
4197 5708519 5645545 5589231 5558428 5585547 5632464 5700306 5811540 5974657 6197870 6465346 6784193
4186 6784193 7168694 7581319 8026217 8476938 8940955 9206874 9197640 8882205 8498202 8206866
4176 8206866 8002545 7865818 7828900 7819756 7838059 7886371 7943384 8015578 8108461 8183221 8236600
4165 8236600 8298708 8358282 8434647 8567849 8715061 8873721 8993002 9129067 9260556 9418021
4155 9418021 9576520 9734956 9930582 10086124 10217205 10466419 10746750 11057978 11420954 11789852
4145 11789852 12181769 12584777 12984852 13380590 13761836 14075208 14416461 14782188 15179306
4136 15179306 15659002 16212423 16812305 17506458 18268237 19095537 19939691 20868322 21822487
4127 21822487 22828004 23908839 25076041 26360163 27720444 29109700 30599076 32182453
4119 32182453 33802850 35262129 36626592 38183483 40091907 42335223 44866251 47766992
4111 47766992 51144630 55011095 59491640 64610902 70492467 77264815 85053543 93979021
4103 93979021 104281782 116590424 131583019 149994672 172191738 197872899 226369738
4096 226369738 254366698 274493948 275242154 254175858 218647797 181703842 151678206
4089 151678206 128236718 109967762 95383605 83762467 74315126 66667397 60394379
4082 60394379 55359001 51232347 47819233 44746238 41943503 39341081 37003968 34961987
4074 34961987 33179362 31547268 30106540 28696246 27375624 26116173 24920260 23791128
4066 23791128 22775061 21880963 21165301 20541755 20006199 19528552 19090451 18695797 18363720
4057 18363720 18043828 17699645 17277151 16828357 16371280 15916594 15477526 15059879 14673355
4048 14673355 14367731 14082999 13857578 13706047 13599536 13449618 13339408 13244099 13211322 13168303
4038 13168303 13081903 13013243 12944810 12889308 12822771 12642871 12412387 12159191 11942346 11801112
4028 11801112 11657971 11551833 11423445 11328256 11258006 11178279 11134261 11133753 11172107 11267436 11364328
4017 11364328 11517025 11723230 11931440 12157014 12373894 12619037 12887653 13151361 13474618
4008 13474618 13822990 14172474 14583760 15028908 15498323 15986346 16557551 17174192 17848224
3999 17848224 18572459 19412538 20353091 21450344 22695056 24109466 25858565 27979341 30562430
3990 30562430 33641005 37335830 41862370 47357006 53851973 61294244 68961103 75468932
3982 75468932 80273850 83543609 83578354 78304251 70703945 63147197 55013156 46921986
3974 46921986 40113282 34755341 30546653 27248517 24557219 22405963 20664494 19275354
3966 19275354 18134879 17146133 16292359 15612090 14991809 14441578 13931580 13466739 13024600
3957 13024600 12598384 12192014 11811501 11445326 11111626 10837082 10584632 10313824 10104850
3948 10104850 9932981 9769349 9660860 9515178 9385463 9309049 9242676 9207669 9180775 9206027
3938 9206027 9224229 9253922 9348312 9466826 9604863 9808608 10087052 10446137 10886354 11382788
3928 11382788 11901278 12510374 13105667 13690873 14236084 14713340 15055318 15168648 15022417
3919 15022417 14620968 14004913 13300199 12554752 11861189 11251362 10711068 10223650 9818777
3910 9818777 9475880 9215408 8985273 8851389 8786785 8802711 8851816 8916548 8956042 9013483 9065673
3899 9065673 9168117 9312113 9415156 9430643 9375290 9221091 8968847 8674757 8338020 8015744
3889 8015744 7715751 7427889 7202814 6969766 6782795 6660990 6579208 6518621 6517098 6623372
3879 6623372 6752943 6903364 7151458 7476890 7870934 8392209 9070619 9797552 10645563 11425668
3869 11425668 11795140 11284046 10046165 8798904 7830688 7067471 6470150 5973245 5573901
3860 5573901 5264450 5010846 4791535 4588214 4419844 4308550 4212022 4139610 4073439 4007011
3850 4007011 3943271 3903665 3875581 3851692 3855974 3825473 3781693 3741430 3734950 3676199 3635374 3623544
3838 3623544 3642591 3642379 3703648 3734531 3782302 3837159 3890359 3949143 4030928 4118417 4189847 4266948
3826 4266948 4363835 4451206 4543735 4673510 4812639 4934197 5093831 5263041 5499219 5720777
3816 5720777 6027201 6402896 6875527 7397710 8070374 8821501 9730246 10711286 11916854
3807 11916854 13405503 15203354 17243496 19794110 22537375 25953985 29547049 31911146
3799 31911146 28972092 22629093 18090453 15003981 12860412 11143506 9873476 8886533
3791 8886533 8182837 7622701 7232222 6911892 6760497 6662999 6632893 6651362 6729714 6871219
3781 6871219 7108568 7405565 7810531 8190390 8581850 8796741 8763668 8425870 7789613 7027109
3771 7027109 6358379 5760534 5257014 4835207 4483877 4172394 3898074 3685573 3514910 3366422
3761 3366422 3220856 3089367 2959332 2825300 2721521 2622250 2528327 2463817 2393150 2338474
3751 2338474 2309438 2294337 2248309 2208329 2178208 2161894 2165561 2130773 2132733 2146803 2126041 2127456
3739 2127456 2117339 2099200 2064950 2005774 1948813 1926522 1920341 1880472 1824734 1777778 1760240 1727264
3727 1727264 1734011 1720715 1716525 1716823 1737939 1763207 1776189 1773491 1783033 1787537 1773055 1740634 1745593
3714 1745593 1733016 1756495 1762389 1713378 1672237 1638872 1591893 1502895 1449483 1415343 1384395 1348575
3702 1348575 1300745 1284014 1266718 1267446 1266745 1275887 1282796 1308536 1354805 1390249 1426084 1438366 1442291
3689 1442291 1432211 1420338 1402883 1401649 1349985 1305222 1240798 1192545 1152783 1100824 1066998 1035682
3677 1035682 1001504 1014757 1045652 1057178 1048753 1031592 1034496 1019816 1006940 1008136 1000336 983426
3665 983426 988312 1009639 987900 977843 956679 949620 936789 928779 938593 953730 953995 959845 962838
3652 962838 944132 912308 943692 932557 902511 891523 867749 850339 819340 783609 774548 726589
3640 726589 713340 716319 689727 697366 701737 690159 691333 711061 714485 731012 762403 761312 762409
3627 762409 766555 786788 766529 706701 693991 679881 623774 599073 566952 540749 521354 515938
3615 515938 542756 537452 541696 562777 593500 605090 661188 702604 699038 673671 658107 633707
3603 633707 604683 587849 581107 580472 582473 577259 554060 555149 531651 506964 483824 412936 407154
3590 407154 387011 370260 370674 352074 349241 345809 357773 351735 354363 345806 351037 312678 328835
3577 328835 357526 319154 333472 333682 309613 333237 347220 342552 353232 330561 344009 359180
3565 359180 361888 356456 345044 358614 375397 391534 418830 410279 430060 432044 444281 475576
3553 475576 451544 437936 442169 432092 451898 470271 469565 495803 530632 541907 527853 485345
3541 485345 459905 437064 416231 416191 431733 441028 432272 433846 436478 452675 463443 523667 546240
3528 546240 546453 586592 596071 607773 570214 540161 520575 487845 461471 427287 422204 396673
3516 396673 383130 396071 370379 359331 338191 327735 318955 339462 360712 336695 337886 351921
3504 351921 375131 386472 407022 386217 408202 432409 449070 462167 490218 519588 563181 569475
3492 569475 596912 636486 650667 624345 548197 518298 478874 468394 469011 428414 397363 381940
3480 381940 351370 322377 313016 279963 273622 305432 318498 323342 321032 297550 277204 276148 240574
3467 240574 276434 271660 255696 246084 250982 274960 263982 246679 220473 199838 195862 240287
3455 240287 240895 250302 257336 266228 262693 273390 260537 260631 269446 257843 266144 249783 256773 253742
3441 253742 248591 239020 246756 247116 245856 261974 254390 248792 253546 262640 270606 255620 265399 275656
3427 275656 277006 273793 283188 278335 265931 310860 331250 287617 287774 311296 300637 342360 356490
3414 356490 360413 377059 405015 434627 430249 442485 464622 462455 452874 483326 473141 455213
3402 455213 454785 455413 450389 471508 485488 504293 472527 472508 498640 509609 554001 554235 562862 573613
3388 573613 574726 602540 633742 684761 734842 804977 853242 917580 1005873 1084471 1145738 1121641
3376 1121641 1026876 989257 957409 898382 884972 869823 843041 844015 855632 897470 932599 958660
3364 958660 992757 1014777 1035015 1029859 1032469 1040029 1058569 1106436 1160384 1196080 1251122 1255723
3352 1255723 1298640 1332314 1389609 1463114 1544889 1628381 1645515 1552453 1436390 1319858 1235422
3341 1235422 1194435 1153291 1135959 1103930 1101111 1119812 1153927 1144502 1139684 1169606 1171402 1141117
3329 1141117 1144724 1150796 1117981 1149618 1151129 1173383 1185418 1225121 1255902 1299875 1362331 1447434
3317 1447434 1562438 1626881 1694705 1734856 1780866 1757315 1718610 1684112 1639112 1613503 1553846
3306 1553846 1545746 1550240 1509859 1461136 1430305 1400393 1359988 1367285 1368360 1380070 1394023 1420978
3294 1420978 1456235 1493664 1518925 1557443 1578741 1592832 1641258 1711764 1773959 1794824 1797285 1826771
3282 1826771 1846253 1882703 1902538 1876289 1889571 1937202 1951036 1976546 2001903 2028215 2056266
3271 2056266 2127705 2195277 2259799 2354836 2440306 2535625 2659661 2785565 2877415 3041673 3203119
3260 3203119 3342153 3450741 3589553 3715196 3788517 3865748 3924960 3989075 4067795 4180995
3250 4180995 4307119 4471179 4659419 4868182 5115652 5359281 5634917 5883876 6125425 6375519
3240 6375519 6637117 6902016 7086335 7178771 7205874 7056581 6781184 6403864 5995758 5623666
3230 5623666 5263889 4967002 4672491 4434276 4220750 4077652 3942523 3763315 3567959 3338791
3220 3338791 3164861 3012122 2866585 2729917 2632181 2530837 2445598 2350529 2271883 2219765
3210 2219765 2171600 2098314 2027180 1995715 1975951 1951981 1931202 1895733 1868502 1863374 1879154 1918172
3198 1918172 1914084 1876851 1813500 1743825 1725015 1700604 1650454 1624770 1553475 1479898 1431996 1397897
3186 1397897 1348148 1295849 1260253 1235490 1192352 1192490 1169690 1138650 1145226 1180354 1156943 1146718
3174 1146718 1157671 1149803 1132196 1144533 1176804 1205332 1209107 1223266 1255715 1238945 1224708 1214177
3162 1214177 1146701 1110866 1080165 1033772 1015846 969139 916181 892012 886841 894784 872323 850489
3150 850489 849644 855607 844548 879117 870029 831754 814827 780082 756419 757123 745475 700453 690269
3137 690269 683261 672892 688669 677149 632006 633236 645115 626663 603940 595898 580163 600721
3125 600721 588589 580608 578461 596281 591546 595749 580335 587685 596360 570753 575768 601310 581712
3112 581712 556836 561422 559404 565336 596409 599841 592801 613825 641378 640683 639259 629824 628670 656232
3098 656232 643268 668233 679429 682403 669754 672133 710739 725768 718240 732560 735515 726206 728544
3085 728544 719539 710048 690063 667435 676927 668486 656378 682989 682093 687614 677731 693696 678050
3072 678050 678550 724926 737300 735998 729410 730392 740881 751514 763741 776133 786002 789120 797237
3059 797237 776157 800430 840736 860785 880306 891975 909988 910455 925131 976727 996895 988996
3047 988996 1007358 1038699 1068740 1095475 1119380 1142553 1198012 1254234 1284978 1319173 1345315 1385531
3035 1385531 1447152 1492346 1527255 1584590 1669356 1718452 1801593 1890842 1968807 2083260 2152149
3024 2152149 2224540 2344141 2487206 2656254 2816240 2986815 3200236 3383826 3551070 3716125
3014 3716125 3863479 3946938 3982087 3987126 3926464 3846759 3791951 3721404 3689309 3704502 3715027
3003 3715027 3776667 3830542 3912245 3969875 3991884 4075254 4123236 4173599 4207047 4253829 4312838
2992 4312838 4330251 4368390 4431091 4519435 4636723 4796849 5008669 5309737 5607479 5934964
2982 5934964 6314891 6738445 7161260 7507040 7755166 7911074 7950425 7809713 7436344 6992349
2972 6992349 6568343 6241810 6024248 5904589 5851014 5849574 5869224 5929109 6001429 6020463 5980702
2961 5980702 5926541 5860494 5695913 5519920 5327640 5082834 4819530 4589790 4451904 4386607
2951 4386607 4371680 4402195 4479107 4589659 4716910 4854156 5041073 5190301 5309665 5389466
2941 5389466 5369873 5247567 5069875 4861107 4602293 4358849 4163689 4041279 3966982 3867271
2931 3867271 3842562 3814270 3760691 3766354 3758448 3702849 3624499 3532953 3425042 3267337 3076713
2920 3076713 2914409 2714839 2546616 2391063 2278487 2160172 2073210 2015722 1958260 1891885
2910 1891885 1851795 1835253 1803753 1785093 1745148 1709818 1691142 1698477 1688806 1656498 1666066 1699018
2898 1699018 1680100 1697909 1716748 1717719 1716574 1719935 1748736 1762175 1754197 1731479 1715962 1720048 1681150
2885 1681150 1631556 1606586 1560533 1532676 1516438 1487118 1438576 1437904 1431859 1427524 1428732 1452278
2873 1452278 1415322 1398814 1396742 1394937 1395929 1371865 1356156 1335144 1320082 1319128 1276527 1252542 1252606
2860 1252606 1227299 1193979 1185982 1159097 1142160 1124474 1098899 1095199 1055255 1049294 1010396 967773
2848 967773 963719 937636 922172 896026 901237 883644 846636 796316 759064 756642 703796 683276
2836 683276 682126 649070 595824 570361 552565 547754 555008 531167 499110 491967 467664 436768
2824 436768 435385 431569 410122 414704 421206 384456 360507 340784 358094 335865 322646 310362
2812 310362 324798 342247 310155 289594 277276 286150 278621 308778 309302 290586 262192 253920 243542
2799 243542 259592 233632 226771 240597 232597 229898 224396 226641 212000 198824 184390 193196 191329
2786 191329 184164 161032 153354 148495 143584 137442 144710 156000 149827 141584 135121 130854 130575 137226
2772 137226 119184 128636 132012 135827 126464 117838 104933 104200 103508 124360 149990 158087 130782 119402
2758 119402 100726 104224 102679 85179 85721 85807 83971 88854 100215 122061 100380 93223 97305 94902
2744 94902 110517 130456 153747 141695 123076 130358 116961 88579 91173 87104 96368 126418 117883
2731 117883 125439 154345 138872 153358 153442 176543 184750 182506 140668 162635 174830 169150 182506
2718 182506 182468 203884 200102 205650 207382 197182 204639 232762 227415 230154 255780 261278 285729 268226
2704 268226 238530 250899 285596 291568 274604 282133 302613 305302 306641 319144 338562 349446
2692 349446 367405 382177 399588 420446 429100 450315 443433 463130 490008 480418 499916 532295
2680 532295 555485 577633 579329 600748 644418 657715 667396 666429 716354 744381 775921 825152
2668 825152 853636 864385 890821 926283 984429 1020723 1044326 1077530 1099262 1154623 1195791 1263135
2656 1263135 1303827 1353481 1439660 1506841 1547531 1604181 1638590 1667533 1695738 1722594 1752871
2645 1752871 1794676 1823362 1841069 1873330 1978486 2054837 2125958 2198849 2253104 2267619 2278993
2634 2278993 2266920 2248747 2258689 2250398 2236607 2244232 2259967 2246490 2257031 2283539 2341456 2387257
2622 2387257 2451461 2506412 2583224 2713175 2830748 2959621 3046233 3097143 3123483 3127981 3097428
2611 3097428 3123731 3174962 3187340 3198183 3249353 3367274 3468003 3578676 3636844 3697731 3732092
2600 3732092 3696439 3589291 3497303 3415771 3333613 3192874 3029082 2910824 2802207 2710314
2590 2710314 2631281 2582470 2528811 2503048 2492310 2530363 2586473 2661053 2733768 2788321 2881417
2579 2881417 2925900 2965314 2982806 2958650 2906289 2848396 2834311 2823058 2818245 2852137 2881681 2911959
2567 2911959 2960863 2974791 2929500 2843642 2716143 2594207 2466054 2360666 2225115 2092340
2557 2092340 1962658 1835072 1718106 1640627 1550390 1482103 1426234 1393513 1392132 1352093 1355934
2546 1355934 1346172 1364690 1363697 1390386 1388582 1408448 1400344 1369323 1350810 1290019 1230479 1178235
2534 1178235 1143369 1127823 1132669 1117982 1084022 1007540 987513 947295 893073 863636 805284 758161
2522 758161 700104 652229 590469 544099 517385 490310 448156 454923 392325 363163 355117 349918
2510 349918 355963 334381 311012 325187 342114 327763 311995 294172 284466 278863 253026 243514
2498 243514 220162 192119 172894 122069 142198 129141 131858 132578 114538 113705 83510 76603 95653
2485 95653 88428 76069 72047 74677 31933 35643 70354 92989 55450 36993 28544 51039 50426
2472 50426 30258 54511 51527 23472 15453 13284 15825 14114 -10231 27430 23039 6275 5799
2459 5799 3620 3195 -19231 -25358 -6108 1075 -8825 -18626 -1783 -7660 -10969 -27941 -26930 -26389
2445 -26389 -29012 -23752 -22583 -29734 -30393 -50963 -54696 -51552 -15601 -30441 -37672 -46762 -28214 -26065
2431 -26065 -31060 -16994 -36408 -37459 -50035 -38096 -25902 -34099 -55470 -81595 -94345 -79871
2419 -79871 -76755 -71801 -80652 -54900 -43680 -47809 -60183 -61659 -49958 -52700 -61777 -73127 -75341
2406 -75341 -65459 -63818 -76189 -72817 -64715 -57096 -31156 -52545 -44165 -54204 -38611 -57425 -80539
2393 -80539 -59547 -66124 -76460 -68962 -58762 -67683 -67226 -74219 -56478 -58507 -40887 -61994 -52936
2380 -52936 -63548 -93300 -72350 -62240 -56992 -53810 -45365 -56734 -31107 -44847 -50385 -72063 -63400
2367 -63400 -22487 -24384 -30132 -3524 -6070 -32644 -30910 -22386 -26836 -25259 -23243 -34831 -34215 -29936
2353 -29936 -46103 -46519 -47037 -37359 -34151 -24503 -31460 -46695 -69036 -42085 -49875 -48170 -41773 -45332
2339 -45332 -50569 -46187 -49919 -45568 -24831 -52803 -66584 -70591 -68203 -72468 -66603 -57646 -59974 -63177
2325 -63177 -57728 -69688 -64107 -65702 -53241 -41563 -14615 -14204 -25686 -46529 -42855 -40404 -26433
2312 -26433 -17974 -25166 -46551 -58039 -63185 -51485 -34250 -56115 -56733 -36501 -63580 -78885 -73736
2299 -73736 -47104 -51007 -51185 -65879 -72015 -42421 -37341 -81867 -70597 -57285 -48985 -59031 -83020
2286 -83020 -65527 -19433 -25071 -56427 -64642 -64170 -53962 -67608 -69294 -41882 -39879 -14748 -17614
2273 -17614 -53781 -53102 -57359 -35835 -67097 -67154 -70254 -71189 -55196 -54952 -57604 -50926 -61384 -68609 -76971
2258 -76971 -69215 -60403 -64104 -57411 -64614 -60857 -37182 -43896 -55419 -70676 -66440 -61627 -67016 -60726
2244 -60726 -66014 -73942 -71634 -71683 -73113 -48855 -59927 -58758 -28396 -24554 -56115 -63274 -45379 -55860
2230 -55860 -53374 -35234 -22326 -27594 -44706 -24947 -6568 -12609 -22342 -21692 -33629 -18190 -26488
2217 -26488 -46474 -35798 -38757 -61832 -42718 -45024 -35833 -26434 -12828 444 -29571 -20916 -12022
2204 -12022 -13245 -5813 -16682 179 640 -8238 6967 17760 50421 29820 31000 57378 37483
2191 37483 10159 19410 23191 49274 45683 50923 38981 29051 26059 30904 43811 77664 82171
2178 82171 86364 90010 77723 90549 107290 101590 108857 128827 139693 123582 103265 114735 114843
2165 114843 119082 145479 165551 177159 179939 169784 161942 176922 162520 170135 184729 180478 176810
2152 176810 179291 182729 188801 171769 187294 234169 233833 240322 245811 253155 237021 273737 298066
2139 298066 319024 353507 340681 356972 329412 376378 388817 404279 445718 459677 469562 502032
2127 502032 515362 553645 621089 632724 663534 722513 774098 802129 848113 880327 918802 959423
2115 959423 1036177 1099506 1195590 1285256 1371376 1487511 1637810 1795920 1909290 2013493 2173479
2104 2173479 2388012 2665253 2939455 3330599 3791835 4422744 5186815 6182688 7275934
2095 7275934 8675958 10163253 11145664 9954092 7515786 5882373 4782012 3978071 3327057
2086 3327057 2842554 2418184 2137936 1901073 1759894 1623324 1546641 1471826 1423203 1323219
2076 1323219 1178816 1060285 980444 908859 859389 807328 790620 725814 679341 619374 574607
2065 574607 523281 501828 480260 456169 455795 429355 399028 400456 381399 387662 397419 360124 337263
2052 337263 326474 320019 305377 270372 256702 267239 227349 195716 196642 210702 216885 204095
2040 204095 202873 210810 197906 218383 200958 175351 169245 158755 131208 150920 149254 143943 120385
2027 120385 100138 112151 116551 111547 93838 61519 56374 77683 79043 82823 73317 40503 55211
2014 55211 42252 45084 62695 34474 45663 57373 26312 30568 33359 25564 20528 6599 7070
2001 7070 8380 31236 58741 40386 47352 59332 32399 12956 3845 22793 27874 29695 11176
1988 11176 5580 -5364 -18412 -8393 -13289 6207 7320 15190 -2136 -27706 -16004 -13594 -13820
1975 -13820 1811 -2147 -24362 -26261 -4298 3148 3640 2790 -16502 -4274 -28259 -30057 -20878 -11652
1961 -11652 -26157 -60661 -33347 -1948 18401 -2904 -38142 -26113 -7990 -26721 -30909 -21641
1949 -21641 -23261 -40760 -57663 -36571 -43024 -16898 -36689 -31419 -19744 -28893 -7552 -14040 -23569
1936 -23569 -36453 -26791 -15659 -4012 -24201 -30158 -32722 -43083 -30901 -21476 -4045 -16532 -16699
1923 -16699 -15345 -7480 -3948 -12224 -11208 -25722 -15769 704 -24492 -42604 -38106 -35582 -39628 -46176
1909 -46176 -53167 -42732 -58528 -51199 -36143 -38720 -22813 -30937 -46067 -47697 -67653 -53879 -46937
1896 -46937 -38259 -26162 -32042 -39632 -45857 -32122 -22084 5795 -13986 -9430 -16401 -29527 -40708
1883 -40708 -45154 -23750 -23309 -53479 -53915 -29424 -53993 -48094 -48344 -38467 -35197 -50047 -44447 -70505
1869 -70505 -52983 -41082 -38234 -48405 -41024 -39070 -59306 -66988 -59995 -58788 -58276 -57471 -63734 -45650
1855 -45650 -39584 -59066 -71167 -60636 -70493 -76120 -69492 -39966 -24443 -15165 -33028 -24496 -7791
1842 -7791 -15120 -1634 -12082 9195 11630 -8208 -26020 -37791 -17508 -8358 -6655 15149 -21606
1829 -21606 -49057 -47247 -16227 -16496 -12974 13612 7740 -20292 -49248 -55838 -69640 -69840 -77418 -77462
1815 -77462 -56272 -50185 -64173 -69267 -40149 -38085 -56943 -64219 -67962 -37774 -38602 -60363 -58189
1802 -58189 -50913 -53338 -29697 -15580 -9442 -19094 -36908 -53628 -53743 -64714 -54562 -43975 -50365
1789 -50365 -56773 -66116 -62251 -64412 -40369 -40134 -53560 -49094 -43910 -45790 -58331 -65340 -31238 -2933
1775 -2933 -28151 -35466 -46353 -79432 -80289 -69336 -23421 -10204 -25438 -24642 -20542 -10084 -23551
1762 -23551 -41057 -28534 -33595 -34710 -31758 -47482 -65598 -73616 -73687 -59727 -26036 -48288 -51690
1749 -51690 -56711 -70680 -53969 -59386 -46945 -41913 -18076 -6856 -19825 -37850 -53408 -46451 -56789
1736 -56789 -46245 -49812 -75241 -54793 -37543 -54487 -73423 -73029 -36854 -54894 -58181 -57283 -44344
1723 -44344 -43703 -13936 -6368 -51106 -45864 -46054 -62425 -49105 -53330 -64791 -47478 -47484 -47082 -37817 -48527
1708 -48527 -70211 -43434 -61184 -39168 -29336 -38906 -54958 -68797 -46357 -36657 -26552 -29103 -43903
1695 -43903 -41443 -39032 -55730 -60389 -64688 -66551 -45116 -27564 -47558 -50108 -50289 -63103 -55540 -46263
1681 -46263 -28339 -49248 -55101 -33160 -36501 -56050 -58746 -62824 -67077 -48480 -41589 -45589 -44491
1668 -44491 -23533 -16418 -19736 -26287 -30838 -54803 -46139 -41264 -43562 -54665 -63513 -58183 -41190 -25106
1654 -25106 -19575 -31710 -28452 -34276 -29195 -40126 -41322 -47475 -42993 -35469 -25152 -36202 -44231 -29617
1640 -29617 -27239 -54013 -53130 -43370 -36744 -39767 -49066 -16243 -42635 -45918 -43908 -46861 -37759 -72549
1626 -72549 -51808 -30485 -19555 -19377 -41950 -32083 -42941 -13273 -9922 -32358 -54535 -56430 -51319
1613 -51319 -46867 -46065 -37061 -24653 -6970 -8094 -20484 -34729 -27876 -31871 -38540 -49189 -40261 -54069
1599 -54069 -43359 -69619 -75999 -54418 -13201 -25850 -40949 -55684 -41985 459 -24567 -22701
1587 -22701 -18771 -33113 -45231 -33744 -39184 -39636 -9810 -33789 -34064 -28433 -38232 -37866 -33072 -33357
1573 -33357 -39729 -23782 -25307 -28942 -30463 -41308 -69170 -47667 -72156 -53851 -40781 -49931 -17503
1560 -17503 -4219 -23314 -11243 -16854 -28606 -38468 -57825 -57010 -68982 -44340 -9910 -10476 -25972
1547 -25972 -45041 -55951 -59583 -35974 -26945 -19986 16487 307 -11502 -32951 -43615 -23875
1535 -23875 -24206 -21743 -38654 -44528 -41427 -39732 -31926 -36460 -29902 -26137 -36832 -25764 -35049 -21513
1521 -21513 -40212 -18706 -20732 -14165 -22983 -20946 -4330 -11557 -20313 -44988 -18001 -37915 -45101
1508 -45101 -18242 -20392 -21329 -27430 -8066 -13238 -32138 -31803 -33275 -44964 -51425 -11376 -7704 -31471
1494 -31471 -4672 -9017 -25456 -29361 -10498 -10918 -37223 -24497 -12387 -31470 -14772 -1622 -6435
1481 -6435 -20786 -31737 -22782 -15193 -20218 -34970 12688 -4471 -22341 -22744 -38058 -32520 -8292
1468 -8292 -43589 -33097 -30361 -35531 -31110 -19270 -5008 12367 226 2224 -15267 -21606 -9511
1455 -9511 -15584 -22767 -35194 -40770 -30280 -19981 -14910 -9735 -29119 -26464 -20943 -43794 -42981 -2862
1441 -2862 -21716 -12338 -15913 -31880 -10700 -26291 -45949 -34411 -50315 -65431 -54654 -50829 -34772
1428 -34772 1008 5257 -14823 -2686 5399 5421 -4539 -5256 1006 -6127 -22709 -20314 -1896 -36980
1414 -36980 -45384 -15075 -15488 -15913 -19240 -27367 -19859 -20204 -13128 -6427 -3511 -9061 -2747 -3821 -23289
1399 -23289 -41808 -22071 -12842 -2106 20498 20319 8938 1824 -11451 -8919 -9309 -1440 -538 -5095
1385 -5095 -13912 -16843 12514 16143 -6181 -15205 -28078 -9328 -28439 1026 8859 -20437 -8652
1372 -8652 -14006 -26443 -55659 -55322 -44486 -48776 -27320 -21813 -13293 -21 -236 1215 -12473 -37460
1358 -37460 -40017 -6132 -12722 -7286 -11582 -1988 -6140 -13037 -8969 -1195 5221 1789 -2497 -6584
1344 -6584 -13616 -12794 -15071 -3193 -23053 -15165 -27928 -37354 -39749 -34762 -10469 -12033 -26926 -29101
1330 -29101 -19588 -14245 -18250 -35703 -14822 -16251 -22773 -10965 -19989 218 -622 1764 -2742 5638
1316 5638 98 -11540 2890 -2231 -3668 -6706 13741 33419 23708 54211 50981 4315 -17658
1303 -17658 -24153 -35882 -10338 4552 10531 3724 -17450 -4788 16085 -10949 -47266 -51363 -53548
1290 -53548 -25544 -848 2072 -33253 45 -9606 -32265 -37307 -26246 -3240 -16309 -27685
1278 -27685 -17326 -30375 -29940 -17281 -8335 -29864 -12361 541 17094 3471 -392 2042 3686
1265 3686 11118 7819 -2064 4604 -5962 11558 26547 20777 1810 -13158 15240 7623 -3516
1252 -3516 -17445 19504 15719 -9539 -7246 -6990 -8700 -7744 -4991 -10407 -18845 -29157 -29669 4735
1238 4735 -10398 -31675 -6578 -6468 -14831 -10419 -16061 -22095 -9922 -7647 -10261 17540 -2803 -3540
1224 -3540 10987 2023 -5539 -29180 -13359 -3031 -14213 -5759 -8625 281 -1130 2158 -1554 -9873
1210 -9873 -20804 -22776 5593 5088 -14108 -527 -25868 -23049 -24446 -33300 -18564 -7869 -2346
1197 -2346 1550 -5708 -12578 14299 -8331 -15817 -13288 -15622 -3728 -1634 13454 -13911 -39767
1184 -39767 -23751 -5596 106 -4427 17463 20879 26220 36108 14931 20642 28955 5459 -676
1171 -676 -17913 -10303 -8535 -23194 -35030 -31965 -21711 -11098 4203 5658 -6020 -13128 -6828
1158 -6828 -9750 -2586 8319 20600 -13301 -22084 -25327 -25707 -7456 -22217 -36638 -28763 -15957
1145 -15957 -8810 -30511 8988 -992 -6245 23131 3738 12715 22003 -2336 -8368 -3744 -7672
1132 -7672 -15001 -33214 -20529 -13853 -18450 -19472 -4070 -1374 -4858 4390 13920 7745 2478 3323
1118 3323 6500 -8535 -2778 -4149 -804 -20836 -20829 11116 24094 -7774 -26428 -11777 17720 17650
1104 17650 23862 17760 14522 37361 42333 -1607 -21563 3613 13548 22545 13805 11612 19185 -25634
1090 -25634 -49052 -19123 7733 -4314 -5102 18692 28647 31368 21252 15900 10350 21710 -1485
1077 -1485 -2645 -26217 -31703 -5769 6083 8701 7343 7767 -6867 12690 3964 28517 37918 15230
1063 15230 23220 31289 36517 13234 11333 -1319 3968 -10023 -9970 10078 16959 22979 11807 8028
1049 8028 9680 26381 26518 -3459 -9495 -735 -9337 -23093 -38621 -10802 -4201 14391 15930 16905
1035 16905 20478 5764 2235 -2131 18810 6222 8596 -203 4383 9740 -4698 -12746 7681
1022 7681 37200 31477 12646 29792 4684 -8021 -34148 -37738 -16486 -3284 -18774 -24144 -153
1009 -153 18429 5127 9241 32630 47553 51032 60872 47565 6564 16275 24434 34191 22649
996 22649 16061 17037 18742 15826 21936 8983 -8371 -17421 -26741 -5972 17363 9123 51861 43881
982 43881 24431 14699 23305 -6251 -15000 11914 18378 10897 -531 -22115 -11984 -9801 -22913
969 -22913 -14519 -30039 -9409 2378 30411 13361 -13278 -6997 10645 33359 34850 34874 44789
956 44789 42207 18082 15825 16927 21492 5692 -3944 1082 11878 8762 7233 3864 11622 39029
942 39029 24351 34879 25015 11549 20715 16941 6269 8402 159 1136 -3306 -33024 -43172 -8863
928 -8863 23863 10088 -11223 847 7961 -28692 -51187 -9077 18721 9895 -7051 -12109 -22666
915 -22666 2850 -13033 -17652 2260 -3189 -12967 -15674 -7210 -3223 12822 -10389 4524 28276
902 28276 20487 16702 13812 27150 15968 270 20688 14999 6203 30187 28665 9736 -1455
889 -1455 10349 10836 19047 29685 29712 23985 29395 31548 10590 20494 -2186 5818 6390 30252 24190
874 24190 48280 33498 2011 5065 18324 30695 23227 22166 31587 38423 37491 29519 10496 -13248
860 -13248 9270 41766 25672 19055 9224 16314 7475 11823 17551 8271 16038 22825 -6904 1068
846 1068 -3647 5172 7734 11599 30272 32645 35245 16176 23013 30937 19709 15925 26645 37758
832 37758 48291 14367 -20283 -17957 28326 25210 3783 -3598 6129 24260 31978 40594 25934
819 25934 25208 30504 35868 23930 8382 20779 27296 15569 4110 17693 29586 9444 7984
806 7984 40205 38296 26405 26926 26708 12030 5727 2418 7368 39417 23346 23745 24079 20310 13016
791 13016 23855 8639 9809 22761 25543 19645 11523 24585 37679 20884 4632 2992 6243
778 6243 25579 44602 34874 44339 20429 8776 11636 15544 13019 32116 18224 13657 49820
765 49820 66502 35462 63835 52892 45755 26743 -9114 -4025 -1898 3837 -2617 16783 17866
752 17866 25976 18673 26250 8246 -17649 5078 17236 4850 4128 -9946 -4671 15382 18966
739 18966 12047 13683 35616 22180 11579 23075 4809 -4317 14668 50384 43917 23561 2187
726 2187 8631 9696 30463 22775 39550 37671 31936 6567 39841 19245 6204 9239 24664
713 24664 34603 -344 15372 31855 24008 6767 10828 21986 6388 21674 18253 12656 13925
700 13925 48222 43120 25017 34848 10872 33135 18507 27066 34255 44095 53383 18020 -11162
687 -11162 15943 28442 15016 14749 13801 45137 42352 19832 25549 9817 -2598 -12384 -23054
674 -23054 -13126 13050 30615 33790 8195 21941 50844 29333 42156 49445 21276 12991 18393
661 18393 20054 10438 11436 12688 31738 3785 9332 15117 19865 24913 25575 -5026 -18272 -7944
647 -7944 7140 19301 19028 46586 52826 43253 8504 26137 34068 28491 36538 37260 9257 11322
633 11322 24949 11988 -5132 -9664 12929 17332 1046 13915 35975 3347 17253 36290
621 36290 16818 1950 16194 24318 4447 1103 8777 3641 18305 27348 30880 8766 -1412
608 -1412 12951 13740 36504 40158 22666 26047 32897 21532 34242 29569 6730 2103 17626 28001
594 28001 4439 21886 12381 14244 3736 14427 26270 -3356 8616 8138 20709 23397 34356
581 34356 7841 5355 23703 36510 24248 -6794 1093 11175 4612 9833 14675 13915 10661 -4976
567 -4976 6930 16745 14303 28965 47669 14161 -2765 -12741 1471 25869 54283 52074 40116
554 40116 29847 30657 61710 49055 41575 63275 35744 16516 19481 39856 47489 16513 16493 384
540 384 -2260 5033 20894 37528 37368 22362 -603 16786 11773 12948 -6384 5473 14539 10718
526 10718 -10358 -3103 27634 37057 27798 -3489 26648 23652 19134 13312 -1410 -4062 -24851
513 -24851 -7180 16037 29211 22243 -8097 -8619 -7614 11847 6627 12424 2151 7569 958 9983
499 9983 26940 24927 45058 53335 25088 15835 -1926 13546 7002 3227 44524 49240 32823
486 32823 22627 -12044 -2618 1370 2165 4456 11173 -1332 -12212 8701 23144 -775 1031
473 1031 3652 6390 21744 9702 11369 10622 11049 -11761 -12618 8166 2370 -16774 4983 9080
459 9080 34864 32218 13782 -14474 -24658 21154 28143 21954 1783 15509 27762 13737 334
446 334 9440 16896 23828 32087 26444 38155 46587 32975 3172 3881 26463 26016 2212 7773 9835
431 9835 11147 -3594 -3274 -16747 -16943 2291 38068 22938 -3013 -13554 6349 3995 5472 18552
417 18552 -8528 -3021 5428 -5426 4424 -3627 -223 1281 19397 8128 -5367 8755 6096
404 6096 23997 20464 -5992 -14276 -8233 -15396 -1290 -11648 16984 12616 -2804 1775 13228
391 13228 1855 -18999 -9761 -16211 -23459 -11998 7495 25992 7571 -14429 -13707 520 9447
378 9447 25835 35590 15113 21751 -6372 -14922 451 -3603 -29840 -2981 12412 9796 22297
365 22297 6106 5859 -7274 -20825 2725 14672 -10641 -20427 -31561 -11284 16706 -2211 -10480
352 -10480 12764 -6608 -11603 6118 -19938 -4922 -13489 -20448 -7149 2863 18723 10136 3835
339 3835 4161 -22842 -18025 -7986 -2358 -5098 14483 5451 -952 20903 6526 33517 31294 34162
325 34162 23493 19822 8117 -18305 8092 -2338 -17643 22158 6790 -2664 -376 -3882 -8747
312 -8747 13542 11491 -2238 -11735 24876 22060 2714 11068 -12422 -8855 -53944 -10286 -10724 -14753
298 -14753 -7173 6069 11811 -8375 -2005 14728 12455 8051 9569 5704 1220 -670 -9949 -31428
284 -31428 -27211 -19791 -8001 -3584 15932 9346 -18884 -4511 9598 15023 -3245 -14431 2260
271 2260 3539 -7973 3634 18551 -2888 1697 16996 21287 3051 11797 -761 -20749 -15437
258 -15437 -9936 -25915 2294 5350 16683 4485 3091 -1186 -32465 -26715 -774 7384 18419
245 18419 8182 -22855 4037 -4367 -29323 13415 3071 3414 4001 -16113 -21761 -27070 -24433 -6977
231 -6977 15462 10306 3521 -18371 -2990 7247 -20162 -26502 -37222 -20451 -8773 17589 12033
218 12033 -20955 -19195 -15179 -14449 -15865 -11211 -3685 157 12763 27859 -5395 -13311 -4505 -12390
204 -12390 -8211 5376 11596 15142 5158 7744 5534 -521 4537 11089 10048 4505 601 -1647 -23295
189 -23295 -26311 -16394 -4294 -16588 -23702 -6950 11041 9465 19609 3196 1614 3065 23735
176 23735 -7737 -21117 -9055 -2847 16429 3593 6071 -12136 -29593 -46400 -39766 -7635 -24279
163 -24279 -22409 -20159 -5948 -20802 -26475 -15663 -14381 6786 5448 10051 27227 15478 1042
150 1042 17147 7170 954 -3969 -10887 -7029 -13815 -8016 9689 20471 46147 40081 14853 5785
136 5785 -11148 -9633 -17027 -17296 -16030 -34618 -19624 -15208 -8107 -16396 -11574 6074 6781 3399 -4933
121 -4933 -3344 4578 8658 -16322 -19915 -400 16862 1484 -15445 -2137 -1211 -3885 -5678 1916
107 1916 -10216 -17037 -30847 -20303 -28152 -17971 -16610 -3094 3825 6088 22448 -6336 -12714
94 -12714 -31055 -16249 532 -3339 -6314 8516 25557 13430 2594 7015 2795 1587 -990
81 -990 -2668 -9591 799 11715 7552 -3258 -988 -6952 -16875 -9867 -9264 -2043 -5330 -23109 -1771
66 -1771 13990 -8951 -22109 -11668 1729 -14368 -22722 -20583 2894 -4575 -17230 -5845 -4824
53 -4824 -5994 -5700 -22083 -39582 -39719 -15767 -4002 -8249 -16230 -12547 -1901 5467 -3994 -10863 -33875
38 -33875 -35088 -6478 -22004 -30911 -13280 -11561 -19258 -10356 2642 7396 -5329 -16743 -12440 -14086
24 -14086 -20278 17934 14788 -10427 -6516 -16919 4673 -5460 -1766 -2763 -8276 -7440 1709 3889
10 3889 14571 10753 -4926 -20618 -3445 -12305 -17873 -15051 -20386 -3894
0 -3894
$$ Imaginary data points
##PAGE= N=2
##DATA TABLE= (X++(I..I)), XYDATA
16383 -359856 -344214 -356012 -330128 -302598 -310047 -304393 -290338 -264303 -246850 -249709 -239919 -239031 -216006
16370 -216006 -187675 -187536 -154604 -148892 -138404 -135628 -132689 -109392 -110727 -87936 -79368 -66500 -58473
16357 -58473 -61955 -33413 -19805 -11737 -785 8061 8839 12537 33378 58121 85810 118636 133812
16344 133812 133683 137878 151040 130955 144165 157562 177043 194591 207605 209119 206293 226709
16332 226709 257836 271947 266178 260269 296341 300738 311380 339635 343160 357303 360737 380946
16320 380946 379675 383362 385190 407931 426320 444970 476308 464839 477206 508031 487287 500006
16308 500006 511057 523837 526548 528388 552151 575005 576612 583273 594152 607537 621266 644765
16296 644765 648486 666864 660000 640073 643319 645756 650633 672057 686736 698395 711564 714750 731924
16283 731924 740151 769508 785740 777287 792172 810477 808194 805171 819976 833881 838994 838925 841153
16270 841153 848198 845883 868571 873806 899414 878252 879536 904708 930497 936605 942712 964410 952423
16257 952423 975025 983847 989505 995137 1000613 1003230 1000712 1006332 1008865 1023040 1047249 1060017 1057636
16244 1057636 1058248 1067071 1065377 1088671 1086067 1088790 1098618 1126041 1114988 1121649 1127966 1160578 1152952
16231 1152952 1141095 1150261 1170887 1168595 1148950 1157321 1180095 1182401 1171433 1181173 1183349 1201166
16219 1201166 1212667 1232643 1256104 1274890 1278006 1278532 1258302 1258380 1254289 1237614 1263167 1297226 1306498
16206 1306498 1280334 1260953 1288199 1301263 1309814 1329135 1328286 1316015 1321094 1333733 1328104 1336954
16194 1336954 1355204 1355253 1357082 1339608 1344480 1347006 1349443 1387607 1382866 1384420 1394548 1392175 1389357
16181 1389357 1385529 1386850 1394833 1409563 1409876 1407640 1400272 1413378 1403389 1415520 1431944 1432906 1425621
16168 1425621 1424452 1397708 1427147 1428893 1411684 1421194 1401909 1449386 1467213 1441284 1426574 1446099
16156 1446099 1451117 1454268 1452400 1448536 1442491 1446472 1468270 1464124 1484316 1471287 1492557 1493827 1502673
16143 1502673 1518373 1491856 1483189 1492412 1488143 1504116 1541797 1526011 1510864 1517603 1516134 1516132 1531542
16130 1531542 1535805 1539982 1535920 1543893 1523655 1512012 1520976 1520047 1520048 1535080 1519568 1522490 1540596 1519842
16116 1519842 1541617 1550632 1550811 1565483 1566063 1560068 1555402 1544612 1549243 1541143 1544171 1552980 1551196 1547539
16102 1547539 1535313 1542754 1582981 1578043 1546167 1562434 1568288 1587558 1607188 1581383 1560044 1582406
16090 1582406 1588302 1590350 1597056 1599207 1619992 1614639 1603857 1582610 1588161 1590114 1606843 1558988 1564348
16077 1564348 1600068 1617557 1596263 1585409 1584325 1565822 1583950 1603139 1625721 1595278 1587255 1607464
16065 1607464 1592434 1600393 1602773 1591307 1582132 1603865 1598073 1594042 1608032 1591905 1596364 1593493 1601348
16052 1601348 1585685 1589365 1617654 1619020 1602037 1567956 1561737 1599025 1591080 1603403 1584457 1585731
16040 1585731 1621709 1602730 1594330 1634415 1619444 1631526 1585939 1596935 1607911 1610270 1608676 1604203
16028 1604203 1605876 1599492 1608168 1604066 1616093 1637003 1611037 1606235 1607947 1605514 1608537 1620193 1622644
16015 1622644 1602806 1599262 1613172 1630439 1630000 1621118 1622377 1606041 1597545 1602334 1608190 1608199 1598674 1624480
16001 1624480 1621378 1602539 1605237 1631051 1622453 1605248 1632307 1633215 1611602 1628587 1628641 1620035 1629879
15988 1629879 1630533 1629107 1621390 1609015 1613355 1618646 1624480 1645544 1641398 1634456 1657504 1632266 1638436
15975 1638436 1650858 1654255 1612321 1629819 1620965 1613389 1632955 1625923 1637241 1625467 1615082 1623193
15963 1623193 1623829 1638361 1623679 1620367 1614811 1587489 1610531 1613638 1639934 1669039 1653462 1655174
15951 1655174 1656758 1639731 1623596 1619282 1610188 1623864 1624181 1600407 1608136 1610872 1623901 1619783 1626461
15938 1626461 1666369 1660269 1633547 1613173 1610364 1613442 1602702 1637689 1651852 1642465 1641517 1635593 1655051
15925 1655051 1645178 1645290 1651041 1634400 1639377 1649392 1656530 1631335 1638952 1644203 1639983 1625782 1630284
15912 1630284 1641909 1656286 1656953 1675371 1682951 1661359 1670453 1662810 1668486 1665184 1673493 1653392 1660839
15899 1660839 1671721 1679082 1677037 1658401 1662362 1657394 1663095 1662247 1666095 1665889 1654812 1655787 1656357 1660173
15885 1660173 1664775 1655056 1636521 1639007 1636346 1641893 1635944 1662325 1674298 1648561 1647852 1645177 1645196 1647942
15871 1647942 1637403 1648929 1639400 1678221 1689657 1673527 1652673 1642721 1650851 1655773 1633163 1624978
15859 1624978 1640796 1643448 1651110 1660925 1667111 1652987 1647390 1675311 1688746 1653405 1649614 1667420
15847 1667420 1688982 1676631 1651518 1633328 1639026 1632250 1609060 1640237 1661992 1659167 1684021 1683314
15835 1683314 1653719 1658353 1689409 1669569 1645505 1667181 1666859 1658022 1661640 1660086 1650123 1646814 1655801
15822 1655801 1652731 1638364 1639441 1666793 1664933 1649166 1660695 1670620 1669573 1687251 1691650 1695985 1676549
15809 1676549 1651728 1650567 1647352 1646707 1691776 1681945 1668688 1654633 1662973 1675169 1670647 1656084 1636923
15796 1636923 1618047 1648731 1672378 1681194 1670484 1670738 1655429 1655450 1689737 1700110 1679636 1699722
15784 1699722 1680867 1656878 1658476 1669278 1682430 1673176 1657381 1646848 1653479 1687745 1679185 1681788
15772 1681788 1692520 1693909 1711813 1713228 1683016 1672689 1665068 1668185 1680678 1667997 1673004 1683040
15760 1683040 1691737 1686628 1689621 1695723 1716829 1693621 1695299 1691615 1678051 1667448 1688175 1662060
15748 1662060 1662378 1670476 1678030 1664908 1667021 1692094 1686376 1676703 1672012 1680393 1678614 1680540 1685454 1666665
15734 1666665 1671061 1668801 1665808 1682752 1688130 1680557 1680475 1663092 1679157 1668395 1682162 1689477 1690755
15721 1690755 1694682 1690333 1702766 1717419 1701507 1690300 1674092 1689430 1688045 1715555 1714639 1712989
15709 1712989 1723167 1707917 1724157 1703369 1682292 1694253 1712430 1714344 1698024 1703544 1697720 1683199
15697 1683199 1686604 1707622 1729785 1701958 1683447 1690212 1684100 1660528 1679847 1694478 1710870 1696654
15685 1696654 1714147 1733993 1714571 1706514 1705532 1698503 1707892 1717236 1726775 1705112 1712888 1714374 1711124
15672 1711124 1701853 1694603 1706976 1699829 1704299 1713863 1681306 1696213 1723026 1725467 1723664 1725620 1720320
15659 1720320 1708394 1726326 1704111 1708219 1724877 1705345 1697136 1703375 1716340 1698563 1691009 1706631
15647 1706631 1714763 1709689 1674158 1690264 1706335 1696718 1709370 1696871 1680970 1684447 1698445 1706726
15635 1706726 1714614 1716914 1708224 1708775 1695929 1699877 1709893 1726261 1731919 1743927 1715465 1722014 1714854
15622 1714854 1708346 1736078 1717335 1728478 1731084 1748149 1740341 1715950 1730758 1728542 1716459 1703731
15610 1703731 1713559 1722953 1717719 1709042 1732287 1759735 1734433 1741942 1733194 1738697 1729006 1710199 1702989
15597 1702989 1716188 1731678 1752494 1746642 1726680 1710147 1696990 1696380 1704694 1718599 1731722 1721711
15585 1721711 1730398 1732781 1715637 1722701 1732933 1740631 1748282 1751355 1757927 1780425 1748528 1714460 1711398
15572 1711398 1723710 1735318 1732400 1732881 1724471 1727349 1727894 1757191 1777368 1748294 1730842 1732536 1758933
15559 1758933 1737818 1740831 1753366 1739452 1727878 1755670 1727980 1708044 1744493 1763436 1752466
15548 1752466 1743801 1738574 1737145 1752641 1770691 1761546 1747179 1754043 1720138 1713070 1715526 1708381 1731750
15535 1731750 1749342 1724058 1745137 1745478 1725182 1716626 1750332 1739434 1751449 1771707 1763476 1738921
15523 1738921 1708689 1728545 1736615 1725515 1747856 1741469 1739519 1749645 1744957 1748631 1747890 1736834 1736485
15510 1736485 1752429 1742057 1724474 1742011 1749906 1747172 1761207 1764776 1754322 1733688 1731466 1718509
15498 1718509 1769842 1747495 1741831 1785040 1795018 1749213 1736428 1727342 1706831 1759995 1762455 1754194
15486 1754194 1779161 1772101 1772375 1755574 1741554 1754684 1764178 1744281 1740130 1758504 1741607 1740549
15474 1740549 1736785 1733874 1744334 1720003 1747715 1763375 1755047 1745797 1735516 1709679 1738424 1758658
15462 1758658 1735530 1741118 1756142 1758492 1746088 1740398 1742927 1738737 1756759 1763373 1768790 1782638 1762405
15449 1762405 1776794 1775156 1765652 1768308 1749239 1761211 1748951 1751606 1762548 1776944 1808120 1770392
15437 1770392 1765188 1778785 1764821 1773898 1785115 1776680 1765584 1763587 1780598 1770162 1769898 1762442 1779839
15424 1779839 1777751 1754030 1760196 1789797 1801186 1785368 1776220 1775154 1775202 1762373 1754699 1757233 1768230
15411 1768230 1767870 1738277 1731825 1734434 1748179 1737951 1741463 1745861 1774790 1781867 1764968 1786788 1766026
15398 1766026 1757719 1764153 1771926 1794689 1777006 1781008 1785731 1782926 1772559 1778404 1758692 1775226 1778152
15385 1778152 1789556 1786158 1782980 1786932 1764100 1788048 1795801 1804461 1797573 1790932 1768281 1758228 1747399
15372 1747399 1772498 1774013 1764684 1787846 1789851 1773605 1757875 1751285 1758128 1787868 1774828 1761123
15360 1761123 1798700 1796372 1805711 1799422 1797283 1790982 1830553 1848691 1807874 1785301 1792159 1822040
15348 1822040 1827516 1829995 1818438 1802189 1798575 1802084 1806391 1815813 1796602 1783518 1767189 1771248 1792969
15335 1792969 1789995 1806671 1792460 1801617 1803388 1801088 1779758 1779026 1809359 1793867 1815278 1810636 1804035
15322 1804035 1786359 1796983 1836648 1794142 1806433 1825259 1805458 1798410 1805243 1782577 1778109 1820292
15310 1820292 1826541 1812039 1818110 1809181 1795601 1808034 1794976 1802311 1816166 1835414 1838267 1810439
15298 1810439 1805160 1808207 1808824 1823609 1826380 1826353 1813329 1832873 1832370 1836011 1816196 1805613 1818911
15285 1818911 1805057 1805950 1777643 1796428 1807209 1796249 1810408 1812169 1836258 1834244 1803834 1820158
15273 1820158 1826872 1829063 1825306 1832931 1823089 1810694 1815426 1832004 1825231 1791891 1802187 1806362 1787702
15260 1787702 1788123 1835723 1823531 1807828 1815065 1827661 1820434 1828563 1831895 1838645 1834458 1835099 1842294
15247 1842294 1805809 1799994 1814139 1814084 1838734 1833180 1824166 1833075 1815673 1820875 1817775 1814864 1810409
15234 1810409 1836606 1853837 1850084 1838257 1818815 1823602 1819931 1832758 1849745 1842273 1825826 1843829
15222 1843829 1833785 1822946 1802953 1803028 1844168 1849857 1831007 1803175 1824714 1825474 1818732 1811446 1834569
15209 1834569 1819463 1811458 1799666 1814251 1850464 1837479 1834226 1831492 1816423 1830137 1820970 1825936
15197 1825936 1833974 1829840 1838538 1802708 1807678 1836991 1832849 1829888 1832338 1826566 1816916 1827589 1859692
15184 1859692 1858755 1837185 1849565 1839673 1826251 1825688 1853366 1851821 1840033 1854821 1858475 1850762 1853225
15171 1853225 1841699 1823129 1834014 1866713 1862168 1847952 1841095 1852226 1845278 1831987 1835079 1827404
15159 1827404 1821221 1813000 1822718 1835121 1852781 1825308 1815240 1822469 1836360 1865601 1887232 1855543
15147 1855543 1847692 1846167 1872991 1884935 1855039 1873479 1872639 1853736 1855907 1856831 1863766 1872704 1852592
15134 1852592 1860951 1851876 1880341 1911374 1883301 1863556 1869255 1868830 1849199 1860248 1880500 1892679
15122 1892679 1847006 1851047 1845192 1842693 1853706 1865963 1856740 1872985 1851629 1829090 1842365 1867489
15110 1867489 1861993 1832678 1834300 1850982 1868924 1842828 1847232 1879142 1883246 1865031 1866851 1848819
15098 1848819 1847211 1850922 1858111 1840240 1854674 1877303 1870086 1852085 1866958 1884128 1859065 1870049
15086 1870049 1858483 1875500 1888746 1876820 1869998 1872069 1874829 1868203 1870676 1866549 1874067 1887583 1872136
15073 1872136 1853833 1856135 1845188 1864488 1866468 1876392 1888835 1882957 1858873 1856833 1853489 1873954
15061 1873954 1879268 1852005 1865892 1879290 1876510 1888984 1876150 1874121 1887526 1884714 1910128 1885576
15049 1885576 1855600 1847033 1844837 1859103 1866993 1863612 1878467 1856568 1893797 1929731 1899079 1884682
15037 1884682 1904347 1896330 1884457 1873539 1890145 1907907 1910096 1913340 1894737 1877443 1876350 1870535
15025 1870535 1865392 1893945 1868972 1865758 1891881 1904294 1881052 1885376 1892827 1893585 1882678 1890537 1913641
15012 1913641 1882081 1885373 1893853 1917034 1913907 1873903 1873374 1883621 1878342 1866376 1883354 1877373 1894718
14999 1894718 1904295 1902079 1920738 1915731 1906308 1907269 1904479 1912854 1923164 1892055 1888245 1899496 1907185
14986 1907185 1909909 1896057 1899016 1890963 1911419 1894904 1894679 1907414 1914354 1917989 1875827 1871343 1889602
14973 1889602 1901081 1925061 1933348 1910380 1903067 1893511 1903839 1922185 1933422 1918291 1928105 1931410
14961 1931410 1912057 1882060 1892231 1925714 1927190 1902939 1911478 1910504 1922418 1923288 1900500 1906534 1882697
14948 1882697 1906044 1916815 1914961 1898486 1901046 1900029 1920621 1920395 1909594 1899832 1912707 1904187 1919990
14935 1919990 1932542 1911688 1921631 1923982 1908145 1926120 1935395 1935822 1912197 1904368 1905906 1898016 1901856
14922 1901856 1907873 1927779 1943428 1972544 1942835 1922552 1938154 1948603 1942989 1951729 1976862 1959649
14910 1959649 1917625 1913269 1925463 1944179 1948206 1928493 1920681 1935104 1918026 1919700 1932873 1945958
14898 1945958 1942146 1912641 1922537 1939930 1936752 1943175 1942913 1909702 1907141 1933853 1937736 1917033 1906891
14885 1906891 1923496 1939113 1938311 1940950 1936040 1917145 1930106 1918406 1943738 1958482 1953781 1937913
14873 1937913 1953009 1944831 1921005 1944910 1945181 1941421 1954943 1942917 1944283 1942291 1938388 1934822 1949600
14860 1949600 1938631 1924364 1931979 1920172 1899229 1922895 1935163 1924799 1955692 1957159 1943719 1938042
14848 1938042 1943615 1953862 1940992 1937997 1909267 1931363 1955826 1946910 1940122 1946079 1951405 1958310 1966189
14835 1966189 1948154 1951203 1938864 1943120 1963408 1969712 1965199 1967363 1995052 1988784 1991409 1998556 1976079
14822 1976079 1971404 1946369 1939241 1936462 1956166 1961259 1933490 1962684 1962519 1939811 1942637 1950643 1952979
14809 1952979 1949251 1962978 1947064 1947058 1967056 1959326 1971443 1970876 1954611 1978536 1987493 1975486 1957711
14796 1957711 1999808 1972026 1969654 1952345 1953350 1946555 1936600 1991757 1995545 2005658 2001672 1989530
14784 1989530 1979239 1971708 1954259 1964204 1984779 1962854 1995566 1975838 1969300 1949307 1908680 1932068
14772 1932068 1934078 1943070 1963897 1943942 1971950 1983160 1980511 1986497 1964537 1985354 2007471 1994311
14760 1994311 2003176 1998265 1990682 1970219 1978818 1964304 1963692 1988554 1977694 1995445 1999358 1982229 1962198
14747 1962198 1971038 1943732 1956154 1975341 1965322 1961589 1948361 1943486 1970755 1974984 1957716 1981590
14735 1981590 1972203 1952151 1953504 1957725 1980165 1957225 1963272 1990006 1971223 1968424 1986024 1990152
14723 1990152 1965830 1974167 1991352 1963309 1981683 1977195 1983303 1979099 1994460 1968413 1987676 1997911
14711 1997911 1996363 2002314 2002769 1991165 1987893 2008840 2016306 2030283 2013661 2000850 1996261 1982682 1977260
14698 1977260 1987458 1978847 1997383 2016196 2008083 1978052 1998206 2002390 2002215 1998254 1989357 1968779 1976950
$$ [...]
##END NTUPLES=NMR SPECTRUM
##END=
