##TITLE=1H_CA-8962-2
 CDCl3
 8 sc, 
 11.1.2022
##JCAMPDX= 6.0         $$ Bruker NMR JCAMP-DX V2.0
##DATA TYPE= NMR SPECTRUM
##DATA CLASS= NTUPLES
##ORIGIN= UXNMR, Bruker Analytische Messtechnik GmbH
##OWNER= root
$$ XWIN-NMR		Version 3.5
$$ Tue Jan 11 11:21:55 2022 Russian Standard Time (UT+4h)  she@DPX200
##.OBSERVE FREQUENCY= 200.131346
##.OBSERVE NUCLEUS= ^1H
##.ACQUISITION MODE= SIMULTANEOUS
##.ACQUISITION SCHEME= undefined
##.AVERAGES= 8
##.DIGITISER RES= 18
##SPECTROMETER/DATA SYSTEM= spect
##.PULSE SEQUENCE= zg30
##.SOLVENT NAME= CDCl3
##.SHIFT REFERENCE= (INTERNAL, CDCl3, 0, 15.7149)
##AUDIT TRAIL= $$ (NUMBER, WHEN, WHO, WHERE, WHAT)
$$ ##TITLE= Audit trail, XWIN-NMR		Version 3.5
$$ ##JCAMPDX= 5.01
$$ ##ORIGIN= Bruker BioSpin GmbH
$$ ##OWNER= she
$$ F:/spectra/data/she/nmr/H-F/1/pdata/1/auditp.txt
$$ ##AUDIT TRAIL=  $$ (NUMBER, WHEN, WHO, WHERE, WHAT)
(   1,<2022-01-11 11:20:42.82 +0400>,<she>,<DPX200>,
      <created by zg, POWCHK disabled, PULCHK disabled
       configuration hash MD5:
       00 E9 B6 7A A2 85 ED C7 34 08 36 98 17 FE 4E 26
       data hash MD5: 16K
       66 9A 82 A2 A8 09 5D 94 E3 84 F9 F8 8D F5 72 27>)
(   2,<2022-01-11 11:20:44.62 +0400>,<she>,<DPX200>,
      <Start of raw data processing
       efp BC_mod = 2 LB = 0.24 FT_mod = 6 PKNL = 1 PHC0 = -15865.43 PHC1 = 7.80079 SI = 16K 
       data hash MD5: 16K
       69 16 63 BB 8E 7A 0A 63 F8 A8 C3 92 BE FC 80 0C>)
(   3,<2022-01-11 11:21:02.90 +0400>,<she>,<DPX200>,
      <pk PHC0 = -0.4334869 PHC1 = 3.2 
       data hash MD5: 16K
       DC 1E AC C3 DC 51 CD 3F 39 74 0A B1 71 1E DB 8B>)
(   4,<2022-01-11 11:21:06.03 +0400>,<she>,<DPX200>,
      <abs ABSG = 5 
       data hash MD5: 16K
       43 FB EE 0F 35 4C 8F 9D 2D 39 47 90 A7 5D 93 F9>)
$$ ##END=
$$ 
$$ hash MD5
$$ DD AA E1 D6 AC B8 F4 60 09 5C B0 79 D9 6B D3 E6
##$RELAX= 
##$RELAX= 
##$RELAX= 
##$RELAX= 
##$RELAX= 
##$RELAX= 
$$ Bruker specific parameters
$$ --------------------------
##$DU= <F:/spectra>
##$EXPNO= 1
##$NAME= <H-F>
##$PROCNO= 1
##$TYPE= <nmr>
##$USER= <she>
##$AMP= (0..31)
100 100 100 100 100 100 100 100 100 100 100 100 100 100 100 100 100 100 
100 100 100 100 100 100 100 100 100 100 100 100 100 100 
##$AQSEQ= 0
##$AQ_mod= 1
##$AUNM= <au_zg>
##$AUTOPOS= <>
##$BF1= 200.13
##$BF2= 200.13
##$BF3= 200.13
##$BF4= 200.13
##$BF5= 200.13
##$BF6= 200.13
##$BF7= 200.13
##$BF8= 200.13
##$BYTORDA= 1
##$CFDGTYP= 0
##$CFRGTYP= 5
##$CHEMSTR= <none>
##$CNST= (0..31)
1 1 145 1 1 1 1 1 1 1 1 1 1 1 1 1 1 1 1 1 1 1 1 1 1 1 1 1 1 1 1 1 
##$CPDPRG= <>
##$CPDPRG1= <>
##$CPDPRG2= <>
##$CPDPRG3= <>
##$CPDPRG4= <mlev>
##$CPDPRG5= <mlev>
##$CPDPRG6= <mlev>
##$CPDPRG7= <mlev>
##$CPDPRG8= <mlev>
##$CPDPRGB= <>
##$CPDPRGT= <>
##$D= (0..31)
0 1.2 0 0 0 0 0 0 0 0.06 0 0.03 0 0 0 0 0.0002 0 0 0 0 0 0 0 0 0 0 0 0 
0 0 0 
##$DATE= 1641885642
##$DBL= (0..7)
120 120 120 120 120 120 120 120 
##$DBP= (0..7)
150 150 150 150 150 150 150 150 
##$DBP07= 0
##$DBPNAM0= <>
##$DBPNAM1= <>
##$DBPNAM2= <>
##$DBPNAM3= <>
##$DBPNAM4= <>
$$ [...]
##$SUBNAM2= <"">
##$SUBNAM3= <"">
##$SUBNAM4= <"">
##$SUBNAM5= <"">
##$SUBNAM6= <"">
##$SUBNAM7= <"">
##$SUBNAM8= <"">
##$SUBNAM9= <"">
##$SW= 18.0517287032376
##$SWIBOX= (0..15)
0 0 2 0 0 0 0 0 0 0 0 0 0 0 0 0 
##$SW_h= 3612.71676300578
##$TD= 16384
##$TD0= 1
##$TE= 0
##$TE2= 300
##$TE3= 300
##$TEG= 300
##$TL= (0..7)
0 120 120 120 120 120 120 120 
##$TP= (0..7)
150 150 150 150 150 150 150 150 
##$TP07= 0
##$TPNAME0= <>
##$TPNAME1= <>
##$TPNAME2= <>
##$TPNAME3= <>
##$TPNAME4= <>
##$TPNAME5= <>
##$TPNAME6= <>
##$TPNAME7= <>
##$TPOAL= (0..7)
0.5 0.5 0.5 0.5 0.5 0.5 0.5 0.5 
##$TPOFFS= (0..7)
0 0 0 0 0 0 0 0 
##$TUNHIN= 0
##$TUNHOUT= 0
##$TUNXOUT= 0
##$USERA1= <user>
##$USERA2= <user>
##$USERA3= <user>
##$USERA4= <user>
##$USERA5= <user>
##$V9= 5
##$VALIST= <valist>
##$VCLIST= <CCCCCCCCCCCCCCC>
##$VD= 0
##$VDLIST= <DDDDDDDDDDDDDDD>
##$VPLIST= <PPPPPPPPPPPPPPP>
##$VTLIST= <TTTTTTTTTTTTTTT>
##$WBST= 1024
##$WBSW= 4
##$XGAIN= (0..3)
0 0 0 0 
##$XL= 0
##$YL= 0
##$YMAX_a= 135774
##$YMIN_a= -168658
##$ZGOPTNS= <>
##$ZL1= 120
##$ZL2= 120
##$ZL3= 120
##$ZL4= 120
##$ABSF1= 15.74579
##$ABSF2= -2.30606
##$ABSG= 5
##$ABSL= 3
##$ALPHA= 0
##$AQORDER= 0
##$ASSFAC= 0
##$ASSFACI= 0
##$ASSFACX= 0
##$ASSWID= 0
##$AUNMP= <proc_1d>
##$AZFE= 0.1
##$AZFW= 0.1
##$BCFW= 0
##$BC_mod= 2
##$BYTORDP= 0
##$COROFFS= 0
##$CY= -3
##$DATMOD= 1
##$DC= 0
##$DFILT= <>
##$DTYPP= 0
##$F1P= 0
##$F2P= 0
##$FCOR= 1
##$FTSIZE= 16384
##$FT_mod= 6
##$GAMMA= 0
##$GB= 0
##$INTBC= 1
##$INTSCL= 0
##$ISEN= 128
##$LB= 0.24
##$LEV0= 0
##$LPBIN= 0
##$MAXI= 10000
##$MC2= 0
##$MEAN= 0
##$ME_mod= 0
##$MI= 1.114404
##$NCOEF= 0
##$NC_proc= -8
##$NLEV= 6
##$NOISF1= 3.799351
##$NOISF2= 2.8
##$NSP= 0
##$NTH_PI= 0
##$NZP= 0
##$OFFSET= 15.71494
##$PC= 1
##$PHC0= -15865.86
##$PHC1= 11.00079
##$PH_mod= 1
##$PKNL= yes
##$PPARMOD= 0
##$PSCAL= 0
##$PSIGN= 0
##$REVERSE= no
##$SF= 200.130007327619
##$SI= 16384
##$SIGF1= 3
##$SIGF2= 2
##$SINO= 5.538805
##$SIOLD= 16384
##$SREGLST= <1H.CDCl3>
##$SSB= 0
##$STSI= 16384
##$STSR= 0
##$SW_p= 3612.71676300578
##$SYMM= 0
##$S_DEV= 0
##$TDeff= 16384
##$TDoff= 0
##$TI= <>
##$TILT= no
##$TM1= 0
##$TM2= 0
##$TOPLEV= 0
##$USERP1= <user>
##$USERP2= <user>
##$USERP3= <user>
##$USERP4= <user>
##$USERP5= <user>
##$WDW= 1
##$XDIM= 16384
##$YMAX_p= 374052146
##$YMIN_p= -1009677
$$ End of Bruker specific parameters
$$ ---------------------------------
##NTUPLES= NMR SPECTRUM
##VAR_NAME=  FREQUENCY,     SPECTRUM/REAL,   SPECTRUM/IMAG
##SYMBOL=    X,             R,               I
##VAR_TYPE=  INDEPENDENT,   DEPENDENT,       DEPENDENT
##VAR_FORM=  AFFN,          ASDF,            ASDF
##VAR_DIM=   16384,         16384,           16384
##UNITS=     HZ,            ARBITRARY UNITS, ARBITRARY UNITS
##FACTOR=    0.220516191357247, 1,           1
##FIRST=     3145.03107158353, 0,            0
##LAST=      -467.685691422251, 0,           0
##MIN=       -467.685691422251, -1009677,    0
##MAX=       3145.03107158353, 374052146,    0
$$ Real data points
##PAGE= N=1
##DATA TABLE= (X++(R..R)), XYDATA
$$ [...]
6753D26452m7725j72498m2559K8632O2911K35402q9298j00152Q0203J82464R9688
$$ 426452 378727 206229 163670 192302 255213 490615 401317 301165 381368 563832 663520
6742F63520j739M08344J03314l80060n84044M33241J15322K20646J62652J34307
$$ 663520 661781 1070125 1173439 793379 209335 642576 757898 978544 1141196 1275503
6732A275503l94778J4129K07874M3012m30934k25510K06462Q4225M70345j45080
$$ 1275503 880725 894854 1102728 1145740 714806 489296 695758 779983 1250328 1105248
6722A105248R5871j69851k35300p1415L56631J1896k28350K13147Q6337q91364
$$ 1105248 1201119 1031268 795968 724553 1081184 1093080 864730 1077877 1164214 272850
6712B72850J64970k755k22448j34031J37201j02010m11290l6757M37315K17749
$$ 272850 437820 435065 212617 78586 215787 113777 -297513 -334270 103045 320794
6702C20794j92994P697O2503J5517l08204Q8912J61488J61468m44238j91580K58938
$$ 320794 127800 135497 198000 213517 -94687 -5775 155713 317181 -127057 -318637 -59699
6691e9699N32158K09664n34914m88560R9117q1441L2846M03856L21155K17691
$$ -59699 472459 682123 147209 -341351 -242234 -323675 -290829 113027 434182 651873
6681F51873N3748k05422k61557J7958k78276k71427K8966K42378k2662P5543J76115
$$ 651873 705621 500199 238642 256600 -21676 -293103 -264137 -21759 -44421 31122 207237
6670B07237k30331l8003J66742L29347n0109K18918L14718n50007l55591M54669
$$ 207237 -23094 -61097 105645 434992 384883 603801 918519 368512 12921 467590
6660D67590L57143l36210l18740l95318J94079N66570k22402K59229p8138l2125
$$ 467590 824733 488523 169783 -225535 -31456 535114 312712 571941 493803 461678
6650D61678k73334j90967M31900J19057j67733J11275k49893K09720j56202j63248
$$ 461678 188344 -2623 429277 548334 380601 491876 241983 451703 295501 132253
6640A32253Q4907J96526n22333J97148J5534J40395j12649j75136p6185k3177
$$ 132253 217160 413686 -108647 88501 104035 244430 131781 -43355 -119540 -142717
6630a42717P3879J46485K90692l1349o0424m50579P9893r3570J40950M84422p2714
$$ -142717 -68838 77647 368339 336990 276566 -174013 -94120 -187690 -46740 437682 364968
6619C64968J8748j02413j08073m3577j40553K5550J88432M15977j31445l46926
$$ 364968 383716 281303 173230 129653 -10900 14650 203082 619059 487614 140688
6609A40688p3959N3246L26211L36024n54441p5001p4234r9726J34356m18335J00536
$$ 140688 66729 119975 446186 782210 227769 152768 78534 -21192 113164 -305171 -204635
6598b04635Q7449J53277M42765j60034m36209j54717Q7355N7414J89250j18598
$$ -204635 -117186 36091 478856 318822 -117387 -272104 -184749 -127335 61915 -56683
6588e6683J66111Q1178J5948m02732l283k40977L4936J10156K83654J97008l62520
$$ -56683 109428 190606 206554 -196178 -199461 -440438 -405502 -295346 -11692 185316 -177204
6577a77204j25103L42212J42149J66550l11818K09884l35585n0203q3543K00636
$$ -177204 -302307 39905 182054 348604 36786 246670 -88915 -139118 -222661 -22025
6567b2025M98301M9811j56931j78238k50160J71674J57856j72627k2819J53519
$$ -22025 476276 526087 369156 190918 -59242 112432 270288 97661 74842 228361
6557B28361K04735N4734j2596p2236p779P8538m26436n64619j10418o8735J62981
$$ 228361 433096 487830 475234 402998 395219 473757 47321 -517298 -627716 -696451 -533470
6546e33470O11737n0890n4507M1521o60561L70331O17463n26724n6633N32929
$$ -533470 78267 27377 -27130 14391 -646170 -275839 341624 -185100 -241733 291196
6536B91196J49559n2417m1184M5087K6907k95135n31385O20808n1690P903L53847
$$ 291196 440755 388338 347154 392241 419148 124013 -407372 213436 161746 169649 523496
6525E23496j32024j23486k80444j71287L28115P5854N3451j94969J44049j68969
$$ 523496 391472 267986 -12458 -183745 144370 220224 273675 78706 222755 53786
6515E3786q80j9952r8420M41149l42434k35251O3986J45943L27440j37521k78215
$$ 53786 52906 32954 -65466 375683 33249 -202002 -138016 7927 335367 197846 -80369
6504h0369L32827L67699m81818K62771m17946K28284L38133K05268r5642k56407
$$ -80369 252458 620157 138339 401110 -16836 211448 549581 754849 659207 402800
6494D02800k54657n1661J49918l79484q7467m5395L51680N7555q2859L53596j30985
$$ 402800 148143 96482 246400 -133084 -220551 -265946 85734 143289 60430 414026 283041
6483B83041j97759l36788M61650M3159K69047K77360p01254m32802j21722M122
$$ 283041 85282 -251506 210144 253303 522350 799710 98456 -334346 -456068 -451946
6473d51946L13907K19105j65324J38149l16846K19470J02183l6996o9561m7150
$$ -451946 -138039 81066 -84258 53891 -262955 -43485 58698 21702 -47859 -95009
6463i5009M984J98926n6271L86315J4182p8214J62264o6166k30790k20037M4804
$$ -95009 -90025 108901 52630 438945 453127 374913 537177 471011 240221 20184 64988
6452F4988l9833p0257K17015Q623n664r847r5719n3673J56158k30665k20664p2285
$$ 64988 25155 -45102 171913 180536 174872 165025 69306 15633 171791 -58874 -279538 -351823
6440c51823N31010P2114k43966K65552k95210K4953M31956Q6658m09002n7569
$$ -351823 179187 251301 7335 272887 -22323 2630 434586 521244 112242 54673
6430E4673J55797J92000L81284l17356n32778j34064J65003k0683O9347J24290
$$ 54673 210470 402470 783754 466398 -66380 -200444 -35441 -56124 13223 137513
6420A37513J4828J08256N7065j2800L4808j66167l80462O3558K86334J1290k81399
$$ 137513 152341 260597 317662 304862 339670 173503 -206959 -143401 142933 154223 -127176
6409a27176J35424l34115J40436J4581M33984K56112j68355q46n30956L00567
$$ -127176 8248 -325867 -185431 -170850 263134 519246 350891 350045 -180911 119656
6399A19656k38574j3089L14137m627n4718L42782k84160K83385J11420o35431
$$ 119656 -118918 -132007 182130 177503 122785 465567 181407 464792 576212 -59219
6389e9219J79626L127r7180j66015K6994Q8672m2431J74359J96037k07175L6130
$$ -59219 120407 123534 26354 -139661 -112667 -23995 -66426 107933 303970 96795 132925
6378A32925j28970k00867j00057L72255R5362K9475L3592K68580j2665j74848
$$ 132925 3955 -196912 -296969 75286 170648 200123 233715 502295 489630 314782
6368C14782l93852P0514L30818k53914k77883L78581L47286l12841p0998P4167
$$ 314782 -79070 -8556 322262 68348 -209535 169046 516332 203491 132493 206660
6358B06660J60402O5890k66686J07649K33961o43310l22072M89741J43399j92071
$$ 206660 367062 432952 166266 273915 507876 -135434 -457506 32235 175634 -16437
6348a6437O6303K56694k95976J50010L8626j50904j92200J13679K31605J97537
$$ -16437 49866 306560 10584 160594 199220 48316 -143884 -30205 201400 398937
6338C98937p8833m68909O0448j07621J6350l04864L40657K31974k73659k30542
$$ 398937 320104 -148805 -88357 -195978 -179628 -484492 -143835 88139 -185520 -416062
6328d16062j11298L12410j21283q3516J98697K49007J22388J3918j71190K80980
$$ -416062 -527360 -214950 -336233 -419749 -221052 27955 150343 164261 -6929 274051
6318B74051j59724j22799K43641k62126K86936j31255m8858j711J36383k9103
$$ 274051 114327 -8472 235169 -26957 259979 128724 79866 78155 214538 185435
6308A85435k2650J1738J36546K266l7566R1140l2374k63954m35219L52341N94950
$$ 185435 162785 174523 311069 313335 275769 366909 334535 70581 -364638 -12297 582653
6297E82653j01001l38214q1163L30953m499k29805k68009r9497K06977J56042
$$ 582653 481652 143438 62275 393228 388729 158924 -109085 -208582 -1605 154437
6287A54437j85722J62062R1152j92456l6249j13555K97252L11930k14888k28101
$$ 154437 -31285 130777 221929 29473 -6776 -120331 176921 488851 273963 45862
6277D5862k60245K9322O3778k7743J56n0501J39541K87767o1662J97133L6867
$$ 45862 -214383 -185061 -121283 -149026 -148870 -199371 -59830 227937 166275 363408 400275
6266D00275o04481l88482N11019L14191p7661m03422J29071K29060Q0763j93859
$$ 400275 -204206 -592688 -81669 232522 154861 -248561 -119490 109570 190333 -3526
6256c526l5793K32972j8294Q9871J27922J4276j69185j5970J08153j97203j3348
$$ -3526 -39319 193653 175359 265230 393152 407428 238243 222273 330426 133223 119875
6245A19875M41486l77765J35812J49462l75832l10477L44130j24466Q261M1595
$$ 119875 561361 183596 319408 468870 93038 -217439 126691 2225 10486 52081
6235E2081p8392M32947j11508o23220j21773O83452J66343p554l42072m65322
$$ 52081 -26311 406636 295128 -328092 -449865 233587 399930 392376 50304 -415018
6225d15018j0391K62277J79438R803K04169p8739J03986k33188l27592J15981
$$ -415018 -425409 -163132 16306 26109 230278 151539 255525 22337 -305255 -189274
6215a89274M1317J11117N40452k38371j31789k8005k24394k50099j48180K69493
$$ -189274 -147957 -36840 503612 265241 133452 105447 -118947 -369046 -517226 -247733
6205b47733K44747M4075k33558K54479J13339K11354j15027l10603k16889P5975
$$ -247733 -2986 41089 -192469 62010 175349 386703 271676 -38927 -255816 -179841
6195a79841J17115n7410K55071k02868K68738l24798K19784o3362L34850M7968
$$ -179841 -62726 -120136 134935 -67933 200805 -123993 95791 32429 367279 415247
6185D15247o15023K76328J07208k93448R5534j9417L76784q5016q2922K1642p5009
$$ 415247 -199776 76552 183760 -109688 -14154 -33571 343213 258197 175275 196917 121908
6174A21908l82470L9965K18570L1589J00933j91259j9178K09282k04553J17604
$$ 121908 -260562 -220597 -2027 29562 130495 -60764 -79942 129340 -75213 42391
6164D2391J28094k38427n5826L37554j34650m2120J2790j02736J53176j54817
$$ 42391 170485 -67942 -123768 213786 79136 37016 49806 -52930 100246 -54571
6154e4571J17838j51661n6924J99629M23304k43912m72836K22234M35492l94020
$$ -54571 63267 -88394 -145318 54311 477615 233703 -239133 -16899 418593 24573
6144B4573q5260n7806P0011K83047M98233m14485j39578J06832K74369k44763
$$ 24573 -60687 -118493 -48482 234565 732798 318313 178735 285567 559936 315173
6134C15173o4540k01355L34486m0706j4630R5715N3287k68465L08918K16959o34099
$$ 315173 250633 49278 383764 343058 328428 424143 477430 208965 517883 734842 100743
6123A00743j03658K91784l5792k37884J27609q2005j5926k78545K10724m4209
$$ 100743 -2915 288869 253077 15193 142802 60797 44871 -233674 -22950 -67159
6113f7159J63433k35632J30028Q893K10759J45399O2106J9248o02742k48181L36744
$$ -67159 96274 -139358 -9330 -437 210322 355721 417827 437075 -165667 -413848 -77104
6102g7104K17901J72300N2301J79504k33145J63617J08682m53090j41304N26213
$$ -77104 140797 313097 365398 544902 311757 475374 584056 130966 -10338 515875
6092E15875j15692n1500Q5844o67602N26619j7251j22074j34056K56251k21142
$$ 515875 400183 348683 434527 -233075 293544 276293 154219 20163 276414 55272
6082E5272J3742K02344R4744l30019J83307l77750R3514J9280L81288q7962n2200
$$ 55272 69014 271358 366102 36083 219390 -158360 -64846 -45566 335722 247760 195560
6071A95560J84475l24561k29892N58910k53976m5428K19624q5911K35702l9479
$$ 195560 380035 55474 -174418 384492 130516 85088 304712 218801 454503 415024
6061D15024k54020O4219j04978m03727K12405L36318L8766k97376P3248R0231
$$ 415024 161004 225223 120245 -283482 -71077 265241 304007 6631 79879 170110
6051A70110K76160J07162K40356k29899j50470l19601K19139N1089m671k37395
$$ 170110 446270 553432 793788 563889 413419 93818 312957 364046 359375 121980
6041A21980o9018J73530K97877m1945J001j87331r2708j92364L62217k52563N15512
$$ 121980 52962 226492 524369 482424 483425 296094 203386 11022 373239 120676 636188
6030F36188k20059j49113L2698m1214K63433J29966m27877K04584L30985n21021
$$ 636188 416129 267016 299714 258500 521933 651899 224022 428606 759591 238570
6020B38570k56117K13853J17234k91961j07809K87312j61952p6815j50899m3803
$$ 238570 -17547 196306 313540 21579 -86230 201082 39130 -37685 -188584 -232387
6010b32387M3025J9274M56895K10682K846j82571j87562j0973K09044J23845l75679
$$ -232387 -189362 -170088 286807 497489 500335 317764 130202 119229 328273 452118 76439
5999G6439o9516N20511k07523q3415j94122M6203K58235l58402k2426p3426j5766
$$ 76439 6923 527434 319911 236496 42374 88577 346812 -11590 -34016 -107442 -123208
5988a23208J53766K86041Q3714j03364K78784q17699Q1566N76771r6850o56075
$$ -123208 30558 316599 400313 296949 575733 -241966 -160400 416371 319521 -336554
5978c36554K13846L05375J03744M22541j48329r9493L47029J73658J09949k35636
$$ -336554 -122708 182667 286411 708952 560623 461130 808159 981817 1091766 856130
5968H56130O216N6052l97283R1347k20649J34331N7303P6144L2706o4098K66139
$$ 856130 862346 918398 521115 612462 391813 526144 583447 659591 692297 628199 894338
5957H94338Q9642J85144o8912k31486K36741q0138J00547n0303k44628K70907
$$ 894338 983980 1169124 1100212 868726 1105467 1025329 1125876 1075573 830945 1101852
5947A101852L9181k02266k92586M1116K60046k28491l55726K14328j14936p3166
$$ 1101852 1141033 938767 646181 687297 947343 718852 363126 577454 462518 389352
5937C89352J83053J90159R6356L61531K28170M33692L3805O5406j58099l65607
$$ 389352 572405 762564 858920 1220451 1448621 1882313 1916118 1981524 1823425 1457818
5927A457818j34843K4965j86442K9040l5759J20170o35862q6370l4110J62434
$$ 1457818 1322975 1347940 1161498 1190538 1154779 1274949 639087 552717 518607 681041
5917F81041M01713J65713j8434j17882p2093K92785M74589J45882L079k85789
$$ 681041 1082754 1248467 1230033 1112151 1040058 1332843 1807432 1953314 1956393 1670604
5907A670604K82045J95035j85483j24675p4428m57074o3418O5462Q4704L73427
$$ 1670604 1952649 2147684 1962201 1837526 1763098 1306024 1242606 1308068 1392772 1766199
5897A766199n1079n95010L57000N02162K18937j73768j91039K70113M25687J53623
$$ 1766199 1715120 1120110 1477110 1979272 2198209 2024441 1833402 2103515 2529202 2682825
5887B682825k18673n08553j72073K318J58256k56476J75661K54747m49051j22020
$$ 2682825 2464152 1955599 1783526 1785844 1944100 1687624 1863285 2118032 1668981 1546961
5877A546961K17956k48784M59j48390L98361N44430Q7811j42729l75578j23469
$$ 1546961 1764917 1516133 1516592 1368202 1766563 2310993 2398804 2256075 1880497 1757028
5867A757028O6225L01077P9423K84263J67076j78770l74595J89297j15689l98487
$$ 1757028 1823253 2124330 2203753 2488016 2655092 2476322 2101727 2291024 2175335 1776848
5857A776848o2022K58578j88018j42617M76484m38199K14987j30854k53250k35707
$$ 1776848 1714826 1973404 1785386 1642769 2119253 1681054 1896041 1765187 1511937 1276230
5847A276230l50541o05k2322j63267n8430K79743J97733L4874m35230l2638J46562
$$ 1276230 925689 925084 902762 739495 681065 960808 1158541 1193415 758185 725547 872109
5836H72109K75349r4015J99681j19135J56762K27558k93380J27770K03643p7929
$$ 872109 1147458 1053443 1253124 1133989 1290751 1518309 1224929 1352699 1556342 1478413
5826A478413N14499j24470j60167K24632j85484l58447J78610O05429m0877n67472
$$ 1478413 1992912 1868442 1708275 1932907 1747423 1388976 1567586 2173015 2132138 1564666
5816A564666k45342K45925k07905j36102L76054l1782n36774L12464K2635j84502
$$ 1564666 1319324 1565249 1357344 1221242 1597296 1565514 1028740 1341204 1363839 1179337
5806A179337l92602j04169L72875k5534k44623P7492K1447L18782k8280l81212
$$ 1179337 786735 682566 1055441 1029907 785284 862776 884223 1203005 1174725 793513
5796G93513r3950R317j82698N27894L10773k09939O4523j47043j2714J09819R2820
$$ 793513 699563 708880 526182 1054076 1364849 1154910 1219433 1072390 1059676 1169495 1262315
5785A262315J47812n3956k24039j54084k19389K61395q9239j00243K1695L11396
$$ 1262315 1410127 1356171 1132132 978048 758659 1020054 930815 830572 852267 1163663
5775A163663K83533o55407Q3295j5241J15818j56207j21036n9527L71601M05158
$$ 1163663 1447196 791789 875084 859843 975661 819454 698418 638891 1010492 1415650
5765A415650j73029L6996J83248J7111l32772N8372L82935J29278n5665k28705
$$ 1415650 1242621 1279617 1462865 1479976 1147204 1205576 1588511 1717789 1662124 1433419
5755A433419m1714j66807j50634J82753j32262J32998j70676J14072j37617K70139
$$ 1433419 1391705 1224898 1074264 1257017 1124755 1257753 1087077 1201149 1063532 1333671
5745A333671L03635P1656q8673M62498k69758J546j42765p1976k75089k58964
$$ 1333671 1637306 1708962 1620289 2082787 1813029 1814575 1671810 1599834 1324745 1065781
5735A065781P28888k8298l54026k09255K54937L7079j76536J72639n9922j43588
$$ 1065781 1794669 1766371 1412345 1203090 1458027 1495106 1318570 1491209 1431287 1287699
5725A287699L79745k09729j13549R9609J60066O1811l03578M66061n1227o32890
$$ 1287699 1667444 1457715 1344166 1443775 1603841 1665652 1362074 1828135 1776908 1144018
5715A144018o4214Q0878R5385M01662R9441l12109j73150N1530k9043r901O3941
$$ 1144018 1079804 1160682 1256067 1657729 1757170 1445061 1271911 1323441 1294398 1284497 1348438
5704A348438l94633K0012l998M21596l88424l6470J04793N7464K01303O4203j31958
$$ 1348438 953805 973817 969819 1391415 1002991 966521 1071314 1128778 1330081 1394284 1262326
5693A262326k75339J46820j16637K30304J15608k07233J1197n115Q0338j93501
$$ 1262326 986987 1133807 1017170 1247474 1363082 1155849 1167046 1161931 1242269 1048768
5683A048768m66703L06249J61116M7650Q2856l24406L25124J50410r2335j4489
$$ 1048768 582065 888314 1049430 1097080 1179936 855530 1180654 1331064 1238729 1224240
5673A224240j30846k94955J316O8343L66086J1959q6888K1237N7680P8182n53736
$$ 1224240 1093394 798439 799755 868098 1234184 1246143 1159255 1180492 1238172 1316354 762618
5662G62618k72847L78950N81570l24701j97968J70274M02469k17852k43539q7421
$$ 762618 489771 868721 1450291 1125590 927622 1097896 1500365 1282513 1038974 951553
5652I51553L26391j01004K27320j54496k72042j25817L67591j93653j40691Q5635
$$ 951553 1277944 1176940 1404260 1249764 977722 851905 1219496 1025843 885152 970787
5642I70787k68322K68529L9544q9845P5940R5622k01226j93102J28189J57893
$$ 970787 702465 970994 1010538 920693 996633 1092255 891029 697927 826116 984009
5632I84009Q8808k63547l705o6401p2313P15569p3246r8174m7448J78616j87026
$$ 984009 1072817 809270 805565 739164 666851 1382420 1309174 1211000 1163552 1342168 1155142
5621A155142q6164j64729K13990L55216m32202m688L24002J46809L83343l12227
$$ 1155142 1068978 904249 1118239 1473455 1041253 1036565 1360567 1507376 1890719 1578492
5611A578492J87221O3960j77248K20765j40653k64252o675N095p8299J47034J47477
$$ 1578492 1765713 1829673 1652425 1873190 1732537 1468285 1461610 1466705 1388406 1535440 1682917
5600A682917j16765l30357r2496J82599J63590Q4824k15199L76637M35313K288
$$ 1682917 1566152 1235795 1143299 1325898 1489488 1574312 1359113 1735750 2171063 2173351
5590B173351j11116l48856L99540J68484l17159L1331L5774m25366r3657l8679
$$ 2173351 2062235 1713379 2112919 2281403 1964244 1995575 2031349 1605983 1512326 1473647
5580A473647L19208L88308j65579o6519K49160J76216p1894j24021K03473J48106
$$ 1473647 1792855 2181163 2015584 1949065 2198225 2374441 2302547 2178526 2381999 2530105
5570B530105o8068N19969L84399l05392r2751j09555q4881K57623p7816q9142
$$ 2530105 2462037 2982006 3366405 3061013 2968262 2858707 2773826 3031449 2953633 2864491
5560B864491J88330J61612M34237k26681k51860r6255K92891K20028R0975j8554
$$ 2864491 3052821 3214433 3648670 3421989 3170129 3073874 3366765 3586793 3677768 3659214
5550C659214l00478J0645J73085L64148K95707J72652R1297J48550j32330L46153
$$ 3659214 3358736 3369381 3542466 3906614 4202321 4374973 4466270 4614820 4482490 4828643
5540D828643J95434O47709K78309N6695J51862L55139p6138J30962M2393m16219
$$ 4828643 5024077 5671786 5950095 6006790 6158652 6513791 6437653 6568615 6611008 6194789
5530F194789N0287N99J49029K35935k3376K3691N49894L26295K54486N03074L36566
$$ 6194789 6245076 6245675 6394704 6630639 6607263 6630954 7180848 7507143 7761629 8264703 8601269
5519H601269M36375O27637Q73443M02884j3899r2486K30362p2246q51265p64214
$$ 8601269 9037644 9665281 10538724 10941608 10927709 10835223 11065585 10993339 10142074 9377860
5509I377860m62119j61407L17694L97580J59945L6690J71814l19532N41517M70224
$$ 9377860 8915741 8754334 9072028 9469608 9629553 9666243 9838057 9518525 10060042 10530266
5499A0530266O45715R33271O57593O85137Q18685Q26504J16611K25289L56457
$$ 10530266 11175981 12109252 12766845 13451982 14270667 15097171 15213782 15439071 15795528
5490A5795528J06832j82815j49486q00340p86313o44626J69935Q9761O0833O3250
$$ 15795528 15902360 15719545 15570059 14769719 13983406 13338780 13508715 13598476 13659309 13722559
5480A3722559L72022K68763N78172P17906P71874J129016J264705O08781J091765
$$ 13722559 14094581 14363344 14941516 15659422 16431296 17560312 18825017 19433798 20525563
5471B0525563Q64009J5503K31372K42021n69436n36569j148382r26712r59409
$$ 20525563 21389572 21405075 21636447 21878468 21309032 20772463 19624081 18697369 17737960
5462A7737960r08716n26431j89665K4842n482j37J72370O12484O24823O11307
$$ 17737960 16829244 16302813 16113148 16137990 16132508 16132371 16304741 16917225 17542048 18153355
5452A8153355N93993P74622Q88876M28040m79914O6681m42082r09648j65567J65848
$$ 18153355 18747348 19521970 20410846 20838886 20358972 20425653 19983571 19073923 18908356 19074204
5442A9074204l66906o4239M00564N16486L07421K26643K78795Q05371M6941M3291
$$ 19074204 18707298 18643059 19043623 19560109 19867530 20094173 20372968 21178339 21225280 21268571
5432B1268571p0608m04971o58967k24891J47128n0464K86624J82586N75318N40553
$$ 21268571 21197963 20792992 20134025 19909134 20056262 20005798 20292422 20475008 21050326 21590879
5422B1590879P04952P00816Q81874J673503J258104J497833J840535J745223J552352
$$ 21590879 22295831 22996647 23878521 25552024 26810128 28307961 30148496 31893719 33446071
5413C3446071R82749M58636J85902K43353L1498k30486p48212Q08890J430624
$$ 33446071 34428820 34887456 35073358 35316711 35348209 35117723 34369511 35178401 36609025
5404C6609025J859697J856805J960145J905134J770980K392682J719732J606055
$$ 36609025 38468722 40325527 42285672 44190806 45961786 48354468 50074200 51680255
5396E1680255J659938J095297J256818J011300O58611K95468m37844q22013j037979
$$ 51680255 53340193 54435490 55692308 56703608 57362219 57657687 57219843 56397830 55359851
5387E5359851j498605r18863k9565P34998Q60417J310724K126095K002575K904763
$$ 55359851 53861246 52942383 52912818 53647816 54508233 55818957 57945052 59947627 62852390
5378F2852390L496572M028936M700115M845292M232771M589623L352875K103212
$$ 62852390 66348962 70377898 75078013 79923305 84156076 88745699 92098574 94201786
5370I4201786J134638o03365j805155l197316m309836m693396n137495m653520
$$ 94201786 95336424 94733059 92927904 89730588 85420752 80727356 75589861 70936341
5362G0936341m307772l646327l146157j971117j296510j024911r9766K11253P93783
$$ 70936341 66628569 62982242 59836085 57864968 56568458 55543547 55443781 55655034 56448817
5353E6448817R12568J051879K062801K484811K607830K740234K001410Q86422
$$ 56448817 57361385 58413264 60476065 62960876 65568706 68308940 70310350 71196772
5345G1196772n81500k997918l764192m370057m799257m864554m157738l730319
$$ 71196772 70615272 67617354 63853162 59483105 54683848 49819294 45661556 41931237
5337D1931237l301141k680246k838560k197826j631024j624272j426698j204578
$$ 41931237 38630096 35949850 33111290 30913464 29282440 27658168 26231470 25026892
5329B5026892j279543r26179q48129q96686r19859n43049n72767q20155p00450
$$ 25026892 23747349 22821170 21973041 21076355 20156496 19613447 19040680 18220525 17520075
5320A7520075m47482k44978k81861n87022l85390p93333k70059m72279p5523l89828
$$ 17520075 17072593 16827615 16545754 15958732 15573342 14780009 14509950 14037671 13962148 13572320
5310A3572320k03146K69981l79414L0238q79032N475m20662M8071N81982q5405
$$ 13572320 13369174 13639155 13259741 13289979 12410947 12416422 11995760 12043831 12625813 12540408
5300A2540408R5924j43649j03941J25792n7629m86596o80594L37278j76535n68231
$$ 12540408 12636332 12492683 12388742 12514534 12456905 11970309 11289715 11626993 11450458 10882227
5290A0882227j22168o7146J84498k20497M7779R774L3414p3498L17411q0095k74882
$$ 10882227 10760059 10692913 10877411 10656914 10704693 10714467 10747881 10674383 10991794 10911699 10636817
5279A0636817k09377L79403K45676j68713K60813j43696j56828J64381L6855K79488
$$ 10636817 10427440 10806843 11052519 10883806 11144619 11000923 10844095 11008476 11045331 11324819
5269A1324819j51203l31448l82224O09055J2365K88352J29019k382j63620m3488
$$ 11324819 11173616 10842168 10459944 11068999 11081364 11369716 11498735 11496353 11332733 11289245
5259A1289245L27292M5174k4802o038J15214M01154M01831j32876M7586J96215
$$ 11289245 11616537 11661711 11636909 11630871 11746085 12147239 12549070 12416194 12463780 12659995
5249A2659995n954J84915M79470M49559j8980M40833P81727J51937J59447L09611
$$ 12659995 12654041 12838956 13318426 13767985 13749005 14189838 14971565 15123502 15282949 15592560
5239A5592560n3534Q78133K85646k91528N77247N52147N66301L17814l1730L60453
$$ 15592560 15539026 16417159 16702805 16411277 16988524 17540671 18106972 18424786 18393056 18753509
5229A8753509R76746K53872J016506J177949M52916Q21676J474495J003168J239510
$$ 18753509 19730255 19984127 21000633 22178582 22631498 23453174 24927669 25930837 27170347
5220B7170347J316661J933999K159402J680629J892528K146731K014783K247812
$$ 27170347 28487008 30421007 32580409 34261038 36153566 38300297 40315080 42562892
5212D2562892K056818J448108J428840J496481Q33153J020055O10027P59083J165369
$$ 42562892 44619710 46067818 47496658 48993139 49826292 50846347 51456374 52215457 53380826
5203E3380826J267066J056375J49613P89144J198880Q05104J596039J956690K179310
$$ 53380826 54647892 55704267 55853880 56643024 57841904 58647008 60243047 62199737 64379047
5194F4379047K710465L239799L314058L474952L839825K842322K656588J732879
$$ 64379047 67089512 70329311 73643369 77118321 80958146 83800468 86457056 88189935
5186H8189935J523503J019322L89997o1535p05459q92030j102873j231573j922658
$$ 88189935 89713438 90732760 91122757 91061222 90355763 89463733 88360860 87129287 85206629
5177H5206629j572888j168765j331943p67117n61687n44486P5047L10483L48840
$$ 85206629 83633741 82464976 81133033 80365916 79804229 79259743 79334790 79645273 79994113
5168G9994113M59488J372365Q02304K55306M04220K00863k67743m87601j278339
$$ 79994113 80453601 81825966 82628270 82883576 83287796 83488659 83220916 82733315 81454976
5159H1454976j405746j834058k278664k061453k999781k647388j860573k660207
$$ 81454976 80049230 78215172 75936508 73875055 70875274 68227886 66367313 63707106
5151F3707106k593986l100747k540690k906492j927940k078935k121700j603888
$$ 63707106 61113120 58012373 55471683 52565191 50637251 48558316 46436616 44832728
5143D4832728j470647j017245p88471r31885j016593k72318r73851l97770r49341
$$ 44832728 43362081 42344836 41556365 40624480 39607887 39335569 38361718 37963948 37014607
5134C7014607n99936o09990j100329j632350j586808j630636j621834k318912
$$ 37014607 36414671 35804681 34704352 33072002 31485194 29854558 28232724 25913812
5126B5913812j917163j242862r54789j557143j299870n58936o85158o62242j079029
$$ 25913812 23996649 22753787 21798998 20241855 18941985 18383049 17697891 17035649 15956620
5117A5956620m93274m36794k76600k89612n75376k85779l41363n22583m98897
$$ 15956620 15463346 15026552 14749952 14460340 13884964 13599185 13257822 12735239 12236342
5108A2236342j95796j19994m696K2969o57115p82605j87572m37332r7276R2579
$$ 12236342 12040546 11920552 11915856 11938825 11281710 10499105 10311533 9874201 9776925 9869504
5098I869504k76410n40598m6486j34767l19777M824K896l50041k70786m08658
$$ 9869504 9593094 9052496 9006010 8871243 8551466 8556290 8559186 8209145 7938359 7529701
5088G529701o1526K35814k66016j11675j73422K3992k05060k13141p2064p6113
$$ 7529701 7468175 7703989 7437973 7326298 7152876 7176868 6971808 6758667 6686603 6610490
5078F610490k12772R0163P3848k39804m85414L45105J5415k31552k76965l10669
$$ 6610490 6397718 6487881 6561729 6321925 5836511 6181616 6197031 5965479 5688514 5377845
5068E377845K21894k32977k09113l2485J01231O2774k05841J51073j59716j48727
$$ 5377845 5599739 5366762 5157649 5125164 5226395 5289169 5083328 5234401 5074685 4925958
5058D925958M8346n9186K06962n52211K75166k1319j47324l28443J79910r0031
$$ 4925958 4974304 4915118 5122080 4569869 4845035 4823716 4676392 4347949 4527859 4437828
5048D437828M67036l9376r635k21786k95853L01748j90757n8623k32668J10930
$$ 4437828 4904864 4865488 4855853 4634067 4338214 4639962 4449205 4390582 4157914 4268844
5038D268844j59582M81981l10134l76073k95730o8608O448j89074L10911K59392
$$ 4268844 4109262 4591243 4281109 3905036 3609306 3540698 3547146 3358072 3668983 3928375
5028C928375K36673l99399k51901j93426l88873L6550j76137L3440j21095l772
$$ 3928375 4165048 3765649 3513748 3320322 2931449 2967999 2791862 2825302 2704207 2700435
5018B700435K71310O7591j30595j04407J61366k41111m4703N1785J00683k04813
$$ 2700435 2971745 3039336 2908741 2804334 2965700 2724589 2679886 2731671 2832354 2627541
5008B627541K68763L36072o65991k24628Q0740K06402P7393j19508r8075k83536
$$ 2627541 2896304 3232376 2566385 2341757 2422497 2628899 2706292 2586784 2488709 2205173
4998B205173J0057M36080j6308j34008k70338k74789l00007J84374o8869j27305
$$ 2205173 2215230 2651310 2635002 2500994 2230656 1955867 1655860 1840234 1771365 1644060
4988A644060J74111p2623K61789Q7933j15271j33176r8288Q5565n0716L72081
$$ 1644060 1818171 1745548 2007337 2095270 1979999 1846823 1748535 1834100 1783384 2155465
4978B155465j41809N1334p3159m7756R8707l36695J40874J92295k96859M18064
$$ 2155465 2013656 2064990 1991831 1944075 2042782 1706087 1846961 2039256 1742397 2160461
4968B160461R4471nl17970j72419k74424j24668M58726O4066L04903N3876k43401
$$ 2160461 2254932 2254927 1936957 1764538 1490114 1365446 1824172 1888238 2193141 2247017 2003616
4957B003616k09713j92795J30622L99586l97016L47310k8108j33453K83452J7946
$$ 2003616 1793903 1601108 1731730 2131316 1734300 2081610 2053502 1920049 2203501 2221447
4947B221447k25243l58316J98125J80751O8469j14790k327J34258P0406j10792
$$ 2221447 1996204 1637888 1836013 2016764 2085233 1970443 1968116 2102374 2172780 2061988
4937B061988l81538K03289J79195p0738K36946J2006k49194o882O44166j55161
$$ 2061988 1680450 1883739 2062934 1992196 2229142 2241148 1991954 1985072 2629238 2474077
4927B474077r5317k5840R2163j23120K35177k6504K63494l72777j68831L37947
$$ 2474077 2378760 2352920 2445083 2321963 2557140 2530636 2794130 2421353 2252522 2590469
4917B590469K14181j13189M8408J36436m0133J37886k54839M3521n74377L07430
$$ 2590469 2804650 2691461 2739869 2876305 2836172 2974058 2719219 2762740 2188363 2495793
4907B495793K52235J64363J47908q9372m85984J98287j28938N4227L63876k6217
$$ 2495793 2748028 2912391 3060299 2970927 2484943 2683230 2554292 2608519 2972395 2946178
4897B946178q5205l1742P2842R8188J7940L90894M354j57455J91283P85549k66730
$$ 2946178 2860973 2829231 2902073 3000261 3018201 3409095 3413449 3255994 3447277 4232826 3966096
4886C966096j64152K0702L8055L22857j34257n18109L04118O25610K3672k21076
$$ 3966096 3801944 3822646 3860701 4183558 4049301 3531192 3835310 4460920 4484592 4263516
4876D263516j92835L16222P34227K10903O3216L8694J84498J634J98438L02791
$$ 4263516 4070681 4386903 5121130 5332033 5395249 5433943 5618441 5620075 5818513 6121304
4866F121304k53586Q4032M56849P38811N28251K63313N2917N85859Q2976M64818
$$ 6121304 5867718 5951750 6408599 7147410 7675661 7938974 7991891 8577750 8660726 9125544
4856I125544O66677N42265K49709N12575N78559O47225R85396R00761J060655
$$ 9125544 9792221 10334486 10584195 11096770 11675329 12322554 13307950 14208711 15269366
4847A5269366J113924J529662J416744J822413K316860K709574K612393L217227
$$ 15269366 16383290 17912952 19329696 21152109 23468969 26178543 28790936 32008163
4839C2008163L553810L772880L909065L073583J345371r35924l094003m005531
$$ 32008163 35561973 39334853 43243918 46317501 47662872 46726948 43632945 39627414
4831C9627414m373159l793034l390714l223240k485518j923006j323761j204113
$$ 39627414 35254255 31461221 28070507 24847267 22361749 20438743 19114982 17910869
4823A7910869j330719j152876q80263j237073o79324p14329o89944n33672k72110
$$ 17910869 16580150 15427274 14547011 13309938 12630614 11916285 11226341 10692669 10420559
4814A0420559m71979j64385N8949l05640k14542o1608K42424o0763O4608J81481
$$ 10420559 9948580 9784195 9843144 9537504 9322962 9261354 9503778 9443015 9507623 9689104
4804I689104l41691j43116L50496K38971R6672j99321N1654L6884M46656N02375
$$ 9689104 9347413 9204297 9554793 9793764 9890436 9691115 9742769 9779653 10226309 10728684
4794A0728684l03447L5921K89513O01429J11057O35544Q00617N09688Q74214M93018
$$ 10728684 10425237 10461158 10750671 11352100 11463157 12098701 12899318 13409006 14283220 14776238
4784A4776238P36584J189763J286114J670765J806597K148076K002865L132173
$$ 14776238 15512822 16702585 17988699 19659464 21466061 23614137 25617002 28749175
4776B8749175L445355L531575L548924M143650L910035K973530R15180q19245
$$ 28749175 32194530 35726105 39275029 43418679 47328714 50302244 51217424 50398179
4768E0398179k947709l993987m640973m262898m446467l647644k743799k662797
$$ 50398179 47450470 43456483 38815510 34552612 30106145 26458501 23714702 21051905
4760B1051905j814795j831911j170232j345986j246314q10157o80352q76288o29116
$$ 21051905 19237110 17405199 16234967 14888981 13642667 12832510 12152158 11275870 10646754
4751A0646754n09544p66700r92659n06529j98593k50430k45373k14433j32013
$$ 10646754 10137210 9370510 8377851 7871322 7672729 7422299 7176926 6962493 6830480
4742F830480m74955k63148p3526l28837k09067r7096j84545l26203j8789n51425
$$ 6830480 6355525 6092377 6018851 5690014 5480947 5383851 5199306 4873103 4854314 4302889
4732D302889j06319O9867l96715q8155J93278J35805k60198k29334J47267k29866
$$ 4302889 4196570 4266437 3869722 3781567 3974845 4110650 3850452 3621118 3768385 3538519
4722C538519k37880k56738M61473j40344l66246o0947p635j29344K49736j73267
$$ 3538519 3300639 3043901 3505374 3365030 2998784 2937837 2930202 2800858 3050594 2877327
4712B877327n60020l2339J64761L47279q6153m09055l3386M75148K88596m85427
$$ 2877327 2317307 2284968 2449729 2797008 2710855 2301800 2268414 2743562 3032158 2546731
4702B546731m86573M32389M7967m69517m03595J67164N95080j06986q0295k34474
$$ 2546731 2060158 2492547 2540514 2070997 1667402 1834566 2429646 2322660 2242365 2007891
4692B007891K26040n01848k40256L89813O2974j54026k754L9298l51339K51780
$$ 2007891 2233931 1732083 1491827 1881640 1944614 1790588 1787834 1827132 1475793 1727573
4682A727573j76012j55063k1701l62936K78150m7767K29481K3710L70059q2484
$$ 1727573 1551561 1396498 1374797 1011861 1290011 1242244 1471725 1495435 1865494 1783010
4672A783010k46754k40761O175P8477j8224L42881M0510j55096j47312m683k52721
$$ 1783010 1536256 1295495 1301670 1380147 1361923 1704804 1745314 1590218 1442906 1438223 1185502
4661A185502J76255R7718k82310o8736m07331M18665J50582l03639k2710l4847
$$ 1185502 1361757 1459475 1177165 1108429 701098 1119763 1270345 966706 943996 909149
4651I09149j18061L69058M13512l65936J95331l80139K67522j8378j08525j65922
$$ 909149 791088 1160146 1573658 1207722 1403053 1022914 1290436 1272058 1163533 997611
4641I97611Q5734J54940J77215k75304j66203K33574k31725m15013K5724M80587
$$ 997611 1083345 1238285 1415500 1140196 973993 1207567 975842 560829 586553 1067140
4631A067140m4266k44567l02307M51716O5585Q0048L52970l0066K5989o9544k55106
$$ 1067140 1022874 778307 476000 927716 993301 1073349 1426319 1396253 1422242 1352698 1097592
4620A097592l7507J75953k89528J21012j60585l08138K69465o1463J27470k8632
$$ 1097592 1060085 1236038 946510 1067522 906937 598799 868264 806801 934271 905639
4610I05639m18684j6986K07479J5969J12245M12380j74509p5292L48410l0856
$$ 905639 486955 469969 677448 693417 805662 1218042 1043533 968241 1316651 1285795
4600A285795J64722O7182k45151K53562m45561K6544j81426l1641j7811j0495
$$ 1285795 1450517 1517699 1272548 1526110 1080549 1107093 925667 894026 876215 865720
4590H65720K28758K30634j0021j44652k61782M47884O4138l56105K57490K11379
$$ 865720 1094478 1325112 1315091 1170439 908657 1356541 1420679 1064574 1322064 1533443
4580A533443J15774L46382m33567l10365M94560Q6994n20867L28535J08458j95172
$$ 1533443 1649217 1995599 1562032 1251667 1746227 1833221 1312354 1640889 1749347 1554175
4570A554175o1398j1361k85340J91056N18981j21764k18586n1524k61317j76527
$$ 1554175 1492777 1481416 1196076 1387132 1906113 1784349 1565763 1514239 1252922 1076395
4560A076395K5218K93272J98166K05928k38479L56923J91140o16152M27675l21028
$$ 1076395 1101613 1394885 1593051 1798979 1560500 1917423 2108563 1492411 1920086 1599058
4550A599058J44001L3667j50304p1383L56508j98872j71656K43601L01425l11379
$$ 1599058 1743059 1776726 1626422 1555039 1911547 1712675 1541019 1784620 2086045 1774666
4540A774666L73588n0448N1977L0232L70668r0226j94624L25389O2383M1051L36036
$$ 1774666 2148254 2097806 2149783 2180015 2550683 2460457 2265833 2591222 2653605 2694656 3030692
4529C030692j25499m66822j01635Q9975k73440J5910J96844J38584j22189M3327
$$ 3030692 2905193 2438371 2336736 2426711 2153271 2169181 2366025 2504609 2382420 2425747
4519B425747J92171K81405L45919n85600l18062K78473J94962r4834j79775K21492
$$ 2425747 2617918 2899323 3245242 2659642 2341580 2620053 2815015 2720181 2540406 2761898
4509B761898L36980P8639O1684r8222K37988L3616L37593m17242o20789j49500
$$ 2761898 3098878 3177517 3239201 3140979 3378967 3412583 3750176 3332934 2712145 2562645
4499B562645k79965j07770q0269j61367m76M0134M58738j42834r1267L64816J34726
$$ 2562645 2282680 2174910 2094641 1933274 1932798 1972932 2431670 2288836 2197569 2562385 2697111
4488B697111J21140N1036l28781l99096K003L46467j68993l03898K15656L0348
$$ 2697111 2818251 2869287 2540506 2141410 2143413 2489880 2320887 2016989 2232645 2262993
4478B262993J7456j62626K20776J39931K3196m94218k4450K30108O223l81564
$$ 2262993 2280449 2117823 2338599 2478530 2501726 2007508 1983058 2213166 2219389 1837825
4468A837825J48628L49211o36387p4415O1294N7326N2674l89264K31766N52570
$$ 1837825 1986453 2335664 1699277 1624862 1686156 1743482 1796156 1406892 1638658 2191228
4458B191228L84082l41438l24050N76275k37702p6885J8704j88589J41822J7677
$$ 2191228 2575310 2233872 1909822 2486097 2248395 2171510 2190214 2001625 2143447 2161124
4448B161124K9997K63441J21186L6317N4050J88677k84527J64690k09375n78406
$$ 2161124 2191121 2454562 2575748 2612065 2666115 2854792 2570265 2734955 2525580 1947174
4438A947174L23038J48817L99826j46883o0246P7375m36758O7219L77453m1605
$$ 1947174 2270212 2419029 2818855 2671972 2611726 2689101 2252343 2319562 2697015 2655410
4428B655410l08729N9068K24452O7901j38195o1070p9376k56782N4101K73530
$$ 2655410 2346681 2405749 2630201 2698102 2559907 2498837 2419461 2162679 2216780 2490310
4418B490310K18947O4217m18631n16757M7867O27288R8122R5577k66709J45578
$$ 2490310 2709257 2773474 2354843 1838086 1885953 2513241 2611363 2706940 2440231 2585809
4408B585809L96018j8886l37051L09432L44066o5962M3734J43720o2197J57676
$$ 2585809 2981827 2962941 2625890 2935322 3279388 3213426 3257160 3400880 3338683 3496359
4398C496359l9558j54093M02855m48069o9509J18550n08751n2921K57690N3116
$$ 3496359 3456801 3302708 3705563 3257494 3187985 3306535 2797784 2744863 3002553 3055669
4388C055669J76388n7771l72914L87805L09078J29842j82549l2874m7485j8094
$$ 3055669 3232057 3174286 2801372 3189177 3498255 3628097 3445548 3412674 3365189 3347095
4378C347095O49878J19908K34937k58136M22011M61187l52803j59577k46140L37041
$$ 3347095 3996973 4116881 4351818 4093682 4515693 4976880 4624077 4464500 4218360 4555401
4368D555401J0511m04783K57388M57975k44397P4172r2699L6372P3521l4634O37804
$$ 4555401 4565912 4161129 4418517 4876492 4632095 4706267 4613568 4649940 4723461 4688827 5326631
4357E326631j74889P8323K27973M18431j40229k83540J0917L65048K71727j72282
$$ 5326631 5151742 5230065 5458038 5876469 5736240 5452700 5463617 5828665 6100392 5928110
4347E928110K33215K73851R4875K75302l2016J29330j13824m6487L74840K93908
$$ 5928110 6161325 6435176 6530051 6805353 6773337 6902667 6788843 6742356 7117196 7411104
4337G411104r8996O5978j0057J09835R04755Q92255j71055J8276J71753M8220
$$ 7411104 7312108 7378086 7368029 7477864 8382619 9274874 9103819 9122095 9293848 9342068
4327I342068M46723M72174K37165m0691N09410J66282O41013M29189n3344J06838
$$ 9342068 9788791 10260965 10498130 10457439 10966849 11133131 11774144 12203333 12149989 12256827
4317A2256827P84084Q62373N88891Q86143N53564J041963J202391J055790J564777
$$ 12256827 13040911 13903284 14492175 15378318 15931882 16973845 18176236 19232026 20796803
4308B0796803J360427R32518J556074J214130K62486j3519n22921j545122j384217
$$ 20796803 22157230 23089748 24645822 25859952 26122438 26108919 25585998 24040876 22656659
4299B2656659q80225q40548r3774n5722q10713n08420l8868m83343L04244J86813
$$ 22656659 21776434 20935886 20842112 20786390 19975677 19467257 19428389 18945046 19249290 19436103
4289A9436103J22545j44585N56824P11190L23504J94077O14525O79201N11110
$$ 19436103 19558648 19414063 19970887 20682077 21005581 21199658 21814183 22493384 23004494
4280B3004494M87896L91070P29042Q06927N54129N98020J021441Q57218N76298
$$ 23004494 23492390 23883460 24612502 25419429 25973558 26571578 27593019 28450237 29026535
4271B9026535M47015O11331J113260Q37950J094302J282602J404748J817076K226489
$$ 29026535 29473550 30084881 31198141 32036091 33130393 34412995 35817743 37634819 39861308
4262C9861308J593326J459795J585210K045469K349501K424146L201705L781026
$$ 39861308 41454634 42914429 44499639 46545108 48894609 51318755 54520460 58301486
4254E8301486M230329N010702N514563N753594P613057Q712849J0409588J2635001
$$ 58301486 62531815 67542517 73057080 78810674 86423731 95136580 105546168 118181169
4246A18181169J4010636J6488822J8190438J6226443Q540822m202689j4583248
$$ 118181169 132191805 148680627 166871065 183097508 191638330 187435641 172852393
4239A72852393j6354580j2825988r452818o646137m875873k322444k44039J113310
$$ 172852393 156497813 143671825 134219007 127572870 122696997 120374553 120130514 121243824
4231A21243824L184985N370711P524376R457484J1345574J3992259J7136611K0544020
$$ 121243824 124428809 129799520 137323896 146781380 158126954 172119213 189255824 209799844
4223B09799844K5011927L0475693L6153461L8503336K8877606N230279k9841474
$$ 209799844 234811771 265287464 301440925 339944261 368821867 374052146 344210672
4216C44210672m9565958m8127160l8452455k8941158k2396195j7663805j4453291
$$ 344210672 294644714 246517554 208065099 179123941 156727746 139063941 124610650
4209A24610650j1840673r490917p707515n629356m925682m744536m731223m823503
$$ 124610650 112769977 103279060 95571545 89942189 85016507 80271971 75540748 70717245
4201G0717245m124642m530470k924957l181884k846202j947501k162735j804907
$$ 70717245 66592603 62062133 59137176 55955292 53109090 51161589 48998854 47193947
4193D7193947j244719j385642j420566r78421r68854r30160q35835n88296j071318
$$ 47193947 45949228 44563586 43143020 42164599 41195745 40265585 39429750 38841454 37770136
4184C7770136p84964o65641q95270m77087m68630p59492m65548k63662M06927
$$ 37770136 36985172 36319531 35424261 34947174 34478544 33719052 33253504 32989842 33396769
4175C3396769L97361L4871N67188q0492K81891K20842N85161K31935N4769N66241
$$ 33396769 33794130 33829001 34396189 34315697 34597588 34818430 35403591 35635526 35690295 36256536
4165C6256536M83945J041146J604928J411528J980235K663244K656747L150769
$$ 36256536 36740481 37781627 39386555 40798083 42778318 45441562 48098309 51249078
4157E1249078M233347M598565N685173P260292Q242245R531475J1976523J3913104
$$ 51249078 55482425 60080990 65766163 73026455 81268700 90800175 102776698 116689802
4149A16689802J4610624J1124826K176680j1341356j8253746j6989126j3096315
$$ 116689802 131300426 142425252 144601932 133260576 115006830 98017704 84921389
4142H4921389j0318300p647350n750110m564138l475602k532668r82661j91367
$$ 84921389 74603089 66955739 61205629 56641491 53165889 50633221 49650560 49459193
4134D9459193P19549J62069o11712k841567m548965m045056l259567k013480k105482
$$ 49459193 50178742 50340811 49729099 46887532 42338567 38293511 35033944 33020464 30914982
4125C0914982j878657j444285j041947r35874m72673k44847j014390o05934l47597
$$ 30914982 29036325 27592040 26550093 25614219 25141546 24896699 23882309 23276375 22928778
4116B2928778n0395o05530k39265k62941k47811p6050m1506m6436l09296j0622
$$ 22928778 22878383 22272853 22033588 21770647 21522836 21446786 21405280 21358844 21049548 21038926
4106B1038926J79103K70068K18843P60314Q72712R80046J447970J536762J408204
$$ 21038926 21218029 21488097 21706940 22467254 23339966 24320012 25767982 27304744 28712948
4097B8712948J887246K405527L265945M262162N290490O083674Q338772J0491768
$$ 28712948 30600194 33005721 36271666 40533828 45824318 51907992 60246764 70738532
4089G0738532R105283J908364j1688541j5006890j0622477p041407m862792k954815
$$ 70738532 79843815 81752179 70063638 55056748 44434271 37392864 32530072 29575257
4081B9575257k148721k302938j819252j233137q71953r78902q08184n88444j40849
$$ 29575257 27426536 25123598 23304346 22071209 21199256 20220354 19412170 18823726 18682877
4072A8682877p96253m33567m65011o54847m54928m77663n87413o63395N6088l03905
$$ 18682877 17886624 17453057 16988046 16333199 15878271 15400608 14813195 14149800 14205888 13901983
4062A3901983l12363l10162n54305K9925q0245K84070l63808j67010m05178k39296
$$ 13901983 13589620 13279458 12725153 12755078 12674833 12958903 12595095 12428085 12022907 11783611
4052A1783611o9677K34556L48408m63043k83652j15792K14684K82009N7921j54990
$$ 11783611 11713934 11948490 12296898 11833855 11550203 11434411 11649095 11931104 11989025 11834035
4042A1834035P31822J46683k61013j86010K66298L7061j09705K38436K65477J93173
$$ 11834035 12565857 12712540 12451527 12265517 12531815 12568876 12459171 12697607 12963084 13156257
4032A3156257N88206L25784J15236J4831N29012K39281M38480L20646j80604q7649
$$ 13156257 13744463 14070247 14185483 14200314 14729326 14968607 15407087 15727733 15547129 15459480
4022A5459480N2501K72623J78236l3823j65349J6274j01953J49342k60552K77788
$$ 15459480 15511981 15784604 15962840 15929017 15763668 15779942 15677989 15827331 15566779 15844567
4012A5844567J30716L24757l5655N57768P25028L36625L17893N66693J60517N39325
$$ 15844567 15975283 16300040 16264385 16822153 17547181 17883806 18201699 18768392 18928909 19468234
4002A9468234O28808j27697L04579O44918O33757O63347P48534M02026J165906
$$ 19468234 20097042 19969345 20273924 20918842 21552599 22215946 22964480 23366506 24532412
3993B4532412J015499J036830R61998J030941J659066J739573K158443K056565
$$ 24532412 25547911 26584741 27546739 28577680 30236746 31976319 34134762 36191327
3985C6191327J906087K076266J389049J479415O03652j0037P8190M3077n068M45906
$$ 36191327 38097414 40173680 41562729 43042144 43645796 43635759 43713949 43757026 43751958 44197864
3975D4197864K98683P26495P00193J188952J610591K140736K536656K390699L081795
$$ 44197864 44496547 45223042 45923235 47112187 48722778 50863514 53400170 55790869 58872664
3966E8872664L677145M458010L735043K554912J411107N10349M19506j2249j274179
$$ 58872664 62549809 67007819 70742862 73297774 74708881 75219230 75638736 75626487 74352308
3957G4352308j826623k886871l044475l135100k931938k583038k623866k316533
$$ 74352308 72525685 69638814 66594339 63459239 60527301 57944263 55320397 53003864
3949E3003864j914291j315635j082291n55924j69394k98172m03773j81483O88101
$$ 53003864 51089573 49773938 48691647 48135723 47966329 47668157 47264384 47082901 47771002
3940D7771002R22225P89784J080291R48971L77783P24606m8466p7227l81571j316333
$$ 47771002 48693227 49483011 50563302 51512273 51890056 52614662 52566196 52488969 52107398 50791065
3930E0791065o05144n15159l13177k37924m61982J8097Q7840O92895L01893J001939
$$ 50791065 50185921 49670762 49357585 49119661 48657679 48675776 48763616 49456511 49758404 50760343
3920E0760343N73280J075241J366338R94772J112067J531268J943482K243041
$$ 50760343 51333623 52408864 53775202 54769974 55882041 57413309 59356791 61599832
3912F1599832K154464K831515L648761M213707M807064N302034O481163P303964
$$ 61599832 63754296 66585811 70234572 74448279 79255343 84557377 91038540 98342504
3904I8342504Q481511J0041015J1971413J3283020J5961253J8588798K1841893
$$ 98342504 106824015 116865030 128836443 142119463 158080716 176669514 198511407
3897A98511407K3714544K7563642L1585827L4969437L1121856J5162418j1734244
$$ 198511407 222225951 249789593 281375420 316344857 347466713 362629131 350894887
3890C50894887l8790168m6723939m0743428l2590792k5817824j9486334j5513138
$$ 350894887 312104719 265380780 224637352 192046560 166228736 146742402 131229264
3883A31229264j3126895j0861875q666203p202458o264082m777597m109989l593501
$$ 131229264 118102369 107240494 98574291 91371833 85107751 80330154 76220165 72626664
3875G2626664l578603l474783k852552k802433k293587k023362k008249j468875
$$ 72626664 69048061 65573278 62720726 59918293 57624706 55601344 53593095 52124220
3867E2124220j080764j203630k132J01621k91707J81643k42807K61939J66935
$$ 52124220 51043456 49839826 49837694 49939315 49647608 49829251 49586444 49848383 50015318
3858E0015318O27243J031119J259101J337226J909602K324904K668374K859139
$$ 50015318 50642561 51673680 52932781 54270007 56179609 58504513 61172887 64032026
3850F4032026L189822L478941K694931J314101m98819j985298l554203m592665
$$ 64032026 67221848 70700789 73395720 74709821 74211002 72225704 68671501 64078836
3842F4078836m388261l830168l555995k510527k398174j963605j729643j676564
$$ 64078836 59690575 55860407 52304412 49793885 47395711 45432106 43702463 42025899
3834D2025899j088335j124581q38831r53761m17695m40816k87251n0032n86429
$$ 42025899 40937564 39812983 38974152 38020391 37602696 37161880 36874629 36824597 36238168
3825C6238168p3487K31723j55380K8163J39351p2350J0769O67669P03176L77000
$$ 36238168 36164681 36396404 36241024 36269187 36408538 36336188 36346957 37014626 37717802 38094802
3815C8094802P67799Q74006O93160O69267O90074P10122J155824J032915J266439
$$ 38094802 38862601 39736607 40429767 41099034 41789108 42499230 43655054 44687969 45954408
3806D5954408J237869J427397J881669J494216K142059K168101K995927K791996
$$ 45954408 47192277 48619674 50501343 51995559 54137618 56305719 59301646 62093642
3798F2093642L291194L341996L890881M783267M830003N748536O033140P013037
$$ 62093642 65384836 68726832 72617713 77400980 82230983 87979519 94012659 101025696
3790A01025696P812798Q624022R597862J0356666J1705250J2120742J1284528
$$ 101025696 108838494 117462516 127060378 137417044 149122294 161243036 172527564
3783A72527564Q333455L314730l036186r030960j2684240j4241711j3448872j2080023
$$ 172527564 180861019 184175749 181139563 172108603 159424363 145182652 131733780 119653757
3775A19653757j0331509q286429o986710n722292m723384l996562l233362k713043
$$ 119653757 109322248 101035819 94049109 88326817 83603433 79606871 76373509 73660466
3767G3660466k786033k608468j536078r36391q62541q07307l67334L6613L0439
$$ 73660466 70874433 68265965 66729887 65793496 64930955 64123648 63756314 63792927 63823366
3758F3823366J37856Q77613Q84391R62433J136114J488945J712179J415205J063274
$$ 63823366 63961222 64838835 65723226 66685659 67821773 69310718 71022897 72438102 73501376
3749G3501376J455624J579637J796886K436565K903749L167280M647339N243637
$$ 73501376 74957000 76536637 78333523 80770088 83673837 86841117 91488456 96732093
3741I6732093N661297O931697Q176018R649555J1004365J2878013J4880294J6748838
$$ 96732093 102393390 109325087 117501105 127150660 138155025 151033038 165913332 182662170
3733A82662170J9345623K0945405K2224331K2369105J9230750J0846518q72221
$$ 182662170 202007793 222953198 245177529 267546634 286777384 297623902 296751681
3726B96751681j3562397k2527181k5040600k4340710k1679115j8432066j6521487
$$ 296751681 283189284 260662103 235621503 211280793 189601678 171169612 154648125
3719A54648125j4622058j2210063j1277932r755422p975504p237730o458229n682415
$$ 154648125 140026067 127816004 116538072 106782650 98807146 91569416 85111187 79428772
3711G9428772m873238m212736m258489l253232l636267l079764k532454k480187
$$ 79428772 74555534 70342798 66084309 62831077 59194810 56115046 53582592 51102405
3703E1102405j853189j799841j375522j620533j269050j072615r79684p15535
$$ 51102405 49249216 47449375 46073853 44453320 43184270 42111655 41131971 40416436
3695D0416436j033141q96856j210495j608964j303581j452721j528900j803883
$$ 40416436 39383295 38486439 37275944 35666980 34363399 32910678 31381778 29577895
3687B9577895j726229p59668o75808q91705j491989q18643q54060l19320p79233
$$ 29577895 27851666 27091998 26416190 25524485 24032496 23213853 22359793 22040473 21261240
3678B1261240p54492m08937o07950l31148p89587p47463k12152j29897o48172
$$ 21261240 20506748 20097811 19489861 19158713 18369126 17621663 17409511 17279614 16631442
3669A6631442k99534m98311N1493l55631r6176K83159j43379k84565l5205k71422
$$ 16631442 16331908 15833597 15885090 15529459 15433283 15716442 15573063 15288498 15253293 14981871
3659A4981871o27083m90081k33074k57084j37658l04341j33711k13970j05168
$$ 14981871 14354788 13864707 13631633 13374549 13236891 12932550 12798839 12584869 12479701
3650A2479701p7115L6489l88519m75480l7935R2494k58142q5526J11011k98036
$$ 12479701 12402586 12439075 12050556 11575076 11537141 11629635 11371493 11285967 11396978 11098942
3640A1098942m77827j41061m84690l93023j23235l48227j10611l72072K4451J2747
$$ 11098942 10621115 10480054 9995364 9602341 9479106 9130879 9020268 8648196 8672647 8685394
3630H685394k59502J70109k84446n35012J58065m5723j896n19527n1976p0803
$$ 8685394 8425892 8596001 8311555 7776543 7934608 7888885 7886989 7367462 7315486 7244683
3620G244683k47329L34032l7193O8062m3533J45194L74699N5081r6330q3901K22588
$$ 7244683 6997354 7331386 7294193 7362255 7318722 7463916 7838615 7893696 7797366 7713465 7936053
3609G936053l66795R6979K53951J6307R4256l79116l09968K01727L48243m9323
$$ 7936053 7569258 7666237 7920188 7936495 8030751 7651635 7341667 7543394 7891637 7842314
3599G842314j70351N5989o3731J06765m27300K80562K6734m72243m84946l04614
$$ 7842314 7671963 7727952 7664221 7770986 7343686 7624248 7650982 7178739 6693793 6389179
3589F389179P4568j9708m80887k31183L04396j1018k60220K20286l9937m37393
$$ 6389179 6463747 6444039 5963152 5731969 6036365 6025347 5765127 5985413 5945476 5508083
3579E508083K13464k5062l63315k64577K09462K49945n35250j4562l26450J43729
$$ 5508083 5721547 5696485 5333170 5068593 5278055 5528000 4992750 4978188 4651738 4795467
3569D795467K50023j63261k87317j21451J76610k49245q2319J12062o6492j25035
$$ 4795467 5045490 4882229 4594912 4473461 4650071 4400826 4318507 4430569 4364077 4239042
3559D239042P74574j86597o5335M15228m32000K9588K3798k00319k01809P5366
$$ 4239042 5013616 4827019 4761684 5176912 4744912 4774500 4798298 4597979 4396170 4471536
3549D471536k0058N9274J25881n0395p9992k14163q3331J84311P4366p7299L23024
$$ 4471536 4451478 4510752 4636633 4586238 4506246 4292083 4208752 4393063 4467429 4390130 4713154
3538D713154k67782K88001J07872k92097j38818K5898J12471L62164k67726k86402
$$ 4713154 4445372 4733373 4841245 4549148 4410330 4436228 4548699 4910863 4643137 4356735
3528D356735j74522K8724J48703k14750j14005J43318L26678K59489k99788k14608
$$ 4356735 4182213 4210937 4359640 4144890 4030885 4174203 4500881 4760370 4460582 4245974
3518D245974N7898R4672J59320N8760J79872K58743p9914K8132M35292l94491
$$ 4245974 4303872 4398544 4557864 4616624 4796496 5055239 4975325 5003457 5438749 5044258
3508E044258k00416j68407L09064O96857l03122k89839p4783K18283j94533J53899
$$ 5044258 4843842 4675435 4984499 5681356 5378234 5088395 5013612 5231895 5037362 5191261
3498E191261K26160J89218K67169r3769J48119J24880P078K13138L73275m44078
$$ 5191261 5417421 5606639 5873808 5780039 5928158 6053038 6060116 6273254 6646529 6202451
3488F202451n0071L17141l46703J94625K51390Q2538k52029n9083O36883O27665
$$ 6202451 6152380 6469521 6122818 6317443 6568833 6651371 6399342 6340259 6977142 7604807
3478G604807j78598k37725K22697k27283j82938P19565O7255k4651K78850j28200
$$ 7604807 7426209 7188484 7411181 7183898 7000960 7720525 7787780 7763129 8041979 7913779
3468G913779j81145L40662M38468L60666p5076Q0691J85776J55025r4902k2822
$$ 7913779 7732634 8073296 8511764 8872430 8797354 8878045 9063821 9218846 9123944 9101122
3458I101122J70176J52195O25858L03225J43332K04257M81280q7229J14472O29743
$$ 9101122 9271298 9423493 10049351 10352576 10495908 10700165 11181445 11094216 11208688 11838431
3448A1838431P27357o7912m95922M87634Q5040L46199P07831L23610K04412J84992
$$ 11838431 12565788 12497876 12001954 12489588 12574628 12920827 13628658 13952268 14156680 14341672
3438A4341672M48116M12684L80665p3165O29972P77426R09821L19164P06924M01835
$$ 14341672 14789788 15202472 15583137 15509972 16139944 16917370 17827191 18146355 18853279 19255114
3428A9255114O13739L58002N73673J054642R87798O16891J241698J451426J571449
$$ 19255114 19868853 20226855 20800528 21855170 22842968 23459859 24701557 26152983 27724432
3419B7724432J644217J433307K320994K535375K902377L534787M227059M425013
$$ 27724432 29368649 30801956 33122950 35658325 38560702 42095489 46322548 50747561
3411E0747561M672622N277758O679716P275408Q397628Q913817Q643014P734776
$$ 50747561 55420183 60697941 67377657 74653065 83050693 91964510 100607524 108342300
3403A08342300M585224J15240n191090q737481r871235r867601q483562p154906
$$ 108342300 112927524 113042764 107851674 99114193 89242958 79375357 70891795 63736889
3395F3736889o039725m023217l807341l077993k688395k300877k070942j306551
$$ 63736889 57697164 53673947 49866606 46788613 44100218 41799341 39728399 38421848
3387C8421848n16001j447638r36550p20259m34484K59631O3508J53163M84308
$$ 38421848 37905847 36458209 35521659 34801400 34366916 34626547 34690055 34843218 35327526
3378C5327526M82718P52643J274744K15916n80615m91708j249729j186793j378431
$$ 35327526 35810244 36562887 37837631 38053547 37472932 36981224 35731495 34544702 33166271
3369C3166271j084416j313463q70175o27382p8815j47461J22715J52432o201L18358
$$ 33166271 32081855 30768392 29898217 29270835 29192020 29044559 29167274 29319706 29313505 29631863
3359B9631863O45890K84467K20067N74078Q42821P10334R88564R92021J013235
$$ 29631863 30277753 30562220 30782287 31356365 32199186 32909520 33898084 34890105 35903340
3350C5903340O68671Q17814J598893J664509J841183J315623J496866J665660
$$ 35903340 36572011 37389825 38988718 40653227 42494410 43810033 45306899 46972559
3342D6972559J943884K050601K431593L090595K813472L316625M123168M554524
$$ 46972559 48916443 50967044 53398637 56489232 59302704 62619329 66742497 71297021
3334G1297021N286772N827052O669628P283520P958785R741392J0883039J2002866
$$ 71297021 76583793 82410845 89080473 96363993 104322778 114064170 124947209 136950075
3326A36950075J3728407J5853796J8300007J9580718K0294891K0122806J7190893
$$ 136950075 150678482 166532278 184832285 204413003 224707894 244830700 262021593
3319B62021593J0290828J74233j0697463j8992563k3125296k4144790k2333442
$$ 262021593 272312421 272486654 261789191 242796628 219671332 195526542 173193100
3312A73193100j9342141j6320138j3498324j1449730r900503q702044p703899
$$ 173193100 153850959 137530821 124032497 112582767 102682264 93980220 86276321
3305H6276321o527091n738734n087714m495605l841604l958231l457241l161572
$$ 86276321 79749230 74010496 68922782 64427177 60585573 56627342 53170101 50008529
3297E0008529k349212k287609k503210j614523j984729j565241j708099r14849
$$ 50008529 47659317 45371708 42868498 41253975 39269246 37704005 35995906 35081057
3289C5081057q22211j106376j169756o29633j127887q72857q53984p33900l16894
$$ 35081057 34258846 33152470 31982714 31353081 30225194 29352337 28498353 27764453 27447559
3280B7447559p34147p73352m21570m30285n66872o24046m46521j38665k10496
$$ 27447559 26713412 25940060 25518490 25088205 24521333 23897287 23450766 23312101 23101605
3271B3101605l04771J93036Q6897k30968k29949n63437l50975n6510K87148J83069
$$ 23101605 22796834 22989870 23076767 22845799 22615850 22052413 21701438 21644928 21932076 22115145
3261B2115145p542k64119R8795r3594l0909J63692k86032M34939M78009n83639
$$ 22115145 22107603 21843484 21942279 21848685 21817776 21981468 21695436 22130375 22608384 22024745
3251B2024745l19022O9084L28942M86225L56642k44367j42784R3727o7118P40048
$$ 22024745 21705723 21774807 22103749 22589974 22946616 22702249 22559465 22653192 22586074 23326122
3241B3326122J3103J49419N72601Q26108L02913N62356J022888O39381Q57352
$$ 23326122 23339225 23488644 24061245 24887353 25190266 25752622 26775510 27414891 28272243
3232B8272243J521810J240357J534633K329778K176083J514395J209139J151420
$$ 28272243 29794053 31034410 32569043 34898821 37074904 38589299 39798438 40949858
3224D0949858K89098r8178j224489r02453o70602q92000o59017l5302o2946L51874
$$ 40949858 41238956 41140778 39916289 39013836 38343234 37451234 36792217 36756915 36693969 37045843
3214C7045843Q53184N30893Q34102R03294J478540J659275J384449J971266K245141
$$ 37045843 37899027 38429920 39264022 40167316 41645856 43305131 44689580 46660846 48905987
3205D8905987K446568K724852L349837L610459M000808M405086N453216N685213
$$ 48905987 51352555 54077407 57427244 61037703 65038511 69443597 74896813 80582026
3197H0582026O543919P417632Q219314R125381Q708051Q137007O250391L406702
$$ 80582026 87125945 94543577 102762891 111888272 120596323 128733330 134983721 138390423
3189A38390423o88009m234257n868589o554101n846770m620381k774308j221206
$$ 138390423 137702414 133468157 127599568 121045467 115198697 110578316 107804008 106582802
3181A06582802k61168J405736L108597M105434N913043O577234Q204872J0384328
$$ 106582802 106321634 107727370 110835967 114941401 120854444 127431678 135636550 146020878
3173A46020878J1955819J3789154J5801747J8274047K0208469K0269846J9299227
$$ 146020878 157976697 171765851 187567598 205841645 226050114 246319960 265619187
3166B65619187J4222993M866543n638651j5340411k2194371k4811227k3996171
$$ 265619187 279842180 284708723 279070072 263729661 241535290 216724063 192727892
3159A92727892k1990137j8939872j5479797j3681508j1573647r654975q714547
$$ 192727892 170737755 151797883 136318086 122636578 111062931 101407956 92693409
3152I2693409p366327o414305n395148m830302m872131m326074l637920l388998
$$ 92693409 85327082 78912777 73517629 68687327 63815196 59489122 55851202 52462204
3144E2462204k908771k466797k649081k462059k388168j349622j610325j872071
$$ 52462204 49553433 47086636 44437555 41975496 39587328 38237706 36627381 34755310
3136C4755310j364935j299412j571729j202955p77765j162183q98768r04774j061605
$$ 34755310 33390375 32090963 30519234 29316279 28538514 27376331 26477563 25572789 24511184
3127B4511184j136553p09787q58676p50652p87247k33440m20186j46757m13635
$$ 24511184 23374631 22664844 21806168 21055516 20268269 20034829 19614643 19467886 19054251
3118A9054251p38497k92455l39902o73941m2686o41788m79731q13167m40557n70109
$$ 19054251 18315754 18023299 17683397 17009456 16966770 16324982 15845251 15032084 14591527 14021418
3108A4021418l84420j66048k81688l63554l07671n47837K0560l3480l52667m32293
$$ 14021418 13636998 13470950 13189262 12825708 12518037 11970200 11990760 11957280 11604613 11172320
3098A1172320J22111K2011k26427l81938l00405l13359j36901j16002p9652l26753
$$ 11172320 11294431 11316442 11090015 10708077 10407672 10094313 9957412 9841410 9761758 9435005
3088I435005J24314J68542j71556o64691k55448j54560l31058o414q762j02698
$$ 9435005 9559319 9727861 9556305 8891614 8636166 8481606 8150548 8144134 8135372 8032674
3078H032674l03883k46267k50751J25598O0778K5452l17516k01678j56795k92384
$$ 8032674 7728791 7482524 7231773 7357371 7418149 7443601 7126085 6924407 6767612 6475228
3068F475228M653k48444m45731K02116J29593l49366n09575J26402q3003J16242
$$ 6475228 6479881 6231437 5785706 5987822 6117415 5768049 5258474 5384876 5301873 5418115
3058E418115n922K23075m89218j79904K5956K46609l69216K6427J55814o7272
$$ 5418115 5412193 5635268 5146050 4966146 4992102 5238711 4869495 4895922 5051736 4984464
3048D984464l26955l32784L2768Q3094j06665L8496m8494J09925l48631K91561
$$ 4984464 4657509 4324725 4357493 4440587 4333922 4372418 4323924 4433849 4085218 4376779
3038D376779K22732K11326k27423j28850K2747p0800J79882j18897M7413j80758
$$ 4376779 4599511 4810837 4583414 4454564 4477311 4406511 4586393 4467496 4514909 4334151
3028D334151j40357j91399o2787o8485k23503L0638J6308l51481N5916K22113
$$ 4334151 4193794 4002395 3939608 3871123 3647620 3678258 3694566 3343085 3399001 3621114
3018C621114k74849K64447o9304m93257J55401k43713L56521k50640k20084L59126
$$ 3621114 3346265 3610712 3541408 3048151 3203552 2959839 3316360 3065720 2845636 3204762
3008C204762k90958l56781j3604k1737k6423M2256k49209K28306m97814n6996
$$ 3204762 2913804 2557023 2543419 2521682 2495259 2537515 2288306 2516612 2018798 1961802
2998A961802M32111K78526k88903j84603L48974q2523J6723l26195l5208N0421
$$ 1961802 2393913 2672439 2383536 2198933 2547907 2465384 2482107 2155912 2120704 2171125
2988B171125k43311r616j90090l0326k04296Q0226K81844J34234K8518m05381
$$ 2171125 1927814 1918198 1728108 1697782 1493486 1573712 1855556 1989790 2018308 1612927
2978A612927k12971P5861M05841l41060J63508L04687K31047l3176j42244m32954
$$ 1612927 1399956 1475817 1881658 1540598 1704106 2008793 2239840 2206664 2064420 1631466
2968A631466j06986K63680l4395p2048K47911K88415l57799k95573j13459j45567
$$ 1631466 1524480 1788160 1753765 1681717 1929628 2218043 1860244 1564671 1451212 1305645
2958A305645k54471o765K76293N43832J81404l38228k12890j20639J38078l37858
$$ 1305645 1051174 1044409 1320702 1864534 2045938 1707710 1494820 1374181 1512259 1174401
2948A174401j75011J05494K71512j67009p8001J08365O5615j59944J3154M06605
$$ 1174401 999390 1104884 1376396 1209387 1131386 1239751 1305366 1145422 1158576 1565181
2938A565181J68431l49269Q0223L23913m56581l25676M34743K03012l20426M8575
$$ 1565181 1733612 1384343 1464566 1788479 1331898 1006222 1440965 1643977 1323551 1372126
2928A372126K52520n9150l41240M33369K9701k66560N42850N6636k47895j64058
$$ 1372126 1624646 1565496 1224256 1657625 1687326 1420766 1963616 2020252 1772357 1608299
2918A608299n01116K32864M83080k21690l05320n8617r360P20688L29013p88917
$$ 1608299 1107183 1340047 1823127 1601437 1296117 1237500 1228140 1948828 2277841 1488924
2908A488924J82987N50508Q0430l88226L00155K40189m39048o9234Q9064o5929
$$ 1488924 1671911 2222419 2302849 1914623 2214778 2454967 2015919 1946685 2035749 1969820
2898A969820k83569K60893k26178m18804J5125J18555J51914m3930J0592j88434
$$ 1969820 1686251 1947144 1720966 1302162 1317287 1435842 1587756 1543826 1554418 1365984
2888A365984J05871L6602j49867J41115M24829J53986R9125o4217L08827R6112
$$ 1365984 1471855 1508457 1358590 1499705 1924534 2078520 2177645 2113428 2422255 2518367
2878B518367o6443K12578k97346j66876m9938L7522k34669k92034l31744K36201
$$ 2518367 2451924 2664502 2367156 2200280 2150342 2187864 1953195 1661161 1329417 1565618
2868A565618j00129k18221M54986l23027k40356j37353J19140j10077k34836k13199
$$ 1565618 1465489 1247268 1702254 1379227 1138871 1001518 1120658 1010581 775745 562546
2858E62546l2505P4350M3998L4341j03570K23689o0082j83329K35475K21095j92063
$$ 562546 530041 604391 648389 682730 579160 802849 742767 559438 794913 1016008 823945
2847H23945Q3408p4787J7487J17096N9629k21720k10969M4921q442L8506J75444
$$ 823945 907353 832566 850053 967149 1026778 805058 594089 639010 630568 669074 844518
2836H44518j88919j32062j17413K00207J06587j55184N7327o3404r2605J25685
$$ 844518 655599 523537 406124 606331 712918 557734 615061 551657 459052 584737
2826E84737M03274J1768j65161k3472k68176k34045J18585K79684L82072j49397
$$ 584737 988011 999779 834618 811146 542970 308925 427510 707194 1089266 939869
2816I39869k34488M6618J0056k01304K76232R7983q2560K79048k31934k69905
$$ 939869 705381 751999 762055 560751 836983 934966 852406 1131454 899520 629615
2806F29615l88913K32255L53533M7995j28527k07074j31434L54224k32536q7368
$$ 629615 240702 472957 826490 874485 745958 538884 407450 761674 529138 441770
2796D41770k4618Q1147J6357j13630K45621J7210j38675k00424m0798N85123j98713
$$ 441770 417152 498299 514656 401026 646647 663857 525182 324758 283960 869083 670370
2785F70370k14892j56603k74622k9705j86009K07758M78943L76074l27186k63924
$$ 670370 455478 298875 24253 -5452 -191461 16297 495240 871314 544128 280204
2775B80204J62553P6635k0279k14691k83779l3857Q121R1354k14945L35344N36851
$$ 280204 442757 519392 499113 284422 643 -33214 -25093 66261 -148684 186660 723511
2764G23511K4750k99305k24040M69222J18441l60671k860o0004k28669J4523K63119
$$ 723511 748261 448956 224916 694138 812579 451908 449048 389044 160375 174898 438017
2753D38017n43619O0228K94010n9633r386J62603R8106k36932J7453K59652N5710
$$ 438017 -105602 -45374 248636 189003 179617 342220 440326 203394 220847 480499 536209
2742E36209l25445j45572L1539j66103l70231J50110J95466J48855j0741Q7080
$$ 536209 210764 65192 96731 -69372 -439603 -289493 -94027 54828 44087 131167
2732A31167p820j03102K68906N2181J73456j75430k34268j52440m5143j500j77859
$$ 131167 123347 20245 289151 341332 514788 339358 105090 -47350 -92493 -93993 -271852
2721b71852J05486J43254J49037K00874K3098k33923l7150o03997M09631N84766
$$ -271852 -166366 -23112 125925 326799 349897 115974 78824 -525173 -115542 469224
2711D69224o76424K32100J57938k72890J51996K09009p5965M53975J10092O2143
$$ 469224 -207200 24900 182838 -90052 61944 270953 194988 648963 759055 821198
2701H21198n27579K39614M0469k56082K90868p3749j95472P5537k08757K35408
$$ 821198 293619 533233 573702 317620 608488 534739 339267 414804 206047 441455
2691D41455k33015o3568K00912l15144n2847J59009j50470l39642L56753J14906
$$ 441455 208440 144872 345784 30640 -22207 136802 -13668 -353310 3443 118349
2681A18349j6314J58015n3582k21965R1071R6366j28770j9901J17357k48917K12906
$$ 118349 102035 260050 206468 -15497 75574 171940 43170 23269 140626 -108291 104615
2670A04615j09282J7524l85455J77187J37956l52821K31655J04220R9484J0670
$$ 104615 -4667 12857 -372598 -195411 -57455 -410276 -178621 -74401 25083 35753
2660C5753k62783M9447N02386J85336l18105j43674j37176L81140K03719j48200
$$ 35753 -227030 -177583 324803 510139 192034 48360 -88816 292324 496043 347843
2650C47843P0067k29549M2680j65359P744n0285k92837K56291k05956J29993K98703
$$ 347843 417910 188361 231041 65682 73426 23141 -269696 -13405 -219361 -89368 209335
2639B09335o8550m5602k23036L6329k3893k05311l87799L24713l1824L0721K21426
$$ 209335 140785 95183 -127853 -91524 -115417 -320728 -708527 -383814 -415638 -384917 -163491
2628a63491j25081L05141p4050M8582n162k02991J88376L4127k20498Q9388J50639
$$ -163491 -288572 16569 -57481 -8899 -14061 -217052 -28676 5451 -215047 -125659 24980
2617B4980P1085k17670o9124j6783K27542j60949n3867k30940j68770L46971j769
$$ 24980 96065 -121605 -190729 -207512 20030 -140919 -194786 -425726 -594496 -247525 -249294
2606b49294O66378M3033j69442K5793j84900k52329J43848M4583l17510k28824
$$ -249294 417084 460117 290675 316468 131568 -120761 23087 67670 -249840 -478664
2596d78664r9850j04654L17376J15526j42079N3635L08019K44690k08225K55427
$$ -478664 -578514 -683168 -365792 -250266 -392345 -338710 -30691 213999 5774 261201
2586B61201k14407l8448J46093j1400M99380m19570p55351M86310L29301k82465
$$ 261201 46794 8346 154439 143039 642419 222849 -532502 -46192 283109 644
2576F44O2524J09699N7591r9000m06474j24133K88378K90337K11401l8049j77550
$$ 644 63168 172867 230458 131458 -275016 -399149 -110771 179566 390967 352918 175368
2565A75368k1745J35424k00785j28447j29507N51k78641L88142J66355o1176M60513
$$ 175368 153623 289047 88262 -40185 -169692 -169141 -447782 -59640 106715 45539 506052
2554E06052l45031l28851j59474O0045M18800M52677m03677O4765k90706n3408
$$ 506052 161021 -167830 -327304 -267259 151541 604218 200541 265306 -25400 -78808
2544g8808L60753N7105l69392j55642j10910j63160o2114L18695J93042K37138
$$ -78808 281945 339050 -30342 -185984 -296894 -460054 -522168 -203473 -10431 226707
2534B26707r3722l75249Q7906M48866l460q0407K84209k08274k12716m55081J09159
$$ 226707 132985 -242264 -154358 294508 291048 210641 494850 286576 73860 -381221 -272062
2523b72062L09734J53058j0228j74492J26932K25461J8029l63389j36346j65495
$$ -272062 37672 190730 180502 6010 132942 358403 376432 13043 -123303 -288798
2513b88798K07103Q9221j45937j36512J74119L49199J52180m96145l0327k83098
$$ -288798 -81695 7526 -138411 -274923 -100804 248395 400575 -95570 -125897 -408995
2503d08995R2960M68371p55403j22958N68353O01396n29580j19121L71652L8288
$$ -408995 -316035 152336 -603067 -726025 -157672 443724 -85856 -204977 166675 204963
2493B04963m2827p7588m26629M15419K40321j97998l9571j90547J3010M31241
$$ 204963 162136 84548 -342081 73338 313659 115661 76090 -114457 -101447 329794
2483C29794m36312j6062l80836K14803L05509k8554J3754P8584N6388m26465L30341
$$ 329794 -106518 -122580 -503416 -288613 16896 -11658 2096 80680 137068 -289397 40944
2472D0944k33857J40864J30652J10435J26128k01054k40947j11533K07284J64035
$$ 40944 -192913 -52049 78603 189038 315166 114112 -126835 -238368 -31084 132951
2462A32951j19300K35927O8290L07507m4144l88519j80307o6576J80843j29417
$$ 132951 13651 249578 317868 625375 581231 192712 12405 -54171 126672 -2745
2452b745N8808M5609P6552n2177k59616Q6240K28454j69953j66162K24945K23590
$$ -2745 56063 101672 178224 126047 -133569 -47329 181125 11172 -154990 69955 293545
2441B93545l20765j37536p7638J71281J62057M33714j41866m18333j809k9892
$$ 293545 -27220 -164756 -242394 -71113 90944 524658 382792 -35541 -37350 -67242
2431f7242k32424K5397K28244l7383K10867J12320l32116j0265R7430L0056o1874
$$ -67242 -299666 -274269 -46025 -83408 127459 239779 -92337 -102602 -5172 24884 -36990
2420c6990n1315m2176K04312R0457n3990K87703l238j73489n6194M2342j86319
$$ -36990 -88305 -130481 73831 164288 110298 398001 394763 221274 165080 207422 21103
2409B1103j9235q542J86246K11412q7869k70010j72258N08511k4398O1363L24311
$$ 21103 1868 -6674 179572 390984 303115 33105 -139153 369358 344960 406323 730634
2398G30634k33714j69477L8487M03013L0395J52439j184K76306k9927R2095M3667
$$ 730634 496920 327443 365930 768943 799338 951777 950593 1226899 1196972 1289067 1332734
2387A332734R7533J10792n76807N8338k56497l95859J53181r4218p338p1200N8512
$$ 1332734 1430267 1541059 964252 1022590 766093 370234 523415 429197 421859 350659 409171
2376D09171n4534j1434l541k83205J12073r7955O1760P5322J84413o7754m6942
$$ 409171 354637 343203 339662 56457 168530 70575 132335 207657 392070 324316 277374
2365B77374k0829k86569Q0636M02434o0718m17249P9261O2343j40958K98145K1094
$$ 277374 256545 -30024 50612 453046 392328 -24921 54340 116683 -24275 273870 294964
2354B94964k77981P1475j99167j29600L67910j82883J74289N41163j73537J5547
$$ 294964 16983 88458 -110709 -240309 127601 -55282 119007 660170 486633 502180
2344E02180L2333M3518n74385R5706K24724J0570p2664J69983N2638O3775j91276
$$ 502180 534513 578031 3646 99352 324076 334646 261982 431965 484603 548378 357102
2333C57102L1144K2304k85713M7458L14777J20696l40158O0355K68645j85885
$$ 357102 388246 410550 124837 172295 487072 607768 267610 327965 596610 410725
2323D10725N00210R5948m53809o8748q816j20187K5350J97705L02776m19733O6029
$$ 410725 910935 1006883 553074 484326 475510 355323 380673 578378 881154 461421 527450
2312E27450K70565k02645m2914k0542K82849l60582k52496M25196j66979K20675
$$ 527450 798015 595370 552456 531914 814763 454181 201685 626881 459902 680577
2302F80577j15246q3722M19146J19729k84507k11014J42821k41880k30909P1241
$$ 680577 565331 481609 900755 1020484 735977 524963 667784 425904 194995 266236
2292B66236O50061m74166m3311L11313k45369J05867n320l95822L78342L84121
$$ 266236 916297 442131 398820 710133 464764 570631 565311 169489 547831 931952
2282I31952J12759J58682m30010j93422J09410p300M7212m24358J89807K27111
$$ 931952 1044711 1203393 773383 579961 689371 682071 729283 304925 494732 721843
2272G21843K04515J78335L38134j96763R3182l31135N3191k86243k56010O1881
$$ 721843 926358 1104693 1442827 1246064 1339246 1008111 1061302 775059 519049 580930
2262E80930K85286n3096m66424l7296O2017R2785K46257K67194J14980j17693
$$ 580930 866216 813120 346696 309400 371417 464202 710459 977653 1092633 974940
2252I74940l38388M23389L18856N2390l26276o833l9389K12460L44461l104l39440
$$ 974940 636552 1059941 1378797 1431187 1104911 1098078 1058689 1271149 1615610 1612506 1273066
2241A273066l28606K80895L16649l7951j32310M29914K26864k23948j18233k14719
$$ 1273066 944460 1225355 1542004 1504053 1371743 1801657 2028521 1804573 1686340 1471621
2231A471621M08099L86441l07357m831J60677l54280O8242L74774M03612l02011
$$ 1471621 1879720 2266161 1958804 1953973 2114650 1760370 1828612 2203386 2606998 2304987
2221B304987l32509k9748K16770k29502M3026J89010j45033O6100K01192K02671
$$ 2304987 1972478 1942730 2159500 1929998 1973024 2162034 2017001 2083101 2284293 2486964
2211B486964L58125O4768j30811M02804J58301M6892k03094N7381L73342N8710
$$ 2486964 2845089 2909857 2779046 3181850 3340151 3387043 3183949 3241330 3614672 3673382
2201C673382R8475j17539L5197L78705j95135M09908O8251J86562L86545R7131
$$ 3673382 3771857 3654318 3689515 4068220 3873085 4282993 4351244 4537806 4924351 5021482
2191E021482O8115R8545Q4202M4687J08726k8717J48149J68567K29100L69820
$$ 5021482 5089597 5188142 5272344 5317031 5425757 5397040 5545189 5713756 5942856 6312676
2181F312676O30368J0631R5115J5670J14914L95991O2754P3972k54544K33425
$$ 6312676 6943044 6953675 7048790 7064460 7179374 7575365 7638119 7712091 7457547 7690972
2171G690972j88221o7513k61903J165878L29859N28268K80479N09537M73274L23528
$$ 7690972 7502751 7435238 7173335 8339213 8669072 9197340 9477819 9987356 10460630 10784158
2161A0784158M11352p8345L77646M53649M02733N98570R74957M32381Q50448O41393
$$ 10784158 11195510 11117165 11494811 11948460 12351193 12949763 13924720 14357101 15207549 15848942
2151A5848942Q82758R24844J257875M99362R22766J275517R19829J115519J375749
$$ 15848942 16731700 17656544 18914419 19413781 20336547 21612064 22531893 23647412 25023161
2142B5023161J251712J092223J918541K102988L112000L344185L372659L301994
$$ 25023161 26274873 27367096 29285637 31388625 34500625 37844810 41217469 44519463
2134D4519463K458048L699118M430772O114701P300352R083642J1032707J5179834
$$ 44519463 46977511 50676629 55107401 61222102 68522454 77606096 88638803 103818637
2126A03818637J7195360K1442186K7586915L8665564M0181311K7508025j7621665
$$ 103818637 121013997 142456183 170043098 208708662 248889973 276397998 258776333
2119B58776333n6149044m9318217l2476654k1006761j5326272j1073152q732267
$$ 258776333 202627289 153309072 120832418 99825657 84499385 73426233 64693966
2112F4693966p408744n961454m357018l282820k306538j674962j226271k616995
$$ 64693966 57285222 51323768 46966750 43683930 41377392 39702430 38476159 35859164
2104C5859164k995556l110788k553213k499194k084242j169599j179904j180305
$$ 35859164 32863608 29752820 27199607 24700413 22616171 21446572 20266668 19086363
2096A9086363r35126p93080o93649q02899m00256n11739m57713j212774r29206
$$ 19086363 18151237 17358157 16664508 15861609 15461353 14949614 14491901 13279127 12349921
2087A2349921k11559m83186o57404o3805p47927o04266n31072L4253k25602n37773
$$ 12349921 12138362 11655176 10997772 10933967 10186040 9581774 9050702 9084955 8859353 8321580
2077H321580n30518j8416J50503L9749o76715k71013n5864J82644p27659n63463
$$ 8321580 7791062 7772646 7923149 7962898 7286183 7015170 6959306 7141950 6414291 5850828
2067E850828K00196N61K72304n24901p72040m04459N50153L02657j78388R3762
$$ 5850828 6051024 6051585 6323889 5798988 5026948 4622489 5172642 5475299 5296911 5390673
2057E390673m71859l45003J38671j66743M9454n9586L47338m81614k23809L32650
$$ 5390673 4918814 4573811 4712482 4545739 4595193 4535607 4882945 4401331 4177522 4510172
2047D510172l00522k10334l00807J13651l5967K23556J20765n97850m37472J36336
$$ 4510172 4209650 3999316 3698509 3812160 3776193 3999749 4120514 3522664 3085192 3221528
2037C221528J5797l25842k90227L3771J48317O801P9430n3397l85689J67581k9918
$$ 3221528 3237325 2911483 2621256 2655027 2803344 2810145 2889575 2836178 2450489 2618070 2588152
2026B588152k11152l39862N1024q0044R2229l27376k37269l27195k52031J52127
$$ 2588152 2377000 2037138 2088162 2008118 2100347 1772971 1535702 1208507 956476 1108603
2016A108603M12704K25548l21128J88751j07740j26366K2495L08717K10669J20682
$$ 1108603 1521307 1746855 1425727 1614478 1506738 1380372 1402867 1711584 1922253 2042935
2006B042935l24681L52257K4693n95320k61486J38862M62058L6110k90876q6335
$$ 2042935 1718254 2070511 2095204 1499884 1238398 1377260 1839318 1875428 1584552 1498217
1996A498217m5050l49523p4345J81630l28094k86028j53976M10050M09158k4614
$$ 1498217 1453167 1103644 1029299 1210929 882835 596807 442831 852881 1262039 1237425
1986A237425k86442j85077J3387M32880j7315k4174l3388l99289o9053J66255
$$ 1237425 950983 765906 779293 1212173 1194858 1170684 1137296 738007 668954 835209
1976H35209K35411M4988j03354J27296k5754p2413j61583R4376j78053r7701L37373
$$ 835209 1070620 1115608 1012254 1139550 1113796 1041383 879800 974176 796123 698422 1035795
1965A035795l4646J19874k95319J3620J59455m12146L48781k5015N5394L06872
$$ 1035795 1001149 1121023 825704 839324 998779 586633 935414 910399 965793 1272665
1955A272665k92063l23235j43925K13652K25138k67543j73994J2666J65903K79134
$$ 1272665 980602 657367 513442 727094 952232 684689 510695 523361 689264 968398
1945I68398l73403j20023O7922j65898j82972N5809M01143q4171R006q683o4382
$$ 968398 594995 474972 542894 376996 194024 249833 650976 566805 575811 567128 502746
1934E02746K47013n2077k54291r5324K74330Q0970k32703J73616k08279q4456
$$ 502746 749759 697682 443391 348067 622397 703367 470664 644280 436001 351545
1924C51545L21113j64948k16705p8463K21260P2670R395j16301j2837J69561l97975
$$ 351545 672658 507710 291005 212542 433802 506472 515867 399566 386729 556290 158315
1913A58315k1378J21577k8637j28945j38266R3001L02436q1642j61866O39498
$$ 158315 136937 258514 229877 100932 -37334 55667 358103 276461 114595 754093
1903G54093j90119k79344k2598o9549L32505j93243k34115k65529J28982L36864
$$ 754093 563974 284630 262032 192483 524988 331745 97630 -167899 -38917 297947
1893B97947J82095J30952m85717j11963K04532k3632L4406l41121J50005q7633
$$ 297947 480042 610994 125277 13314 217846 194214 228620 -112501 37504 -50129
1883e0129M07601J6377l00031L06422j9020O7362J8567M945J18404J64483K49654
$$ -50129 357472 373849 73818 380240 361220 428582 447149 452094 570498 734981 984635
1872I84635m99334j79393L21528Q8815J71332M2464K0649k31555j62253J59701
$$ 984635 485301 305908 627436 716251 887583 930047 950696 719141 556888 716589
1862G16589l6082j97482J00656L37624N6896J51368M97449k27691j74429m100
$$ 716589 680507 483025 583681 921305 978201 1129569 1627018 1399327 1224898 1220798
1852A220798L39037K08523m48972l65554l15399k79560L16497k43527j91840P1076
$$ 1220798 1559835 1768358 1319386 953832 638433 358873 675370 431843 240003 311079
1842C11079m6398j6002L08563o9712r9418p0421m9432J02601p0581k61301N41431
$$ 311079 264681 248679 557242 487530 388112 317691 268259 370860 300279 38978 580409
1831E80409r7680r9029M19983n61282m40336K94660k83382j1962o5557N44276
$$ 580409 482729 383700 803683 242401 -197935 96725 -186657 -198619 -264176 280100
1821B80100M24247l63683n39462J41403J21943P1193K26027n7426J40671j90553
$$ 280100 704347 340664 -198798 -57395 64548 135741 361768 304342 445013 254460
1811B54460J38094l72577k3280K8170l90435N320N10331K54991k52154j84077
$$ 254460 392554 19977 -3303 24867 -365568 -360248 150083 405074 152920 -31157
1801c1157K6176o2105j87318M9435K3984K74771k15877J5198M715N5736R7268
$$ -31157 -4981 -67086 -254404 -204969 -180985 93786 -122091 -106893 -102178 -46442 50826
1790E0826m0707L51558J4647m7900l06323m98467L6185K83143L02605N8605k75062
$$ 50826 10119 361677 376324 328424 22101 -476366 -440181 -157038 145567 204172 -70890
1779g0890J37723K12188M53914j92976k29096m43252J59342K3585j30717K23011
$$ -70890 66833 279021 732935 539959 310863 -132389 26953 50538 -80179 142832
1769A42832j0894J34729l9766r3703j58249Q1845l8313K1758R1116j68173r393
$$ 142832 131938 266667 226901 133198 -25051 56794 18481 40239 131355 -36818 -46211
1758d6211J19821j38771j3101j9140p5087K01796m7588K52020k16150Q9676M4270
$$ -46211 73610 -65161 -78262 -97402 -172489 29307 -18281 233739 17589 107265 151535
1747A51535j03501r3644L67517J52009N21806K7626k95994k07936m29882l51839
$$ 151535 48034 -45610 321907 473916 995722 1023348 727354 519418 89536 -262303
1737b62303q4642K09220J65727J74172l24060L02767j02317k49937P2868L58867
$$ -262303 -346945 -137725 28002 202174 -121886 180881 78564 -171373 -98505 260362
1727B60362L39483n14842K35668j66271j00677L57911m40452k1128j07311k5879
$$ 260362 599845 85003 320671 154400 53723 411634 -28818 -49946 -157257 -183136
1717a83136J71057N9163m37582K34983K26115l38482L14908K86993q4974K9904
$$ -183136 -12079 47084 -390498 -155515 70600 -267882 47026 334019 249045 278949
1707B78949L10998m63680l29246N9061J75682j89812K93751M0796L51621j29619
$$ 278949 589947 126267 -202979 -143918 31764 -158048 135703 176499 528120 398501
1697C98501m99277K12196K72539k48212N8607J91752k09499m7124m559o2193K99856
$$ 398501 -100776 111420 383959 135747 194354 386106 176607 129483 124924 62731 362587
1686C62587m3855j16826L54728n00363m3767K93149J56844o54567N0921l4010
$$ 362587 318732 201906 556634 56271 12504 305653 462497 -192070 -141149 -175159
1676a75159J44465m86663M45143J20466K8299L46568m42418J54249r8420r1374
$$ -175159 -30694 -517357 -72214 48252 76551 423119 -19299 134950 36530 -54844
1666e4844M5340l31771l82182J88439K25761j55495j63277j39086R7828K23426
$$ -54844 -9504 -341275 -723457 -535018 -309257 -464752 -628029 -767115 -669287 -445861
1656d45861R8187K76568K92587o89r6503k19827n8420J58999R3555k88557j41852
$$ -445861 -347674 -71106 221481 220792 124289 -95538 -153958 5041 98596 -189961 -331813
1645c31813j71366P3531N87781m5636r6961J03348r7273k44793m988O3007Q468
$$ -331813 -503179 -429648 158133 112497 15536 118884 21611 -223182 -228170 -165163 -156695
1634a56695j30025K21246j24397j81047N72566L03626j25110m50470n6400K74404
$$ -156695 -286720 -65474 -189871 -370918 201648 505274 380164 -70306 -126706 147698
1624A47698q0461L704J76117j14543L1387k11605k898J49730j89704N150r7369
$$ 147698 67237 70941 247058 132515 163902 -47703 -50601 99129 -90575 -85425 -182794
1613a82794J6066N0013K40851J48629m72627q0508k95085L78245L95547K7331
$$ -182794 -166728 -116715 124136 272765 -199862 -280370 -575455 -197210 198337 225668
1603B25668l08799J37267k480l26975J56141J44630R6985l5364J36111m35442
$$ 225668 -83131 54136 51656 -275319 -119178 25452 122437 87073 223184 -212258
1593b12258L3096J77561p033K27329M380O405j93104m59678j96184J6766r3194
$$ -212258 -179162 -1601 -8634 218695 223075 229480 36376 -423302 -619486 -602720 -695914
1582f95914P24445J72519k79705j61479k73862K82156J78068j6235l830K06414
$$ -695914 28531 201050 -78655 -240134 -513996 -231840 -53772 -70007 -73837 132577
1572A32577M4028r7611j87764m5636K41040j95430k39381M39839k50168J03168
$$ 132577 176605 78994 -108770 -154406 86634 -108796 -348177 91662 -158506 -55338
1562e5338K78419j38910k14455j04600R8769N352J02708J09931l5262K79659l20816
$$ -55338 223081 84171 -130284 -234884 -136115 -130763 -28055 81876 46614 326273 5457
1551E457l02235l9515k23871l83944L49678K35060L11489p936j93517j44575L5893
$$ 5457 -296778 -336293 -560164 -944108 -594430 -359370 -47881 -55817 -249334 -393909 -358016
1540c58016K73118l08585J84358M15149l90265l1252J11778J76011j42205K82172
$$ -358016 -84898 -393483 -209125 206024 -184241 -215493 -103715 72296 -69909 212263
1530B12263n48445N9182o9862m3682J69507m6893R1564o6200J24626M01556r791
$$ 212263 -336182 -277000 -346862 -390544 -221037 -267930 -176366 -242566 -117940 283616 273825
1519B73825K6200R3241p66507J24577M46944o5270j78347K7571m04310Q333N9481
$$ 273825 300025 393266 -373241 -248664 198280 133010 -45337 -17766 -422076 -413743 -354262
1508c54262Q4926O25441L74965O6530j75958o51625j81363n7575J70605M9392
$$ -354262 -269336 356105 731070 797600 621642 -29983 -211346 -268921 -98316 -48924
1498d8924j37449J50231L13911L6853P1128j42293m12772m84352N2946K20763
$$ -48924 -186373 -36142 277769 314622 385750 243457 -169315 -653667 -600721 -379958
1488c79958L04526r7746K97469K552k67101j40640K12954K41449J33438l55531
$$ -379958 -75432 -173178 124291 126843 -140258 -280898 -67944 173505 306943 -48588
1478d8588j38257r4390j06181q7809Q7215j03836K58346L10389K10176k24698
$$ -48588 -186845 -281235 -387416 -475225 -388010 -491846 -233500 76889 287065 62367
1468F2367Q4529m98072j00070K41513K80587M8927j82394k0319k09719K51987
$$ 62367 146896 -351176 -451246 -209733 70854 119781 -62613 -82932 -292651 -40664
1458d0664N0878j89002l57839J56616K65668p696j46418M9586L80823k43454J21454
$$ -40664 10214 -178788 -536627 -380011 -114343 -122039 -268457 -218871 161952 -81502 39952
1447C9952N9649j89901j60814n39609L90222J60910r7901j76614K3779K63999
$$ 39952 99601 -90300 -251114 -790723 -400501 -239591 -337492 -514106 -490327 -226328
1437b26328J50535j17421K454J21001R0648n7227K18820O8455j47368j87017r0703
$$ -226328 -75793 -193214 -190760 -69759 20889 -36338 182482 250937 103569 -83448 -174151
1426a74151K20956k78224l20272M82235P8274L8833j41557J63724j31261r3587
$$ -174151 46805 -231419 -551691 -69456 8818 47651 -93906 69818 -61443 -155030
1416a55030j29036L8379n34133J00390L18807J83451J30656K59608l29805j24579
$$ -155030 -284066 -245687 -779820 -679430 -360623 -177172 -46516 213092 -116713 -241292
1406b41292k13857K4598K39857k7409r0382L57365K91863k73192k43965k34424
$$ -241292 -455149 -430551 -190694 -218103 -308485 48880 340743 67551 -176414 -410838
1396d10838m06126L89260M69165m95096j90089j25369J87224j4163O35920k85502
$$ -410838 -816964 -427704 41461 -453635 -643724 -769093 -581869 -596032 39888 -245614
1386b45614J62277L1212j74960L5101N2506J20787J58965m87137K20836L64770
$$ -245614 -83337 -52125 -227085 -191984 -139478 -18691 140274 -346863 -126027 238743
1376B38743J6416m34668M5050p0683j56080J46988K5491Q4806J84507J46008K57858
$$ 238743 255159 -179509 -134459 -205142 -361222 -214234 -188743 -103937 80570 226578 484436
1365D84436l16584l60976J71142j14646j11943k55994Q4060k2119N20897K05681
$$ 484436 167852 -193124 -21982 -136628 -248571 -504565 -420505 -442624 78273 283954
1355B83954K1002k10934Q2591J46651J66755m68198p4346J09984J36904p4565
$$ 283954 304956 94022 176613 323264 490019 21821 -52525 57459 194363 119798
1345A19798j62992j48717j79694M20084L7789m04659J52486Q1354k36478k8357
$$ 119798 -43194 -191911 -371605 48479 86268 -318391 -165905 -84551 -321029 -349386
1335c49386L2753m0218N36969r0986k87523K40197K49816J74570l92261j54252
$$ -349386 -316633 -356851 180118 89132 -198391 41806 291622 466192 73931 -80321
1325h0321J19785l09757k8098J75243J98343r9321J24908R2245k41171L45950
$$ -80321 39464 -270293 -298391 -123148 75195 -24126 100782 193027 -48144 297806
1315B97806j8746K75428k40880j56398q7712j6642q1841R8610K08726m6437p7612
$$ 297806 279060 554488 313608 157210 69498 52856 -28985 69625 278351 231914 154302
1304A54302j9959j85427J86943J70721m58762k7306l8623K81291j04321j67582
$$ 154302 134343 -51084 135859 306580 -152182 -179488 -218111 63180 -41141 -208723
1294b08723J46955k4652K86558k40654K82494j77693n21579P8845L23578K65533
$$ -208723 -61768 -86420 200138 -40516 241978 64285 -457294 -378449 -54871 210662
1284B10662j41824Q3997O857j19891r1023J32661J51651Q723k63042K24532l13259
$$ 210662 68838 152835 159692 39801 -51222 81439 233090 241813 -21229 203303 -109956
1273a09956p1616N07977j48704K22446q9798j14501n2857m5407O9794j49237J20005
$$ -109956 -181572 326405 177701 400147 310349 195848 142991 97584 167378 18141 138146
1262A38146j23549m07268K90618l3414J09046J44846j81137l25311M47964j17538
$$ 138146 14597 -392671 -102053 -135467 -26421 118425 -62712 -388023 59941 -57597
1252e7597k48405J37461j32092j01339K8626K21155J33595k24122j1624l5752
$$ -57597 -306002 -168541 -300633 -401972 -373346 -152191 -18596 -242718 -254342 -290094
1242b90094k24991L18810Q6877N5270m5334J79664k03300m4998p4500J13340Q9781
$$ -290094 -515085 -196275 -109398 -54128 -99462 80202 -123098 -168096 -242596 -129256 -39475
1231c9475p2263j33270J58335J75363J6645k90289K56113K65330k08690J763K17846
$$ -39475 -111738 -245008 -86673 88690 105335 -184954 71159 336489 127799 129562 347408
1220C47408K97146k78434L8700k94868l90672K9550K20661l86283R5888K36660
$$ 347408 644554 366120 404820 109952 -280720 -251170 -30509 -416792 -320904 -84244
1210h4244P0732O869j89119K76470j39447j48727R410j02118l8778K76658N84089
$$ -84244 -13512 -6643 -195762 80708 -58739 -207466 -198056 -300174 -338952 -62294 521795
1199E21795j27503l2929M34956n42861n23798R9129N25527J23818n04020k29707
$$ 521795 394292 361363 796319 253458 -270340 -171211 354316 478134 -25886 -255593
1189b55593Q2883M0274L49665N6145l47616K91626l39209p6502J05408j96030
$$ -255593 -172710 -132436 217229 273374 -74242 217384 -121825 -198327 -92919 -288949
1179b88949K41914M1027k63201j74127J78884J81937j53189k76692K12673J40380
$$ -288949 -47035 -6008 -269209 -443336 -264452 -82515 -235704 -512396 -299723 -159343
1169a59343j83447L33785N42721l86553k44032N1702J73435j18398K14711J43979
$$ -159343 -342790 -9005 533716 147163 -96869 -45167 128268 9870 224581 368560
1159C68560k48125k74172O15043M60563l66843n56191Q7790K46258k51205J32906
$$ 368560 120435 -153737 461306 921869 555026 -1165 86625 332883 81678 214584
1149B14584p7139K31872k57193O6194L10567m08204l68643j12754k15784J91339
$$ 214584 137445 369317 112124 178318 488885 80681 -287962 -400716 -616500 -425161
1139d25161J2260r4060L57655j39736K45747L33410k97512l31220J47647J12484
$$ -425161 -412901 -506961 -149306 -289042 -43295 290115 -7397 -338617 -190970 -78486
1129g8486k9926l40654J66893J41118J95917m07777k58824L78179J41079l0611
$$ -78486 -108412 -449066 -282173 -141055 54862 -352915 -611739 -233560 -92481 -123092
1119a23092j0763L34417K66570L9951o14266K31004P8030k82023O75868k69914
$$ -123092 -133855 200562 467132 507083 -107183 123821 201851 -80172 595696 325782
1109C25782n35366J39539k04295J04022p1581K10780O7070l85247m52114K84745
$$ 325782 -209584 -70045 -274340 -170318 -241899 -31119 35951 -349296 -801410 -516665
1099e16665K23845J13875N57960n30463k0694j31297K72939J3153k30737J77389
$$ -516665 -292820 -178945 379015 -151448 -172142 -303439 -30500 -17347 -248084 -70695
1089g0695J32596O6006k06846l22261Q9855J53276n2834K60117m41351L268Q9304
$$ -70695 61901 127907 -78939 -401200 -311345 -158069 -210903 49214 -392137 -388869 -299565
1078b99565N8295m69328L77925r1191l21161J46162L98781R1253K60885k29571
$$ -299565 -241270 -710598 -332673 -423864 -745025 -598863 -200082 -108829 152056 -77515
1068g7515j98911j32385K97270J14290k49264r7290k22019K91251K41374K5368
$$ -77515 -276426 -408811 -111541 2749 -246515 -343805 -565824 -274573 -33199 -7831
1058g831J95526j08097r1729K50078k01261n9682k36156L39307J34290p6695J09739
$$ -7831 187695 79598 -12131 237947 36686 -22996 -259152 80155 214445 137750 247489
1047B47489l6785J57303K53751k23853N8027j91595n33407L12006L24947l88749
$$ 247489 210704 368007 621758 397905 455932 264337 -269070 42936 367883 -20866
1037b0866l27717l8431r7191j78169M45753Q6663l3116j55370R5371L29966p7446
$$ -20866 -348583 -387014 -484205 -662374 -216621 -129958 -163074 -318444 -223073 106893 29447
1026B9447j12661J03443J71067k28705j06533L97703K05641m32392k25861J01504
$$ 29447 -83214 20229 191296 -37409 -143942 253761 459402 27010 -198851 -97347
1016i7347j50012J67484Q6241K1330n2142l10344j78668M49551J32418J5767Q7796
$$ -97347 -247359 -79875 6366 27696 -24446 -334790 -513458 -63907 68511 84278 172074
$$ [...]
##END NTUPLES=NMR SPECTRUM
##END=
