##TITLE=1H_CA-8962-1
 CDCl3
 8 sc, 
 17.12.2021
##JCAMPDX= 6.0         $$ Bruker NMR JCAMP-DX V2.0
##DATA TYPE= NMR SPECTRUM
##DATA CLASS= NTUPLES
##ORIGIN= UXNMR, Bruker Analytische Messtechnik GmbH
##OWNER= root
$$ XWIN-NMR		Version 3.5
$$ Fri Dec 17 11:57:58 2021 Russian Standard Time (UT+4h)  she@DPX200
##.OBSERVE FREQUENCY= 200.131346
##.OBSERVE NUCLEUS= ^1H
##.ACQUISITION MODE= SIMULTANEOUS
##.ACQUISITION SCHEME= undefined
##.AVERAGES= 8
##.DIGITISER RES= 18
##SPECTROMETER/DATA SYSTEM= spect
##.PULSE SEQUENCE= zg30
##.SOLVENT NAME= CDCl3
##.SHIFT REFERENCE= (INTERNAL, CDCl3, 0, 15.7392)
##AUDIT TRAIL= $$ (NUMBER, WHEN, WHO, WHERE, WHAT)
$$ ##TITLE= Audit trail, XWIN-NMR		Version 3.5
$$ ##JCAMPDX= 5.01
$$ ##ORIGIN= Bruker BioSpin GmbH
$$ ##OWNER= she
$$ F:/spectra/data/she/nmr/H-F/1/pdata/1/auditp.txt
$$ ##AUDIT TRAIL=  $$ (NUMBER, WHEN, WHO, WHERE, WHAT)
(   1,<2021-12-17 11:56:42.65 +0400>,<she>,<DPX200>,
      <created by zg, POWCHK disabled, PULCHK disabled
       configuration hash MD5:
       00 E9 B6 7A A2 85 ED C7 34 08 36 98 17 FE 4E 26
       data hash MD5: 16K
       6F C6 DE 60 F3 92 16 A4 02 EA C2 89 6E D9 72 C0>)
(   2,<2021-12-17 11:56:46.20 +0400>,<she>,<DPX200>,
      <Start of raw data processing
       efp BC_mod = 2 LB = 0.24 FT_mod = 6 PKNL = 1 PHC0 = -15871.45 PHC1 = 10.20079 SI = 16K 
       data hash MD5: 16K
       2E 62 67 C2 C9 81 A2 76 9B BB 6F 3D A4 E0 88 37>)
(   3,<2021-12-17 11:57:03.64 +0400>,<she>,<DPX200>,
      <pk PHC0 = -155.2844 PHC1 = -1.4 
       data hash MD5: 16K
       DB 03 E7 FB 26 6E 2A 67 48 23 EB 22 B5 54 B6 C1>)
(   4,<2021-12-17 11:57:06.85 +0400>,<she>,<DPX200>,
      <abs ABSG = 5 
       data hash MD5: 16K
       CB 29 45 0F 7F 18 27 B8 D0 E6 D2 81 AF 11 43 DB>)
$$ ##END=
$$ 
$$ hash MD5
$$ B6 77 5B A5 2F 1C 0F 58 36 20 C8 58 E8 2D 33 8D
##$RELAX= 
##$RELAX= 
##$RELAX= 
##$RELAX= 
##$RELAX= 
##$RELAX= 
$$ Bruker specific parameters
$$ --------------------------
##$DU= <F:/spectra>
##$EXPNO= 1
##$NAME= <H-F>
##$PROCNO= 1
##$TYPE= <nmr>
##$USER= <she>
##$AMP= (0..31)
100 100 100 100 100 100 100 100 100 100 100 100 100 100 100 100 100 100 
100 100 100 100 100 100 100 100 100 100 100 100 100 100 
##$AQSEQ= 0
##$AQ_mod= 1
##$AUNM= <au_zg>
##$AUTOPOS= <>
##$BF1= 200.13
##$BF2= 200.13
##$BF3= 200.13
##$BF4= 200.13
##$BF5= 200.13
##$BF6= 200.13
##$BF7= 200.13
##$BF8= 200.13
##$BYTORDA= 1
##$CFDGTYP= 0
##$CFRGTYP= 5
##$CHEMSTR= <none>
##$CNST= (0..31)
1 1 145 1 1 1 1 1 1 1 1 1 1 1 1 1 1 1 1 1 1 1 1 1 1 1 1 1 1 1 1 1 
##$CPDPRG= <>
##$CPDPRG1= <>
##$CPDPRG2= <>
##$CPDPRG3= <>
##$CPDPRG4= <mlev>
##$CPDPRG5= <mlev>
##$CPDPRG6= <mlev>
##$CPDPRG7= <mlev>
##$CPDPRG8= <mlev>
##$CPDPRGB= <>
##$CPDPRGT= <>
##$D= (0..31)
0 1.2 0 0 0 0 0 0 0 0.06 0 0.03 0 0 0 0 0.0002 0 0 0 0 0 0 0 0 0 0 0 0 
0 0 0 
##$DATE= 1639727802
##$DBL= (0..7)
120 120 120 120 120 120 120 120 
##$DBP= (0..7)
150 150 150 150 150 150 150 150 
##$DBP07= 0
##$DBPNAM0= <>
##$DBPNAM1= <>
##$DBPNAM2= <>
##$DBPNAM3= <>
##$DBPNAM4= <>
$$ [...]
##$SUBNAM2= <"">
##$SUBNAM3= <"">
##$SUBNAM4= <"">
##$SUBNAM5= <"">
##$SUBNAM6= <"">
##$SUBNAM7= <"">
##$SUBNAM8= <"">
##$SUBNAM9= <"">
##$SW= 18.0517287032376
##$SWIBOX= (0..15)
0 0 2 0 0 0 0 0 0 0 0 0 0 0 0 0 
##$SW_h= 3612.71676300578
##$TD= 16384
##$TD0= 1
##$TE= 0
##$TE2= 300
##$TE3= 300
##$TEG= 300
##$TL= (0..7)
0 120 120 120 120 120 120 120 
##$TP= (0..7)
150 150 150 150 150 150 150 150 
##$TP07= 0
##$TPNAME0= <>
##$TPNAME1= <>
##$TPNAME2= <>
##$TPNAME3= <>
##$TPNAME4= <>
##$TPNAME5= <>
##$TPNAME6= <>
##$TPNAME7= <>
##$TPOAL= (0..7)
0.5 0.5 0.5 0.5 0.5 0.5 0.5 0.5 
##$TPOFFS= (0..7)
0 0 0 0 0 0 0 0 
##$TUNHIN= 0
##$TUNHOUT= 0
##$TUNXOUT= 0
##$USERA1= <user>
##$USERA2= <user>
##$USERA3= <user>
##$USERA4= <user>
##$USERA5= <user>
##$V9= 5
##$VALIST= <valist>
##$VCLIST= <CCCCCCCCCCCCCCC>
##$VD= 0
##$VDLIST= <DDDDDDDDDDDDDDD>
##$VPLIST= <PPPPPPPPPPPPPPP>
##$VTLIST= <TTTTTTTTTTTTTTT>
##$WBST= 1024
##$WBSW= 4
##$XGAIN= (0..3)
0 0 0 0 
##$XL= 0
##$YL= 0
##$YMAX_a= 349341
##$YMIN_a= -385549
##$ZGOPTNS= <>
##$ZL1= 120
##$ZL2= 120
##$ZL3= 120
##$ZL4= 120
##$ABSF1= 15.72044
##$ABSF2= -2.331409
##$ABSG= 5
##$ABSL= 3
##$ALPHA= 0
##$AQORDER= 0
##$ASSFAC= 0
##$ASSFACI= 0
##$ASSFACX= 0
##$ASSWID= 0
##$AUNMP= <proc_1d>
##$AZFE= 0.1
##$AZFW= 0.1
##$BCFW= 0
##$BC_mod= 2
##$BYTORDP= 0
##$COROFFS= 0
##$CY= -3
##$DATMOD= 1
##$DC= 0
##$DFILT= <>
##$DTYPP= 0
##$F1P= 0
##$F2P= 0
##$FCOR= 1
##$FTSIZE= 16384
##$FT_mod= 6
##$GAMMA= 0
##$GB= 0
##$INTBC= 1
##$INTSCL= 0
##$ISEN= 128
##$LB= 0.24
##$LEV0= 0
##$LPBIN= 0
##$MAXI= 10000
##$MC2= 0
##$MEAN= 0
##$ME_mod= 0
##$MI= 1.114404
##$NCOEF= 0
##$NC_proc= -7
##$NLEV= 6
##$NOISF1= 3.799351
##$NOISF2= 2.8
##$NSP= 0
##$NTH_PI= 0
##$NZP= 0
##$OFFSET= 15.73918
##$PC= 1
##$PHC0= -16026.73
##$PHC1= 8.800791
##$PH_mod= 1
##$PKNL= yes
##$PPARMOD= 0
##$PSCAL= 0
##$PSIGN= 0
##$REVERSE= no
##$SF= 200.130002475954
##$SI= 16384
##$SIGF1= 3
##$SIGF2= 2
##$SINO= 5.538805
##$SIOLD= 16384
##$SREGLST= <1H.CDCl3>
##$SSB= 0
##$STSI= 16384
##$STSR= 0
##$SW_p= 3612.71676300578
##$SYMM= 0
##$S_DEV= 0
##$TDeff= 16384
##$TDoff= 0
##$TI= <>
##$TILT= no
##$TM1= 0
##$TM2= 0
##$TOPLEV= 0
##$USERP1= <user>
##$USERP2= <user>
##$USERP3= <user>
##$USERP4= <user>
##$USERP5= <user>
##$WDW= 1
##$XDIM= 16384
##$YMAX_p= 319802731
##$YMIN_p= -688794
$$ End of Bruker specific parameters
$$ ---------------------------------
##NTUPLES= NMR SPECTRUM
##VAR_NAME=  FREQUENCY,     SPECTRUM/REAL,   SPECTRUM/IMAG
##SYMBOL=    X,             R,               I
##VAR_TYPE=  INDEPENDENT,   DEPENDENT,       DEPENDENT
##VAR_FORM=  AFFN,          ASDF,            ASDF
##VAR_DIM=   16384,         16384,           16384
##UNITS=     HZ,            ARBITRARY UNITS, ARBITRARY UNITS
##FACTOR=    0.220516191357247, 1,           1
##FIRST=     3149.88205456015, 0,            0
##LAST=      -462.834708445628, 0,           0
##MIN=       -462.834708445628, -688794,     0
##MAX=       3149.88205456015, 319802731,    0
$$ Real data points
##PAGE= N=1
##DATA TABLE= (X++(R..R)), XYDATA
$$ [...]
9122 72540876 68932350 65645521 63023887 61147355 60128731 59857961 60123520 60705770 61393568
9113 61393568 62078009 62562138 62967559 63505635 64247124 64735542 64252644 62804390 60967885
9104 60967885 58652907 55803460 52228381 48063823 43852897 40061883 36839568 34219551
9096 34219551 32116960 30423251 29010120 27778012 26713447 25688039 24635359 23551875
9088 23551875 22575474 21709884 20976516 20263967 19700048 19241160 18857606 18550131 18283374
9079 18283374 18009206 17780468 17599850 17473131 17524848 17560590 17615259 17726855 17789428 17878887
9069 17878887 18025845 18211947 18316231 18391607 18431933 18407761 18410532 18401221 18367647 18340305 18112321
9058 18112321 17813378 17570411 17326147 17210646 17145422 17223272 17427953 17563453 17696933 17879505
9048 17879505 18058781 18298595 18580307 18909625 19115674 19211809 19400867 19715952 19969070 20219031
9038 20219031 20353210 20359810 20121719 19957518 19825062 19836694 19893470 19929268 20094276 20294630
9028 20294630 20474216 20475973 20451967 20244582 20064247 19875702 19604991 19277759 18907690 18623110
9018 18623110 18491984 18389631 18465976 18591387 18760254 18987732 19262393 19479568 19577592 19667437
9008 19667437 19902614 20172941 20523332 20500490 20409236 20231996 19930004 19466047 18923979 18264189
8998 18264189 17518663 16960905 16493432 16109520 15905317 15780021 15790212 15758186 15747412 15791949
8988 15791949 15935109 16052230 16116047 16266488 16484585 16756523 16896959 17230080 17547830 17965240
8978 17965240 18521274 19279981 20125957 21188544 22428574 23771178 25276637 27005500 28801671
8969 28801671 30689610 32592873 34414507 35954798 37115260 37883402 38581425 39391232 40270750
8960 40270750 41108784 41562377 40934774 39316910 37319431 35217591 33370125 31928751 30847497
8951 30847497 30049460 29453612 28938022 28482443 27954524 27539984 27393918 27460919 27766486 28339755
8941 28339755 29101269 30170992 31530589 33149140 34981063 37059738 39312406 41578161
8933 41578161 43641832 45549209 47338962 49184115 51240428 53463216 55335769 56206291
8925 56206291 56055414 55288405 53873636 51708141 49021247 45761165 41993333 38357544
8917 38357544 35153406 32524442 30486407 28806723 27498163 26407918 25504759 24718888
8909 24718888 23938893 23108828 22389516 21691542 21007295 20370157 19900333 19424473 18935037
8900 18935037 18626052 18376636 18101329 17873195 17682384 17549908 17415304 17324629 17304657 17289071
8890 17289071 17368948 17479289 17458960 17584125 17662246 17739279 17891432 17996729 18093962 18312151
8880 18312151 18458697 18626672 18796772 18975211 19238509 19527320 19892863 20153513 20529315
8871 20529315 20907043 21227328 21597235 21979276 22401775 22803764 23333647 23818577 24307703
8862 24307703 24906789 25513535 26238731 26931289 27752453 28640634 29514097 30547722 31650668
8853 31650668 32888594 34268576 35738146 37351277 39094223 41050424 43167262 45571557
8845 45571557 48034187 50563402 53272859 56098061 59061091 62064303 64998582 67681192
8837 67681192 69881891 71737447 73114748 74137064 75034683 76166130 77596373 79220301
8829 79220301 81075948 83328325 86062816 89328671 93112987 97180865 101099252 104794049
8821 104794049 108263059 110828843 112983662 115220262 117689791 120834218 124745053 129239741
8813 129239741 133891654 138144320 141514705 144313516 146901645 149509916 152348983 155136928
8805 155136928 157508931 159089888 160029150 160389938 160061282 159393096 158446971 157705046 157264918
8796 157264918 157329125 157950572 159228135 161480430 164702086 168748120 173525039 178239672
8788 178239672 182455110 185886837 188871309 192023525 194714429 197233766 199902905 202532914
8780 202532914 204000743 203683497 202538998 201371535 200489386 199661081 198762800 197167975 194515566
8771 194515566 191115571 186796334 181996718 177196987 172696349 168159662 163224939 157617309
8763 157617309 151837944 146477582 142179745 139066160 137148179 136001277 135073780 134662168
8755 134662168 135228578 136875231 139417609 142347357 145450682 148389158 150183214 151026215
8747 151026215 151348674 151368621 151172145 150013437 147523065 143744724 138968895 133554957 127741340
8738 127741340 122020648 116657824 111716240 106667145 101374633 95823565 90320926 85179462
8730 85179462 80692368 77002336 73931857 71436730 69310146 67531761 66030586 64736583
8722 64736583 63702902 62885001 62281639 61910382 61997127 62346160 62792967 62231884 60932891
8713 60932891 60280313 59877690 59971396 60413186 61002388 61664186 62214879 62751680 63382671 64107890
8703 64107890 64807269 65232738 65210021 64809275 64371890 64173324 64032967 64052812 64028035 63941055
8693 63941055 64100319 64544970 65311157 66346158 67629027 69211335 71016914 73117511 75411628
8684 75411628 77736755 80222208 82925888 85728825 88485254 91007937 93328501 95611658
8676 95611658 98011583 100570228 103511119 106875013 110429597 114141475 117590714 120199247
8668 120199247 121494396 121433884 120611369 119207330 117480795 115239471 112496054 109775559
8660 109775559 107407334 105758114 104789505 104234700 103899849 103813968 103980717 104084454 104301768
8651 104301768 104563379 104477681 103811702 102569084 100959029 99133108 97398322 95776740 94469297
8642 94469297 93613407 93368128 93574421 94248925 95052133 96002439 97114740 98390800 99975318
8633 99975318 101907576 103790811 105381570 106371195 106768494 106961635 107129381 107468254 107876108
8624 107876108 107829953 107269686 106670324 105950630 105254953 105011508 104942736 104677345 103088767
8615 103088767 99512915 94839308 90195835 85879659 82071288 78513574 75040240 72083161
8607 72083161 69501299 67196036 65184978 63711013 62821287 62360001 62280054 62467569 62729871
8598 62729871 63141158 63733288 64580773 65940092 67690977 69652373 71511065 72766120 73034721
8589 73034721 72490863 71888523 71456137 71477161 71877943 72248486 71553527 69645109 66394287
8580 66394287 62410706 58265469 54446235 51143528 48505692 46276096 44262600 42234689
8572 42234689 40262806 38584306 37146198 36080384 35187640 34600136 34108811 33680517 33488202
8563 33488202 33333853 33146579 33003044 33019809 33067400 33095694 32956018 32810282 32675432 32163408
8553 32163408 31507905 30868880 30421396 29974217 29174265 27765473 26299216 25191257 24119527
8544 24119527 23107963 21906327 20625143 19645664 18685089 17829086 17097845 16531260 15965177
8535 15965177 15419129 14909383 14514060 14057476 13670575 13306464 12866898 12490557 12240286
8526 12240286 11905349 11632445 11492913 11233634 10925345 10590519 10302683 10065495 9761417
8517 9761417 9428926 9251770 9078801 8876725 8623170 8431185 8273007 8076644 7876878 7707280
8507 7707280 7551164 7417698 7328041 7195252 7130124 6964836 6871729 6768276 6579967 6397403
8497 6397403 6222915 6139916 6006105 5824814 5765061 5706376 5567932 5462179 5383526 5330575
8487 5330575 5177105 5120629 5049500 4972359 4980549 4903300 4809976 4765034 4719681 4644078 4569186
8476 4569186 4535263 4453452 4417834 4412670 4346951 4289603 4169807 4122672 4057548 4040375 3979777
8465 3979777 3958223 3835902 3689914 3703550 3766625 3755606 3747714 3760739 3683569 3637228 3660062
8454 3660062 3605565 3576024 3539150 3475886 3501231 3528991 3462669 3426759 3404032 3370282 3349621
8443 3349621 3315804 3286439 3337543 3325552 3246563 3215718 3151304 3168847 3098304 3110460 3050021
8432 3050021 3023975 2941122 2966687 2967861 2926205 2903155 2892415 2866866 2830083 2794532 2795330 2764824
8420 2764824 2787543 2806062 2736869 2789535 2739910 2720894 2687259 2701340 2696689 2610715 2632913 2631151
8408 2631151 2583310 2589150 2561364 2494852 2414013 2383779 2307590 2311168 2325053 2281465 2266764 2170832
8396 2170832 2138556 2119348 2047855 2082482 2074288 1937046 1872949 1901859 1914559 1887485 1851877
8385 1851877 1812295 1818375 1725213 1744718 1676441 1709463 1736468 1703784 1715493 1638406 1585333 1548466
8373 1548466 1555251 1486030 1459828 1465052 1555192 1563633 1482934 1453715 1380405 1359297 1395448 1343006
8361 1343006 1326253 1273841 1222112 1289387 1405677 1337963 1273832 1315930 1277660 1204562 1201946
8350 1201946 1181999 1108394 1083032 1105279 1057867 1093467 1075693 1003506 1070749 1072574 1104948 1057247
8338 1057247 1055346 1039346 1032941 1029133 1055944 1027008 1049748 1081421 1012286 1029663 1063198 1038296
8326 1038296 959971 998388 989236 965279 1001770 1014396 1025150 1039513 1002959 1025803 1052704 1041184
8314 1041184 1012892 1053254 1078139 1139662 1105590 1054953 1102477 1160746 1162894 1151595 1146252 1131916
8302 1131916 1132884 1129604 1107409 1123689 1074458 1048141 1150537 1151537 1131466 1147581 1182729 1154266
8290 1154266 1157667 1192211 1172063 1118902 1161588 1192073 1132805 1041156 1081465 1114870 1090285 1114983
8278 1114983 1096243 1125437 1125115 1189352 1181582 1158552 1149448 1173309 1198280 1227012 1242715 1262724
8266 1262724 1268912 1252763 1242871 1224262 1227305 1326450 1347578 1307049 1330149 1274965 1317105 1301678
8254 1301678 1300345 1314480 1337236 1289883 1257706 1213782 1155815 1091753 1057433 1107979 1108422 1023758
8242 1023758 1053854 1106097 1054458 926647 933296 982336 1002646 972722 899103 961401 944802
8231 944802 1004997 1033396 1027989 1048446 1004376 978155 1040494 1053958 1050499 1031148 1033342 986426
8219 986426 965633 957977 927929 885801 843724 812772 784495 735859 639253 684525 716849 663613
8207 663613 655405 611693 539611 487897 465717 517724 541794 550489 490013 578029 538948 414649
8195 414649 437615 626258 690341 446325 332722 494223 419479 361958 304781 365323 458039
8184 458039 490556 501474 491351 557324 478885 360380 288929 379586 313895 338453 350135
8173 350135 280866 265150 312900 232903 246213 258446 328086 296509 207698 237302 288468 212942
8161 212942 151559 131361 169872 210557 143910 205823 248106 210065 113357 121010 123594 89563
8149 89563 119543 122077 118153 101822 80077 79017 79996 121356 91632 75266 87373 71406 26719
8136 26719 39305 35377 34198 60827 144976 133949 91148 126762 54114 35289 9376 51292
8124 51292 111444 128901 147462 96726 150213 85305 56809 22952 72663 49677 51117 70150
8112 70150 94581 122050 77397 37227 59469 89186 82622 49539 6964 55427 8718 32927
8100 32927 42139 32944 54031 77102 23218 -71505 -84431 -26678 -32347 20121 35023 97093
8088 97093 133928 84898 104492 81886 83272 173098 175463 139536 89242 64338 111018 126978
8076 126978 156891 112301 53338 85986 -3420 26651 76417 128440 67672 -13759 52431 71753
8064 71753 33845 41450 101149 1731 30805 -27712 3691 9576 -54339 -64341 -75547 -9229
8052 -9229 714 17439 -36473 -126602 -71801 45807 -13411 -35307 -27825 -41376 -98111 -76676
8040 -76676 -11084 -95873 -60618 -46975 -34442 -60350 -81547 -97358 -49253 16291 -53726 -72691
8028 -72691 406 -4691 -34799 -54288 -98657 -100391 -111358 -125284 -73436 -20779 -11372 -59028
8016 -59028 -118334 -90179 -121462 -135366 -78922 -120220 -184647 -176284 -198613 -154570 -109762 -111065
8004 -111065 -101566 -102189 -170163 -210434 -160999 -166960 -132643 -126633 -122148 -86124 -130491 -152506 -135605
7991 -135605 -109780 -124749 -141695 -159610 -170282 -136040 -170475 -151818 -139447 -108331 -84111 -151880
7979 -151880 -196285 -162523 -94375 -135986 -163589 -223761 -216273 -181481 -104113 -181802 -187688 -206286
7967 -206286 -205492 -209290 -150669 -132174 -201411 -167108 -166780 -107585 -130015 -132748 -130682 -254564 -284418
7954 -284418 -249914 -265998 -293955 -245831 -189412 -166476 -147368 -221034 -272039 -260701 -192730 -99690
7942 -99690 -101708 -63433 -147193 -234210 -170097 -196902 -137051 -133145 -162244 -166762 -213788 -190825
7930 -190825 -129976 -130645 -117062 -160140 -171101 -116297 -83072 -166163 -149417 -89673 -44697 -64891
7918 -64891 -111089 -123117 -75478 -83264 -51201 -67102 -128794 -166073 -106654 -52329 -124597 -138129
7906 -138129 -105691 -89151 -63574 -99121 -147879 -108046 -117039 -107433 -91973 -182484 -129453 -67765
7894 -67765 -125695 -125144 -140485 -191595 -108933 -50580 -134686 -163259 -125654 -89672 -120640 -167322
7882 -167322 -179465 -85945 -71884 -69738 -74528 -121043 -196148 -213821 -96143 -114050 -88496 -73834
7870 -73834 -112988 -114115 -106159 -134989 -107940 -138938 -156055 -178925 -189812 -170121 -123299 -176181
7858 -176181 -160219 -154272 -192344 -150785 -117263 -127294 -141369 -129577 -220790 -190973 -149610 -116477
7846 -116477 -66596 -74798 -96636 -79109 -127099 -172557 -212330 -199087 -97671 -128664 -181148 -159468
7834 -159468 -216692 -182442 -140327 -157306 -193739 -114032 -70823 -102191 -134519 -119805 -92822 -96616
7822 -96616 -174648 -175845 -153083 -135046 -121857 -93616 -98886 -151863 -195301 -206540 -168908 -107559
7810 -107559 -131127 -137987 -165040 -106743 -139327 -197981 -194469 -113065 -172353 -119334 -688794 -522249
7798 -522249 -58312 -228270 -217870 -202658 -150396 -199385 -228177 -205368 -136087 -135266 -84502 -73998
7786 -73998 -99310 -154166 -164640 -201303 -167568 -195258 -140931 -131479 -154106 -193113 -202393 -204822
7774 -204822 -208787 -250051 -183502 -104512 -103701 -153923 -102436 -183276 -210318 -158558 -148514 -143224
7762 -143224 -144188 -200622 -194277 -175873 -203401 -142946 -131211 -224744 -246243 -228130 -182656 -169891
7750 -169891 -193445 -149957 -146307 -207873 -213416 -194133 -131339 -188535 -172085 -187055 -209543 -162638
7738 -162638 -138375 -133280 -181091 -219872 -276612 -267419 -300151 -226589 -227697 -212395 -119443 -148558
7726 -148558 -167856 -252426 -219976 -150995 -174888 -112459 -95829 -157805 -159413 -160813 -161739 -176630
7714 -176630 -131500 -139308 -146670 -153297 -159822 -175043 -198746 -162561 -164418 -163355 -164166 -211271 -211596 -221193
7700 -221193 -196169 -149062 -159011 -152321 -116073 -77658 -131185 -242430 -200781 -126196 -84221 -67203
7688 -67203 -97522 -103702 -128229 -114487 -100755 -131162 -76698 -58743 -68639 -30615 -144531 -164813
7676 -164813 -159229 -165705 -186169 -147991 -216364 -192788 -162021 -166849 -129817 -94388 -70879 -136496
7664 -136496 -179903 -219456 -161638 -127807 -104350 -109405 -146637 -124356 -72030 -63267 -136931 -130045
7652 -130045 -121827 -145875 -125860 -125881 -174159 -233725 -231280 -238127 -246030 -239255 -251394 -228175 -191458
7639 -191458 -187968 -235480 -236941 -154677 -163839 -183200 -160591 -246195 -230534 -237473 -261376 -241178
7627 -241178 -176478 -199618 -201314 -194467 -198462 -170242 -210125 -268919 -197149 -128705 -160452 -179294
7615 -179294 -123140 -160862 -196748 -192291 -131732 -169579 -208467 -204586 -150307 -184776 -199575 -184241
7603 -184241 -264877 -180402 -103622 -82987 -43748 -83088 -158145 -158247 -149174 -157133 -143675 -179835
7591 -179835 -128180 -102662 -139460 -113554 -82288 -119193 -80523 -27189 -85833 -142256 -89485 -63913
7579 -63913 -68166 -54661 -47480 -24264 -34400 -29449 -116043 -67001 -96900 -63326 -81787 -107570
7567 -107570 -115642 -108973 -78787 -25538 -35697 -34937 -55566 -100489 -60101 -76622 -161861 -163903 -168127
7554 -168127 -106251 -170041 -166690 -125098 -91829 -119824 -189997 -182145 -119292 -42089 -80262 -80812
7542 -80812 -136308 -180840 -78902 -40221 -40787 -79063 -76944 -86856 -116401 -89795 -153248 -131393
7530 -131393 -67513 -96262 -68251 4067 -61605 -99429 -104443 -151561 -143941 -147690 -134950 -78624
7518 -78624 -67983 -99602 -158756 -92210 -91331 -58248 -98779 -236148 -182500 -45501 -63932 -101835
7506 -101835 -35553 -82873 -135566 -129489 -116462 -64390 -73399 -120335 -123121 -104384 -102331 -82533
7494 -82533 -36983 -80138 -108853 -119170 -129712 -210710 -280552 -266641 -160108 -139679 -137939 -196777
7482 -196777 -222357 -163881 -78323 -56318 -32665 -27764 -68224 -69029 -110782 -129425 -107771 -129368
7470 -129368 -145791 -136273 -77486 -75932 -71558 -81666 -88838 -50879 -116667 -73003 -124940 -107786
7458 -107786 -138764 -136260 -80911 -64714 -105381 -97892 -84582 -96517 -80745 -144019 -108801 -103984
7446 -103984 -80930 -92953 -111304 -101468 -100502 -95574 -102313 -13102 -38260 28913 -30627 -49906 -34520
7433 -34520 -75206 -64227 -21427 -36779 -40850 -3209 21614 38031 8245 48242 89974 89718
7421 89718 65670 90242 125943 89328 113653 142902 189940 204737 125913 115799 146759 167767
7409 167767 193440 190753 232411 256530 200528 134734 103348 236363 323890 244890 247577 209222
7397 209222 188678 211407 201612 94980 96792 143443 152732 136709 119229 114345 103027 57192
7385 57192 71699 53031 64197 99455 4891 -21114 -6499 -22246 -47377 15471 -37435 -20987
7373 -20987 -2768 7283 59 16028 12280 34641 20633 19906 22217 26736 19135 -22091 1771
7360 1771 60218 17859 -350 74984 66736 94427 99538 175011 166895 97815 86689 131532 165880
7347 165880 146062 167672 159459 206365 287878 282402 171246 112537 76464 91104 33977 71467
7335 71467 98773 138193 190707 116545 74192 99882 118723 115421 174346 225767 197443 165529
7323 165529 139467 119365 183289 227338 185904 161977 181038 161311 138728 149493 172952 144857
7311 144857 149508 113966 25662 50239 -2649 25904 27799 49993 111282 41224 34826 109375
7299 109375 52527 25580 2682 12642 36777 5281 59756 592 37581 51317 40836 -6973
7287 -6973 -13086 31485 73353 45876 -12885 86027 115572 149290 158102 141259 100578 147491
7275 147491 143531 121384 147452 92481 85339 163351 202254 158199 122367 116689 163683 86115
7263 86115 75168 120427 64057 95508 93905 120297 85521 66202 95790 132856 127396 245396
7251 245396 293220 304793 333243 386796 424017 529141 637962 636402 507230 481796 428824
7240 428824 301322 329460 275934 221948 177736 133486 122789 237811 137422 169899 118860
7229 118860 106809 92430 142475 113205 102179 143404 81522 24440 46679 36076 12249 25217
7217 25217 45066 -12216 -5589 17915 -33556 -5867 -28760 54122 23756 -21415 -34565 -24304
7205 -24304 79358 89738 53088 -785 -9478 -13127 9756 28060 -52052 -69218 26910 43678
7193 43678 132097 103670 71368 155595 113219 15419 70751 77533 73061 125058 129195 129318 119566
7180 119566 74545 124551 104734 179668 224224 146218 173740 133732 120230 162836 214360 221487
7168 221487 219768 212022 219262 216608 187144 192888 272005 257394 294336 288140 266965 304375 316252
7155 316252 381526 445945 440649 426775 437862 497935 480826 554587 451480 353446 368140 479249
7143 479249 504579 429568 354639 368538 378930 287656 301791 355405 333740 311335 329132 293665
7131 293665 293119 249558 309860 284074 308181 329683 283646 253437 342572 314132 350337 344104
7119 344104 389031 352848 228126 249069 293998 340537 246987 291077 284421 314294 193800
7108 193800 245811 295655 284759 322116 348323 314305 338659 336960 342317 387318 387859 321944
7096 321944 360996 386475 394288 432350 350227 295829 328220 328941 284134 316389 336731 349364
7084 349364 391288 431135 435608 442865 432747 472345 465160 444014 434656 442839 490370 490051 546685
7071 546685 668114 758952 815752 792984 775255 877616 941988 914545 932029 933352 887560
7060 887560 880738 863653 804947 711573 805156 819033 833496 813943 833400 881053 896672 975854
7048 975854 909264 955407 950419 918432 928233 908192 843809 899537 871332 822187 845387 880197
7036 880197 888742 840046 928202 946375 965000 1011491 1080705 1180756 1329574 1447314 1561114
7025 1561114 1665786 1812852 1947360 1921136 1760459 1624378 1441776 1198048 1057328 926491
7015 926491 895042 887854 887607 883944 774568 742256 669466 665111 743075 748414 780073 691435 724064
7002 724064 761855 800156 776494 758335 729788 763562 705130 653988 693298 705814 659654 694783
6990 694783 816143 753145 661564 648776 671132 740548 714733 698755 669892 634104 613944
6979 613944 611194 582421 634865 729917 746737 769830 762051 773683 736191 731689 717329 699170
6967 699170 734063 747812 776737 791329 786463 691715 669365 674869 682326 729850 843753 865504
6955 865504 836892 836519 843602 820840 821368 864645 874483 930310 949454 988832 1000319 938408 1044531
6942 1044531 1043034 1088574 1062309 1070395 1160777 1204603 1237907 1278747 1218190 1260986 1362483 1444085
6930 1444085 1420164 1420120 1500102 1558880 1606174 1647516 1653795 1680126 1765184 1779470 1878193 1977111
6918 1977111 1957853 2030991 2105159 2118033 2183923 2301683 2377899 2445225 2530906 2671635 2738847
6907 2738847 2746898 2837095 2856659 2936532 2955239 3047713 3106372 3117622 3148412 3271878 3359868
6896 3359868 3489683 3527663 3615403 3729649 3753720 3827187 3985016 4167102 4293137 4332761
6886 4332761 4525881 4774706 4902097 5105683 5428033 5580849 5719472 5883205 6208278 6477846
6876 6477846 6745746 7004318 7284799 7556900 8013007 8368993 8776285 9116643 9525608 9832368
6866 9832368 10273212 10817991 11704845 12516257 13315438 14258903 15415713 16654363 18383816
6857 18383816 20277553 22728419 25665905 29579658 33996498 39422161 45543429 52912979
6849 52912979 60569750 69563275 79727910 92704396 107961828 122471617 116981466 93092592
6841 93092592 75087258 60118175 47961766 39093201 33474933 29406253 26674208 24665526
6833 24665526 23013977 21189969 19640774 18094084 16793500 15446566 14402052 13444679
6825 13444679 12761247 12081130 11422209 10874107 10429481 9882666 9414322 8924687 8623569
6816 8623569 8315888 8085461 7930518 7651221 7374372 7137804 6944309 6797059 6637607 6483543
6806 6483543 6306742 6164926 6029457 5898513 5849545 5829423 5747813 5645543 5713116 5715707 5759213
6795 5759213 5779349 5876542 6006462 6067656 6128759 6333641 6412404 6638307 6774390 6878665
6785 6878665 7061336 7327936 7493723 7654875 7663405 7779896 7908054 8008697 8150446 8437147
6775 8437147 8512073 8441467 8346772 8181738 7916946 7757777 7637933 7500037 7326397 7247130
6765 7247130 7036673 6789582 6540156 6354269 6176081 6034719 5853602 5819092 5644631 5599522
6755 5599522 5543933 5537866 5472615 5387765 5263073 5182651 5030279 4904075 4814110 4772623 4626516
6744 4626516 4422484 4153508 3938005 3785001 3618960 3444626 3317346 3206566 3086620 3018293
6734 3018293 2912959 2788113 2601227 2563597 2512482 2499528 2415199 2394429 2270680 2199054 2180445
6723 2180445 2180359 2212216 2251078 2317874 2287126 2265342 2268344 2261917 2248801 2201886 2203655 2237148 2243206
6710 2243206 2245896 2206473 2232429 2226916 2225064 2219985 2160031 2166907 2086405 2160208 2217487 2238557
6698 2238557 2224875 2205637 2194482 2166460 2226769 2273651 2394392 2547997 2676782 2758696 2844954
6687 2844954 2994863 3192289 3385736 3665824 3980486 4300079 4617957 4962751 5373122 5702350
6677 5702350 6030066 6173584 6265329 6388586 6589134 6556016 6496002 6516478 6505424 6469527 6454762
6666 6454762 6414523 6288269 6156574 6006237 5788363 5710748 5658885 5498254 5332843 5152228
6656 5152228 4977421 4790817 4536237 4264909 3999369 3726249 3389694 3092777 2912611 2736344
6646 2736344 2599523 2378350 2273925 2133980 1974736 1866849 1811327 1727348 1588638 1541747
6636 1541747 1519032 1501561 1411660 1440682 1469083 1402231 1388237 1383504 1417223 1343785 1319235 1228515
6624 1228515 1149864 1142444 1085744 1165238 1136487 1090391 1191960 1188575 1094982 1104419 1214307 1164364
6612 1164364 1166743 1229434 1219529 1236299 1226723 1216317 1126553 1073131 1121200 1111192 1076950 1102989
6600 1102989 1042024 993749 916505 947235 977763 988546 958152 901625 863161 789768 718919
6589 718919 699908 703561 724016 713955 691007 724895 716075 737088 662925 591206 568105 514190
6577 514190 504879 580008 613763 578826 497416 453545 432764 460140 430219 422194 426647 399614
6565 399614 410678 406885 370293 360320 329121 343676 326947 252622 298665 291886 299631 415441
6553 415441 436768 418695 335254 310371 295615 289030 396027 299632 271805 285723 282135 327653
6541 327653 348671 315903 213860 247901 281724 304152 279200 232176 254547 267149 323066
6530 323066 243049 247348 274267 273679 267620 268990 247281 158611 121077 138801 255111 212265
6518 212265 250744 190110 152172 218370 181791 182195 133400 136205 212276 256141 228529 258122
6506 258122 217854 261039 242097 238855 251266 309003 309933 323585 334280 279493 271199 330721
6494 330721 306311 297916 352444 361305 378714 373906 412895 407185 425925 465831 511591 575616
6482 575616 591527 648394 590048 569151 586420 610006 603165 516587 543281 519892 533915 451578
6470 451578 442049 439293 347745 313460 352680 428591 395666 347725 436698 448601 406478 353134
6458 353134 311979 368969 408950 392337 394539 385790 421713 443735 464531 448937 518821 603954
6446 603954 648171 662241 691734 747372 862675 932830 980030 1084916 1158971 1076689 1014011
6435 1014011 891374 817895 779969 694284 676504 734928 628933 625140 610466 598073 630800
6424 630800 563119 550334 550800 492847 415365 391679 429593 422244 393604 411351 413405 419743 356877
6411 356877 371788 368757 363904 297875 269866 337156 352026 325207 280690 350048 323854 343248
6399 343248 285054 242400 350864 315146 349242 339024 357244 376899 361039 374613 369499 316815
6387 316815 333513 290354 314386 321409 336048 306240 352140 332538 343992 370781 353358 346745
6375 346745 328645 254406 222514 194686 211146 268423 287868 245239 227792 367041 338294
6364 338294 226101 259295 231441 224975 235595 211305 209017 190335 191189 185056 186286 192726 264396
6351 264396 238255 226962 180963 114183 179680 164253 171315 103264 157066 175135 152967 148520
6339 148520 158748 129767 89012 138808 130835 125307 105338 128555 235207 240943 158116 147317
6327 147317 171626 230980 171534 164139 205937 175060 115879 138512 75353 84870 72466 123365
6315 123365 153943 116325 83986 104588 155947 119291 173589 201396 224420 216132 148433 136735
6303 136735 95369 132646 111539 22220 66899 90125 88840 16871 80766 50917 63854 78070
6291 78070 72446 135090 22445 -25583 41981 81512 42045 57266 27156 56526 44294 77233
6279 77233 126809 35650 26809 38052 5274 -26022 61059 123248 93471 110667 132403 88323
6267 88323 102532 53547 70262 136854 96283 111219 121690 184848 206554 205102 228413 197934
6255 197934 112292 143206 97318 156596 146813 133795 185652 207059 200127 183733 252043 254907
6243 254907 207018 195067 206277 252735 261638 297157 320221 326940 331483 258984 294887 295120 355273
6230 355273 407762 377080 359594 390677 445518 394548 357916 409558 486837 554191 472372 425872
6218 425872 399330 430522 409174 391865 330053 301648 327789 281141 249876 261016 277750 299286
6206 299286 331661 317664 303677 296286 350992 331680 339014 316777 354286 354407 350420 356669 391815
6193 391815 374051 329696 363268 428071 425752 386520 421450 472117 388573 450424 398691 358703
6181 358703 383698 352452 393713 430333 479552 529390 535951 538749 620061 581434 611151 603266
6169 603266 648168 635669 653583 692076 734248 753122 719406 676955 705245 721527 741216 733838
6157 733838 726815 752299 762079 653063 624716 626280 634053 620201 589360 565310 579717 582437
6145 582437 530764 525571 575846 607868 572423 576145 549624 607739 590064 584316 626774 689431
6133 689431 684910 670358 680652 705807 711647 661659 667734 657676 643157 612952 592492 544134
6121 544134 542592 551650 586117 558731 606746 579742 496041 457492 535475 518550 508250 591689
6109 591689 537728 556295 537439 578347 633897 610956 618887 620503 661746 664911 661507 646725
6097 646725 630240 693923 771501 840700 754191 736850 857607 891885 900072 904578 892965 876981
6085 876981 898775 934961 919274 905024 931296 988459 959119 987646 1000949 1043009 1034429 1079307
6073 1079307 1121520 1121260 1101165 1098811 1062302 1066200 1113782 1173791 1198444 1308307 1378928 1432679
6061 1432679 1438468 1520910 1567328 1605614 1646815 1724489 1865651 2031964 2225191 2360396 2532802
6050 2532802 2756675 2992210 3241126 3559905 3923738 4326851 4660804 5038912 4749431 4071405
6040 4071405 3505830 3113121 2830454 2692572 2543885 2361090 2280543 2301678 2267738 2195217
6030 2195217 2106066 2102700 2125675 2076624 2078812 2084254 2059770 1941433 1970842 2009054 1945970 1998295
6018 1998295 1944599 1880798 1884835 1953908 1947615 1947447 1892072 1819625 1909686 1880015 1861898 1898192
6006 1898192 1870872 1892479 1861989 1809651 1831211 1765002 1771634 1754818 1757431 1798479 1721143 1690312
5994 1690312 1758944 1759204 1755543 1706981 1690905 1633180 1634812 1655215 1585837 1577461 1596458 1560249
5982 1560249 1571468 1540584 1528100 1544970 1567731 1600409 1561259 1583705 1642433 1579711 1563734
5971 1563734 1590175 1611567 1567850 1562480 1650546 1652724 1600645 1681267 1711734 1671914 1701107 1656620
5959 1656620 1705213 1731781 1699029 1729463 1735039 1742099 1721664 1773530 1854891 1875240 1802781 1737370
5947 1737370 1819435 1859839 1957000 1935127 1908738 1990454 2036286 2002820 2052101 2075831 2089229
5936 2089229 2098942 2103533 2113408 2109729 2156440 2235483 2274274 2306930 2426465 2467783 2522612 2591239
5924 2591239 2633932 2756185 2853766 2952635 3061255 3201878 3312649 3408897 3562464 3734195
5914 3734195 3888477 4104935 4390102 4619674 4902672 5275630 5678621 6043986 6481674 6898544
5904 6898544 7191000 7219227 6950414 6599667 6293649 6092593 5949035 5882037 5933589 5947649
5894 5947649 6094833 6240624 6436162 6730099 6960678 7270399 7668847 8114978 8608811 9108561
5884 9108561 9647603 10153012 10611776 10739237 10465481 10170634 9891480 9750235 9745097 9852073
5874 9852073 10203181 10654990 11186723 11950648 12817998 13831920 14870136 16067038 17345597
5865 17345597 18687783 19835832 20356026 20068765 19303276 18392907 17377885 16228733 15264613
5856 15264613 14546022 14071871 13796679 13767687 13898957 14218869 14761609 15391917 16200249 17040410
5846 17040410 18126774 19367217 20772354 22276135 23608643 24203407 23779139 23020745 22314907
5837 22314907 21570019 20694974 19902885 19478630 19372221 19631507 20199262 20982802 21974348
5828 21974348 23234660 24622294 26094284 27647039 28848570 29380774 29479978 29334871 28966077
5819 28966077 28061795 26442720 24554131 22685456 21119104 20018617 19090421 18473281 18159525
5810 18159525 17999624 18007920 18232662 18623898 19218203 20032026 21017450 22192860 23588135
5801 23588135 25180818 26917413 28877558 30747968 32218112 33150329 33608008 33853965 33910626
5792 33910626 33356500 32249995 31197118 30333173 29886520 29885968 30105778 30174754 29245166 27287289
5782 27287289 24950895 22750625 20874573 19275422 18011921 17016151 16318820 15711969 15225561
5773 15225561 14878978 14553462 14259048 13977871 13855702 13791833 13787461 13924413 14229769 14640766
5763 14640766 15139836 15762630 16539329 17434658 18453405 19580245 20849352 22252893 23606836
5754 23606836 24501275 24480514 23482104 21955468 20355557 18899206 17849221 17039241 16514110
5745 16514110 16048067 15453499 14609587 13666917 12642319 11810548 11155636 10646123 10225574
5736 10225574 9782086 9400864 9076106 8840470 8600547 8465188 8328418 8223826 8093234
5727 8093234 8035287 7942351 7942562 8020076 8058028 8161031 8401784 8476352 8735891 9054546 9319594
5716 9319594 9689295 9920793 10049895 9963326 9545603 9013189 8449560 7942339 7481743 7162884
5706 7162884 6870929 6650570 6548026 6442012 6293143 6105849 6023585 5960558 5994195 5953433
5696 5953433 5890073 5786623 5843769 5839031 5864195 5903737 5972858 6048038 6178296 6408394 6591523
5685 6591523 6717700 6905484 7174044 7465610 7783577 8109020 8401963 8601101 8581141 8474079
5675 8474079 8305957 8070638 7874624 7754336 7736108 7717451 7810260 7988433 8182833 8360265
5665 8360265 8519120 8702992 9160023 9589290 10020002 10515132 10975979 11335545 11482623 11404576
5655 11404576 11212278 10884725 10564036 10228045 9902889 9501524 9178015 8943652 8777475
5646 8777475 8795431 8787557 8762797 8921846 9032812 9173152 9256878 9405018 9643471 9847699
5636 9847699 10093337 10258298 10278514 10010430 9630331 9227935 8806180 8413524 8118352 7892970
5626 7892970 7676353 7540642 7477330 7441046 7367034 7343336 7268922 7258793 7256423 7236430 7279841
5615 7279841 7355300 7421666 7426950 7480557 7534391 7642869 7740388 7880849 7931303 8004009 8100739
5604 8100739 8290373 8455454 8655586 8857279 9010380 9214004 9435037 9791541 10100921 10340681
5594 10340681 10597751 10995216 11437937 11828802 12238974 12671632 13099843 13618563 14106080
5585 14106080 14578834 15097992 15541888 15963817 16453810 16929625 17257748 17573221 17894210
5576 17894210 18279434 18567323 18820771 19119503 19492754 19858925 20172904 20660160 21181987
5567 21181987 21661632 22300135 22815747 23396586 23979521 24563323 25116598 25610479 25988431
5558 25988431 26252692 26448076 26482944 26315117 26110016 25745330 25206003 24661605 24220144 23777047
5548 23777047 23333391 22870211 22495327 22133181 21775245 21523613 21316803 21120217 20883749
5539 20883749 20589181 20350181 20116120 19910331 19680942 19348875 18953372 18568525 18173080
5530 18173080 17660620 17198865 16676002 16271164 15802342 15284238 14853319 14486496 14114050
5521 14114050 13740053 13409433 13069279 12739442 12499053 12187656 11989284 11711904 11454341
5512 11454341 11298686 11151572 11010884 10928341 10782943 10656753 10529666 10484982 10339114 10258599
5502 10258599 10293894 10214674 10196409 10118476 10051745 10040640 9966366 9913985 9966634 9971429 9933688
5491 9933688 9992618 10024059 10061762 10085135 10158710 10201624 10215912 10314187 10398545 10524639 10678497
5480 10678497 10771527 10807362 11002396 11187385 11367527 11549492 11755003 12058671 12273269 12459226
5470 12459226 12665378 12891362 13077787 13300443 13487437 13716938 13895336 13968977 14136677 14352614
5460 14352614 14599403 14798460 15064111 15386936 15745671 16140224 16468278 16775980 17187372
5451 17187372 17589191 18026476 18449291 18784586 19162987 19504520 19729280 19863355 19919900 19952157
5441 19952157 20032725 20135203 20291003 20494502 20735232 21131030 21580366 21960869 22408473 22976494
5431 22976494 23578095 24222121 24805099 25405194 25997979 26526897 26985120 27247535 27423818
5422 27423818 27492937 27551403 27625007 27594455 27710488 27933949 28164044 28608573 29126122 29720755
5412 29720755 30394210 31192846 32091621 32946683 33799495 34617790 35372843 36041926 36605490
5403 36605490 37060362 37367505 37401519 37269472 37050572 36707967 36368557 36045100 35781291 35775718
5393 35775718 35831388 35995402 36258195 36603700 36967547 37357667 37789934 38207780 38469267 38693853
5383 38693853 38821367 38906958 38807675 38588304 38270994 38000510 37720510 37525406 37488996 37539736
5373 37539736 37680980 37860799 38158408 38407930 38514462 38548954 38371340 37946601 37373456 36577378
5363 36577378 35703031 34769646 33796802 32950910 32222994 31557429 31054686 30511193 30067143
5354 30067143 29733490 29543700 29451391 29405380 29355235 29361241 29413992 29415071 29339426 29087903 28683734
5343 28683734 28210580 27581272 26832454 26101945 25402453 24813337 24253110 23726401 23390419
5334 23390419 23091129 22856087 22715773 22611101 22540499 22464066 22420254 22407962 22442027 22507777
5324 22507777 22555623 22560954 22434605 22264851 21946853 21686550 21403293 21164342 21015690 20801810
5314 20801810 20717712 20779526 20867664 20987327 21215701 21547494 21841554 22147965 22483460 22870789
5304 22870789 23300942 23721039 24081964 24428649 24685078 24886628 25121576 25358106 25612340
5295 25612340 25912170 26211532 26549175 26933474 27372475 27764806 28199122 28581420 28941636
5286 28941636 29267129 29589179 29917887 30156628 30501873 30861128 31278351 31714154 32156462
5277 32156462 32620532 33108009 33609306 34167680 34774795 35439736 36187943 37013970 37897652
5268 37897652 38875312 39823571 40818775 41850375 42722229 43493676 44242759 44945673 45415663
5259 45415663 45747149 46005422 46073137 46064806 45975097 45728468 45368677 45044463 44553842 44021954
5249 44021954 43389219 42732202 42029727 41385682 40786039 40409133 39997043 39647921 39483091
5240 39483091 39407610 39365646 39353468 39468611 39530729 39496756 39494144 39497313 39393475 39254214 39070473
5229 39070473 38806896 38451930 37989317 37497513 36891086 36184598 35643007 35051231 34461444
5220 34461444 33954064 33528542 33249426 32978476 32852596 32824124 32779385 32853496 32904019 33014536
5210 33014536 33169382 33389338 33593402 33773929 33939791 34084414 34328925 34587920 34843991
5201 34843991 35171206 35546522 36006050 36556560 37088803 37639553 38296408 38966009 39765490
5192 39765490 40516233 41244026 41943178 42635179 43309542 43884511 44362519 44769273 45087581
5183 45087581 45288935 45368730 45295648 45194112 45142845 45072110 44883311 44759770 44732317 44770042
5173 44770042 44919579 45037608 45154265 45284324 45466608 45581061 45620137 45604419 45531863 45340244
5163 45340244 45039745 44589382 43938111 43272045 42428600 41574744 40734189 39833142 39033947
5154 39033947 38303175 37612948 36969063 36431413 35951496 35509415 35019803 34626117 34304778
5145 34304778 33961196 33594285 33148279 32719749 32273068 31811282 31336359 30835784 30332216
5136 30332216 29913884 29463201 29080556 28699298 28448538 28250296 27990614 27805047 27774907 27761731
5126 27761731 27753021 27770683 27859753 27994372 28250606 28449591 28630886 28903184 29142115 29467520
5116 29467520 29784436 30129081 30476057 30838035 31176362 31389518 31615844 31776245 31902149
5107 31902149 31992414 31925437 31908288 31753268 31578569 31469780 31412358 31238310 31152166 31058487
5097 31058487 30925919 30855680 30857409 30917308 30971622 31085589 31207498 31336309 31390620 31429820 31439590
5086 31439590 31419218 31310965 31141283 30941305 30735257 30420200 30045765 29632898 29199182 28781159
5076 28781159 28298669 27926542 27514243 27170519 26881010 26737825 26593272 26505798 26429128 26478771
5066 26478771 26565226 26659422 26776570 26911509 27100667 27268979 27426461 27579602 27751943 27938874
5056 27938874 28111818 28203467 28300986 28482462 28723522 28880842 29064876 29198780 29384600 29597516
5046 29597516 29853498 30149366 30434867 30712289 31096593 31517346 31958564 32314360 32745989
5037 32745989 33190570 33638726 34145093 34630666 35089332 35539707 35980410 36389045 36753323
5028 36753323 37080197 37301514 37540342 37663972 37826695 37969395 38138859 38353163 38510696
5019 38510696 38719325 38886374 38970297 39057905 39138179 39197874 39152681 39131243 39007190 38875110
5009 38875110 38612891 38320383 37997589 37590275 37198527 36730243 36279953 35874485 35426562
5000 35426562 35026089 34588261 34122959 33574350 33095441 32622812 32005783 31521749 30936493
4991 30936493 30293859 29636918 29025350 28354248 27769082 27162923 26559952 25899340 25294327
4982 25294327 24738081 24126377 23550714 22945862 22429247 21884978 21321219 20902311 20456817
4973 20456817 20093679 19691626 19276438 18913429 18581009 18221018 17818524 17444916 17193030
4964 17193030 16738148 16356353 15956877 15508131 15063685 14720173 14339182 13996783 13606261
4955 13606261 13323920 13092721 12859446 12602174 12319550 12178614 12107035 11947216 11764831 11755802
4945 11755802 11695422 11733799 11763207 11755933 11819438 11995122 12128086 12363934 12493186 12485220 12264068
4934 12264068 11829722 11237570 10680283 10129148 9664817 9315262 9069835 8930491 8730274
4925 8730274 8617033 8446398 8345007 8301081 8144368 8121458 8120890 8135517 8186236 8261207 8371736
4914 8371736 8561504 8775030 9140015 9408939 9720106 10221429 10732135 11362853 11831039 11825855
4904 11825855 11327087 10555442 9749280 8938210 8248086 7730100 7351664 7037921 6860228
4895 6860228 6637484 6454496 6312641 6123876 5986066 5910203 5872930 5809481 5743888 5711074
4885 5711074 5701746 5793643 5832967 5874388 6070461 6184813 6328999 6555372 6800051 7006440
4875 7006440 7130074 7082985 6895109 6577457 6160953 5786276 5558411 5348192 5197082 5077837
4865 5077837 4982097 4915984 4893171 4703647 4602285 4554001 4454162 4407135 4486566 4329386 4184203
4854 4184203 4210239 4159132 4128079 4083276 4014339 4071424 4050240 4060466 4053347 4068037 4019070 3971103
4842 3971103 3977328 4021224 4146999 4123007 4125398 4124172 4116515 4145405 4237182 4210002 4163141 4188563
4830 4188563 4209497 4302524 4371107 4361025 4378871 4432561 4462386 4443143 4464225 4477416 4535521
4819 4535521 4510465 4559504 4599231 4677771 4750222 4748328 4795942 4934248 5061945 5154421 5193097
4808 5193097 5275138 5377052 5452399 5545810 5706737 5782762 5902687 6083070 6213472 6326928
4798 6326928 6428486 6573936 6803375 7033452 7237209 7458156 7696576 7960914 8276595 8616370
4788 8616370 8965928 9331850 9802511 10290140 10813604 11507494 12121218 12846872 13644081 14586261
4778 14586261 15607682 16668780 17703287 18798250 19960832 21027706 21986900 22798545
4770 22798545 23362281 23464360 23209716 22588656 21674061 20485796 19290617 18083675 17032049
4761 17032049 16048704 15136272 14365529 13675257 13130284 12590230 12088572 11653775 11234720
4752 11234720 10920611 10698981 10520623 10282171 10148116 10052017 9911468 9763914 9746896 9711004
4742 9711004 9666906 9712675 9743318 9766911 9854457 9970876 10037875 10155010 10274477 10494065 10665649
4731 10665649 10888084 11107265 11383245 11681310 11988027 12299596 12760248 13295128 13764212
4722 13764212 14358722 15002395 15620453 16380907 17203563 18190283 19250655 20431777 21731401
4713 21731401 23133616 24738705 26480880 28470539 30647854 32906757 35272888 37654875
4705 37654875 39999628 42319805 44409296 46467683 48706570 51107622 52784446 52068020
4697 52068020 49126297 44372395 38543884 33415942 29246381 25967464 23459757 21548058
4689 21548058 20058593 18809516 17711898 16694638 15758644 14927904 14169553 13512652 12940994
4680 12940994 12412166 11952570 11513236 11122213 10788732 10550315 10287292 10054901 9842078
4671 9842078 9628231 9415530 9270127 9146049 9037844 8974917 8921177 8840488 8816841 8772148
4661 8772148 8771317 8753105 8815567 8926748 9077450 9231860 9460126 9740656 10118118 10499238
4651 10499238 11080434 11740598 12635545 13706562 15020618 16597782 18390266 20429310 22725062
4642 22725062 25404379 28497358 31906743 34373657 34620429 33618354 31688741 27685329
4634 27685329 23175580 19636626 16872334 14725630 13139495 11997325 11128777 10452088
4626 10452088 9856021 9323735 8838108 8379084 7940397 7549903 7289094 7030976 6739666
4617 6739666 6492245 6288621 6140986 6030108 5768378 5662498 5467807 5403165 5277002 5246159
4607 5246159 5190391 5040684 4911454 4859396 4816175 4677592 4707971 4616899 4543250 4540656 4423012
4596 4423012 4461852 4387120 4280705 4209677 4178411 4072785 4021150 3995657 3927812 3888963 3939629
4585 3939629 3949251 3966489 3928704 3946596 3886072 3778747 3753677 3749390 3732215 3693912 3800532
4574 3800532 3818211 3827161 3786995 3774712 3828812 3853713 3885869 3889933 3925910 3971273 3941072 4030517
4562 4030517 4011955 4049547 4083960 4011545 4084620 4153188 4118213 4149807 4185303 4162337 4218290
4551 4218290 4252682 4360897 4438371 4414696 4418713 4449672 4483735 4504858 4565783 4631561 4675873
4540 4675873 4722937 4763099 4777600 4835815 4907867 5054979 5131223 5261915 5378912 5414344 5442983
4529 5442983 5516420 5628394 5784332 5838240 5916044 6022112 6082526 6199710 6337650 6470149
4519 6470149 6736064 6894975 7148192 7448104 7826351 8225915 8606152 9126539 9678369 10288924
4509 10288924 10953382 11593023 12083032 12341266 12178100 11618816 10933561 10291135 9711122
4500 9711122 9271852 8997975 8773831 8675390 8644729 8644902 8732345 8770095 8857867 8863365 8982201
4489 8982201 9118621 9410592 9681734 9991138 10355689 10738462 11144233 11622330 12104349 12659729
4479 12659729 13184957 13826913 14537435 15180892 15574368 15548752 15043686 14344173 13871916 13557388
4469 13557388 13465782 13603707 13829824 14199967 14671851 15217452 15836172 16337262 16424655 15858167
4459 15858167 15136195 14382395 13844766 13526051 13523281 13701099 13978873 14283299 14771320 15415670
4449 15415670 16097736 16911098 17721141 18111506 17914414 17018476 16026773 15142860 14416958
4440 14416958 13847668 13647583 13575868 13720261 13918127 14256819 14674097 15105589 15611775 16014875
4430 16014875 16039800 15606047 15023516 14470682 14010775 13816297 13885047 14060682 14356058 14801313
4420 14801313 15381852 16081102 16933458 17868961 18948111 19808956 20123255 19456164 18395519
4411 18395519 17471137 16773523 16375786 16261848 16311837 16582263 16995832 17475599 17948105 18153341
4401 18153341 17856153 16973042 15893543 14862741 13821472 13068976 12486137 12045771 11675050
4392 11675050 11351507 11105171 10876994 10718030 10581635 10553860 10551145 10520403 10526550 10629604
4382 10629604 10789060 10999414 11277203 11629970 12057165 12460685 12982506 13588685 14273674
4373 14273674 14908185 15600896 16155348 16286452 15850936 14964574 13932831 12947301 12053504
4364 12053504 11417085 10916953 10646966 10364799 10173239 10101949 9941288 9686313 9596059 9416115
4354 9416115 9275764 9201294 9073586 8966241 8866850 8825726 8815871 8803201 8679420 8635938 8559646
4343 8559646 8513571 8597882 8686120 8741716 8805756 8889417 9026798 9126726 9311978 9470031 9525338
4332 9525338 9658782 9795691 9916957 10046870 10119406 10186509 10346337 10450695 10621034 10716741
4322 10716741 10871715 11037654 11155598 11255807 11373389 11570402 11788177 11964946 12090623
4313 12090623 12441118 12842062 13089353 13446630 13837968 14330442 14831834 15274530 15838781
4304 15838781 16380937 16907342 17533371 18221033 18894944 19637005 20388797 21221710 22120690
4295 22120690 22995206 23952645 24969306 25907284 26927323 27842015 28636985 29265466 29698981
4286 29698981 29850820 29738443 29332049 28900472 28415435 27845183 27238927 26739932 26371237
4277 26371237 25980233 25753003 25670787 25513487 25440219 25522819 25623700 25681306 25772979 25850621
4267 25850621 25930144 25920598 25964254 26112978 26264520 26359964 26557481 26853427 27162447 27503818
4257 27503818 28029400 28443286 28970172 29555589 30162856 30797363 31428477 32034279 32514334
4248 32514334 32888444 33199919 33440409 33759777 34249438 34856253 35620560 36457009 37408527
4239 37408527 38407164 39499563 40629938 41849675 43158591 44510003 45877876 47329764
4231 47329764 48885507 50610041 52493797 54432856 56363073 58450346 60618652 62655422
4223 62655422 64504523 66065428 67515512 68626740 69646968 70652900 71708496 73032695
4215 73032695 74680638 76724391 79223475 82303448 86093181 90602290 95912515 101896826
4207 101896826 108717121 116389359 124814069 133983143 143900960 154398494 165509712 176835076
4199 176835076 187602077 196374734 200723350 197277169 187096181 174997537 163078437
4192 163078437 152664689 144648192 139013108 135435552 133824698 133862570 135400726 138375051
4184 138375051 142589228 147869736 154135473 161210040 168939736 177167672 185614567 193902044
4176 193902044 200987972 204940018 201993473 190433012 175279003 160086306 145914614
4169 145914614 133570879 123589394 115636615 109318488 104266824 100244521 97094283 94450429
4161 94450429 92307155 90834516 89850947 89113110 88075605 85347310 80731608 75851620
4153 75851620 71369798 67342126 63941637 61093737 58851816 57015664 55444708 54190060
4145 54190060 53108354 52159630 51172699 50319878 49665000 49128569 48715180 48505083 48488811
4136 48488811 48623134 48873124 49239694 49717658 50378311 51171127 52072125 53165694 54323268
4127 54323268 55265868 55655141 55199496 54134370 52989231 52055485 51278607 50874307 50884576
4118 50884576 51197015 51886118 52692659 53542254 54538037 55559158 56512799 57259494 58054010
4109 58054010 58834542 59836858 60961479 62508437 64087183 65561107 66719448 67593077
4101 67593077 68245485 69063001 70291207 72065920 74273282 76902649 80069645 83756260
4093 83756260 87833080 92583275 98331533 105167397 113172746 122514036 133111161 144932750
4085 144932750 158028516 173135890 190149386 209552668 231859993 258059082 287442857
4078 287442857 314002155 319802731 299458609 277196640 260348258 248188709 241514446
4071 241514446 239277783 238449171 234556422 222683637 205378862 187736313 170487590 154313444
4063 154313444 139930632 127612690 117224719 108582779 101268322 95009654 89640634 84979386
4055 84979386 80852216 77144188 73724823 70873469 68310049 66076215 64105946 62600579
4047 62600579 61243133 60046897 58892459 57903559 56728265 55365739 54003461 52754652
4039 52754652 51708003 51002164 50452750 50270771 50484076 50943767 51491511 52324629 53276171
4030 53276171 54193317 55179822 56346192 57127722 57326922 56766397 55112970 52494090 49692547
4021 49692547 47061008 44691089 42829483 41338285 40256106 39481950 38588474 37454986
4013 37454986 36510824 35807267 35256900 34855510 34542291 34320308 34121500 33949261 33597311
4004 33597311 33072174 32267146 31453571 30603452 29839689 29140321 28707175 28414093 28146512
3995 28146512 27941177 27811072 27659930 27560965 27322329 27162674 27181265 27273528 27523906 27966082
3985 27966082 28511951 29208608 30132003 31257658 32611238 33983738 35048799 35810874 36399994
3976 36399994 36868739 36943124 36637005 36072685 35234009 34114977 33015893 31807079 30471283
3967 30471283 29003655 27582136 26405060 25387719 24584621 23950941 23419847 22933111 22490709
3958 22490709 22085727 21800990 21585086 21423301 21359136 21280115 21269788 21317127 21374337 21516022
3948 21516022 21818857 22175102 22575378 23134702 23685762 24470191 25190737 25956230 26800863
3939 26800863 27701483 28777556 29875743 31019458 32076465 33030186 33848218 34541237 35057719
3930 35057719 35115231 34758485 34065277 33195430 32164601 31024628 29950101 28904998 28122333
3921 28122333 27457435 26823890 26279465 25685865 25102836 24600890 24246754 23952946 23812813
3912 23812813 23746012 23735328 23875261 24192799 24604261 25063164 25582208 26193074 26911938 27701693
3902 27701693 28523011 29044230 28835481 27831306 26568002 25443234 24407606 23691082 23176065
3893 23176065 22888139 22617484 22454556 22400013 22471915 22555157 22557797 22572597 22591774 22663071 22716157
3882 22716157 22786595 22931793 23106412 23301554 23680874 24107384 24611442 25289844 26002655 26779837
3872 26779837 27607305 28459653 29430471 30410781 31415294 32315623 33100830 33677562 33910174
3863 33910174 33734304 33263213 32537806 31747989 30961187 30195927 29580592 29120577 28714826
3854 28714826 28343838 28203194 28112257 28061625 28089255 28273093 28482550 28862445 29340633 29818522
3844 29818522 30302252 31055471 31875597 32619681 33464572 34320473 35155579 35921499 36588083
3835 36588083 37292886 38210321 39207379 40271483 41474473 42915207 44546025 46402652 48562750
3826 48562750 51038742 53807946 56866681 60321622 64309726 68943360 74137631 80086483
3818 80086483 86817101 94436441 102841743 112121303 121952849 132277219 142793243 153243133
3810 153243133 163316700 172013533 177848227 178087596 170814477 159424439 147439501 135594095
3802 135594095 124795395 115368297 107129338 100049584 93729935 88040448 82902733 78214866
3794 78214866 74006899 70142199 66553492 63228695 60270615 57653416 55427480 53408964
3786 53408964 51645912 50067393 48641462 47327303 46107436 44887173 43890834 42947478
3778 42947478 42191231 41487312 40818134 40242670 39771285 39390419 39149175 38859925 38809075 38775032
3768 38775032 38955260 39040533 39175709 39481200 39870572 40304032 40821936 41464798 42284299 43168556
3758 43168556 44125210 45225603 46411368 47818167 49275454 50964338 52882611 54964820
3750 54964820 57348118 59983557 62900884 66084216 69603546 73598701 77964260 82710570
3742 82710570 87960506 93595190 99592579 105721277 111994454 118062137 123649082 128623107
3734 128623107 132551649 134954929 135478496 134024226 130479303 125232862 118939340 112138395
3726 112138395 105310320 98856483 92900653 87576863 82924540 78881347 75278622 72181634
3718 72181634 69514126 67157508 65085724 63356036 61788658 60583291 59667741 58994919
3710 58994919 58521775 58293865 58199098 58451568 58894064 59668853 60606070 61837728 63393458
3701 63393458 65267791 67525927 70185937 73263746 76804643 80822461 85413761 90526336
3693 90526336 96026374 101953777 108335009 114964832 121584339 127959538 133797180 138537044
3685 138537044 141626001 142567141 140921035 136853699 130871700 123722884 116172730 108840543
3677 108840543 101999543 95774053 90420321 85769216 81719739 78284575 75219150 72602164
3669 72602164 70481958 68808064 67241134 65576288 63386123 60735270 57470426 53898958
3661 53898958 50489432 47357523 44637665 42354602 40337020 38575864 37097826 35703885
3653 35703885 34470710 33392458 32249191 31248011 30319013 29474111 28621546 27927379 27344893
3644 27344893 26749534 26218305 25686511 25221174 24772475 24332685 23963213 23547432 23131634
3635 23131634 22755472 22434588 22192324 21801925 21476046 21196893 20930142 20659846 20402034
3626 20402034 20186317 19959241 19811595 19695873 19607326 19527687 19432931 19339654 19310966 19200580
3616 19200580 19067895 19037874 19023729 19011947 19065766 19176986 19261361 19445851 19710608 20035657
3606 20035657 20480191 21038415 21612454 22381496 23278716 24381477 25650354 27090885 28798593
3597 28798593 30713149 32842902 35012690 36988712 38471625 39151899 39198623 38480591 37378910
3588 37378910 36010796 34481561 32844534 31111094 29409094 27850043 26427390 25163745
3580 25163745 23990387 22952782 22032575 21210101 20601378 20042873 19564348 19094647 18822377
3571 18822377 18581240 18468508 18352475 18275833 18379722 18482307 18663477 18930559 19276010 19776962
3561 19776962 20237025 20791244 21462679 22186288 22986422 23778791 24463024 25026897 25455455
3552 25455455 25600739 25609563 25378286 24919675 24246989 23358037 22364078 21318528 20228119
3543 20228119 19215978 18375433 17479281 16750748 16176447 15595113 15114501 14617766 14309316
3534 14309316 14076072 13796465 13610225 13357512 13200169 13115382 12956193 12848841 12697628 12558549
3524 12558549 12525781 12385720 12357866 12387665 12309608 12372323 12354982 12386496 12448078 12443689 12463419
3513 12463419 12452864 12491888 12416525 12368473 12236359 12132344 11965352 11830726 11700613 11556221
3503 11556221 11411258 11375342 11202619 11172682 11172217 11107169 11042765 10952059 10910396 10739038 10691682
3492 10691682 10688588 10671922 10719125 10800949 10825077 10891709 10917600 10871376 10848190 10874241 10791399
3481 10791399 10772142 10852935 10872151 10886267 10898776 10901757 10925362 10969737 10953405 10905149 11045073
3470 11045073 11098194 11246898 11245596 11221130 11185751 11178135 11139410 11064142 11124388 11108869 11103645 11070754
3458 11070754 11043254 11119103 11179649 11182207 11288834 11311300 11325919 11355020 11545425 11675375 11603262
3447 11603262 11608272 11672696 11728795 11845545 11986618 12090976 12168552 12207763 12316301 12460992
3437 12460992 12566978 12723418 12828534 12907937 13017901 13200259 13297672 13396119 13618135 13827858
3427 13827858 14075337 14241907 14429896 14673999 14915382 15200209 15507786 15750262 15884149
3418 15884149 16170965 16476511 16700720 16970779 17193965 17447906 17773181 18143684 18457535
3409 18457535 18740285 19125608 19618672 20055824 20479170 20950476 21477310 22002985 22536254
3400 22536254 23059253 23710048 24454148 25190232 25992965 26742980 27664033 28495651 29326791
3391 29326791 30261334 31169539 32037207 32896389 33747014 34668514 35672661 36683034 37771549
3382 37771549 38916509 40236702 41607524 43220831 44964976 46862425 49014136 51361809
3374 51361809 53916534 56742624 59943785 63396764 67208250 71388884 75945718 81025341
3366 81025341 86639808 92809643 99497985 106676782 114132488 121811755 129634540 137143431
3358 137143431 143859620 149233653 152511426 153181427 151268338 147311396 142213700 136942549
3350 136942549 131913780 127461605 123513647 120104331 117301525 115178926 113891546 113737009
3342 113737009 114864138 117344558 121279652 126797412 133816646 142433261 152507302 164029939
3334 164029939 176848226 190150964 202696549 212755023 217600058 215653743 207615272
3327 207615272 193552268 175837817 157705995 140886248 126331666 114510885 105228191
3320 105228191 97857957 91990870 87125387 82983002 79418774 76289515 73576332 71270310
3312 71270310 69297863 67708850 66471668 65467083 64700236 64142194 63821385 63635418 63556735
3303 63556735 63674835 63970959 64385140 65030065 65840142 66793432 67835055 69226858 70824124
3294 70824124 72626082 74787867 77334228 80287145 83674686 87521695 91906792 96751521
3286 96751521 102108146 107907172 114057102 120482079 126925578 133128561 138776173 143348107
3278 143348107 146327011 147244635 145676068 141821613 135910888 128826950 121210235 113612931
3270 113612931 106400394 99882989 94137260 88975349 84472647 80313157 76565598 73289874
3262 73289874 70388076 67750458 65318775 63192004 61366678 59763054 58318076 56983430
3254 56983430 55826439 54763623 53823634 53034169 52369793 51720031 51130085 50632395 50044164
3245 50044164 49391567 48679045 47916971 47179027 46637267 46170480 45778255 45603762 45345109
3236 45345109 45332371 45410040 45540189 45860196 46070185 46334186 46697988 47100145 47574006 48154458
3226 48154458 48740375 49379281 50085280 50787389 51388456 51818804 52137635 52316611 52167386
3217 52167386 51888079 51420509 51027273 50742615 50449124 50360573 50335030 50317533 50571569 51034076
3207 51034076 51576993 52275558 53147284 54179789 55289119 56586655 58221067 60130800 62256722
3198 62256722 64803936 67775913 71214454 75408740 80244126 85790668 92369630 100256510
3190 100256510 109308734 119738499 131584858 144837226 159587696 175732092 192767809
3183 192767809 209707395 224962740 236125189 240917026 238977404 230885065 218422396
3176 218422396 204736794 192215411 182050845 174721824 170071685 167388900 166009949 164958909
3168 164958909 163472061 160673823 156304777 150284749 142915727 134741177 126236309 117987047
3160 117987047 110388892 103405358 97177942 91658931 86750534 82354900 78393033 74953651
3152 74953651 71895421 69097490 66561662 64307947 62346354 60619927 59220028 57981267
3144 57981267 56913105 56041934 55306490 54723120 54180129 53828525 53623662 53426387 53267505
3135 53267505 53185245 53098686 53109955 53173995 53462064 53841988 54389669 55152350 56060360 57148726
3125 57148726 58513347 60121878 62099428 64463608 67164616 70327432 73931428 78071703
3117 78071703 82760787 87891953 93484742 99525741 105851649 112343938 118898914 125224250
3109 125224250 130905341 135425540 138231220 138795586 136713614 132081192 125599254 117856685
3101 117856685 109685062 101725843 94129504 87146361 80943565 75451306 70465501 65862992
3093 65862992 61895660 58227169 54843701 51836184 49077498 46565878 44209079 42097891
3085 42097891 40160481 38416720 36837474 35390609 34026661 32716634 31547394 30533244
3077 30533244 29514737 28517525 27559723 26658979 25781671 25060874 24353248 23643053 22929446
3068 22929446 22224043 21631079 21022195 20444426 19983682 19377095 18873140 18415839 17938600
3059 17938600 17487763 17100210 16711851 16358990 15985485 15694607 15385861 14973880 14666523
3050 14666523 14399021 14102732 13893277 13726902 13505480 13331942 13155371 13002602 12813834
3041 12813834 12627711 12420495 12240720 12069027 11853718 11602942 11339900 11065952 10768540
3032 10768540 10576536 10381362 10195783 10032253 9853466 9704207 9512704 9407556 9311969 9166564
3022 9166564 8998369 8842437 8739561 8642253 8474542 8345887 8272721 8139990 8070402 8075891
3012 8075891 7968614 7869643 7800154 7652084 7615622 7635790 7570002 7421876 7314116 7195295
3002 7195295 7051198 6955667 6841367 6773986 6676172 6578776 6494965 6446448 6383952 6358279 6372511
2991 6372511 6292800 6182811 6162706 6037433 5924867 5849906 5748993 5727531 5694631 5663406 5522434
2980 5522434 5516990 5508911 5447055 5384926 5398333 5375576 5420514 5398900 5373450 5343674 5259709 5203950
2968 5203950 5125409 5100417 5051750 4992765 4964295 4855770 4729675 4584481 4576038 4514162 4411981
2957 4411981 4395970 4315985 4327618 4347237 4288059 4230995 4196946 4077241 4055115 4006793 3926166
2946 3926166 3775607 3831096 3832946 3786611 3747768 3752957 3796582 3806676 3846496 3854376 3700447 3715585
2934 3715585 3689492 3708813 3655710 3593130 3541034 3443172 3430875 3408870 3405584 3368046 3400274 3353057
2922 3353057 3292596 3308310 3266914 3292251 3266032 3237525 3263181 3313368 3363761 3324465 3319485 3344701
2910 3344701 3361731 3376761 3401542 3371764 3343509 3339690 3413995 3518528 3488003 3509107 3660670
2899 3660670 3685903 3712952 3765768 3872462 3955022 3999135 4151158 4229136 4189849 4065248 3946956
2888 3946956 3814495 3672085 3575132 3468782 3439410 3374024 3347348 3323669 3307247 3264818 3164735
2877 3164735 3131739 3124748 3082303 2997129 2917851 2905206 2855370 2815998 2711467 2707048 2722495 2713366
2865 2713366 2641320 2541057 2472670 2433996 2395853 2379776 2309290 2237947 2204392 2218727 2146872
2854 2146872 2102174 2053512 2045099 2061168 2033915 1974005 1928919 1926532 1940981 1943368 1962879 1925486
2842 1925486 1854586 1854079 1857710 1793370 1777093 1759173 1662036 1660235 1670355 1626959 1619758 1573342
2830 1573342 1616300 1769269 1772881 1756029 1749107 1803511 1813955 1867793 1902564 1821505 1852543 1778257
2818 1778257 1749329 1770970 1743053 1657225 1552921 1486519 1473945 1441474 1329738 1323450 1331578
2807 1331578 1324440 1252921 1221857 1166349 1148106 1169839 1177456 1128247 1153219 995385 960846 1098377
2795 1098377 1086406 1034262 981151 898600 974426 1019130 993325 888167 900351 984991 968321
2784 968321 951764 876192 795344 782529 800109 829617 808010 764440 729744 729854 690340 729243
2772 729243 752531 692406 684289 708778 745920 782564 782248 744451 730141 667236 662834 658633 747778
2759 747778 734698 654184 617245 646444 600446 585659 631337 622274 567025 571133 613759 589171
2747 589171 602805 553398 550289 517268 578168 546451 503716 520437 524947 517063 496881 531070
2735 531070 532955 496464 504032 511650 501709 583098 530794 488364 463271 488365 453685 461860 488998
2722 488998 436747 375032 364229 420021 477565 433951 397176 444127 403545 413304 429524 378880
2710 378880 346684 412107 461627 374122 353415 370417 403772 434181 393057 348507 255897 264382
2698 264382 255613 263150 271085 269328 258192 234943 310010 307997 253484 275772 268966 164684 209958
2685 209958 260664 304144 332366 287125 289500 322965 281759 244215 251268 285709 167720 211856
2673 211856 238763 262496 240237 186048 193352 262157 264836 213255 244068 273478 306475 240427
2661 240427 196797 204390 253540 269416 290659 270080 228292 296886 325657 290061 273288 299085
2649 299085 368043 286793 307673 256736 246198 288113 278384 266250 288035 248862 261852 277001
2637 277001 247467 231349 245697 249607 218051 280549 257147 226466 298038 315064 196214 121375
2625 121375 126639 242173 275574 290480 289346 240658 202159 188302 249297 161112 190235 263697
2613 263697 275797 234002 175731 234420 231542 233442 282168 232732 235214 220122 176426 150231
2601 150231 202321 161146 163085 190840 198993 161245 179669 155850 171352 168132 130376 140671
2589 140671 131997 136638 221764 253789 156806 165360 132094 142115 93929 86321 113913 207195
2577 207195 188856 119674 108777 121917 116583 110620 80716 90750 117056 166702 172561 131412
2565 131412 70130 23603 60981 44296 79771 90197 98585 122650 98841 114852 84792 85301
2553 85301 60874 34360 106197 77212 45614 47844 68206 132751 108513 102092 108262 154882
2541 154882 180095 134615 83844 90641 67761 73774 58454 6334 -41193 24347 22714 -63882
2529 -63882 -42884 -8381 268 18616 6007 2996 -9598 -22 -9554 -9374 14344 8883 681
2516 681 -9468 -24999 -41462 -65752 -158657 -108068 -33786 -52444 -65412 -89053 -104745 -135848
2504 -135848 -113401 -42538 -57216 -73837 -78585 -26497 25508 20444 -9515 -46387 -13651 40636
2492 40636 -46492 -29801 23084 -18827 -99539 -70592 -108160 -108248 -63748 -19813 -16252 -2970 12939
2479 12939 14686 76791 40030 -76291 -98984 -130510 -118234 -125868 -126765 -41862 -56471 -65642 7148
2466 7148 -30109 -49458 36517 21197 -16773 -982 10732 -33943 -4519 -53385 -50342 -88790
2454 -88790 -37409 -49096 -133901 -149745 -192948 -146137 -114935 -179906 -136595 -111165 -19135 -61288
2442 -61288 -142651 -77141 -79618 -63553 -57668 17346 -44469 -69521 -79595 -16876 -70123 -76374
2430 -76374 -83704 -78764 -25581 -54223 8594 -22051 -87653 -92742 -127129 -198134 -213555 -155015
2418 -155015 -68227 -5074 -44088 -104142 -81716 -82409 -27713 10110 -10407 -78000 -18382 -5280
2406 -5280 -99913 -107521 -43397 -79366 -98973 -18617 3524 -63507 -17794 -53697 -90432 -48733
2394 -48733 -32482 -69121 -98380 -76126 -91044 -58820 -53838 -36068 -70478 -12626 -67501 -87903
2382 -87903 -18051 3698 -2217 -68799 -49771 -118503 -92137 -38459 -94647 -41333 76066 13808
2370 13808 -14317 22983 48435 61120 42561 72366 32766 -28340 -60859 -44605 -41712 -38001
2358 -38001 -19011 -17822 -65122 -36891 -4338 -37260 -53979 -65622 -99170 -57583 -31289 5855
2346 5855 -6306 -98573 -65655 -42583 -69872 -54798 -91796 -16218 -18800 -62916 -90925 -65026
2334 -65026 -13880 -58116 -70005 -65569 -20879 23784 5751 -68699 -73591 -80960 -80455 -61230 -132150
2321 -132150 -147288 -84272 -64552 -87694 -77746 -51403 -74812 -65332 -70071 -23714 -76660 -77691
2309 -77691 -133613 -76906 23552 -14634 -62291 -71290 -64851 -79517 -104608 -108779 -171785 -229267
2297 -229267 -196839 -110895 5430 -11804 12293 -10239 7053 -51323 -84706 -38459 -63923
2286 -63923 -16688 -50322 -111819 -78573 -69038 -87720 -71388 -67784 -82924 -7644 -70016 -78114
2274 -78114 -82761 -50157 8167 -51019 -39141 -50199 -6594 29809 25897 73293 28458 -96377
2262 -96377 -102076 -27279 -9532 -17623 -46730 -57927 -61724 -41672 -20662 -51440 -109402 -118773 -132601
2249 -132601 -111893 -93573 -101877 -70297 40088 44156 -34567 46412 39230 -17553 -31841 -90289
2237 -90289 -65172 22724 20441 -11599 -15723 11687 10189 -32297 10441 2837 13349 14917 52882
2224 52882 68555 -22634 -8518 -37634 -36418 21142 22291 20710 -18950 13891 52383 39412
2212 39412 45705 9101 5328 60134 62163 47227 60704 -12952 15089 -9374 67804 89547
2200 89547 20423 14350 48449 41809 65941 101449 195512 194166 209835 126167 147769 147902 162432
2187 162432 67558 64442 142152 179481 136858 151591 177852 158277 151093 168454 213943 178579
2175 178579 192656 199567 179636 194020 255166 179751 208592 271525 284553 323105 363504 338609
2163 338609 366066 374520 373406 372603 408155 389435 414001 420703 435958 457951 464025 483173 510186
2150 510186 499002 553898 626568 656958 540087 569555 635106 670896 595649 639928 654512
2139 654512 751305 825677 911286 956579 944107 979358 999700 1082430 1133000 1138030 1260443 1259299
2127 1259299 1305983 1411992 1471130 1481184 1602869 1712128 1858812 1966732 2097053 2311930
2117 2311930 2489085 2713867 3013615 3274276 3576242 3783418 4121518 4625882 5245137 5983874
2107 5983874 6912408 7870911 9123119 10504591 11973532 13701755 15803648 18291406 20879189
2098 20879189 20250958 16224960 13131019 10595101 8427490 6982737 6039531 5225725 4687543
2089 4687543 4357997 4085061 3782457 3650430 3423676 3264637 3052691 2753712 2505659 2278781
2079 2278781 2114314 1993102 1841209 1770052 1620994 1539815 1426200 1385860 1369514 1326854
2069 1326854 1323433 1236698 1116370 1093775 1035508 1005727 944926 848441 828088 837125 764413 707093
2057 707093 672601 642089 667438 706672 571728 483483 511450 540759 504609 490665 433607
2046 433607 465856 402192 432563 482042 461712 405776 382735 451203 414967 326640 375886 380251
2034 380251 338548 321799 348990 348443 368115 318892 339911 320171 305309 292103 249097 205944
2022 205944 99645 188237 145841 194575 192721 205485 209116 258036 168673 190957 199047 196573
2010 196573 160996 178648 155851 103763 125730 163456 153278 134092 98409 143468 104211 117911
1998 117911 154080 128056 70102 107539 42345 102754 63087 53981 16887 -66308 -29486 -13973
1986 -13973 6114 54526 4061 25949 56406 33033 68751 121626 60066 16762 -4809 21055
1974 21055 71600 44780 -45314 -32045 4286 17049 43799 16861 41775 -26856 3076 27285
1962 27285 63748 37536 -25518 -35424 -67988 -52525 11448 -4208 5085 -16707 64317 64326 32525
1949 32525 -36658 -46045 -37544 5887 8303 -8102 33123 -24082 -14727 25331 16175 24244 14433
1936 14433 -13227 -349 -11082 -77565 -52720 -46206 6077 -2993 -14723 -63435 -90564 -27861
1924 -27861 -25405 -24332 -27571 17617 12386 10102 -3652 -17842 -19661 -26497 23940 21960 -3597
1911 -3597 -71169 -24005 -57201 -50948 -61518 -76759 -16390 -18485 -50709 -151102 -125204 -98553
1899 -98553 -140147 -66587 -8319 -28028 273 -63816 -84654 -88751 -122140 -173402 -117716 -93799
1887 -93799 -34058 -20145 -45364 -79905 -73612 -61044 -62943 -70457 -76578 -111169 -44575 -28389 -68537
1874 -68537 -5436 -76553 -55796 -35099 -145058 -50963 -75898 -50786 613 -29747 -55173 -87943
1862 -87943 -15904 -13279 -71236 -93072 -89423 -106272 -42207 -43352 -92226 -9520 52290 -26688
1850 -26688 -58741 -61616 -8781 25997 79478 6179 -55899 -73630 -46505 -52153 -36444 -62243
1838 -62243 -27908 -26808 -57249 -29349 -51562 19209 143732 79732 57674 62480 23748 -40278
1826 -40278 8842 -2259 19958 -14587 -69425 -44547 -59996 -18216 -25479 12295 22088 -23434
1814 -23434 -36152 -42012 -125604 -138134 -118043 -75868 -31688 -33993 -109138 -110034 -22696 -26791 1874
1801 1874 -9135 3919 -55734 -37203 -77090 -40291 -28182 -91658 -23299 -46700 -47173 -40612 -68437
1788 -68437 -109321 -122293 -56878 -24842 -65804 -94589 -111691 -121139 -95368 -54249 -38825 -36879
1776 -36879 -102481 -97212 -49929 -21585 -2607 -33367 -42002 -21123 -64580 -104035 -99948 -102691 -129172
1763 -129172 -93766 -103989 -70949 -62085 -8435 -28387 -77469 -101307 -50514 27939 -28034 -83551
1751 -83551 -26133 -32433 -47185 -41743 -25291 -89903 -49651 -35826 -39799 -15895 -22232 -108152 -108348
1738 -108348 -108832 -89885 -75481 -89551 -63447 -139593 -147153 -79318 -105538 -77376 -81972 -58733
1726 -58733 -56375 -47842 -50826 -41842 -66638 -29916 15885 -62292 -93860 -60776 -63358 -62878 -60927
1713 -60927 -36304 -24141 -85658 -106893 -74204 -42447 -38307 -68734 -74490 -54668 -72449 -85034
1701 -85034 -88440 -81976 -99483 -92997 -80715 -47994 -23853 -28849 -69893 -51213 -66359 -98022 -87435
1688 -87435 -39516 -47444 -29409 -67193 -61478 -63331 -39695 -52291 -57109 8416 -15653 -11631 -75968
1675 -75968 -106760 -95100 -161079 -129767 -106551 -40084 -33503 -15815 8128 -62086 -73162 -110595
1663 -110595 -174803 -78686 -49654 -126960 -117766 -31399 -59195 -3010 -44317 -103818 -119983 -126635
1651 -126635 -95014 -77385 -90647 -92175 -64967 -18797 -14574 -58989 -53722 -63202 -94062 -43442
1639 -43442 -85386 -69042 -106377 -77486 -63719 -81817 -44583 -93100 -16508 -58633 -102494 -64685
1627 -64685 -92338 -69137 -102020 -32829 1508 -64446 -67796 -22777 -62393 -113330 -161433 -146775
1615 -146775 -135121 -116497 -99542 -135560 -73625 -67742 -26501 32143 30565 -38368 -8198 -26600
1603 -26600 -27997 -77489 -37885 10486 -29329 -16540 -13063 -93628 -76599 -22634 -44542 -44199 -72341
1590 -72341 -34844 -31781 -48254 -48876 -101740 -60542 -30435 -39333 -66114 -64994 -28040 34458 -38053
1577 -38053 -47240 -53810 -39173 -66818 -112659 -82964 -111712 -104995 -78107 -56518 -64184 -29423 -13883
1564 -13883 -23049 -28765 -19231 -43162 -29815 -19871 3266 10324 4535 -31301 -104778 -90127 -70362
1551 -70362 -10941 -66124 -51919 -32461 -57567 -64494 -56984 -58332 -95644 -56041 -28322 -128557
1539 -128557 -129385 -85404 -46364 -62995 -68936 -66352 -146816 -23151 43527 -21905 -46008 -58352
1527 -58352 -79275 -55884 5337 -39001 -19882 30326 85722 29185 -67588 87034 48134 13921
1515 13921 43857 11052 -51498 -72398 -61381 -35880 -28807 -26057 -47133 -69427 -48966 -88058
1503 -88058 -74645 -116293 -82289 -25326 -45358 -85261 -80085 -128537 -100978 -86707 -69241 -35646
1491 -35646 -52347 -112009 -112701 -80566 -42810 -23766 -15983 -19449 -888 -89910 -127820 -95628 -124358
1478 -124358 -127625 -112784 -125645 -111127 -99848 -89761 -76092 -46533 -48823 -80006 37269 -12580
1466 -12580 -24187 15724 -8082 -16628 -19878 -12627 -53726 -75316 -79267 -36642 5916 -39870 -67959
1453 -67959 -47779 -41856 -20719 20948 -67186 2791 83889 41130 -14420 66754 45488 34333
1441 34333 -26675 -43326 -37959 -81323 -25372 -7635 55252 31306 -6501 10232 -55843 -32285
1429 -32285 35101 3742 -16476 -24571 -21437 -3777 -56454 -26477 -32702 -2710 -22657 7331
1417 7331 -5238 31722 50067 36172 35553 -57844 -48033 -22801 -58935 -37329 -73488 -93530 -71953
1404 -71953 -61547 -25514 -76379 -9085 52977 46056 33402 35320 43206 31812 -38553 -15973
1392 -15973 -45912 -65843 -106560 -69312 -30581 -34057 -45089 -93777 -79073 -55192 -13020 -10580
1380 -10580 -53248 610 -57 -37440 -13440 -22613 -46251 -75141 -57556 -97262 -59440 -86256
1368 -86256 -127476 -69839 -41477 -28645 27874 -23155 -52870 -20867 -19795 -58346 -68649 -75340
1356 -75340 -62981 -48519 -60506 9006 -62418 -59886 -38070 -15916 45078 23776 -1864 70983
1344 70983 74924 38782 -10207 -54714 -63137 -127763 -125301 -72697 -31498 -122375 -153235 -68461
1332 -68461 -96949 -87095 -18822 -42289 -41441 -1704 -68978 -58044 -14224 -41966 -48135 -45289 -34602
1319 -34602 4385 16232 -7607 -48431 -50894 -51767 -101226 -93430 -63021 -55198 26405 -9984 6384
1306 6384 -54069 -43988 -63737 -50079 -4825 -19078 -24003 -36270 -11489 -15456 -85327 -24649
1294 -24649 -12780 -27041 -44721 -41991 -51311 -73384 -69843 28320 20551 -20118 -3272 2787 29015
1281 29015 -32603 55847 6577 -2252 -26814 -18293 -46553 -89691 12413 43844 8231 -32660
1269 -32660 -35092 -24808 -18236 -18349 -9571 -23855 -106329 -127885 -112579 -72589 -82035 -47743 -2112
1256 -2112 -2785 -52400 -40586 -47011 -23542 -2323 -11393 -21693 9967 27624 13283 3560 61652
1243 61652 17871 -13932 -12896 -36449 -74132 -77781 8876 -35711 -50516 25232 13705 -71883
1231 -71883 -100970 -57143 38839 71727 13386 -80356 -33776 -33877 27404 3307 -9609 19241
1219 19241 -29981 -20902 692 -10449 -24480 4795 5210 10969 21218 19609 -48333 -3236 52349
1206 52349 90645 36996 -10671 -76540 -85842 -6841 92635 75797 22239 -35273 -26654 -39471
1194 -39471 -26871 -9710 -9594 11511 58504 27816 16461 -23732 -86140 -76035 -37651 -9022
1182 -9022 -34151 1114 -12371 -57839 -29406 35540 -50841 -134751 -83916 -66797 -55523 -33459
1170 -33459 -8101 61953 25197 27261 11664 42032 53441 33054 -18185 25749 -3190 -69381
1158 -69381 -38262 4335 -33050 -13881 12332 -37196 41249 74517 -8874 28775 67001 7526
1146 7526 6481 44010 26366 -18303 10712 -17860 -89064 -31739 20494 -64965 -70170 4318
1134 4318 -3941 14475 -23753 -14202 -7503 -62197 -58861 -109050 -84800 -44234 -17544 29564 14934
1121 14934 28585 51322 53841 -9999 -28020 -44437 -7902 -4746 8471 -6319 -60831 -46094
1109 -46094 -29014 -11509 -58289 -3287 -2100 -16717 38502 16086 -20956 11327 33180 12885
1097 12885 90768 54921 -22499 28782 67957 10372 21003 70998 36414 35437 15378 -28217
1085 -28217 -29777 33788 12938 15880 -22313 -9654 5297 17181 -35758 -89033 -38966 -51205
1073 -51205 1654 8185 7817 16394 20281 21792 27766 64193 -16958 -39877 -24087 -24902 -1476 4143
1059 4143 -21606 -17252 -49422 -56238 -49928 -60352 -27640 7357 15090 -45026 22980 58110 14520
1046 14520 14517 52893 12817 -36371 22443 38482 49628 91431 49212 66240 48261 47934 23726
1033 23726 -1999 -59111 -57154 39222 36746 24546 -39328 -81041 -36271 -10112 23684 28273
1021 28273 -58671 5958 46006 57103 -9949 7809 61181 44456 77607 30999 99244 96357
1009 96357 12119 6102 -19021 28060 48723 13963 -23490 -69155 -66216 -66851 -52661 -9378 70450
996 70450 22679 -1734 -19309 -7009 28749 -26998 -84767 -33756 5472 16810 2145 -47426
984 -47426 -70458 -62368 -48959 -23782 21145 9851 17584 23856 15960 17258 48004 20387 9063
971 9063 -55934 -52628 -13418 7715 -24151 -20512 6122 -13375 15012 8377 -66927 -47198 -47451
958 -47451 -28606 -6986 -2784 8983 57811 46958 -32883 -73143 21813 54469 18925 39911
946 39911 -18800 -25425 31011 5348 -9814 -3826 7736 67217 81135 72405 31966 -6055 11714
933 11714 62910 39120 5861 16739 1900 13663 -6388 -11926 30071 -14623 -35500 43676
921 43676 77434 5125 22265 18506 -47836 -7870 62208 43595 -14329 20781 66803 54593
909 54593 92126 50410 -14611 11865 27640 30694 4773 -79853 -35438 -18451 27271 -284
897 -284 -35544 5869 60595 70216 92113 45084 22384 8695 -29762 -3176 -28432 -25355 -30011
884 -30011 -36902 -46684 -50451 -24322 -20493 1851 62278 -21716 -11142 33312 48073 -11805 -18936
871 -18936 43776 13896 6310 -15970 -25439 11761 30521 -3309 54531 69441 -47760 -64177
859 -64177 -46385 16942 10196 -21455 8663 22422 73366 83417 65769 24075 10583 -10782
847 -10782 -16735 108273 60806 -21145 32361 65727 31342 -4319 -25852 -19199 14756 -2134
835 -2134 -81306 -14361 35531 10877 41421 70880 103214 26997 -35607 -20603 -11919 -22019
823 -22019 38009 -5623 17095 25853 10765 -38664 -94863 -43661 20102 29824 -6752 59739
811 59739 3900 6348 68841 62672 4524 -4800 36754 67436 73920 -3383 -6716 -24624 18366
798 18366 15297 -65748 -47197 21378 14367 37581 74728 55173 64056 36808 42964 60812 -10117
785 -10117 25992 -13275 9008 22935 56693 71225 60237 52052 80890 83088 35870 4008
773 4008 -35667 19700 2938 34411 17746 17887 103725 83818 20609 -5261 52595 74083 78851
760 78851 108796 16208 -20297 11973 -16918 -22683 39356 53391 55189 -919 8384 86878 99935
747 99935 91070 35451 911 49031 69748 34808 22243 26082 14137 25885 70338 33511
735 33511 -822 39357 62230 82365 78238 48769 34165 -55228 -64494 1118 18016 -23718
723 -23718 -20936 42880 -6895 36331 13884 63925 51295 75874 118320 109899 73579 46136
711 46136 81219 46750 71208 81756 45130 41765 60916 134369 71461 32743 -2179 42326
699 42326 46706 47510 24041 78750 79888 41595 33006 86754 63519 -1326 40136 20376 13090
686 13090 -12918 32755 -686 16389 55212 789 35784 53977 33179 51793 63304 138813
674 138813 75464 49286 57371 87708 112107 121231 124404 57673 112918 84776 20811 86227
662 86227 89767 78232 111429 48001 42888 94506 56462 54074 56735 53520 84203 94873 85076
649 85076 106455 44595 53533 20514 73236 59352 83003 44984 26843 68121 45143 -180
637 -180 -198 9747 -32060 -49999 38046 24268 28878 15879 81220 75955 28868 72572 83127 67885
623 67885 5584 -65376 -89058 -28139 -23573 -67406 -10688 34097 18994 25168 17475 40171 19097
610 19097 16490 37639 137551 101104 45221 17384 9483 37074 36854 70747 30913 -662 74819
597 74819 61329 15718 -28737 -12798 -21136 -57342 -12225 7105 9888 -60201 -25416 8094
585 8094 30283 30252 73610 1953 -98594 -34297 10029 -13972 -55304 -23942 -8768 -18722 -40799
572 -40799 -23678 14340 9819 28967 55005 69497 78168 38680 -43186 -18267 49248 13182
560 13182 1340 -14195 21301 -15585 -11600 17923 2994 44538 120401 113358 128611 83566
548 83566 152138 82087 81698 22712 -33724 40723 69377 51016 65090 54877 36399 25337
536 25337 28381 64251 97120 74252 56573 17550 32133 8428 24167 39192 15800 33122
524 33122 1335 37718 84283 79556 19059 22277 88203 91505 47595 32436 -749 28699 37469
511 37469 57966 28002 55697 41755 46426 25710 65496 100778 94593 121166 142670 96992
499 96992 78085 19818 68410 114736 93726 33074 58039 40565 784 42233 44221 78319
487 78319 106670 95619 79205 70724 76268 65491 49424 49020 136020 106251 145563 133972 26851
474 26851 115721 65248 42532 -8112 115014 75192 30105 21539 10349 63334 54779 37517
462 37517 13602 21949 80090 123620 104628 102851 68484 25831 78456 124287 48633 77786
450 77786 119023 72652 46635 43994 -1979 46060 13773 -19101 -8139 10837 10510 46664 77615
437 77615 67754 29173 33134 39258 12207 43804 71740 29618 25748 72556 101547 108212 123992
424 123992 120676 165225 152727 58372 112744 146038 62062 39588 -3946 18393 97427 51389
412 51389 41649 64893 60492 60135 95677 39494 45801 114281 117971 70570 34584 21198 41775
399 41775 70959 102695 68042 24406 41889 -13593 -36878 4596 44208 40322 -12160 -15373
387 -15373 -24471 69836 8319 -4307 54121 74634 74292 88254 118119 123523 69213 117511 103672
374 103672 97448 99908 51156 138527 120450 78229 95678 44757 17971 78203 76468 79746 12542
361 12542 56986 111364 68558 20255 -6239 -20993 54118 120781 125179 135245 151368 133799
349 133799 120109 75301 109719 71917 5465 24439 59044 95452 89050 66666 96347 96485
337 96485 73411 62949 111471 66532 81587 135751 99347 48919 28972 41469 81294 36947
325 36947 -10317 83533 56935 50386 67830 86590 107327 91140 4285 27424 77439 95496
313 95496 42496 13255 -14180 -9045 29815 50977 97977 90155 90737 11557 42502 89317 78922
300 78922 127293 117203 76777 40683 88358 51079 18321 83614 56771 29572 24776 29028
288 29028 25489 -24356 27786 49415 -13520 8296 -10078 88094 142390 101892 95896 69714
276 69714 105847 91963 101329 102934 51661 50854 73489 71484 62706 90311 48208 11053 53736
263 53736 31824 80882 50702 -29472 20902 53977 16000 -28262 7686 29354 75202 29456
251 29456 52178 52272 52657 -18887 -80850 -64783 -21474 27525 25780 36449 3620 33435 84707
238 84707 114027 124798 154021 114422 123283 50887 16461 45257 81253 98639 21917 25225
226 25225 64025 96820 136287 67541 97217 76112 27084 -15947 -15127 -1497 96983 91525 56032
213 56032 40283 67044 83458 64805 35195 58278 113426 100028 119793 94685 80052 72722
201 72722 12323 19441 91222 50886 71014 30013 14288 38005 45608 109080 149164 187206
189 187206 150257 92254 -6474 -3348 101188 143482 123357 80317 111156 77539 87299 67058
177 67058 31170 40900 80374 70454 41719 63156 76654 69313 69056 38825 92170 65743 79810
164 79810 122187 189771 138391 96311 57921 65052 75097 96349 75753 92478 138837 35126
152 35126 12043 111361 96912 57470 106787 77513 55779 51895 50253 59090 116339 138470 130039
139 130039 56770 72614 78858 65565 24030 110956 72268 58111 39541 47158 100012 46284
127 46284 30697 62404 47578 17744 17581 69004 114524 61234 37049 19547 44949 62862
115 62862 115940 78068 31634 -18875 -20871 34532 50996 47182 58713 49133 69215 -14388 27109
102 27109 47082 77995 53191 36513 138080 75088 48015 95501 107796 87743 79188 72845
90 72845 41654 66093 24976 86432 58062 22713 -26099 25764 49801 10495 38342 18441
78 18441 27507 -3406 43068 70960 85991 76762 76123 19606 4346 31260 94804 77233 115209
65 115209 95069 91980 47242 58399 59559 86601 90889 57597 77304 89588 61914 34504 39767
52 39767 38065 -8022 31098 58894 58602 62704 55018 89430 42768 30129 54961 46585 49507 77691
38 77691 94319 113744 125293 64468 117615 121202 92671 68186 70857 86492 75256 68473 100447
25 100447 101456 62996 55261 71236 75457 106861 128514 115860 84054 57159 39905 52752 78672
12 78672 52864 36586 38356 58726 24856 7132 58713 91196 57208 70239 37972 57115
0 57115
$$ Imaginary data points
##PAGE= N=2
##DATA TABLE= (X++(I..I)), XYDATA
16383 -2653205 -2569138 -2505945 -2495043 -2458502 -2418252 -2397939 -2345697 -2324274 -2230805 -2158656 -2117260
16372 -2117260 -2065363 -2019844 -1969853 -1882423 -1856419 -1868734 -1809639 -1720014 -1646181 -1647601 -1607226
16361 -1607226 -1565240 -1474296 -1388955 -1333290 -1320174 -1279519 -1210636 -1215749 -1116919 -1081798 -1051836
16350 -1051836 -989643 -914376 -851882 -820115 -784564 -771169 -713336 -707011 -643700 -549513 -497704
16339 -497704 -460011 -398969 -330239 -312702 -301177 -222390 -185989 -110929 -107738 -76154 -2262 -11071
16327 -11071 21365 122683 137736 197947 314037 295139 319019 398149 427334 446374 495796
16316 495796 542305 609410 664240 658163 768905 880667 914779 872749 899848 982906 981818
16305 981818 1008909 1066838 1152612 1121862 1204280 1259963 1276928 1271501 1319865 1407448 1383271 1440453
16293 1440453 1468183 1507038 1520166 1562673 1640709 1650530 1700712 1736902 1766424 1804442 1840647
16282 1840647 1862097 1909500 1994647 2061515 2089996 2124610 2117811 2154647 2190475 2199392 2222821 2274901
16270 2274901 2330153 2365901 2395048 2410589 2464553 2523308 2497310 2510652 2596936 2646039 2650674
16259 2650674 2662342 2698685 2762310 2763099 2788160 2870287 2917377 2909212 2933554 2939047 2999600 3032171
16247 3032171 3080303 3090661 3097062 3095872 3167758 3209424 3271044 3231149 3265868 3305630 3315074 3330290
16235 3330290 3397949 3450553 3402269 3443656 3459067 3487764 3492898 3467752 3484228 3539388 3501989
16224 3501989 3580484 3630597 3600365 3654462 3705337 3728492 3690663 3737813 3720061 3745261 3798313
16213 3798313 3825292 3891751 3901499 3909510 3866683 3935215 3941006 3922901 3924036 4016841 4072866 4131307
16201 4131307 4180073 4182138 4137654 4141452 4171020 4184667 4240483 4243010 4224464 4286220 4311157 4281648
16189 4281648 4310907 4303077 4363650 4433101 4396102 4349957 4355137 4387267 4448627 4435802 4414437 4486947
16177 4486947 4494843 4514792 4502837 4523676 4560948 4540411 4543333 4557044 4554621 4587172 4540617 4553042
16165 4553042 4554553 4641418 4725208 4739588 4756347 4722533 4635488 4611624 4632712 4665649 4713018
16154 4713018 4739808 4744851 4782188 4746755 4731034 4712043 4738076 4731856 4703502 4766032 4845186 4869433
16142 4869433 4926773 4912558 4844857 4865406 4839124 4890026 4900133 4831323 4853384 4900088 4915268
16131 4915268 4963453 4926160 4916234 4951589 4943656 4974437 4936831 4956561 4963985 4958203 5021021 5024343
16119 5024343 4962335 4994969 5072694 5073715 5055529 5001446 5035840 5043814 5038508 5064271 5077652 5057766
16107 5057766 5083939 5052724 5042387 5070319 5089031 5084965 5117690 5089812 5093258 5051803 5050699 5061520
16095 5061520 5023682 5116414 5102956 5081938 5071819 5080215 5066138 5076346 5087232 5144621 5191709
16084 5191709 5215180 5214959 5145342 5123563 5064694 5143756 5109990 5114179 5137218 5158184 5153215 5152279
16072 5152279 5199533 5173094 5187802 5183952 5218242 5244400 5195611 5195587 5177090 5237718 5260552 5221092
16060 5221092 5191739 5162802 5137758 5144909 5213040 5249205 5200914 5227023 5206794 5261226 5326417
16049 5326417 5333473 5314277 5209118 5166266 5167033 5147103 5157986 5194853 5210344 5292560 5275286 5253812
16037 5253812 5239328 5224847 5260944 5318525 5288861 5233993 5244238 5302602 5281729 5280974 5306573 5308618
16025 5308618 5243043 5213355 5310866 5267475 5203363 5237003 5286060 5267260 5268813 5265979 5229530 5318419
16013 5318419 5379870 5350793 5370509 5297218 5357801 5262470 5205851 5333021 5303757 5318580 5309946
16002 5309946 5299595 5323381 5341103 5333218 5288816 5284904 5257859 5210239 5250267 5248716 5218349 5229505
15990 5229505 5301287 5291882 5350415 5324132 5298006 5260008 5321578 5328502 5263396 5319210 5305471 5305254
15978 5305254 5270490 5290794 5284429 5269907 5237079 5254311 5231437 5248297 5345419 5320648 5312032 5309880
15966 5309880 5303834 5283053 5304343 5330583 5303099 5238126 5225651 5320572 5262189 5183277 5206169
15955 5206169 5224499 5249295 5256179 5286459 5251115 5276264 5279877 5270042 5254453 5272042 5320565 5226135
15943 5226135 5190333 5278250 5272329 5292256 5345388 5377047 5245797 5247103 5310460 5201874 5199609
15932 5199609 5273539 5274553 5274733 5248185 5316530 5326741 5335642 5332225 5295555 5280180 5278150 5288507
15920 5288507 5352768 5352111 5284159 5273094 5315220 5358831 5414220 5411696 5379973 5367674 5339006 5345841
15908 5345841 5390819 5351582 5239252 5314339 5282130 5283788 5365257 5369358 5304552 5294764 5344011 5424344
15896 5424344 5353886 5283736 5353436 5408678 5355811 5314017 5318587 5334769 5262525 5315593 5283396
15885 5283396 5289733 5275746 5224813 5283556 5346756 5327220 5345724 5367454 5342247 5313711 5305090 5324505
15873 5324505 5331429 5360792 5340611 5334824 5354951 5310142 5286837 5358408 5368499 5400556 5390150 5378182
15861 5378182 5330092 5318771 5341518 5344950 5331912 5364711 5373402 5372333 5317172 5279546 5340456 5323468
15849 5323468 5336023 5354987 5366165 5389296 5396492 5353069 5447346 5454636 5363899 5330721 5325008 5347209
15837 5347209 5386774 5347118 5404166 5404491 5369033 5442266 5381353 5311571 5303032 5316272 5307573 5289572
15825 5289572 5275312 5401998 5446776 5351519 5332133 5354532 5330573 5295853 5339682 5301328 5299878
15814 5299878 5342991 5385515 5385643 5363380 5363977 5322159 5382113 5393550 5426504 5395641 5397294 5366014
15802 5366014 5347750 5317007 5384533 5420620 5417489 5414892 5387865 5404818 5434733 5464926 5437170 5422306
15790 5422306 5434686 5388632 5324259 5364952 5392574 5342944 5326175 5384965 5395123 5437538 5424132
15779 5424132 5394634 5418163 5413881 5399640 5371904 5402634 5445265 5474100 5521840 5448631 5404958
15768 5404958 5381605 5375917 5426917 5450435 5445265 5493224 5439556 5430479 5417189 5417921 5387027 5384021
15756 5384021 5397306 5377791 5381919 5458317 5451446 5376390 5381303 5391689 5452298 5442481 5419584 5433579
15744 5433579 5484524 5438904 5339752 5366708 5420525 5398871 5415352 5502114 5438748 5445733 5498493
15733 5498493 5417358 5451907 5452725 5443103 5383084 5437925 5466816 5478907 5458638 5419262 5413367 5409385
15721 5409385 5436830 5416817 5418558 5498914 5481912 5413145 5406919 5441965 5470967 5485936 5471904 5480574
15709 5480574 5454397 5446400 5416173 5370610 5377549 5394277 5386160 5391092 5432535 5401664 5385518 5369427
15697 5369427 5382336 5500594 5530556 5554437 5547281 5524262 5469734 5398463 5432709 5446843 5473873
15686 5473873 5418391 5427016 5408503 5343525 5393398 5476889 5549298 5499932 5446303 5479699 5450099
15675 5450099 5408673 5490120 5512912 5512549 5490462 5502680 5517628 5543025 5538452 5445224 5542539 5554984
15663 5554984 5481766 5400049 5426531 5412562 5432239 5448739 5484499 5485531 5483548 5582327 5526913 5490123
15651 5490123 5459088 5508232 5448929 5389089 5393601 5435028 5558753 5600138 5553751 5532260 5586544
15640 5586544 5488724 5494348 5536051 5551466 5526313 5492303 5516304 5521828 5507277 5468739 5467374 5473622
15628 5473622 5481251 5494437 5487624 5492820 5466335 5509217 5512695 5478621 5447085 5446880 5438203 5450007 5508609
15615 5508609 5484712 5466215 5461469 5502123 5515305 5526415 5528928 5445403 5422989 5465996 5539468 5519468
15603 5519468 5476879 5497878 5489414 5446899 5528115 5580550 5573911 5447036 5470429 5532846 5523091 5524829
15591 5524829 5537203 5539383 5486883 5513923 5567866 5621935 5589020 5613945 5580530 5559753 5569549 5570147
15579 5570147 5550508 5559042 5578804 5514678 5503196 5509032 5490533 5507820 5466489 5519900 5550993 5510679
15567 5510679 5535937 5602711 5577767 5569277 5589976 5554318 5533776 5533079 5498467 5492544 5528758 5554795
15555 5554795 5542491 5545747 5521059 5566049 5562692 5535810 5515887 5520908 5628084 5588498 5545498 5566414
15543 5566414 5538514 5522620 5545048 5596895 5553072 5564058 5558614 5541254 5570210 5525213 5557473
15532 5557473 5588217 5631022 5611415 5556812 5617919 5564247 5567749 5595893 5580136 5545250 5614679
15521 5614679 5647155 5598500 5564602 5561762 5625786 5625071 5600317 5557963 5603460 5691044 5663337 5619231
15509 5619231 5555993 5573397 5601028 5597068 5564638 5524627 5559066 5621767 5575392 5527261 5552284
15498 5552284 5594337 5637660 5624152 5701308 5638283 5645304 5640004 5665943 5679476 5534597 5543292 5626305
15486 5626305 5605280 5585774 5627276 5642313 5615757 5657780 5671918 5662826 5585115 5620711 5656213
15475 5656213 5613961 5607959 5688471 5731701 5712073 5689841 5672660 5680158 5671120 5631199 5632104 5658841
15463 5658841 5567496 5582634 5556736 5562136 5562751 5528547 5557575 5533113 5534659 5514080 5596758 5589534
15451 5589534 5571516 5650988 5673051 5638306 5604826 5587366 5617800 5646052 5582215 5566326 5554525
15440 5554525 5610460 5663552 5672768 5687548 5703541 5668400 5622819 5607122 5650621 5684012 5657461
15429 5657461 5679347 5624111 5571852 5620488 5610736 5597480 5573525 5556787 5647498 5636571 5668788
15418 5668788 5637595 5676913 5711903 5665066 5634128 5599717 5662342 5625578 5592459 5642787 5630583
15407 5630583 5630780 5641322 5643639 5670515 5653411 5695105 5688126 5645699 5629974 5623952 5582505 5574383
15395 5574383 5597243 5637309 5642720 5678981 5606328 5556321 5546198 5573917 5620244 5649576 5636651
15384 5636651 5659441 5674156 5689459 5737485 5694404 5683397 5685602 5645442 5622242 5637384 5630522 5619785
15372 5619785 5664980 5666074 5652127 5693966 5684470 5664600 5666520 5698596 5704464 5685061 5693181 5646384
15360 5646384 5610541 5593422 5648530 5690405 5691042 5690280 5673415 5687603 5683038 5681886 5675103 5657193 5690279
15347 5690279 5713137 5678667 5658724 5690864 5740757 5684794 5711311 5761210 5765584 5756786 5731945 5699072
15335 5699072 5722364 5698670 5734795 5691910 5764077 5723929 5703588 5755158 5776589 5725799 5641951
15324 5641951 5646543 5677635 5720490 5711183 5725376 5687811 5701688 5682271 5627961 5634974 5638761 5691065
15312 5691065 5697534 5678732 5720679 5683874 5711484 5672665 5668102 5687795 5698955 5730899 5704961 5688799
15300 5688799 5688205 5683895 5732494 5778338 5726445 5734481 5731042 5732160 5748303 5784543 5791230 5797089 5758057
15287 5758057 5724276 5738304 5729633 5776459 5712514 5697064 5705838 5695435 5659107 5615518 5617143 5644468
15275 5644468 5703585 5705408 5676546 5680419 5629137 5691480 5671062 5670398 5654277 5721634 5749995 5709339
15263 5709339 5713808 5676921 5738655 5743108 5657067 5705623 5678733 5720980 5802927 5828536 5798145 5724031
15251 5724031 5670621 5722286 5763926 5717115 5685023 5680262 5779618 5730948 5781566 5849624 5838858
15240 5838858 5806425 5795096 5805646 5811143 5743890 5783432 5803242 5703768 5684009 5703804 5695493 5725438
15228 5725438 5735865 5722804 5734509 5817479 5789520 5711069 5770919 5687273 5752803 5769356 5773850
15217 5773850 5770968 5742532 5775529 5788085 5737290 5728202 5767239 5746190 5665924 5699406 5754966 5778321
15205 5778321 5731275 5717091 5782497 5780082 5746362 5806282 5805000 5779673 5880685 5804002 5777806
15194 5777806 5758553 5712023 5691730 5774788 5806617 5767263 5750096 5826943 5817346 5838114 5801242
15183 5801242 5798033 5764946 5758828 5759564 5753924 5746333 5798558 5791919 5823238 5777343 5809729 5775991 5747631
15170 5747631 5755695 5745134 5747658 5777204 5790119 5800234 5812383 5831904 5845837 5838644 5883213 5820764
15158 5820764 5872977 5864018 5883055 5826784 5791906 5744252 5736788 5757624 5750922 5835605 5813770 5789999
15146 5789999 5809040 5832207 5767135 5700039 5741326 5776772 5792553 5729274 5730630 5760267 5737497
15135 5737497 5720409 5696884 5723693 5789414 5781767 5768700 5735939 5768650 5753373 5855928 5845643
15124 5845643 5871811 5852235 5808204 5858133 5871973 5851675 5779039 5825302 5841123 5818352 5816052
15113 5816052 5829375 5853996 5873820 5894125 5878711 5869290 5845499 5864688 5790073 5797021 5788965 5827456
15101 5827456 5868683 5898634 5964595 5883826 5810894 5837073 5855013 5815922 5836443 5800687 5799592
15090 5799592 5835674 5856950 5809763 5791738 5812709 5847875 5857868 5895379 5831636 5817775 5858116
15079 5858116 5830316 5879058 5867587 5817950 5807167 5873806 5876850 5838419 5840326 5873087 5895764 5953582
$$ [...]
##END NTUPLES=NMR SPECTRUM
##END=
