##TITLE=1H_CA-8961x
 DMSO
 8 sc, 
 15.12.2021
##JCAMPDX= 6.0         $$ Bruker NMR JCAMP-DX V2.0
##DATA TYPE= NMR SPECTRUM
##DATA CLASS= NTUPLES
##ORIGIN= UXNMR, Bruker Analytische Messtechnik GmbH
##OWNER= root
$$ XWIN-NMR		Version 3.5
$$ Wed Dec 15 11:06:55 2021 Russian Standard Time (UT+4h)  she@DPX200
##.OBSERVE FREQUENCY= 200.131346
##.OBSERVE NUCLEUS= ^1H
##.ACQUISITION MODE= SIMULTANEOUS
##.ACQUISITION SCHEME= undefined
##.AVERAGES= 8
##.DIGITISER RES= 18
##SPECTROMETER/DATA SYSTEM= spect
##.PULSE SEQUENCE= zg30
##.SOLVENT NAME= CDCl3
##.SHIFT REFERENCE= (INTERNAL, CDCl3, 0, 15.7458)
##AUDIT TRAIL= $$ (NUMBER, WHEN, WHO, WHERE, WHAT)
$$ ##TITLE= Audit trail, XWIN-NMR		Version 3.5
$$ ##JCAMPDX= 5.01
$$ ##ORIGIN= Bruker BioSpin GmbH
$$ ##OWNER= she
$$ F:/spectra/data/she/nmr/H-F/1/pdata/1/auditp.txt
$$ ##AUDIT TRAIL=  $$ (NUMBER, WHEN, WHO, WHERE, WHAT)
(   1,<2021-12-15 11:05:32.62 +0400>,<she>,<DPX200>,
      <created by zg, POWCHK disabled, PULCHK disabled
       configuration hash MD5:
       00 E9 B6 7A A2 85 ED C7 34 08 36 98 17 FE 4E 26
       data hash MD5: 16K
       5F 23 53 6D CF 39 4A 80 41 0F 38 09 A8 24 E3 D8>)
(   2,<2021-12-15 11:05:37.28 +0400>,<she>,<DPX200>,
      <Start of raw data processing
       efp BC_mod = 2 LB = 0.24 FT_mod = 6 PKNL = 1 PHC0 = -15940.29 PHC1 = -5.99921 SI = 16K 
       data hash MD5: 16K
       50 DC 0E EA 12 4E 41 EF 94 EC C5 BC 5F 1D 0D 90>)
(   3,<2021-12-15 11:06:07.28 +0400>,<she>,<DPX200>,
      <pk PHC0 = -99.42489 PHC1 = 32 
       data hash MD5: 16K
       3C 47 EA FF 34 65 04 35 2D 82 53 3D EE E6 34 1C>)
(   4,<2021-12-15 11:06:10.90 +0400>,<she>,<DPX200>,
      <abs ABSG = 5 
       data hash MD5: 16K
       8F B5 72 2D EA C7 AC 1A 08 2C 48 11 7D E4 1A DD>)
$$ ##END=
$$ 
$$ hash MD5
$$ 3D 0F 7C EB C8 5A 31 89 50 4F B2 61 22 30 93 12
##$RELAX= 
##$RELAX= 
##$RELAX= 
##$RELAX= 
##$RELAX= 
##$RELAX= 
$$ Bruker specific parameters
$$ --------------------------
##$DU= <F:/spectra>
##$EXPNO= 1
##$NAME= <H-F>
##$PROCNO= 1
##$TYPE= <nmr>
##$USER= <she>
##$AMP= (0..31)
100 100 100 100 100 100 100 100 100 100 100 100 100 100 100 100 100 100 
100 100 100 100 100 100 100 100 100 100 100 100 100 100 
##$AQSEQ= 0
##$AQ_mod= 1
##$AUNM= <au_zg>
##$AUTOPOS= <>
##$BF1= 200.13
##$BF2= 200.13
##$BF3= 200.13
##$BF4= 200.13
##$BF5= 200.13
##$BF6= 200.13
##$BF7= 200.13
##$BF8= 200.13
##$BYTORDA= 1
##$CFDGTYP= 0
##$CFRGTYP= 5
##$CHEMSTR= <none>
##$CNST= (0..31)
1 1 145 1 1 1 1 1 1 1 1 1 1 1 1 1 1 1 1 1 1 1 1 1 1 1 1 1 1 1 1 1 
##$CPDPRG= <>
##$CPDPRG1= <>
##$CPDPRG2= <>
##$CPDPRG3= <>
##$CPDPRG4= <mlev>
##$CPDPRG5= <mlev>
##$CPDPRG6= <mlev>
##$CPDPRG7= <mlev>
##$CPDPRG8= <mlev>
##$CPDPRGB= <>
##$CPDPRGT= <>
##$D= (0..31)
0 1.2 0 0 0 0 0 0 0 0.06 0 0.03 0 0 0 0 0.0002 0 0 0 0 0 0 0 0 0 0 0 0 
0 0 0 
##$DATE= 1639551932
##$DBL= (0..7)
120 120 120 120 120 120 120 120 
##$DBP= (0..7)
150 150 150 150 150 150 150 150 
##$DBP07= 0
##$DBPNAM0= <>
##$DBPNAM1= <>
##$DBPNAM2= <>
##$DBPNAM3= <>
##$DBPNAM4= <>
$$ [...]
##$SUBNAM2= <"">
##$SUBNAM3= <"">
##$SUBNAM4= <"">
##$SUBNAM5= <"">
##$SUBNAM6= <"">
##$SUBNAM7= <"">
##$SUBNAM8= <"">
##$SUBNAM9= <"">
##$SW= 18.0517287032376
##$SWIBOX= (0..15)
0 0 2 0 0 0 0 0 0 0 0 0 0 0 0 0 
##$SW_h= 3612.71676300578
##$TD= 16384
##$TD0= 1
##$TE= 0
##$TE2= 300
##$TE3= 300
##$TEG= 300
##$TL= (0..7)
0 120 120 120 120 120 120 120 
##$TP= (0..7)
150 150 150 150 150 150 150 150 
##$TP07= 0
##$TPNAME0= <>
##$TPNAME1= <>
##$TPNAME2= <>
##$TPNAME3= <>
##$TPNAME4= <>
##$TPNAME5= <>
##$TPNAME6= <>
##$TPNAME7= <>
##$TPOAL= (0..7)
0.5 0.5 0.5 0.5 0.5 0.5 0.5 0.5 
##$TPOFFS= (0..7)
0 0 0 0 0 0 0 0 
##$TUNHIN= 0
##$TUNHOUT= 0
##$TUNXOUT= 0
##$USERA1= <user>
##$USERA2= <user>
##$USERA3= <user>
##$USERA4= <user>
##$USERA5= <user>
##$V9= 5
##$VALIST= <valist>
##$VCLIST= <CCCCCCCCCCCCCCC>
##$VD= 0
##$VDLIST= <DDDDDDDDDDDDDDD>
##$VPLIST= <PPPPPPPPPPPPPPP>
##$VTLIST= <TTTTTTTTTTTTTTT>
##$WBST= 1024
##$WBSW= 4
##$XGAIN= (0..3)
0 0 0 0 
##$XL= 0
##$YL= 0
##$YMAX_a= 131272
##$YMIN_a= -85967
##$ZGOPTNS= <>
##$ZL1= 120
##$ZL2= 120
##$ZL3= 120
##$ZL4= 120
##$ABSF1= 15.74579
##$ABSF2= -2.30606
##$ABSG= 5
##$ABSL= 3
##$ALPHA= 0
##$AQORDER= 0
##$ASSFAC= 0
##$ASSFACI= 0
##$ASSFACX= 0
##$ASSWID= 0
##$AUNMP= <proc_1d>
##$AZFE= 0.1
##$AZFW= 0.1
##$BCFW= 0
##$BC_mod= 2
##$BYTORDP= 0
##$COROFFS= 0
##$CY= -3
##$DATMOD= 1
##$DC= 0
##$DFILT= <>
##$DTYPP= 0
##$F1P= 0
##$F2P= 0
##$FCOR= 1
##$FTSIZE= 16384
##$FT_mod= 6
##$GAMMA= 0
##$GB= 0
##$INTBC= 1
##$INTSCL= 0
##$ISEN= 128
##$LB= 0.24
##$LEV0= 0
##$LPBIN= 0
##$MAXI= 10000
##$MC2= 0
##$MEAN= 0
##$ME_mod= 0
##$MI= 1.114404
##$NCOEF= 0
##$NC_proc= -9
##$NLEV= 6
##$NOISF1= 3.799351
##$NOISF2= 2.8
##$NSP= 0
##$NTH_PI= 0
##$NZP= 0
##$OFFSET= 15.74579
##$PC= 1
##$PHC0= -16039.71
##$PHC1= 26.00079
##$PH_mod= 1
##$PKNL= yes
##$PPARMOD= 0
##$PSCAL= 0
##$PSIGN= 0
##$REVERSE= no
##$SF= 200.130001153767
##$SI= 16384
##$SIGF1= 3
##$SIGF2= 2
##$SINO= 5.538805
##$SIOLD= 16384
##$SREGLST= <1H.CDCl3>
##$SSB= 0
##$STSI= 16384
##$STSR= 0
##$SW_p= 3612.71676300578
##$SYMM= 0
##$S_DEV= 0
##$TDeff= 16384
##$TDoff= 0
##$TI= <>
##$TILT= no
##$TM1= 0
##$TM2= 0
##$TOPLEV= 0
##$USERP1= <user>
##$USERP2= <user>
##$USERP3= <user>
##$USERP4= <user>
##$USERP5= <user>
##$WDW= 1
##$XDIM= 16384
##$YMAX_p= 280173955
##$YMIN_p= -1263349
$$ End of Bruker specific parameters
$$ ---------------------------------
##NTUPLES= NMR SPECTRUM
##VAR_NAME=  FREQUENCY,     SPECTRUM/REAL,   SPECTRUM/IMAG
##SYMBOL=    X,             R,               I
##VAR_TYPE=  INDEPENDENT,   DEPENDENT,       DEPENDENT
##VAR_FORM=  AFFN,          ASDF,            ASDF
##VAR_DIM=   16384,         16384,           16384
##UNITS=     HZ,            ARBITRARY UNITS, ARBITRARY UNITS
##FACTOR=    0.220516191357247, 1,           1
##FIRST=     3151.20487638421, 0,            0
##LAST=      -461.511886621568, 0,           0
##MIN=       -461.511886621568, -1263349,    0
##MAX=       3151.20487638421, 280173955,    0
$$ Real data points
##PAGE= N=1
##DATA TABLE= (X++(R..R)), XYDATA
$$ [...]
6815a26222j11921J67817j02299k10099l91511O8533K00100O3271j66674j99136
6805h08141m053P4751k4140j45799L08200K75558k0663P6820K57461j6054l0889
6794e6949m25985k03391j14005K73786k20985K16764P5379n3946J03113M70278
6784F4059k39177k47613L18109k33624j32344L6260J97054l1068P5235k80946
6774d74055q8197k5135j22074j9337K13986K87754p3446J38812J37292K6497j34275
6763a32178J2058J43161k29443J2916M3456j36166n0562q34k7727J29667O685
6752b28967k37155l28483P2491K76448J3239N6301Q6189j49573L21958L3524k72774
6741c56802p9307k50090J16231J55542J22734o9056j63932M3318L858N2911j4458
$$ plain form
6815 -126222 -238143 -70326 -172625 -382724 -774235 -705702 -505602 -442331 -609005 -808141
6805 -808141 -812194 -737443 -761583 -907382 -599182 -323624 -344287 -267467 -10006 -26060 -56949
6794 -56949 -482934 -686325 -800330 -526544 -747529 -530765 -455386 -509332 -406219 64059
6784 64059 -175118 -422731 -104622 -338246 -470590 -434330 -237276 -268344 -193109 -474055
6774 -474055 -562252 -587387 -709461 -728798 -514812 -227058 -300504 -161692 -24400 2097 -132178
6763 -132178 -120120 23041 -206402 -193486 -150030 -286196 -336758 -337592 -365319 -235652 -228967
6752 -228967 -466122 -794605 -722114 -445666 -432427 -376126 -289937 -439510 -117552 -84028 -356802
6741 -356802 -436109 -686199 -569968 -414426 -291692 -360748 -524680 -481362 -477504 -424593 -439051
6730d39051k94330J9553K16300K12564K84024l60736l6393J38015j6907J76725
6720a00236k25330J11125K8614j41735j19088P5064J69154J93970q2207j22815
6710b13484o6514R689k64673J16822K87182k56690j05647K38904N0491m0554k303
6699b46777j70649j16639N3480p474M6548l1385J30288M77534k8953j18625o5757
6688g8409K29067j23558J70347l17071m4594K08689l24264k74538j05998R6614
6678e63715K29620O6726n1633K29904K63265J86174P7834l1561l8361j66756n7479
6667A44018p4416j33068r2076j44356p2406O465O057L75028O8690j56735K81364
6656B08565K17030j61321J21588O6202N2184n21314l85935J15974P5936k11660
$$ plain form
6730 -439051 -733381 -713828 -497528 -284964 -940 -361676 -398069 -260054 -276961 -100236
6720 -100236 -325566 -214441 -185827 -327562 -446650 -371586 -202432 -8462 -90669 -213484
6710 -213484 -279998 -270309 -534982 -418160 -130978 -387668 -493315 -254411 -203920 -244474 -246777
6699 -246777 -417426 -534065 -480585 -488059 -441511 -472896 -342608 134926 105973 -12652 -78409
6688 -78409 150658 27100 197447 -119624 -164218 44471 -279793 -554331 -660329 -563715
6678 -563715 -334095 -267369 -319002 -89098 174167 360341 438175 406614 368253 201497 144018
6667 144018 69602 -63466 -155542 -299898 -372304 -365839 -359782 15246 83936 -72799 208565
6656 208565 425595 264274 385862 452064 504248 -17066 -403001 -287027 -211091 -422751
6646d22751j23603K15339M5667L45903K31173q069J2630J83163j18476l7544l50987
6635b7555l2112m3959p7810J40583o8510j28378L07984J09193j64137M2111J10100
6624A67510L1761J5217k5868K1324K6738n0086j09725k51154R9424L9498O5307
6613B9946J25888P0605j18555L95387r719j73102K06813q1728k50712j8553l2101
6602A44169j88414J43217l34147j54229M47328J01340j29615M38846K74142l65448
6592C77189j84995J96998R5631n5693j63967J12864j69589j3643R6711M3474o6016
6581B68964J11239k30424J47041N47491m7266j07262k52393j8364k16935K15351
6571D17442n0126j94053N17964j49138o4997K30267q885j58215J13715M236j61077
$$ plain form
6646 -422751 -546354 -331015 -285348 60555 291728 283659 296289 479452 360976 323432 -27555
6635 -27555 -59667 -103626 -181436 -40853 -109363 -237741 70243 179436 15299 57410 167510
6624 167510 199271 214488 188620 209944 236682 186596 76871 -174283 -74859 -35361 29946
6613 29946 155834 226439 107884 503271 493552 320450 527263 445535 194823 176270 144169
6602 144169 -44245 98972 -235175 -389404 57924 159264 29649 468495 742637 377189
6592 377189 192194 389192 484823 429130 265163 378027 208438 194795 291506 334980 268964
6581 268964 380203 149779 296820 844311 797045 689783 437390 419026 202091 417442
6571 417442 367316 173263 691227 542089 477092 707359 698474 540259 653974 658210 497133
6560D97133j6969J05986j92688K45338j59104k49730R2890J21770j34179L9918
6550C50365J30227l575O7951j13798J17336J02263k1767m59188J40711K68393
6540E78918M2566J34357J64478p346m8938j55906R7165j85030j50527J74230L39253
6529I83220M3236q140K09586j98858k44551o9452N267M0369j72503J94838o169
6518G76843P4946K49510J58097n9541k40674P3214r5013k98725j42997J98342
6508F94002J37270J83909j51792l6190K8545J11558j9073j65442J29536J48700
6498A061023r542K36738k01591k14004m698j92791l060K26567J57576j11531J48276
6487A092963j91508P4922j33625J9019J53044J67886J69565K37481J3924j14314
$$ plain form
6560 497133 480164 586150 393462 638800 479696 229966 322856 444626 310447 350365
6550 350365 480592 477017 544968 431170 548506 650769 629002 169814 310525 578918
6540 578918 621484 755841 920319 912973 864035 708129 805294 620264 469737 643967 983220
6529 983220 1026456 1018316 1227902 1029044 784493 715041 720308 760677 588174 783012 776843
6518 776843 851789 1101299 1259396 1199855 959181 1032395 937382 638657 495660 694002
6508 694002 831272 1015181 863389 827199 855744 967302 948229 782787 912323 1061023
6498 1061023 1051481 1288219 1086628 872624 867926 675135 672075 898642 1056218 944687 1092963
6487 1092963 901455 976377 842752 861771 1014815 1182701 1352266 1589747 1603671 1489357
6477A489357j62663j98805J52087j68005k01822L77516N2719R8930K37972N5492
6467A732778k84331k3273j50986l1498j31192j31112P9658Q8272J79217J8686
6457A346219K86430k0889O9763k92925j44783R7209r3981P9585J21363J5777J87326
6446A651094k519m2885p0520l34544q2477j78993J32025N49651N6634K08168J19518
6435B005152r7433q368L1252k21152j73517J81113p3688j65001j81282p2977L31948
6424A556047J53891p2681j70034P8272J57065J1356K11342p3161k99713J70913
6414A723297k9020j66173k67667M4149K36031K71067K65266k11393l33285J42453
6404A674725n1770M243J58373R5756J44836r7461j30277p1564l00105j0887R0723
$$ plain form
6477 1489357 1326694 1127889 1279976 1111971 910149 1287665 1340384 1439314 1677286 1732778
6467 1732778 1448447 1425174 1274188 1242690 1111498 980386 1060044 1148316 1327533 1346219
6457 1346219 1632649 1611760 1681523 1388598 1243815 1341024 1247043 1326628 1447991 1463768 1651094
6446 1651094 1648575 1605690 1535170 1200626 1118149 939156 1071181 1620832 1677466 1885634 2005152
6435 2005152 1907719 1899351 1930603 1709451 1535934 1717047 1643359 1478358 1297076 1224099 1556047
6424 1556047 1709938 1637257 1467223 1545495 1702560 1713916 1925258 1852097 1552384 1723297
6414 1723297 1694277 1528104 1260437 1304586 1540617 1811684 2076950 1865557 1532272 1674725
6404 1674725 1622955 1627198 1785571 1881327 2026163 1928702 1798425 1726861 1426756 1415869 1506592
6393A506592K43708l9005j25707L21907J10289J86925p1672k1179l0526k28198
6383A853134l18202k80873L79844J64130K48251N0526L08463J335j96187J7257
6373B227678m74349k64037R19M21620K62849J3154J77299J94439l9148N8192k04407
6362B374209l32839l07430K52845K75701N3556o22K87981J77931j34764m25922
6352B220646l53535M9987J63150K21545K26546j61697J63355n7873J66767r0816
6342B548075j46726j78142j17232o7069j05702K37429K90282M09756n4067j282
6332B815322k53347o282R2342j35452J25426L64814o8675j42347k53911j09841
6322B428049k10225K8993J75058K52597L15410r8033O9874K80885q3179k40941
$$ plain form
6393 1506592 1750300 1711295 1585588 1907495 2017784 2204709 2133037 2111858 2081332 1853134
6383 1853134 1534932 1254059 1633903 1798033 2046284 2096810 2405273 2406608 2210421 2227678
6373 2227678 1753329 1489292 1490211 1911831 2174680 2187834 2365133 2559572 2520424 2578616 2374209
6362 2374209 2041370 1733940 1986785 2262486 2316042 2315420 2603401 2781332 2646568 2220646
6352 2220646 1867111 1917098 2080248 2301793 2528339 2366642 2529997 2472124 2638891 2548075
6342 2548075 2401349 2223207 2105975 2038906 1933204 2170633 2460915 2870671 2816604 2815322
6332 2815322 2561975 2555693 2648035 2512583 2638009 3002823 2934148 2791801 2537890 2428049
6322 2428049 2217824 2246817 2421875 2674472 2989882 2891849 2961723 3242608 3159429 2918488
6312B918488j46140J86610O3564j49510L140j13437K75634K08047R0546k61577
6302C075365k07722J22741J03315J80313K29142K58296J3837k56457q663j59097
6292C351070n70439m61089p3319M88092J71887L14882N70725M13701O4032k39535
6282D030007K3627n49539l85315k5895J34049K49555J46600P2895J26951K991
6272C825926k00303j59448k2113l1444R3261L10316Q7342J73237J62064j41743
6262D097095j82401r1439L8632k31315j66514J92726L67756N01913O7424J00271
6252D694148j08590p5283k75779J20980o7229k93033O4294L31857j69650j3500
6242D208215J28436j42697p3010l2621K76146m7119O9330J96680K689n2871m45539
$$ plain form
6312 2918488 2772348 2958958 3022522 2873012 2876152 2762715 3038349 3246396 3336942 3075365
6302 3075365 2867643 2990384 3093699 3274012 3503154 3761450 3775287 3518830 3510167 3351070
6292 3351070 2780631 2319542 2246223 2734315 2906202 3221084 3791809 4205510 4269542 4030007
6282 4030007 4053634 3504095 3118780 3092885 3226934 3476489 3623089 3695984 3822935 3825926
6272 3825926 3625623 3466175 3444062 3412618 3505879 3816195 3903537 4076774 4238838 4097095
6262 4097095 3914694 3823255 3861887 3630572 3464058 3656784 4024540 4526453 4593877 4694148
6252 4694148 4585558 4510275 4234496 4355476 4288247 3995214 4059508 4391365 4221715 4208215
6242 4208215 4336651 4193954 4120944 4088323 4364469 4317350 4386680 4583360 4586049 4533178 4087639
6231D087639L7088Q6180o2015R2827J76234L08812L07550p1950j25798j02940
6221D733627m25808J38743j651K41745J43534J31767j55364J51923N8739j47246
6211D870009r0112j24190l9205P5244L11239J59307K57799l4585k12832k32411
6201D940263k51574l0906Q7331K26601K58428L40331J76361K90484j04860K23096
6191F155555k27517n97472m34764j74113K43054Q4048L35941O59197j4194J17630
6181F147365K03707N2363j00717k67843j02879N6448L42492O8253K98937L2057
6171F730183m37219m04231J11348K45997j79554m9964K01463J45298L05834K62128
6161F931283r2072k77217j12990k03120j17886M849p2553R8436K94295K10638
$$ plain form
6231 4087639 4124727 4210907 4148892 4241719 4417953 4726765 5034315 4962365 4836567 4733627
6221 4733627 4307819 4446562 4444911 4686656 4830190 4961957 4806593 4958516 5017255 4870009
6211 4870009 4779897 4655707 4616502 4691746 5002985 5162292 5420091 5385506 5172674 4940263
6201 4940263 4688689 4657783 4745114 4971715 5230143 5570474 5746835 6037319 5932459 6155555
6191 6155555 5928038 5330566 4895802 4721689 4964743 5048791 5384732 6043929 6029735 6147365
6181 6147365 6351072 6403435 6302718 6034875 5931996 5988444 6330936 6399189 6698126 6730183
6171 6730183 6292964 5888733 6000081 6246078 6066524 6016560 6218023 6363321 6669155 6931283
6161 6931283 6839211 6561994 6449004 6245884 6127998 6132847 6060294 6158730 6453025 6663663
6151F663663J00424j26397P9069L9729K46582j68196Q8812J80338o1972j56007
6141F886045l30845j48958J23297p6803J23345J69135K98986P8480k8642R5071
6131G189111m5705j20503j83851O6740K5710M6652K98593P215j5218J22835Q7927
6120G479506n3597p4003J02947q6651q3486k4423K20971O354J64107L40003r0381
6109G901347l39616k20248r1065r7499J85003O04046R1848N7503k5618k40973
6099G824728k98312j00615J39110j08372M79232J4196J5502l8626L65359K84703
6089H576905l38403k03576q9756L8227l45281m9635L69118K37183K1656k76j90931
6078H025231j44239M0052j09906o4267L61833J37853K25510J65j04075N0405O5136
$$ plain form
6151 6663663 6764087 6637690 6716759 6756488 7003070 6834874 6923686 7104024 7042052 6886045
6141 6886045 6555200 6406242 6529539 6452736 6576081 6745216 7044202 7122682 7094040 7189111
6131 7189111 7143406 7022903 6839052 6905792 6931502 6978154 7276747 7283962 7268744 7391579 7479506
6120 7479506 7425909 7351906 7454853 7368202 7284716 7260293 7481264 7487618 7651725 7991728 7901347
6109 7901347 7561731 7341483 7250418 7152919 7337922 7941968 8033816 8091319 8065701 7824728
6099 7824728 7526416 7425801 7564911 7456539 7935771 7949967 7965469 7926843 8292202 8576905
6089 8576905 8238502 8034926 7945170 7983397 7638116 7588481 7957599 8194782 8216438 8216162 8025231
6078 8025231 7880992 7921044 7811138 7746871 8108704 8246557 8472067 8472232 8368157 8418562 8483698
6067H483698k45296j45996p5632J31728M1692K14614J44593K16988j04943q6250
6057H575196L02995j44939R4078J05080k83022k11722j69375J75461K76960j15965
6047H604747K82438k6287k7207J58591J20266j55291N4625K03050j88691m3242
6037H982999J09542j23523k51499R3188j07098J38389K90335J31340j80930P2462
6027I155205M0076r879L18097J32258K40771K10829k08356n4177m2321m8509k12706
6016I521288q7803J13517L21725J75866M50J71488r6628K15645o4483m2209k1697
6005A0207159J20042j06401k56198O1940Q171Q6181j0453L24494j82312k34107
5995A0018516J13741R2731M3204M37828M37526j21645Q7819r2956J95605j57853
$$ plain form
6067 8483698 8238402 8092406 8016774 8148502 8190194 8404808 8549401 8766389 8661446 8575196
6057 8575196 8878191 8733252 8827330 8932410 8649388 8437666 8268291 8443752 8720712 8604747
6047 8604747 8887185 8860898 8833691 8992282 9112548 8957257 9011882 9214932 9026241 8982999
6037 8982999 9092541 8969018 8717519 8810707 8703609 8841998 9132333 9263673 9082743 9155205
6027 9155205 9195281 9185402 9503499 9635757 9876528 10087357 9879001 9824824 9782503 9733994 9521288
6016 9521288 9433485 9547002 9868727 10044593 10045043 10216531 10119903 10335548 10271065 10228856 10207159
6005 10207159 10327201 10220800 9964602 10026542 10034713 10120894 10110441 10434935 10252623 10018516
5995 10018516 10132257 10224988 10268192 10706020 11143546 11021901 11109720 11016764 11212369 11054516
5985A1054516J60882l58784k01354L16003l37433L72801J96056k74849M9962J57727
5975A1135527L13460J48867J42322j4143l107j77877j45665J11608J92315K11253
5965A1914560J07311k30850j48143p3125k1948L36957J29383Q0075K80954K27627
5955A2602801n0268J43706k5118k44460J47279j27923m29655k00826m3209L28166
5945A2100493M99089K11015J18611J45378k30225M6094M3215M4518l5581O4732
5935A3007339L37947m1155j01112Q4764j07659l06448o3313J17701Q5430R0840
5925A3104334j8463K44377K71663j52233J52496J35927J12264o0971k98786K96608
5915A3787216O3026m5076j65888J76604j52303K04704K38376p9477J8506q0499
$$ plain form
5985 11054516 11215398 10856614 10655260 10971263 10633830 11006631 11202687 10927838 10977800 11135527
5975 11135527 11448987 11597854 11740176 11726033 11722926 11545049 11399384 11510992 11703307 11914560
5965 11914560 12021871 11791021 11642878 11569753 11547805 11884762 12014145 12094220 12375174 12602801
5955 12602801 12552533 12696239 12671121 12426661 12573940 12446017 12016362 11815536 11772327 12100493
5945 12100493 12599582 12810597 12929208 13074586 12844361 12890455 12933670 12978188 12942607 13007339
5935 13007339 13345286 13304131 13203019 13287783 13180124 12873676 12810363 12928064 13013494 13104334
5925 13104334 13085871 13330248 13601911 13449678 13602174 13738101 13850365 13789394 13490608 13787216
5915 13787216 13850242 13805166 13639278 13815882 13663579 13868283 14106659 14027182 14045688 13965189
5905A3965189L75873K64414Q3033Q7073J92524j33542k96723k45720O5923k5448
5895A4332596O9623J40524L616k0517J20780L14967N6752k99434K6223L29339
5885A5074469M93867j65427K4764n5304R243k25477j73028J70557K4413L3970
5875A5212047n3109Q9108L63648N3181Q7137J63809o6592L3323j34480n6187J14728
5864A5806613J66921k11660q2401Q5669j56794l3032J52179Q3394L19810L25148
5854A6455847n2679J06268o3124j32886j34748K28319j46001k05156K9092Q0304
5844A6165236R3950K69249L69992R9338m9512l18935j9290k8206J7752j40631
5834A6458943Q6223L9415K29832R136K17165N0107o1594k74128k1152j4368J71103
$$ plain form
5905 13965189 14341062 14605476 14688509 14775582 14968106 14834564 14537841 14292121 14358044 14332596
5895 14332596 14402219 14542743 14546359 14525842 14646622 14961589 15018341 14718907 14745130 15074469
5885 15074469 15568336 15402909 15427673 15372369 15381612 15156135 14983107 15153664 15178077 15212047
5875 15212047 15158938 15248046 15611694 15664875 15752012 15915821 15849229 15882552 15748072 15691885 15806613
5864 15806613 15973534 15761874 15679473 15765142 15608348 15575316 15727495 15810889 16130699 16455847
5854 16455847 16403168 16509436 16446312 16313426 16178678 16406997 16260996 16055840 16084932 16165236
5844 16165236 16259186 16528435 16898427 16997765 16948253 16629318 16610028 16581822 16599574 16458943
5834 16458943 16545166 16584581 16814413 16823549 17040714 17090821 17029227 16755099 16733947 16719579 16890682
5823A6890682M34928R9826J22215n1750r0534l96796k95854K50376j2270M19039
5813A7369862L62487O367j52241j01797J11515k26262L2932J12953m7507K4773
5803A7493082j38467j84202O9964K15444K17817L35339l9719R2186J00217J86290
5793A8347951J47732L76987k6136l60685k92613k01655P0491J93365k6754J09038
5783A8337721K88938L19118M13081p7652o2572k59453j26468K29307J56799o5782
5773A9153037J61469J09506k11826k72574k92784L6459L66373J00503J20656L05359
5763A9576178L42093J94509q8214N0524m3679k88832l41302j63378m6390k21986
5753A8969523K61325K74576N22217L09066o5700J3989K14444k43730n7360j40766
$$ plain form
5823 16890682 17325610 17425436 17547651 17495901 17405367 17008571 16712717 16963093 16950823 17369862
5813 17369862 17732349 17738716 17586475 17484678 17596193 17369931 17402863 17515816 17468309 17493082
5803 17493082 17354615 17170413 17240377 17455821 17673638 18008977 17969258 18061444 18161661 18347951
5793 18347951 18495683 18872670 18846534 18485849 18193236 17991581 18062072 18255437 18228683 18337721
5783 18337721 18626659 18945777 19358858 19281206 19218634 18959181 18832713 19062020 19218819 19153037
5773 19153037 19314506 19424012 19212186 18939612 18646828 18683287 19049660 19150163 19270819 19576178
5763 19576178 19918271 20112780 20024566 20075090 20031411 19742579 19401277 19237899 19191509 18969523
5753 18969523 19230848 19505424 20027641 20336707 20271007 20284996 20499440 20255710 20198350 20057584
5743B0057584q3467L12902K06290k97877j1177k94314K4161P3265M54594L09290
5733B0751251q442J12363j7321O1522K69j02243K9039k19930N2632J35112l5603
5722B0758649m8555r0627J16379l7491L87823J86421n5803j05087L4566J99377
5712B1345652L50R0007J565j21412K11738l70684K46156P032M10831M04912j48156
5701B2077991L31334J53532k90124k21271J99718K39142p9022k36061K24641M38865
5691B2838745K37057k11845k29316M1662J6613J35855L42855Q6192K19525N9209
5681B3536552J08276R8061q8258R3108j79723K12988K06840J32070j22608J42034
5671B4139340L69358j19012O1377o4944k4632M4619j34405j41160L3934K64854
$$ plain form
5743 20057584 19974117 20287019 20493309 20195432 20184255 19889941 19914102 19987367 20441961 20751251
5733 20751251 20742809 20855172 20837851 20899373 20899642 20797399 20826438 20606508 20659140 20794252 20758649
5722 20758649 20710094 20619467 20735846 20698355 21086178 21272599 21216796 21111709 21146275 21345652
5712 21345652 21346002 21436009 21437574 21316162 21527900 21157216 21403372 21410404 21821235 22226147 22077991
5701 22077991 22409325 22562857 22272733 22051462 22251180 22490322 22411300 22175239 22399880 22838745
5691 22838745 23075802 22863957 22634641 22676303 22692916 22828771 23171626 23257818 23477343 23536552
5681 23536552 23644828 23742889 23654631 23747739 23568016 23781004 23987844 24119914 23997306 24139340
5671 24139340 24508698 24389686 24451063 24386119 24361487 24406106 24271701 24130541 24164475 24429329
5661B4429329M58589K72132r9088k6018j54359J80407R2705j04713M09511J124
5651B5459619l06937K9613j9547k47478Q518J15205l0360o6307J04477J09397
5641B5156200m9957M41422K62428p4742k08109J26577P4867l59933j16957J92044
5631B5443840M2091O8444N5058K41319J33918k33337K36018N4426k40332K84336
5621B6085781K14843J23832K1744k06606k15678K19849j03738j99393L88934L57270
5611B6686838J40571K55647l7491r5802p2628o981O3037J55463J36470J32013
5601B7357137J89786j69014J70410J35676q1818j32712O9340l02001K24732J89562
5591B7651098J23900J46417j01103K34295M4521p1264K5242K65171J12195M5691
$$ plain form
5661 24429329 24887918 25160050 25060962 25034944 24880585 25060992 25153697 25048984 25458495 25459619
5651 25459619 25152682 25182295 25162748 24915270 24923788 25038993 25008633 24942326 25046803 25156200
5641 25156200 25106243 25547665 25810093 25735351 25527242 25653819 25728686 25368753 25251796 25443840
5631 25443840 25485931 25554375 25609433 25850752 25984670 25751333 25987351 26041777 25801445 26085781
5621 26085781 26300624 26424456 26446200 26239594 26023916 26243765 26140027 25940634 26329568 26686838
5611 26686838 26827409 27083056 27045565 26949763 26877135 26870154 26933191 27088654 27225124 27357137
5601 27357137 27546923 27377909 27548319 27683995 27602177 27469465 27538805 27236804 27461536 27651098
5591 27651098 27774998 27921415 27820312 28054607 28099128 28027864 28053106 28318277 28430472 28476163
5581B8476163O2991n7438J30331j43617K9035J98137R0807N1272j32470L41246
5571B9046457j23844j36253M5532P3341O5917L33K76806J60538n5363Q8610K3495
5560B9465569k14718J44025M6522L212L55139J36626j42422K26144K06495K90284
5550C0516876Q8208j25707J40137k8030j03154j96059j720q3509J64476K27899
5540C0599417Q0687J01121J46211m5635L70361M95363j65936J17783M0292N4289
5530C1793953l1345J1569n4723k78120p185J20869J40196M82964J03593J92170
5520C2473941k4987J11865Q0129n6392J42003o814l5382q1855k30577K77105J00965
5509C2750001K39901R9249M70691J84044j29973K18545q535P6640O7861J16834
$$ plain form
5581 28476163 28539154 28481716 28612047 28468430 28497465 28695602 28786409 28837681 28705211 29046457
5571 29046457 28922613 28786360 28831892 28905233 28971150 28971483 29248289 29408827 29353464 29442074 29465569
5560 29465569 29250851 29394876 29441398 29444610 29799749 29936375 29793953 30020097 30226592 30516876
5550 30516876 30605084 30479377 30619514 30591484 30488330 30292271 30290551 30207042 30371518 30599417
5540 30599417 30680104 30781225 30927436 30881801 31252162 31747525 31581589 31699372 31739664 31793953
5530 31793953 31762608 31774177 31719454 31441334 31434149 31555018 31695214 32178178 32281771 32473941
5520 32473941 32448954 32560819 32640948 32584556 32726559 32719745 32684363 32602508 32371931 32649036 32750001
5509 32750001 32989902 33089151 33559842 33743886 33613913 33832458 33823923 33900563 33968424 34085258
5499C4085258K8731j96425j55554j95720k03956J17719K80859L67807M22544K41650
5489C4792913K22753J12813J43671o6518m7393J27400J36624O4457o7541k2488
5479C5396691J54434K27887J37596J60267K40996l5090J48673L4618k77700L00464
5469C6488836o4309K27895r2496j42033l27265L35427K73449K09218J20052L36202
5459C7364976N9377J00275L2126J44633K75761M3542l79636l09295o1802M08389
5449C7678346j59481m1059K61784n2692J83824M82861K25446m7122R1175j43994
5439C8479088k3615p1773K22232L86l45230k40994K02936J49480n921J57957J57360
5428C8681906L11355M48566P0549J2984j4075m7799m34992n9324L8756K69132
$$ plain form
5499 34085258 34113989 33917564 33762010 33566290 33362334 33480053 33760912 34128719 34551263 34792913
5489 34792913 35015666 35128479 35272150 35205632 35158239 35285639 35422263 35486720 35419179 35396691
5479 35396691 35551125 35779012 35916608 36076875 36317871 36282781 36431454 36466072 36188372 36488836
5469 36488836 36424527 36652422 36559926 36417893 36090628 36426055 36699504 36908722 37028774 37364976
5459 37364976 37424353 37524628 37556754 37701387 37977148 38020690 37641054 37331759 37269957 37678346
5449 37678346 37518865 37477806 37739590 37686898 37870722 38353583 38579029 38531907 38623082 38479088
5439 38479088 38455473 38383700 38605932 38606318 38261088 38020094 38223030 38372510 38366589 38524546 38681906
5428 38681906 38993261 39441827 39512376 39525360 39511285 39463486 39028494 38969170 39007926 39277058
5418C9277058r8222J6195j5568L35158M62897L03895K96378k76088P919j03989
5408D0205633r4319K5216J31761j40135o0554j51482J94573N9348l369L04340
5398D0471012p7018L15002K17419J02397K50478k36460j72231N1273o2208K8901
5388D0888565p2965K57583k5228q040q6567K96015P3510J19804M90916L14996
5378D2248589k13389k87617J48139j23122j05869K17110L7263j16899J67993m1868
5368D1930330j32120J72421L12508J38790J91106N690J17431K08406l62631j12191
5358D2469740k76972L4831K57643j40412L10762L01632l90585q7705J90722k02076
5348D2467580K76219K03685M9403L4456J53366r5584J56100O0084k3349Q7277
$$ plain form
5418 39277058 39178836 39195031 39179463 39514621 39977518 40281413 40577791 40301703 40309622 40205633
5408 40205633 40111314 40136530 40268291 40128156 40067602 39916120 40110693 40170041 40166672 40471012
5398 40471012 40393994 40708996 40926415 41028812 41279290 41042830 40870599 40921872 40859664 40888565
5388 40888565 40815600 41073183 41047955 41039915 40953348 41249363 41322873 41442677 41933593 42248589
5378 42248589 42035200 41747583 41895722 41772600 41666731 41883841 41921104 41804205 41972198 41930330
5368 41930330 41798210 41970631 42283139 42421929 42613035 42618725 42736156 42944562 42581931 42469740
5358 42469740 42192768 42227599 42485242 42344830 42655592 42957224 42566639 42478934 42669656 42467580
5348 42467580 42743799 42947484 42996887 43031343 43184709 43089125 43245225 43305309 43281960 43369237
5338D3369237k58920J15301j86589R9417R6119N9964K34033R9741j21728j22771
5328D3383804P3051r7294k909M1936K93086R0883J88451j08505r0317j99530j96487
5317D3376169j03711r5554J58872K51528J56282L5090L83867K7765j43967K78310
5307D4324651k9638l16395o0464p1308j20212k04058L11688K92827J16074j2998
5297D4230167j11635K96815K9669K30302K62431L8938j78152J35238l8091k26931
5287D4668751r3327L1050q7090J50266M00427J88761j0475l3199K10707k5172
5277D5400699k85361l953J24434q1170K760m96189l33877J24687l1914l34224
5267D4085892L69660K75217P9867n5281k2579k11069J46885k14467n67446j12398
$$ plain form
5338 43369237 43110317 43225618 43039029 43138446 43234565 43294529 43528562 43628303 43506575 43383804
5328 43383804 43456855 43359561 43356652 43398588 43691674 43782557 43971008 43862503 43772186 43572656 43376169
5317 43376169 43272458 43176904 43335776 43587304 43743586 43778676 44162543 44190308 44046341 44324651
5307 44324651 44295013 43978618 43918154 43846846 43726634 43522576 43834264 44127091 44243165 44230167
5297 44230167 44118532 44415347 44445016 44675318 44937749 44976687 44798535 44933773 44895682 44668751
5287 44668751 44575424 44606474 44519384 44669650 45070077 45258838 45248363 45215164 45425871 45400699
5277 45400699 45115338 45111385 45235819 45154649 45157409 44661220 44327343 44452030 44420116 44085892
5267 44085892 44455552 44730769 44810636 44755355 44732776 44521707 44668592 44454125 43886679 43774281
5257D3774281j18265k52988j55328K94421K04750M8535L66326J16768l0320j03015
5247D4145165l81888j27870k28672p5492Q9621j7223Q2634k80667N3788J77114
5237D3436510q9739K0830k68429J96745j8746J63029m5542q8753p0848J36607
5227D3371664j59402n98195k91245J60205K82847K13333K64703M37101K07433
5218D3888444j04316j60231n02233p2053l05400k96894R9751N9004L03040J02200
5208D3011312K01007L1186j06430K54445J78962l64001o623j7030k10259J4411
5198D2986980m01646l02814P4818K78122j46667q5270K44373J2069J77356J18497
5188D2955818M4666n7220l19233o1916k55149k00086J22257l52721j92179J54129
$$ plain form
5257 43774281 43656016 43403028 43247700 43542121 43746871 43795406 44161732 44278500 44248180 44145165
5247 44145165 43763277 43635407 43406735 43331243 43420864 43403641 43486275 43205608 43259396 43436510
5237 43436510 43346771 43367601 43099172 43295917 43277171 43440200 43394658 43305905 43235057 43371664
5227 43371664 43212262 42614067 42322822 42483027 42765874 42979207 43243910 43681011 43888444
5218 43888444 43784128 43623897 43121664 43049611 42744211 42447317 42547068 42606072 42909112 43011312
5208 43011312 43212319 43243505 43137075 43391520 43570482 43206481 43199858 43182828 42972569 42986980
5198 42986980 42585334 42282520 42357338 42635460 42488793 42403523 42647896 42659965 42837321 42955818
5188 42955818 43000484 42943264 42624031 42562115 42306966 42106880 42229137 41876416 41684237 41838366
5178D1838366N7809k40539N6763O5739N3594K98044K33138j20419P8648J4994
5168D2336137k18796j62553j72858k99599j36596n7153K34851K84072J25327K89976
5158D2222808j12039j47855k12466K5028j67235J08753l17180J16948Q2775k34864
5148D1364673M0278k11193P0508n4314M0534j42782k4360K88329j10183J93525
5138D1455015J42776k68754l55153J42252k32158n18405k42722K22354L87569
5129D0732774J41061J25766k0859j13822j73760r6736q376O2031J58544j08068
5119D0698555J71394K66964J7815J62719q3868k56491j34889J6165k28500j0345
5109D0619519O8168K29405o3167j78976L31933O2078P9426L819K8142p9934L4822
$$ plain form
5178 41838366 41896175 41655636 41712399 41778138 41831732 42129776 42362914 42242495 42321143 42336137
5168 42336137 42117341 41954788 41781930 41482331 41345735 41288582 41523433 41807505 41932832 42222808
5158 42222808 42110769 41962914 41750448 41775476 41608241 41716994 41399814 41516762 41599537 41364673
5148 41364673 41404951 41193758 41264266 41209952 41250486 41107704 41083344 41371673 41261490 41455015
5138 41455015 41597791 41329037 40973884 41116136 40883978 40365573 40122851 40345205 40732774
5129 40732774 40873835 40999601 40978742 40864920 40691160 40594424 40586048 40648079 40806623 40698555
5119 40698555 40869949 41136913 41154728 41317447 41233579 40977088 40842199 40858364 40629864 40619519
5109 40619519 40687687 40917092 40853925 40674949 41006882 41068960 41148386 41152205 41180347 41100413 41135235
5098D1135235Q6002j94796k58718k2081k19320j83409q5626J31327L18742J3424
5088D0720780J64002J29383r4270J54630J65352l56078p5797J08114k14575p9283
5078D0622258P6102l0525j47378o2753M71376J64439n9349K21071K30739m9817
5068D1436163J66738J94647J03162J0209m30996k60063j03924J44948L23571J3264
5058D1597719o5383L22087q8721J45228J47469k40594J20070N4226K86916o1952
5048D2217065o8421P6080m7819J07410l7643l1428L69079M9510K39389J35366
5038D3008588J90247O2594J43746J28117l3360n7247j41131p5346K11683L30450
5028D3768341L32399O8667M56565L77986M9277p8920k20067L6914K4248K04534
$$ plain form
5098 41135235 41221237 41026441 40767723 40745642 40526322 40342913 40257287 40388614 40707356 40720780
5088 40720780 40884782 41014165 40919895 41074525 41239877 40883799 40808002 40916116 40701541 40622258
5078 40622258 40698360 40667835 40520457 40457704 40929080 41093519 41034170 41255241 41485980 41436163
5068 41436163 41602901 41797548 41900710 41910919 41479923 41219860 41115936 41260884 41584455 41597719
5058 41597719 41532336 41854423 41765702 41910930 42058399 41817805 41937875 41992101 42279017 42217065
5048 42217065 42148644 42224724 42176905 42284315 42246672 42215244 42584323 42633833 42873222 43008588
5038 43008588 43198835 43261429 43405175 43533292 43499932 43442685 43301554 43226208 43437891 43768341
5028 43768341 44100740 44169407 44625972 45003958 45053235 44974315 44754248 44791162 44815410 45019944
5018D5019944j59071M64873L82936K02819J39955J57096K5058J58971J28962J6449
5008D6537992m9029j51058L33576L95598j04655K6657M96469L74052L42016m0834
4998D8160784J68362K55048J53322m9273L60112L48286j74033j32091l10218N855
4988D8786154M70839J27499K33550K01868O72J12370L29817K13146Q191K91672
4978E0775778P0608J9499P7663k77983k80597K8379K57716J66843K29797K07412
4968E1275115K18706K29581J13948L0285J28857J89845l4310O5866K2124k6420
4958E2213597J6256N3170k64538j3219L3668N79869N75636R4685N7003l05428
4948E3040699k18516j06680J78844J81494k12596L5801Q9647k4441m4146J30849
$$ plain form
5018 45019944 44860873 45325746 45708682 45911501 46051456 46208552 46233610 46392581 46521543 46537992
5008 46537992 46488963 46337905 46671481 47067079 46962424 46989081 47485550 47859602 48201618 48160784
4998 48160784 48329146 48584194 48737516 48688243 49048355 49396641 49222608 49090517 48780299 48786154
4988 48786154 49256993 49384492 49618042 49819910 49820582 49932952 50262769 50475915 50484106 50775778
4978 50775778 50846386 50865885 50943548 50665565 50384968 50413347 50671063 50837906 51067703 51275115
4968 51275115 51493821 51723402 51837350 51867635 51996492 52186337 52152027 52217893 52240017 52213597
4958 52213597 52229853 52283023 52018485 52005266 52038934 52618803 53194439 53289124 53346127 53040699
4948 53040699 52822183 52715503 52894347 53075841 52863245 52899046 52988693 52964252 52920106 53050955
4938E3050955K05251J40046m1775j55816l08322p8215j27274M15J13835Q9070
4928E2888170J33929J82406m5731j75335j82033M82411K40758l50794l14776k31537
4918E2627468q4597k58812L1162k46381J05785J20611j93383J1758n2996J79557
4908E2240172Q2414K13515m4041j89464j90162l83207k36120k42500l57733q6613
4898E0806261l394n310Q041L06257J35877j10563Q7579m6955N2932k2622j03627
4887E1104476j15751k23011m48357m297j64128q547r3386J51655L72459O6909
4877E0638022L44243M37543Q0123k88866j30414l01832k52028k9331Q2599k54102
4867E0325957p6305L14367k4104K46284L82116M8343J7518q9991k2794K0333L56195
$$ plain form
4938 53050955 53256206 53396252 53354477 53198661 52890339 52812124 52684850 52685265 52799100 52888170
4928 52888170 53022099 53204505 53158774 52983439 52801406 53283817 53524575 53173781 52859005 52627468
4918 52627468 52542871 52284059 52315221 52068840 52174625 52295236 52101853 52113611 52060615 52240172
4908 52240172 52322586 52536101 52492060 52302596 52112434 51729227 51493107 51250607 50892874 50806261
4898 50806261 50802867 50797557 50805598 51111855 51247732 51137169 51224748 51177793 51230725 51208103 51104476
4887 51104476 50988725 50765714 50317357 50313060 50148932 50140385 50046999 50198654 50571113 50638022
4877 50638022 50982265 51419808 51499931 51211065 51080651 50778819 50526791 50497460 50580059 50325957
4867 50325957 50249652 50564019 50539915 50786199 51168315 51216658 51234176 51144185 51121391 51141724 51497919
4856E1497919j22960Q2826j40412j97105k08260J0562K98041r076M28632K25078
4846E1865245L00976L29012J11161o5368k5723j67323J75262k1162J51738J55579
4836E2809397J56982l7856K60691L48480M91395K60084J71895K97047L78896J2562
4826E5149573J55679J91431n0118K18976K09045L69286M13278K06661M65954P80860
4816E8110625O20666K01354M81081J26548L15041r2362P0166K08627K97013K90698
4806F0629457K95883L2565J11733L2880K03471J43757M8019K74552M31566K21539
4796F2425422l31665J53947J18037J18030J66605L28628j40392q1018L43227O04825
4786F3705646O50712O23978K5572K29219J995r3741K57347R7826o4905K46308
$$ plain form
4856 51497919 51374959 51457785 51317373 51120268 50912008 50922570 51220611 51211535 51640167 51865245
4846 51865245 52166221 52495233 52606394 52541026 52515303 52347980 52523242 52502080 52653818 52809397
4836 52809397 52966379 52928523 53189214 53537694 54029089 54289173 54461068 54758115 55137011 55149573
4826 55149573 55305252 55496683 55446565 55665541 55874586 56243872 56657150 56863811 57329765 58110625
4816 58110625 58731291 58932645 59413726 59540274 59855315 59762953 59833119 60041746 60338759 60629457
4806 60629457 60925340 60957905 61069638 61102518 61305989 61449746 61497765 61772317 62203883 62425422
4796 62425422 62093757 62247704 62365741 62483771 62650376 62979004 62838612 62757594 63100821 63705646
4786 63705646 64356358 64980336 65005908 65235127 65237122 65143381 65400728 65498554 65433649 65679957
4776F5679957n2595m1991k07560J54024J13963J08352j28666P5358K47738K8754
4766F5977334j06711j89889j86544j61851j29493k10776m4853j80600n5062L63847
4756F5075402j05352l7624j20048J5098J23994r2842r5584J08913l24456l5383
4746F4512118j52439K24787J12497J80523O2801L609l56878J6075K2260J72307
4736F4797660l45278m55953j91607o64172n64761m89692k89669m81273k00638
4727F1114617m87504l70248r6847l71546n93036m26374l37208l70404n28095l10754
4717E7222601k84755n12100k54953q6022o1443l05456l57023k11376j31920m16269
4707E4601284m75589k040m14952l7116j46020p6489p2237j02611o87791l4825
$$ plain form
4776 65679957 65627362 65585371 65377811 65531835 65645798 65754150 65625484 65700842 65948580 65977334
4766 65977334 65870623 65680734 65494190 65332339 65202846 64992070 64947217 64766617 64711555 65075402
4756 65075402 64970050 64932426 64812378 64827476 64951470 64858628 64763044 64871957 64547501 64512118
4746 64512118 64359679 64584466 64696963 64877486 64940287 64943896 64587018 64603093 64625353 64797660
4736 64797660 64452382 63996429 63804822 63140650 62575889 62086197 61796528 61315255 61114617
4727 61114617 60627113 60256865 60160018 59788472 59195436 58769062 58431854 58061450 57533355 57222601
4717 57222601 56937846 56425746 56170793 56084771 56023328 55717872 55360849 55149473 55017553 54601284
4707 54601284 54125695 54123655 53708703 53671587 53525567 53449078 53376841 53274230 52586439 52551614
4697E2551614r3346l505k60248J75297l28865k83065j74324j04422j90819k88055
4687E1000262j46678p5212j43079q9713K50207j42698l56335l60563P6715m04640
4677D9608266k61749N0755l93663k09474j27786q2105k76370k55318l60428k77130
4667D7414998j46533L8010j83214n8747J31003o2261k30233m71036j33458k84181
4657D6014348p3031j05999n71322j56930p1020m46887k5974k996P5056o8252j72494
4646D4394499q4154r8283j87402j53949k80017j17250k34274m94789j56678r5918
4636D2491785l9835n0112l45066j11871R0468j88182j3894j83732l92366j31984
4626D1125211j18583J7577k15877j67783l50293l00533K6622l69043j84546J6231
$$ plain form
4697 52551614 52458268 52454763 52194515 52369812 52040947 51757882 51583558 51479136 51288317 51000262
4687 51000262 50853584 50778372 50635293 50545580 50795787 50653089 50296754 49936191 50012906 49608266
4677 49608266 49346517 49397272 49003609 48794135 48666349 48584244 48307874 48052556 47692128 47414998
4667 47414998 47268465 47306475 47123261 47064514 47195517 47133256 46903023 46431987 46298529 46014348
4657 46014348 45941317 45835318 45263996 45107066 45036046 44589159 44563185 44560189 44635245 44566993 44394499
4646 44394499 44310345 44212062 44024660 43870711 43590694 43473444 43239170 42744381 42587703 42491785
4636 42491785 42451950 42401838 42056772 41944901 42035369 41847187 41833293 41649561 41257195 41125211
4626 41125211 41006628 41024205 40808328 40640545 40290252 39989719 40016341 39647298 39462752 39478983
4616C9478983p0976J32081N2316k58684k12210l22724J64349j26132l60193l59714
4606C8117096o28281K39370l97888n4057K36400J01861k55498J80141l90024J377
4596C7150497j07114m06304J0895k28020o7997o2733P911m28947n2090j31527
4586C5684571k79194k80109n3555L3393j94882j70565L3884j96352j28738J81871
4576C4630324m27587l75039j38705j21202j06115j38336r486j66584p8539j61569
4566C2907162J30490n1372l30522j87620j81519P200k23040j17389j43219o2920
4556C1747251L2178k10699K6199k5090m11277j72921K87090o6568m56779m8488
4546C0700896k85043n0158J61549j64343k13597m4769J85276j97691o238o2390
$$ plain form
4616 39478983 39408007 39540088 39592404 39333720 39121510 38798786 38963135 38837003 38476810 38117096
4606 38117096 37488815 37728185 37330297 37276240 37512640 37614501 37359003 37539144 37149120 37150497
4596 37150497 37043383 36637079 36647974 36419954 36351957 36289224 36297135 35868188 35816098 35684571
4586 35684571 35405377 35125268 35071713 35105106 34910224 34739659 34773543 34577191 34448453 34630324
4576 34630324 34202737 33827698 33688993 33567791 33461676 33323340 33313854 33147270 33068731 32907162
4566 32907162 33037652 32986280 32655758 32468138 32286619 32293819 32070779 31953390 31810171 31747251
4556 31747251 31779429 31568730 31594929 31569839 31158562 30985641 31272731 31206163 30749384 30700896
4546 30700896 30415853 30365695 30527244 30362901 30149304 30104535 30289811 30092120 30085882 30023492
4536C0023492l3148j51368j41998K42513J26818l35931l66754k80801p453M9789
4526B9125159K5716k6854J89366l6041m8859k55061j70645k41948k45168k29930
4516B8085735k19826k64856k33685Q83O2735j08453k30020j44082m22550j10828
4506B6415053J28064J05846q2448K96463k213l56030K1354l55713m33330P092
4496B5744138n5803k13503j11682J41389l1764J35529m4750J53786p9052k35812
4486B5402476j86918j70018l19168J21595m416j62031l6937j47251n522l0073
4476B4461737j07202l2314p966J85382R5719l4112L76102k06704k00781k38275
4466B4291586R166Q1013j38502J23089K31420j17899k22467L38915O5534k74843
$$ plain form
4536 30023492 29990344 29838976 29696978 29939491 30066309 29730378 29363624 29082823 29075370 29125159
4526 29125159 29150875 29124021 29313387 29277346 29228487 28973426 28802781 28560833 28315665 28085735
4516 28085735 27865909 27601053 27367368 27368251 27430986 27322533 27092513 26948431 26525881 26415053
4506 26415053 26543117 26648963 26566515 26862978 26860765 26504735 26526089 26170376 25737046 25744138
4496 25744138 25688335 25474832 25363150 25504539 25472775 25608304 25563554 25717340 25638288 25402476
4486 25402476 25215558 25045540 24726372 24847967 24843551 24681520 24644583 24497332 24491810 24461737
4476 24461737 24354535 24322221 24314255 24499637 24595356 24561244 24937346 24730642 24529861 24291586
4466 24291586 24300752 24381765 24243263 24366352 24597772 24479873 24257406 24596321 24661855 24387012
4456B4387012J80187K6795J41493K43734J25828J9248j67347K02756o4080l33647
4446B4761979k16645J55305J52409J93491L57516K9168L79206R9239k06343o2748
4436B5642577J43285j33516N7175n3365K57877L01386J72414m1572p0664K02680
4426B6478277M3681J53694J51782J50464J16055N31933L83334L97491J74098k99395
4416B8281414L5073N90732L38926K66088K44517J77030M70241O56873Q77322N22189
4406C2460405O58317N79844L37267P97634N68322O49234J181589J067117J040928
4397C9340657J480739J260611J409876J367900J376619J399467J385253J319463
4389E0340585J325120J311259J407604J236470J274799J372302R67580P71456
$$ plain form
4456 24387012 24567199 24593994 24735487 24979221 25105049 25124297 24956950 25159706 25095626 24761979
4446 24761979 24545334 24700639 24853048 25046539 25404055 25433223 25812429 25911668 25705325 25642577
4436 25642577 25785862 25652346 25709521 25656156 25914033 26215419 26387833 26346261 26275597 26478277
4426 26478277 26521958 26675652 26827434 26977898 27093953 27625886 28009220 28406711 28580809 28281414
4416 28281414 28316487 28907219 29246145 29512233 29756750 29933780 30404021 31060894 31938216 32460405
4406 32460405 33118722 33698566 34035833 34833467 35401789 36051023 37232612 38299729 39340657
4397 39340657 40821396 42082007 43491883 44859783 46236402 47635869 49021122 50340585
4389 50340585 51665705 52976964 54384568 55621038 56895837 58268139 59235719 60007175
4381F0007175P85099R63565O38324K11177P3687M04971k08742n58304n77947n35139
4371F1203866r78687j115452j099183j307995j544019j371810j173541j356440
4363E1256739j196230j456735j639933j258097j490741j689662j791919j477514
4355C9255908j424988j460038j322023j070190r06821j031341p28084j128682
4347C0183741q01839p51549o58367o76998j022501m15274m23195m89592m89407
4338B4455019n45883m55417n24560k43993l73507n65948k77190k71555l01876
4329B0895090m46280m13589j36447O4732j03949j78818j36830l18677j46418k24085
4319A8854729j56751K4917l97412o8865j07327l12066K6056m04537O7258j72352
$$ plain form
4381 60007175 60792274 61755839 62394163 62605340 62679027 63083998 62875256 62316952 61739005 61203866
4371 61203866 60225179 59109727 58010544 56702549 55158530 53786720 52613179 51256739
4363 51256739 50060509 48603774 46963841 45705744 44215003 42525341 40733422 39255908
4355 39255908 37830920 36370882 35048859 33978669 33071848 32040507 31312423 30183741
4347 30183741 29381902 28630353 27971986 27294988 26272487 25857213 25434018 24944426 24455019
4338 24455019 23909136 23453719 22929159 22685166 22311659 21745711 21468521 21196966 20895090
4329 20895090 20448810 20035221 19898774 19963506 19859557 19680739 19543909 19225232 19078814 18854729
4319 18854729 18697978 18722895 18325483 18256618 18149291 17837225 17863281 17458744 17526002 17353650
4309A7353650k28450q7416j72789O039L8085k88986k69455O1518K39197j19773
4299A6531620k37321O7696k65578j57654M3575k42434J16596j21452m1718j52468
4289A5540862j96868R8731l95859K95893J19911m37838J62509k2944j63795J08103
4279A5108705K63714o7803l33829j31504k07702k58782k254k57429K08955k1428
4269A4300643j45147k13542m45477r2911J62818j10759k63305L9393K7862L12995
4259A3572570k11146j44901k15514j43650j29352j52577Q0755J14794l9330l13893
4249A2417756j02281K54622N7502k22636o6203J98659j96795n11973n9752J10417
4239A1879316K6943j12029K52652j41819K149k01053O2766j9185k79105J59311
$$ plain form
4309 17353650 17125200 17037784 16864995 16871034 16909119 16620133 16350678 16412196 16651393 16531620
4299 16531620 16294299 16361995 16096417 15938763 15982338 15739904 15856500 15735048 15693330 15540862
4289 15540862 15343994 15442725 15046866 15342759 15462670 15024832 15187341 15164397 15000602 15108705
4279 15108705 15372419 15304616 14970787 14839283 14631581 14372799 14370545 14113116 14322071 14300643
4269 14300643 14155496 13941954 13496477 13403566 13566384 13455625 13192320 13231713 13259575 13572570
4259 13572570 13361424 13216523 13001009 12857359 12728007 12575430 12656185 12770979 12731649 12417756
4249 12417756 12315475 12570097 12627599 12404963 12338760 12537419 12340624 11828651 11768899 11879316
4239 11879316 11906259 11794230 12046882 11905063 11907212 11706159 11768925 11749740 11470635 11629946
4229A1629946k48624L12865j90043q6945j50831M657Q6039j07663j30819L26441
4219A1445023P1570m6792l2039k65610P5827K38534q976j42339k42061k9993k74446
4208A0788698k27293j93381L02950J30725J16484j0574J22174J16428K67535L0061
4198A1443807k59182k31654r1643n1511m15380O5788J39942L40855J01565P9661
4188A1122248j27374P1782q179J81255k86667n0109j2773J35970j79703P0780
4178A0917230J97405m4838j14831M4272J55768k59354J68072r9636R220J88169
4168A1161477l7802l0558j02859k31591O2919k12407J34897K43274P2691k4386
4158A1035655J51178L60947l37712m07689P6814K66452j11931J28641j62785j32845
$$ plain form
4229 11629946 11381322 11694187 11504144 11417199 11266368 11271025 11357064 11249401 11118582 11445023
4219 11445023 11516593 11469801 11437762 11172152 11247979 11486513 11477537 11335198 11093137 11063144 10788698
4208 10788698 10561405 10368024 10670974 10801699 10918183 10907609 11029783 11146211 11413746 11443807
4198 11443807 11184625 10952971 10861328 10809817 10394437 10460225 10600167 10941022 11042587 11122248
4188 11122248 10994874 11066656 11058477 11239732 10953065 10902956 10890183 11026153 10846450 10917230
4178 10917230 11114635 11069797 10954966 10999238 11155006 10895652 11063724 10964088 10973308 11161477
4168 11161477 11123675 11093117 10990258 10758667 10821586 10609179 10744076 10987350 11060041 11035655
4158 11035655 11186833 11547780 11210068 10802379 10879193 11145645 11033714 11162355 10999570 10866725
4148A0866725J85045k90105J67047K09520L908L82143L3337K88312L17311l829
4138A2159414l06643j22522j28457j91660J01883J98096q3176L28495K12326o4886
4128A2102870J12841K42810K77171j21447J1214M0447j09881K7387R3849n9406
4118A2617855M80732J38761K9234p2000K03839J28818J04551K01792Q2139K98412
4108A4214133Q8190J96544l0312L5453O304K32708K42450K78172K20550R0795
4098A5574987L01753O13040R8741j59226R2426L59321M83789q8071K04129L90366
4088A7871255K11095L61989J98163N61855L87949K40772J64034N00831L24447
4079B0822390L32036M90156L69576N74566J85273M02164M30572N95367N55343
$$ plain form
4148 10866725 11051770 10761665 10928712 11138232 11142140 11524283 11557620 11845932 12163243 12159414
4138 12159414 11852771 11730249 11601792 11410132 11512015 11710111 11626935 11955430 12167756 12102870
4128 12102870 12215711 12458521 12735692 12614245 12625459 12665906 12556025 12583412 12677261 12617855
4118 12617855 13098587 13237348 13266582 13194582 13398421 13527239 13631790 13833582 13915721 14214133
4108 14214133 14302323 14498867 14468555 14504008 14510312 14743020 14985470 15263642 15484192 15574987
4098 15574987 15876740 16489780 16588521 16429295 16521721 16881042 17364831 17276760 17480889 17871255
4088 17871255 18082350 18444339 18642502 19204357 19592306 19833078 19997112 20497943 20822390
4079 20822390 21154426 21644582 22014158 22588724 22773997 23176161 23606733 24202100 24757443
4070B4757443N46516Q59761M30350L53898N12531L49476N48656P05087O89772
4061B9753490J26659N18907N13108O05712N47035N55608N76312P79828R29422
4052C4906081K28988M01285R31833N79491O62178O41691P04900O67955Q37024
4043D0561426J063617P18906J216704J246608R77154J059558J192743J204016
4035D9240732J192998J156306J166481J340500J468070J297860J554487J674577
4027F0092011K077396J770126J841361J861910J877231K190160K386763K235970
4019G6332928K711763K688962K736482K684197L199140L453160L652127L936059
4011A01394818L779509M353456M602883N119435N886425O253918O654205Q014276
$$ plain form
4070 24757443 25303959 26163720 26594070 26947968 27460499 27809975 28358631 29063718 29753490
4061 29753490 29880149 30399056 30912164 31517876 32064911 32620519 33196831 33976659 34906081
4052 34906081 35135069 35536354 36468187 37047678 37709856 38351547 39056447 39724402 40561426
4043 40561426 41625043 42343949 43560653 44807261 45784415 46843973 48036716 49240732
4035 49240732 50433730 51590036 52756517 54097017 55565087 56862947 58417434 60092011
4027 60092011 62169407 63939533 65780894 67642804 69520035 71710195 74096958 76332928
4019 76332928 79044691 81733653 84470135 87154332 90353472 93806632 97458759 101394818
4011 101394818 105174327 109527783 114130666 119250101 125136526 131390444 138044649 146058925
4003A46058925Q859085J0387191J2018371J2624341J3360817J5363407J5874716
3996B34546853J5350245J2742064R973813O551181J009799m996939r231039j1970974
3988B53975003j3006108j4031579j4552130j4336529j3170807j1827762j1151562
3981A61898526r906080q515332p839322p992140p233824o699343o394803o128839
3973A01188843n225870m548207m292545l798698l681079l144101k851484k533649
3965G1113210k525200k633878k535061k530403k513432k124482j964228k027870
3957E2258656j922648j731964j718990j648368j239867j519989j165314j068840
3949D0242676r33251r20534p25176j050980r96801j241340j122430r60900p50635
$$ plain form
4003 146058925 154918010 165305201 177323572 189947913 203308730 218672137 234546853
3996 234546853 249897098 262639162 272612975 279164156 280173955 275177016 265945977 253975003
3988 253975003 240968895 226937316 212385186 198048657 184877850 173050088 161898526
3981 161898526 151992446 143477114 135637792 127645652 120411828 113712485 107317682 101188843
3973 101188843 95962973 91414766 87122221 83323523 79642444 76498343 73646859 71113210
3965 71113210 68588010 65954132 63419071 60888668 58375236 56250754 54286526 52258656
3957 52258656 50336008 48604044 46885054 45236686 43996819 42476830 41311516 40242676
3949 40242676 39309425 38388891 37663715 36612735 35615934 34374594 33252164 32291264 31540629
3940C1540629p98007m50623m09361o10932m28949o37713k40224o74517l97410
3931B6892893n51171n56038k68497n87207p49935o77692l29569k64604j50903
3922B2757277j92973l60051k16910k6819l61752l11415k67126o20657q30335l71869
3912A9197370l44804n20945k88896l29576K09234l0719k25146l08239j16318k7145
3902A7214816k08907K53963n58437n09181m39095k86105k60729m12968J1522O1213
3892A4866092r8867j51450k0065R3264q729k74739j94507j43016k01809k61719
3882A3604455n29156j56687j78493O4761K91153N425Q7928k09912P4213O3144
3872A3116831j77437m2858l04186k98563k40752Q0853o0558o0687k40917m65829
$$ plain form
3940 31540629 30742622 30291999 29882638 29271706 28842757 28205044 27964820 27290303 26892893
3931 26892893 26341722 25785684 25517187 24929980 24180045 23502353 23172784 22908180 22757277
3922 22757277 22564304 22204253 21987343 21960524 21598772 21287357 21020231 20399574 19569239 19197370
3912 19197370 18852566 18331621 18042725 17713149 17922383 17891664 17666518 17358279 17241961 17214816
3902 17214816 17005909 17259872 16701435 16192254 15753159 15467054 15206325 14793357 14804879 14866092
3892 14866092 14767225 14615775 14595710 14688974 14680245 14405506 14210999 14067983 13866174 13604455
3882 13604455 13075299 12918612 12740119 12804880 13096033 13101458 13189386 12979474 13053687 13116831
3872 13116831 12939394 12896536 12592350 12293787 12053035 12133888 12073330 12012643 11771726 11305897
3862A1305897j30729J15393K06399L90470L92207j63873j42565J18649j20081
3853A1971767k33514n53844m01487j8790r315J49330J11819K52625J82797K39118
3843A1690506J837k4715J7844o2514k95085l20715j23243J4100O5598j77057k96980
3832A0489576K35991K22053P0240L27664J46087K08307Q5051j87258l08128m51800
3822A0837783k66158l50466j83783N3491O8563j91906K9761m2876J87794J6327
3812A0158530K308j7906k81090l2753j84816l49396J35034k19383n61025r3331
3802H556172j83975j40682k3391N4115L06247M91865J58013O6290M6369k41874
3792I089149m02372n38282j17539k37048m9609k40547J86065L83891J60122K14637
$$ plain form
3862 11305897 11175168 11290561 11496960 11887430 12279637 12115764 11973199 12091848 11971767
3853 11971767 11738253 11184409 10782922 10764132 10754817 10904147 11015966 11268591 11451388 11690506
3843 11690506 11692343 11667628 11685472 11622958 11327873 11007158 10883915 10898015 10963613 10786556 10489576
3832 10489576 10725567 10947620 11017860 11345524 11491611 11699918 11784969 11597711 11289583 10837783
3822 10837783 10571625 10221159 10037376 10090867 10159430 9967524 9997285 9954409 10142203 10158530
3812 10158530 10160838 10142932 9861842 9829089 9644273 9294877 9429911 9210528 8649503 8556172
3802 8556172 8372197 8231515 8208124 8262239 8568486 9060351 9218364 9284654 9331023 9089149
3792 9089149 8686777 8148495 8030956 7793908 7744299 7503752 7689817 8073708 8233830 8448467
3782H448467j67185l13224j23553J39579l59893m6896R5737j48612K4714L52351
3772G901485l9270k28197k4538K19256k33475n4633J04922L18804L9481q8919
3762G914916O2864j14603l31348m5120M184R3140J61474N6815J23921R7508M09456
3751H433207n924j56512j59294j4593O007k61843j65889K72808j02916q3530N61827
3740H323348J31082J16105K46162o5393K17078j18164j65288O1845O7166j43325
3730H670616j43826q6847K24270K63535K72548L09755K41642o4682R8863N2354
3720I838228p5694R1230j31073j3544J26871M46997K09432o0947K19835J57147
3710A0808482j64458L95187M65387L43144j44537L09642K02840m5847Q9293Q8709
$$ plain form
3782 8448467 8281282 7968058 7844505 7984084 7624191 7577295 7673032 7524420 7549134 7901485
3772 7901485 7862215 7634018 7609480 7828736 7595261 7540628 7645550 7964354 8003835 7914916
3762 7914916 7977780 7863177 7531829 7486709 7490893 7584033 7745507 7802322 7926243 8023751 8433207
3751 8433207 8427283 8270771 8111477 8096884 8102891 7841048 7675159 7947967 7845051 7761521 8323348
3740 8323348 8454430 8570535 8816697 8751304 8968382 8850218 8684930 8746775 8813941 8670616
3730 8670616 8526790 8439943 8664213 8927748 9200296 9510051 9751693 9687011 9785874 9838228
3720 9838228 9762534 9853764 9722691 9709147 9836018 10283015 10492447 10431500 10651335 10808482
3710 10808482 10644024 11039211 11504598 11847742 11703205 12012847 12215687 12169840 12259133 12347842
3700A2347842k51080k69000K49108J81943J44319L43135L46964k908N0938j25614
3690A3015647j54303L9269K2319J19795K19719Q2426K23461N28394M17683m1473
3680A4472937k4418J48519J7710m487K12614L84439M62968m6600J22642N49448
3670A6295772M1009K78183M20323K67121K40545L11922L84318O45102L58929O414
3660A9249638P5157r6799M1340J02095K55089N4625N36812L69412J95469K82804
3650B1065642K17808N70372L50713J16657K1863n104N7355K28421K77058J59176
3640B3059961J52934N2770J3445M41276N48773M20891L69483K61647L47772K37683
3630B5906635k1733O57L93010L12753L88735L93057M72289O25945O71203O42086
$$ plain form
3700 12347842 12096762 11827762 12076870 12258813 12403132 12746267 13093231 13090323 13141261 13015647
3690 13015647 12861344 12900613 12922932 13042727 13262446 13344872 13568333 14096727 14514410 14472937
3680 14472937 14448519 14597038 14614748 14610261 14822875 15207314 15670282 15623682 15746324 16295772
3670 16295772 16336781 16614964 17035287 17302408 17542953 17854875 18239193 18884295 19243224 19249638
3660 19249638 19324795 19227996 19269336 19371431 19626520 19681145 20217957 20587369 20782838 21065642
3650 21065642 21283450 21853822 22204535 22321192 22343055 22337951 22395306 22623727 22900785 23059961
3640 23059961 23212895 23265665 23279110 23720386 24269159 24690050 25059533 25321180 25668952 25906635
3630 25906635 25884902 25885559 26278569 26591322 26980057 27373114 27845403 28471348 29142551 29784637
3620B9784637L29713R40381N92017L96764Q40939L54600N62195M84988P54103
3611C5040337J040934O06727K42814M98980Q47570M90963R95390J049141M87293
3602D1300149L92132M82326L82260P1025l75357J31837j1009L52022K40287J76555
3592D3142227L92775J65404N50559L28711j29668l9362k29012k60805N910J9052
3582D3945791q933l2995j35699k1328N94189K02274Q9331N0284J95690N8383K43070
3571D5180057P1276J89320j70741l55036q862l36661k38098q7285L25013J59778
3561D4728761N8172J39293j98862k94024m8786j38036k46045m65455k68466n36209
3551D2730343p97555l86843j16540o59615m52910m36745j66113l39105o20214
$$ plain form
3620 29784637 30114350 31054731 31646748 32043512 32884451 33239051 33801246 34286234 35040337
3611 35040337 36081271 36687998 36930812 37429792 38277362 38768325 39763715 40812856 41300149
3602 41300149 41692281 42174607 42556867 42627892 42252535 42384372 42373363 42725385 42965672 43142227
3592 43142227 43535002 43700406 44250965 44579676 44450008 44410646 44181634 43920829 43926739 43945791
3582 43945791 43936858 43903863 43768164 43746836 44341025 44543299 44632630 44682914 44878604 44936987 45180057
3571 45180057 45251333 45440653 45269912 44914876 44906014 44569353 44331255 44243970 44568983 44728761
3561 44728761 44786933 44926226 44727364 44433340 44384554 44246518 44000473 43535018 43266552 42730343
3551 42730343 41932788 41545945 41429405 40769790 40316880 39880135 39714022 39374917 38754703
3542C8754703n27315m49076l67128p22817m87823m20216m75208n80656j6231j95686
3532C4512547j59708n39186l2063l57077l97224k04290m46305J41807j48805J87297
3522C2556993J50833o2970K5620O036r5185q9966K59462k54K07550j58584k18901
3511C2580634J38178J89981j72594q0212J85830j51767j14421L65970J55449k85019
3501C2812029P8529L72467j4013L15984L65900p4523l72416l16894j69554r1808
3491C2905701N38920L61257j45701M04688M81669K27746J80144K17579K49456
3482C5421459K13096L48530K24250L96541O896L52510L56788L11635L22039N79715
3472C8533459J78011J48525K87004J52749M01953L37948L44411K07329J27463
$$ plain form
3542 38754703 38227388 37778312 37411184 36688367 36200544 35780328 35305120 34724464 34708233 34512547
3532 34512547 34352839 33813653 33781590 33424513 33027289 32822999 32376694 32518501 32369696 32556993
3522 32556993 32707826 32644856 32670476 32676512 32581327 32491361 32750823 32750569 32958119 32799535 32580634
3511 32580634 32718812 32908793 32736199 32655987 32841817 32690050 32575629 32941599 33097048 32812029
3501 32812029 32890558 33263025 33249012 33564996 33930896 33856373 33483957 33167063 32997509 32905701
3491 32905701 33444621 33805878 33660177 34064865 34546534 34774280 34954424 35172003 35421459
3482 35421459 35634555 35983085 36207335 36603876 36610772 36963282 37320070 37631705 37953744 38533459
3472 38533459 38711470 38859995 39146999 39299748 39701701 40039649 40384060 40591389 40718852
3463D0718852o7698l3927J45081J80924L25193j00866K71557K29584K58743K29082
3453D2156525O7076K40582L05358L72830L67641M76856N32096K02814K02468M83143
3443D5407389N70934O27067N29074L44084L41266L29045O27807O05701O09273
3434D9991640Q26992R27122R85755O45320Q12207J263736J096949P56352R78039
3425E8284112O48055R97694Q11058P64770Q22227J006884Q90899O52039Q98678
3416F5776416Q38354J069354O84255Q78456R45145N89632O02609N94755J14640
3407G2093616K69859K16731N60889P48586P84662N97152O58121P42864O30437
3398G7302917L34055M07917O89865L67992M64013K35992J88926r3907k76612J74879
$$ plain form
3463 40718852 40651154 40617227 40762308 40943232 41268425 41167559 41439116 41668700 41927443 42156525
3453 42156525 42223601 42464183 42769541 43142371 43510012 43986868 44518964 44721778 44924246 45407389
3443 45407389 45978323 46605390 47134464 47478548 47819814 48148859 48776666 49382367 49991640
3434 49991640 50818632 51745754 52731509 53376829 54189036 55452772 56549721 57306073 58284112
3425 58284112 58932167 59929861 60740919 61505689 62327916 63334800 64225699 64877738 65776416
3416 65776416 66614770 67684124 68368379 69246835 70191980 70781612 71384221 71978976 72093616
3407 72093616 72363475 72580206 73141095 73889681 74674343 75271495 75929616 76672480 77302917
3398 77302917 77636972 78044889 78734754 79102746 79566759 79802751 79991677 79897770 79621158 79796037
3388G9796037K66483J3037o8282J53620q8172j81844l87582o71029m45103n67431
3378G7819734p05688o46874p86185r65509p80253p44189m28693q40583j013314
3369G0908446p86250m83264q59134p20624r87342o18142o69953q31203m71144
3360F4481390l71568p90461p08449m15498r4389p5874j63846j76802m8691j40033
3350F1495779j84563j28019j80240k14263l29543O2880r6838J91783p360l70507
3340F0239109K72982k43748n71479k76956m24114k0538m05441q28328p46095m35036
3330E6560356k23048k71665o24543l82746n08533n26024j26434m42011p42101
3321E2713251n38505m87683n70568q66084n24266l22392j84512m15426j92633
$$ plain form
3388 79796037 80062520 80075557 80007275 80160895 80072723 79890879 79503297 78832268 78387165 77819734
3378 77819734 77114046 76467172 75680987 74715478 73935225 73191036 72762343 71921760 70908446
3369 70908446 70122196 69638932 68779798 68059174 67071832 66453690 65783737 64952534 64481390
3360 64481390 64109822 63319361 62610912 62195414 62101025 62025151 61861305 61684503 61635812 61495779
3350 61495779 61311216 61183197 61002957 60788694 60459151 60522031 60425193 60616976 60609616 60239109
3340 60239109 60512091 60268343 59696864 59419908 58995794 58975256 58569815 57741487 56995392 56560356
3330 56560356 56337308 56065643 55441100 55058354 54549821 54023797 53897363 53455352 52713251
3321 52713251 52174746 51687063 51116495 50250411 49726145 49403753 49219241 48803815 48611182
3312D8611182k2262k1331j76431k46743k5035L2460K5013n8596J48641J38148
3302D8405046k69611R9710K49987l5557L95043L20904N27777L41714L29527L81678
3292E0746218O95210K92676J92110L30123M8127L0921O4282K77990L15192L11488
3282E3304337M45399K62395L87384M14357L67949J73154P1261M72465L72484M21665
3272E6692850K32475K91565J50814M38942L41192J99835M64772O00269Q97991
3263F0310705P20994P85970O22399P60046N49488Q01557Q25044R79944N88394
3254F6944541O36807J111742J082567J374812J476976J262385J396434J669590
3246G6955854Q98620J380371J650785J888739J687170K037475K311696K086885
$$ plain form
3312 48611182 48588920 48567589 48391158 48144415 48119380 48151840 48176853 48118257 48266898 48405046
3302 48405046 48135435 48235145 48485132 48449575 48844618 49165522 49693299 50035013 50364540 50746218
3292 50746218 51441428 51734104 51926214 52256337 52304464 52335385 52399667 52677657 52992849 53304337
3282 53304337 53749736 54012131 54399515 54813872 55181821 55354975 55426236 55898701 56271185 56692850
3272 56692850 56925325 57216890 57367704 57806646 58147838 58347673 58812445 59412714 60310705
3263 60310705 61031699 61817669 62440068 63200114 63749602 64551159 65376203 66356147 66944541
3254 66944541 67581348 68693090 69775657 71150469 72627445 73889830 75286264 76955854
3246 76955854 77854474 79234845 80885630 82774369 84461539 86499014 88810710 90897595
3238I0897595K032034K207121K195673K320928K390707K437761K749897K560695
3230A09792411K368954K483858K452426K054561K238915K082168J775738J727481
3222A26976512J541536J505078J102454J131065O05444K28294R1900k80036n36968
3213A32365279n31926o28526j116106j321455j607068j636473j938610k183344
3205A21401771k159160k377836k251264k304442k436581k798736l059440l021585
3197A00992727k789057k706683k675488k589109k536885k323046k215637k263038
3189H0893784j967178j975760j953688k002472j794957j518374k107355j764220
3181F5809780j586728j404534j501640r84980j048561j263740j244379q39954
$$ plain form
3238 90897595 92929629 95136750 97332423 99653351 102044058 104481819 107231716 109792411
3230 109792411 112161365 114645223 117097649 119152210 121391125 123473293 125249031 126976512
3222 126976512 128518048 130023126 131125580 132256645 132862089 133090383 133182283 132902247 132365279
3213 132365279 131833353 131204827 130088721 128767266 127160198 125523725 123585115 121401771
3205 121401771 119242611 116864775 114613511 112309069 109872488 107073752 104014312 100992727
3197 100992727 98203670 95496987 92821499 90232390 87695505 85372459 83156822 80893784
3189 80893784 78926606 76950846 74997158 72994686 71199729 69681355 67574000 65809780
3181 65809780 64223052 62818518 61316878 60331898 59283337 58019597 56775218 55935264
3173E5935264q14955j051935j067101n80913p59193o96140o49073q11793n83949
3164D8920212n88089k98073n30290k20512k32862j40004n42530n77138k43054
3155D5547660j45342j01771J6150j53951k84252j44481j5294k03375M16144K15416
3145D5146904K54935K3398l71055J8246n350M53067O2938Q9890J97270m6763J37539
3134D5961019j91737j05390l8358k43863l58253j86850j925l27636j75336n11923
3124D3819748m22862l41734j6951N8489K143J13578q3452p8358j35049k87502
3114D2628050j93196K88136j51489k64383J44676j58225M00709N1759j0942L51938
3104D3087033M14617J68918L86281K74613L09299K93296N38700K15513L67307
$$ plain form
3173 55935264 55120309 54068374 53001273 52420360 51661167 50965027 50315954 49504161 48920212
3164 48920212 48332123 48034050 47503760 47283248 47050386 46910382 46367852 45790714 45547660
3155 45547660 45402318 45300547 45316697 45162746 44878494 44734013 44718719 44515344 44931488 45146904
3145 45146904 45401839 45425237 45054182 45072428 45067078 45520145 45583083 45672973 45870243 45823480 45961019
3134 45961019 45769282 45663892 45625534 45381671 45023418 44836568 44834643 44507007 44331671 43819748
3124 43819748 43396886 43055152 43038201 43096690 43098833 43212411 43128959 43050601 42915552 42628050
3114 42628050 42434854 42722990 42571501 42307118 42451794 42293569 42694278 42746037 42735095 43087033
3104 43087033 43501650 43670568 44056849 44331462 44640761 44934057 45472757 45688270 46055577
3095D6055577J81861L25793P15805L99247M94408O08294P61496Q10209O42281
3086E0994971P90689M79726J65603N08482J82935J52637J18660N3328j4104p6872
3076E3356055j2787j26622k30609M4652m28970m62977k81376m09492m56220k03569
3066E0788085l34155m46940m16340j69536m03045k99660k51196K36749r965j02975
3056D8591022L44636J28466j9086k54096k55862K17001O9923R2409M89526Q5198
3046D9489137p0549J03405J00979l80364n23296m12822l05312j59713m09635m58787
3036D6973043q31080r68891q50094o23721p33741o81628q59739o93662j129181
3027C9601306o95188n34561o29399m56923r54257j019094q15162p52102l98112
$$ plain form
3095 46055577 46237438 46563231 47279036 47678283 48172691 48780985 49542481 50352690 50994971
3086 50994971 51785660 52265386 52430989 52939471 53122406 53275043 53393703 53447031 53432927 53356055
3076 53356055 53343268 53216646 52986037 53030689 52601719 52138742 51857366 51447874 50991654 50788085
3066 50788085 50453930 50006990 49590650 49421114 49018069 48718409 48467213 48703962 48693997 48591022
3056 48591022 48935658 49064124 49045038 48790942 48535080 48752081 48822004 48914413 49403939 49489137
3046 49489137 49418588 49521993 49622972 49242608 48719312 48306490 48001178 47841465 47431830 46973043
3036 46973043 46141963 45173072 44322978 43699257 42965516 42283888 41424149 40730487 39601306
3027 39601306 38906118 38371557 37742158 37285235 36330978 35311884 34496722 33744620 33346508
3018C3346508n12015p86273p68238p9433k24667o70705m04532m2773k73951k75230
3008B9308691l08600l39129k27863n80188l39932m14792j65946J9389o2228k5657
2998B6863745K34050J01132L5197J58390l5736N5010n9221O8125k62191n60032
2988B6598469n1772j05439J63130k83283k74594j54636p7681j21533o6433n07651
2978B5118577k94261J14064p1803l12323m96551m71800k63971n03818k17216l82285
2968B2218613M667j37993l33021j78591j84985j77631p1671l28534j37324j968
2958B0671562j56988k19374j87602j26519j25865J55103J75844j51074j27119
2949A9907968Q4915j88447k89843k36K32647K03303q9646j14461j42215k03693
$$ plain form
3018 33346508 32834493 32048220 31279982 31200549 30975882 30305177 29900645 29857872 29583921 29308691
3008 29308691 29000091 28660962 28433099 27852911 27512979 27098187 26932241 26951630 26889402 26863745
2998 26863745 27097795 27198927 27234124 27392514 27356778 27411788 27352567 27420692 27158501 26598469
2988 26598469 26546697 26441258 26604388 26321105 26046511 25891875 25814194 25692661 25626228 25118577
2978 25118577 24824316 24938380 24866577 24554254 24057703 23585903 23321932 22818114 22600898 22218613
2968 22218613 22223280 22085287 21752266 21573675 21388690 21211059 21139388 20810854 20673530 20671562
2958 20671562 20514574 20295200 20107598 19981079 19855214 20010317 20186161 20035087 19907968
2949 19907968 19992883 19804436 19514593 19514357 19747004 19950307 19860661 19746200 19603985 19400292
2939A9400292O25N5074L88121J40559M520k2261j15615j1776L3189L86987l0729
2928B0228986N7252M79200K78569o3569O9594M0849K02643J25844J33418L66457
2918B1919243J9841K95162n7473J18046L53181M00577L32813J62615j55185N36821
2908B3925641M06578J56755J2741M43577M44590J33346L28399O27413M49631K13452
2898B7142123M34085P63475K04285M28973O06808L66056N20111N44514Q23364
2889C1833794N74617N31852P11897Q06390O69454P21877O04202Q94947O95738
2880C8044768Q71314Q56591R13270P06716R01049R85830J024680R69830R00575
2871D6174623J263298R52790J058937O62415J287667J072880J157998R73451R36058
$$ plain form
2939 19400292 19400917 19455991 19844112 19984671 19989191 19966930 19851315 19839539 19872728 20259715 20228986
2928 20228986 20286238 20765438 21044007 20980438 21050032 21090881 21293524 21419368 21552786 21919243
2918 21919243 21939084 22234246 22176773 22294819 22648000 23048577 23381390 23544005 23388820 23925641
2908 23925641 24332219 24488974 24501715 24945292 25389882 25523228 25851627 26479040 26928671 27142123
2898 27142123 27576208 28339683 28543968 28972941 29579749 29945805 30465916 31010430 31833794
2889 31833794 32408411 32940263 33652160 34458550 35128004 35849881 36454083 37349030 38044768
2880 38044768 38916082 39772673 40685943 41392659 42293708 43279538 44304218 45274048 46174623
2871 46174623 47437921 48390711 49449648 50112063 51399730 52472610 53630608 54604059 55540117
2862E5540117P98671J023233Q39786N87575Q81548R08581R90044J024147Q70895
2853F3464597P99281R74085J232593N92150Q13074R22127R43636J391817J128085
2844G2261445J181245J184120J481761J848736J824162J995054K367491J978827
2836H6122841K892918K354308K735631K802797L357262L644964L314715L747966
2828A10973402M043471M345144M738118M839461N634898N519530N593776O154899
2820A51842699O635624O905826P221738P248764P408328P546677O886941O643802
2812B08340399O267415N714527N201445L996977K919311K053605M58982n80595
2804B34372066j552831k968354m322142m751452n699413o372741o698132o884249
$$ plain form
2862 55540117 56338788 57362021 58201807 58789382 59670930 60579511 61569555 62593702 63464597
2853 63464597 64263878 65237963 66470556 67062706 67875780 68797907 69741543 71133360 72261445
2844 72261445 73442690 74626810 76108571 77957307 79781469 81776523 84144014 86122841
2836 86122841 89015759 91370067 94105698 96908495 100265757 103910721 107225436 110973402
2828 110973402 115016873 119362017 124100135 128939596 134574494 140094024 145687800 151842699
2820 151842699 158478323 165384149 172605887 179854651 187262979 194809656 201696597 208340399
2812 208340399 214607814 220322341 225523786 229520763 232440074 234493679 234952661 234372066
2804 234372066 232819235 229850881 225528739 220777287 215077874 208705133 202007001 195122752
2796A95122752p140211p140532o968960o910563o801008o507950o265174o008379
2788A41379975n732149n573133n228762m870153m356730m414824m295854l784344
2780A03124026l786181l817089l515766l124738k920524k829349k693464k404134
2772G8032781k381319k543170k107690k107681k107602j728561j651258j714221
2764F1691279j857920j384208j618296j213316j351685j291274q01635p51912
2756E1421033j176959j476367r19582q68901n84138p69073n02654l60346p35957
2747D4027056q94079q24122q32777m42257m67587n70270n93837q01274r01580
2738C7699273q44663m31368l84851l22982l76046k15346p58117r83491n99074
$$ plain form
2796 195122752 187982541 180842009 173873049 166962486 160161478 153653528 147388354 141379975
2788 141379975 135647826 130074693 124845931 119975778 115619048 111204224 106908370 103124026
2780 103124026 99337845 95520756 92004990 88880252 85959728 83130379 80436915 78032781
2772 78032781 75651462 73108292 71000602 68892921 66785319 65056758 63405500 61691279
2764 61691279 59833359 58449151 56830855 55617539 54265854 52974580 52172945 51421033
2756 51421033 50244074 48767707 47848125 46979224 46395086 45626013 45123359 44763013 44027056
2747 44027056 43132977 42308855 41476078 41033821 40566234 39995964 39402127 38600853 37699273
2738 37699273 36854610 36423242 36038391 35715409 35339363 35124017 34365900 33382409 32783335
2729C2783335q7322n25448m96155j83208l44358m30267k95165l88630k66394j85790
2719B9580598l61246l56592k04476L0740j49290j54886m45214k32645k57261o959
2709B7442769q7169l23964L8654J00615k57849N4042K08089K19237j76029K18531
2699B7436926o700p1129r9239j79166P7285k1012R3880m68309j29598P0676O5543
2688B6769157j77812p9589k32854m69263n89491p74329m02858l88531o05829l16682
2678B2731919o99804m98708l86348m45940o11957k33427j49651l64806l46799
2669A8994479k98277k96918m40764o23956k83668l81389k92214l56006k07825
2660A5813462k26577l07116j25006k88592l56m51618r8943n1913n39412j76589
$$ plain form
2729 32783335 32696013 32170565 31674410 31491202 31146844 30716577 30421412 30032782 29766388 29580598
2719 29580598 29219352 28862760 28658284 28689024 28539734 28384848 27939634 27706989 27449728 27442769
2709 27442769 27355600 27031636 27070290 27170905 26913056 26967098 27175187 27394424 27218395 27436926
2699 27436926 27430226 27359097 27259858 27080692 27157977 27136965 27230845 26762536 26632938 26703614 26769157
2688 26769157 26591345 26511756 26278902 25809639 25220148 24445819 24042961 23654430 23048601 22731919
2678 22731919 22032115 21533407 21147059 20701119 20089162 19855735 19706084 19341278 18994479
2669 18994479 18696202 18399284 17958520 17334564 17050896 16669507 16377293 16021287 15813462
2660 15813462 15586885 15279769 15154763 14866171 14865815 14414197 14315254 14263341 13723929 13547340
2650A3547340l32257j52638m09362r7184J03231l05755q5602m73339k36332j09689
2640A1448413P8881J06480p3245m78294j55672m34450k42108k32697J49935k00178
2630I967065j10835j00754j5370j92475l20750j68153K45565n0151k48J00775
2620I354669l05167j09459l74659j39440k17685m2730K17825k6544L3819q4051
2610H306578l23150p6142p6865l809J78931K8038k10884j03435r3922l05335k45878
2599G074127K9147J3031J81797m6085l2787j95316n8032j66794K04589K50223
2589G253900j14367j95472k25786k03774J77303p6985j79012J41250o8504o3339
2579F445214p519l8183p6782J18865j89325l6270K05502j32577k70136n35238
$$ plain form
2650 13547340 13215083 13062445 12653083 12555899 12659130 12353375 12267773 11794434 11558102 11448413
2640 11448413 11527294 11633774 11560529 11082235 10926563 10492113 10250005 10017308 10167243 9967065
2630 9967065 9856230 9755476 9740106 9547631 9226881 9058728 9304293 9254142 9253894 9354669
2620 9354669 9049502 8940043 8565384 8425944 8208259 8165529 8383354 8356810 8390629 8306578
2610 8306578 7983428 7907286 7830421 7826612 8005543 8033581 7822697 7719262 7625340 7320005 7074127
2599 7074127 7103274 7116305 7298102 7252017 7219230 7023914 6965882 6799088 7003677 7253900
2589 7253900 7139533 6944061 6718275 6514501 6691804 6614819 6435807 6577057 6508553 6445214
2579 6445214 6437695 6399512 6322730 6441595 6252270 6216000 6421502 6288925 6018789 5483551
2569E483551k59948J57285J83459J55137k2740j24579R0491q0258o992R0850n2265
2558E613991K24977j1854p9067l23244j14886J20191J42380m6912j87725K11425
2548E549276j20305j7492O1874J67245k41484Q7786m2747r974L01720r9032k77131
2537E359736k16496k12722o7010K33403L23114M5250J80327J04626k79381L27576
2527E798423k81949j45155J66094l27790k72215m212j32959q5968O8710K53290
2517E036269J56913o1342r0779J16269j16340j77529J79149r3063q9343j35848
2507D724356k95770m21816l2471J01738P0077o1705k07379J36714Q2885K8931
2497D125560K59144J73300p6891k65008j08069j12694r1684j90943j99071j98431
$$ plain form
2569 5483551 5223603 5380888 5564347 5719484 5696744 5572165 5662656 5582398 5575406 5666256 5613991
2558 5613991 5838968 5827114 5748047 5424803 5309917 5430108 5572488 5525576 5337851 5549276
2548 5549276 5428971 5411479 5473353 5640598 5399114 5486900 5444153 5434179 5735899 5636867 5359736
2537 5359736 5143240 4930518 4863508 5096911 5420025 5465275 5645602 5750228 5470847 5798423
2527 5798423 5516474 5371319 5537413 5209623 4937408 4933196 4800237 4714269 4782979 5036269
2517 5036269 5193182 5131840 5041061 5157330 5040990 4863461 5042610 4949547 4860204 4724356
2507 4724356 4428586 4006770 3974299 4076037 4146114 4084409 3877030 4013744 4096629 4125560
2497 4125560 4384704 4558004 4481113 4216105 4108036 3995342 3903658 3712715 3513644 3315213
2487C315213k42978K30250K95100J63253J70708n6882k92689J25408J31262L1577
2477C870222k64145P9789k87336k14692j51942J8939J91092r081J6208K35613
2467C484667n5318l04500j43019L20735J13868k05520r7776j4733r9071j39873
2457B859460J71543n0823K8589p965J29945M9122q4751j22273k01048K2158O9490
2446B863447p1576L21875m0627r2651k48031K8463M3201J9725R440n5657P6269
2435B853878J38907r7135j77978o388j3578j7443l5720j40833J14455P6867q0419
2424B614613j28624J65814K8988k12545J60058m3978j1490p4240j69576j01514
2414B227506L4485P02103k7633k19425l09584P2465p4565j16168J95570N8535
$$ plain form
2487 3315213 3072235 3302485 3597585 3760838 3931546 3874664 3581975 3707383 3838645 3870222
2477 3870222 3606077 3685866 3398530 3183838 3031896 3050835 3241927 3232846 3249054 3484667
2467 3484667 3429349 3124849 2981830 3302565 3416433 3210913 3113137 3098404 2999333 2859460
2457 2859460 3031003 2980180 3008769 3000804 3130749 3179871 3095120 2972847 2771799 2793957 2863447
2446 2863447 2791871 3113746 3073119 2980468 2732437 2760900 2804101 2823826 2833266 2777609 2853878
2435 2853878 2992785 2895650 2717672 2711284 2697706 2680263 2644543 2503710 2618165 2695032 2614613
2424 2614613 2485989 2651803 2680791 2468246 2628304 2584326 2572836 2498596 2329020 2227506
2414 2227506 2261991 2964094 2936461 2717036 2407452 2479917 2405352 2289184 2484754 2543289
2404B543289k6975J17788Q5082k91621m34128m8963R3273J11342M44916R2591
2394B686594j88240j35726K71601Q1067K2568K8989m06156k57415k22543p6153
2384A804586J6200k25384K69292J05176K4732k5375L33759r4003M7150k53936
2374B002197j82475N2407r1303m13639Q606Q2170L26831r5467L20735N514k4671
2363A990905k20504L26562Q0854k72007N731J25435N4433j17838K39676k72534
2353A940713j54145K0067K17433l2686J44651J0962p734j37069K05670l48706
2343A859156k42432R5374J04522j45780N781J90206j12094R8149J40683J58240
2333B151805N5746m8527k83133n10470o4023j19244M739K84180L41124J09385
$$ plain form
2404 2543289 2516314 2634102 2719184 2427563 1993435 1944472 2037745 2149087 2594003 2686594
2394 2686594 2498354 2362628 2634229 2715296 2737864 2766853 2360697 2103282 1880739 1804586
2384 1804586 1820786 1595402 1864694 1969870 1994602 1969227 2302986 2208983 2256133 2002197
2374 2002197 1819722 1872129 1780826 1367187 1375793 1457963 1784794 1689327 2010062 2015576 1990905
2363 1990905 1770401 2096963 2177817 1905810 1911541 2036976 2091409 1973571 2213247 1940713
2353 1940713 1786568 1806635 2024068 1991382 2136033 2146995 2139261 2002192 2207862 1859156
2343 1859156 1616724 1712098 1816620 1670840 1676621 1866827 1754733 1852882 1993565 2151805
2333 2151805 2207551 2159024 1875891 1365421 1301398 1182154 1186893 1471073 1812197 1921582
2323A921582j62229N3435j37180k98851K96923J83783J5151k1302j54467Q6446
2313A783291J65104m28415l1342L30347k87539O9524N0974l6300P8630o947J55785
2302A843112j9193o1726j24680J89740k06322n31355k60198p8953P4061L42530
2292A167016J95934J53666J41050M9609j43992k6452P9131J7866J6361j70204
2282A479985j79770k36603l64413j22963M37182N3366N1430L92541K47669k94851
2272A463573l80633o1017j06424L46763J27744M9160J58095k31318n7484k62903
2262A045556k00281J45513l2782n4786J75277J36617J00853J66686J22690R1681
2252A697024K36744j52125l95907J19775j52426k68438R3501L35434J36314J46043
$$ plain form
2323 1921582 1759353 1812788 1675608 1376757 1673680 1857463 1872614 1851312 1696845 1783291
2313 1783291 1948395 1519980 1488638 1818985 1531446 1600970 1651944 1615644 1694274 1687327 1843112
2302 1843112 1823919 1762193 1637513 1827253 1620931 1089576 829378 750425 824486 1167016
2292 1167016 1362950 1516616 1657666 1707275 1563283 1536831 1615962 1633828 1650189 1479985
2282 1479985 1300215 1063612 699199 576236 1013418 1066784 1118214 1510755 1758424 1463573
2272 1463573 1082940 1021923 915499 1262262 1390006 1439166 1597261 1365943 1308459 1045556
2262 1045556 845275 990788 958006 903220 1078497 1215114 1315967 1482653 1605343 1697024
2252 1697024 1933768 1781643 1385736 1505511 1353085 1084647 1178148 1513582 1649896 1795939
2242A795939j49038p8807j31357j26548j97414K31055R7496J94442K54466L9006
2232A929240k69717m26849J20343j8720k50217P9902j82126j49874L12700J39938
2222A284620j0890K04117J27878j19151M6767l08528o6238l92062M4326N24234
2212A335073L0135k16177l31104O7119K18590q718P4527j22817M38445J30223
2202A615296k14448r783J50069J71398j15502l798J40490n35692l02020K46906
2192A142916L1199k87218K60356K95566M02684Q9130j79304k75756k23041j45137
2182A111395j12787L33688N4653K39256o3833j31762J98089l66803J59819J77593
2172A599308K00073l5386R2398n32783l77608M36926N5603J63683j2059J40563
$$ plain form
2242 1795939 1646901 1568094 1436737 1310189 1112775 1343830 1441326 1635768 1890234 1929240
2232 1929240 1659523 1232674 1353017 1334297 1084080 1163982 981856 831982 1144682 1284620
2222 1284620 1273730 1477847 1605725 1486574 1533341 1224813 1158575 766513 810839 1335073
2212 1335073 1365208 1149031 817927 885046 1103636 1094918 1169445 1046628 1485073 1615296
2202 1615296 1400848 1391065 1541134 1712532 1597030 1593232 1733722 1198030 896010 1142916
2192 1142916 1174115 886897 1147253 1442819 1845503 1934633 1755329 1479573 1256532 1111395
2182 1111395 998608 1332296 1386949 1626205 1562372 1430610 1628699 1261896 1421715 1599308
2172 1599308 1799381 1763995 1856393 1323610 946002 1382928 1438531 1602214 1590155 1730718
2162A730718J21644j63890J91057j07562J36835r4573K8739J93309Q5981l73432
2152A748826m13688O7191L07964L3923k63024J99069J22021J0199l236M1806J82962
2141B034013L89307Q0917j18810k80104k53657k68374j59715J49472O2014M59596
2131B094659M58683K17685K49844n4399J57990k3001J40025j18932j1408j71691
2121B939455n5649l11260n8916K61521M66063K54870L43497L86606L4653J72754
2111D433594L07951M16503L31795J25990J25807j48465J36958K03519O69803N28203
2101G131658Q45432Q60269J079361P21622O78006O41305K28079K43854j42890
2092A2286696j14587n77288n43157n58820j023684m11236o05033l08529m36428
$$ plain form
2162 1730718 1852362 1688472 1879529 1771967 1908802 1814229 1842968 2036277 2122258 1748826
2152 1748826 1335138 1402329 1710293 1744216 1481192 1680261 1802282 1812481 1809245 1851051 2034013
2141 2034013 2423320 2504237 2385427 2105323 1851666 1583292 1423577 1573049 1635063 2094659
2131 2094659 2553342 2771027 3020871 2966472 3124462 3101461 3241486 3122554 3111146 2939455
2121 2939455 2883806 2572546 2513630 2775151 3241214 3496084 3839581 4226187 4260840 4433594
2111 4433594 4741545 5158048 5489843 5615833 5741640 5593175 5730133 5933652 6603455 7131658
2101 7131658 7977090 8837359 9916720 10638342 11316348 11957653 12185732 12429586 12286696
2092 12286696 12172109 11594821 11051664 10492844 9469160 9057924 8452891 8144362 7707934
2083G707934k01406k52013l68170l70518q20922k94566m6120l57522o45593l54104
2073C997000n64664o3486K48629K1715k1517N5318j56603J6898j30455k57436
2063C145399j50201o4219q3976j26497j27394m92296j59171J13385j69654j53308
2053A732068J45886L48355K12679J39753p0447j52616l25996l58816n26358L8848
2043A183356K15496j3227j01438J09822K14369K55275r7874K47542l77613p0717
2033A564991O4648k82316j39000j23696k52176K18653K69580j80178j69145j28770
2023H42591J34718J40355K10834N4087J40080N0868j61691q0483k92050k59332
2013G79977N8917O2282k80252N7633N17950p790K86594J12966p1389k11545j85050
$$ plain form
2083 7707934 7506528 7254515 6886345 6515827 5694905 5400339 5354219 4996697 4351104 3997000
2073 3997000 3432336 3368850 3617479 3639194 3617677 3672995 3516392 3533290 3402835 3145399
2063 3145399 2995198 2930979 2847003 2720506 2593112 2100816 1941645 2055030 1885376 1732068
2053 1732068 1877954 2226309 2438988 2578741 2508294 2355678 2029682 1670866 1144508 1183356
2043 1183356 1398852 1385625 1284187 1394009 1608378 1863653 1765779 2013321 1635708 1564991
2033 1564991 1629639 1347323 1208323 1084627 832451 1051104 1320684 1140506 971361 842591
2023 842591 977309 1117664 1328498 1382585 1522665 1573533 1411842 1331359 1039309 779977
2013 779977 838894 901176 620924 678557 1196507 1188717 1475311 1588277 1516888 1305343 1120293
2002A120293J91523k11783k12504K8665M0778j73925K92076J2870n4238j32094
1992I01661O8731J23140Q3481J37760r7922N5132q8969j77322j85021J9509j47175
1981F93005m0228J76788P0909K14966l53385l6966K81547J38252m34001j22347
1971E88540J33691k61898m5753o8630P3176j85808L3627K43867J84802l2844L5676
1960F98446R3412l0644p9919k43316J02931K73192k22525k78659l00156N8193
1950G0955J9543J02762L04633L03803P2938L6192j72225k27068J4845l6266r6922
1939C93190J06734R2790j77554L26776p8179m15414j2174K2634L85998j24351
1929E20450j9757J84600J91726k43854k16498j03995K11960p2524j08960l23887
$$ plain form
2002 1120293 1311816 1100033 887529 916194 956972 783047 1075123 1087993 1033755 901661
1992 901661 970392 1093532 1177013 1314773 1216851 1271983 1183014 1005692 820671 840180 693005
1981 693005 652777 829565 900474 1115440 762055 725089 1006636 1144888 710887 588540
1971 588540 722231 460333 414580 345950 419126 233318 266945 510812 695614 662770 698446
1960 698446 791858 761214 681295 437979 540910 814102 591577 312918 12762 70955
1950 70955 90498 193260 497893 801696 874634 910826 738601 511533 526378 490112 393190
1939 393190 499924 592714 415160 741936 663757 248343 236169 258803 644801 520450
1929 520450 500693 685293 877019 633165 416667 312672 524632 452108 343148 19261
1919A9261O2683J22815M51481J27865j70364K68658o5039l99092j96672R586j58284
1908G2898O8463J9176K52052J41250P9493q3669K9456J09608j56270l48139j21522
1897F2796M6243M11178L9349j45652Q0721K9528J68353j56601l21744o1657r2810
1886E9704L96528m7340J38983K22747j88229k55810j43369p309N553J22715j03670
1875B00503O1957L34597J71196j20122J67988l27431l80865R0100J03978k17255
1865H4646o3393J50817j3736j83266J61372K57945j60104M04264P5690n1234K0596
1854F83597j40513r4690o2604j91722Q2779J5795j29463l0078K41268l172N6070
1843D27267N3961l7973j07496K28607O0817l5419o9439j49572J25884j39722k53079
$$ plain form
1919 19261 81944 204759 656240 784105 613741 882399 817360 418268 221596 231182 72898
1908 72898 141361 160537 412589 553839 633332 549663 579119 688727 532457 184318 62796
1897 62796 109039 520217 559566 413914 494635 524163 692516 535915 214171 152514 59704
1886 59704 456232 408892 547875 770622 582393 326583 183214 175905 181458 304173 200503
1875 200503 262460 597057 768253 648131 816119 488688 107823 197923 301901 84646
1865 84646 21253 172070 158334 -24932 136440 394385 234281 638545 714235 663001 683597
1854 683597 543084 448394 385790 194068 276847 292642 163179 133101 374369 371197 427267
1843 427267 481228 443255 335759 564366 625183 589764 520325 370753 496637 356915 103836
1832A03836j69388R9387M9818J68656K10738j38756L6250J61710p5272o5463K36568
1821F18084J7241j87498l31730j69726j36332L25749j38150j79014L86469K09454
1811D14547j1911j6809K22147J5702k34841k72572K30524m5876J06987K35586
1801F43484k41941l73997J90504j28569Q051o1778K02890J93650L23037n0464
1791G04867k04154N8197k08758o8617J57173j72933k38724j239K06287J46109
1781C78208l2396J04785N9059j5701N2778J6870m56297j51117R8697K73191K09330
1770E37407M9689J10656l08989n3296r8616N5152M1229k16251K84807p311J27081
1759E21558k74004k4612p0033j12364M06979k10549l041k6373P6449J70649L8255
$$ plain form
1832 103836 -65552 33835 83653 252309 463047 324291 360541 522251 446979 381516 618084
1821 618084 635325 447827 116097 -53629 -189961 135788 -2362 -181376 205093 414547
1811 414547 402636 385827 607974 623676 388835 116263 346787 300911 407898 643484
1801 643484 401543 27546 218050 89481 97532 35754 238644 432294 755331 704867
1791 704867 500713 558910 350152 281535 438708 265775 27051 25812 232099 378208
1781 378208 345812 450597 509656 493955 546733 563603 107306 -43811 54886 328077 537407
1770 537407 587096 697752 388763 335467 236851 292003 333232 116981 401788 394477 521558
1759 521558 247554 222942 152909 40545 447524 236975 233934 207561 284010 454659 492914
1748D92914j22198j90598r0702J02838M1257k04452k01198J38132M7339R2366
1738A05698n7391K19668p9690j70061J71423J31417J14888P1062q3759L2414k5575
1727D30094j36756j21232k01201J34149J67368p6098J39783L37291k83905j52392
1717B37101m6965K84685j71209J01649J15103j06049k15762r6809n8468j73722
1707a30446N6383k52728k5297K28021R0947K32907K69762R8326j19780L9798j12390
1696C75503l52174k49738J06667J73285r177m2663K65523q148J9147q8114n2217
1685A37894j1414q5094J3849K92268J22703j22164j71741K16945Q8295j33934
1675C47607k61896j34376K59898p8334J8576Q2351K8928K44897P8974l5316m41391
$$ plain form
1748 492914 370716 180118 89416 192254 233511 29059 -172139 -34007 13332 105698
1738 105698 48307 267975 188285 18224 189647 321064 435952 507014 423255 455669 430094
1727 430094 293338 172106 -29095 105054 272422 196324 336107 673398 389493 237101
1717 237101 190136 474821 303612 405261 520364 414315 198553 101744 43276 -130446
1707 -130446 -74063 -326791 -352088 -124067 -33120 199787 469549 567875 448095 487893 375503
1696 375503 23329 -226409 -119742 53543 44366 1703 267226 259078 278225 190111 137894
1685 137894 126480 41386 55235 347503 470206 348042 176301 393246 481541 347607
1675 347607 85711 -48665 211233 132899 151475 233826 262754 507651 586625 551309 109918
1664A09918j78686J39468J4346j53160J3835K28553M6518o3351j31714K69960
1654B95687J64484M5941l75746O0179J85895P3493k19236j87818m5859K24871
1644B21891K38121p8974k9938k8434q8667q6216Q1540k4511r8475L06996m3263
1633C70070L6815k8546j45981M9580J533k82861P3952J64401n1483r1170j31721
1622c5411N4737L99684Q854j25678j30707P2451k10962j15779J38193N8019J61780
1611B75181l7384J84762k8682k5397L13897K63768m51393k66607l4986n1151K11380
1600C53388M1255l08466J29800K72495Q383L9558j61270R6371k09120Q0295P6093
1589D18782r2549m6373p735J02329j35750m1689q8351J33761j32024k27545L55979
$$ plain form
1664 109918 -68768 70700 85046 -68114 -54279 174274 220792 157441 25727 295687
1654 295687 460171 506112 130366 190545 376440 449933 230697 42879 -2980 221891
1644 221891 460012 381038 351100 322666 233999 147783 229323 204812 106337 413333 370070
1633 370070 406885 378339 232358 281938 283471 610 74562 238963 187480 96310 -35411
1622 -35411 19326 419010 427864 302186 171479 243930 32968 -82811 55382 113401 275181
1611 275181 237797 422559 393877 368480 682377 946145 494752 228145 193159 142008 353388
1600 353388 394643 86177 215977 488472 496855 536413 375143 471514 262394 342689 418782
1589 418782 326233 279860 272125 374454 238704 197015 108664 242425 110401 -117144 238835
1578B38835J21976J29440J88409q5113n7003p3080l01489j63832k37252J30525
1568a08584M3093p6517J41807M2438J19593O5158K19850j11340j09123m5746j38785
1557D1844j5116K680j220K50878j69155k86360j99232k55567J93316L30754j70683
1546b77861M0692K08264Q0800J30846L45424J62667j16851r1934j92256j15757
1536A74034j44628k25563M0994j05866Q9277J30143J18645K76029l0039j3849
1526C09177P5756k15269o3768J56712o2158M9388m4780m47103K70220P1763K06354
1515C06292j37997J33048m99374K34329R9739L630K68877k5573J12262j19359
1505C75874J89086l70993p2967J91832m8031l38805J80125M5240p9917L3311K28251
$$ plain form
1578 238835 360811 490251 678660 593547 536544 463464 161975 -1857 -239109 -108584
1568 -108584 -65491 -142008 -201 42237 161830 226988 446838 335498 226375 180629 41844
1557 41844 26728 29408 28188 279066 109911 -176449 -375681 -631248 -437932 -107178 -277861
1546 -277861 -237169 -28905 51895 182741 528165 690832 573981 482047 289791 174034
1536 174034 29406 -196157 -155163 -261029 -171752 -41609 77036 353065 323026 309177
1526 309177 384933 169664 105896 262608 200450 249838 205058 -242045 28175 99938 306292
1515 306292 168295 301343 -198031 36298 136037 139667 408544 382971 495233 375874
1505 375874 564960 193967 121000 312832 264801 -74004 106121 151361 71444 104755 333006
1494C33006k27409k20651N8964q7777J52751L17270j55967l7865P482l1909J25359
1483B33254J85560J76835o6185m54960L461M2940k08020M3706K39847J44651j83475
1472A57614N10014J17117k78166J39741q0219l0258q6709l57470k43103j6893
1462a68332j0752N07062n7614k21415K84117o278m9822j58259K2385J53087M0724
1451C34903R3880L7000o7256k03885j89088J3286j25848l62460M3780J94499J47616
1440h3573K1676J80241K07632K77995o0673k76621Q7310k98944R1760J33754m5442
1429B35115O4464k19165K7705r792J15879j45430j61068J1052K04374K09667j09050
1418B23751K17992L25086j42791l36702m50181O8433P2036q8912r2955M1662O2101
$$ plain form
1494 333006 105597 -115054 -56090 -143867 8884 326154 170187 132322 139804 107895 233254
1483 233254 418814 595649 529464 74504 77965 120905 -87115 -43409 196438 341089 157614
1472 157614 667628 784745 506579 646320 566101 535843 449134 91664 -151439 -168332
1462 -168332 -179084 327978 270364 48949 333066 326788 276966 118707 141092 294179 334903
1451 334903 428783 465783 398527 194642 5554 18840 -107008 -469468 -425688 -231189 -83573
1440 -83573 -61897 118344 325976 603971 543298 266677 353987 55043 146803 280557 235115
1429 235115 299579 80414 108119 98327 214206 68776 -92292 -81240 123134 332801 223751
1418 223751 441743 766829 624038 287336 -162845 -94412 -22376 -111288 -204243 -162581 -100480
1407a00480O5N5921M236j16858O7827J70078K98865p9443k12702m4688J78585
1396B21406r5970k13753Q1330j07998o3996K39321J19619j07198j52685q3422
1386a63346Q5259l8096N0287J21849j0132j6859J78975j56029J67992M7127l02080
1375c5053k23927J37955K45736J61034j57377J63888Q1764K42035k28180l32829
1365E5046j59940K0860m5150p3302K93056O8243r0318M4987m723k76132J04149
1354f3224J14622K37541Q8047k89194J74848R8964k20530Q2800j90857R5923j01396
1343B7544j58153J87224j84613R1627J69263o583J39843o115j60789j01149m7449
1332d9350O9219j40084L46163n2601K3059l9807j53256j24392r5103J94738K12
$$ plain form
1407 -100480 -100415 -44494 -40258 -157116 -89289 80789 379654 300211 87509 42821 221406
1396 221406 125436 -88317 -6987 -114985 -178981 60340 179959 72761 -79924 -163346
1386 -163346 -78087 -116183 -65896 55953 45821 28962 207937 51908 219900 267027 -35053
1375 -35053 -258980 -121025 124711 285745 128368 292256 374020 616055 387875 55046
1365 55046 -104894 -84034 -129184 -202486 90570 158813 68495 113482 108759 -167373 -63224
1354 -63224 51398 288939 376986 87792 262640 361604 141074 223874 33017 128940 27544
1343 27544 -130609 56615 -127998 -36371 132892 126309 266152 260037 99248 -1901 -49350
1332 -49350 19869 -120215 225948 173347 196406 156599 3343 -121049 -216152 -21414 -21202
1321b1202N2704r9959n1442n2046K45837K24248J13539k27120l02307K15421L021
1310A00694j31841J0822K23700P049k57128m8730Q7304q2277J3651J73058N7820
1299A54122j6787p5160k4124j52376k18435J83479K53963J01078k7106j48313
1289C0341J82011K01171J3637l46876j93689J13262J28480o4053k72055j26037
1279c33808L95220J05378O724K48872k41055j27158j88626l3259k4330P7336k2056
1268a36762J8206J91820J03853j44585k1526Q2390J01843j78861J0430L09848
1258C36656m2099j42090J8343p897k48253J07595p0998J8292K53564n5848Q4193
1247B51458K51979k63703n9019K6447Q2858p8312j50054K2546j37196J9139J22857
$$ plain form
1321 -21202 31502 -68457 -119899 -171945 73892 298140 411679 184559 -117748 97673 100694
1310 100694 -31147 -20325 203375 210424 -46704 -95434 -8130 -90407 -76756 96302 154122
1299 154122 137335 62175 38051 -114325 -332760 -149281 104682 205760 178654 30341
1289 30341 212352 413523 427160 80284 -113405 -143 128337 64284 -207771 -333808
1279 -333808 61412 166790 173514 422386 181331 54173 -134453 -167712 -192042 -114706 -136762
1268 -136762 -118556 73264 177117 32532 11006 93396 195239 16378 26808 336656
1258 336656 294557 152467 170810 162913 -85340 22255 -48743 -30451 223113 167265 251458
1247 251458 503437 239734 180715 207162 290020 211708 61654 84200 -52996 -33857 89000
1236H9000j82326r1421j35331L42369q1085l22084M5146K85620J49672J32802
1226B32362j53965K10372Q1376j26987j12944k08529j01358J4196m7447J12627
1216a00297L5122J83597J89715l97699N5408J98027q1529m9562P4739p9709j93390
1205a65578o6977j75578j6633k600J25169K04000K20605M146j1753J76196J39595
1194D30592O1987j57249j68895j14842K0483j27484j10452P8113M1851J00316
$$ plain form
1236 89000 -93326 -184747 -320078 22291 -58794 -380878 -335732 -50112 99560 232362
1226 232362 78397 288769 370145 243158 130214 -78315 -179673 -165477 -212924 -100297
1216 -100297 -65175 118422 308137 -89562 -34154 163873 82344 32782 107521 27812 -165578
1205 -165578 -232555 -408133 -424766 -427366 -302197 -98197 122408 126554 114801 290997 430592
1194 430592 492579 335330 166435 51593 72076 -55408 -165860 -87747 -45896 54420
$$ [...]
##END NTUPLES=NMR SPECTRUM
##END=
