##TITLE=1H_CA-8960x-2
 DMSO
 8 sc, 
 15.12.2021
##JCAMPDX= 6.0         $$ Bruker NMR JCAMP-DX V2.0
##DATA TYPE= NMR SPECTRUM
##DATA CLASS= NTUPLES
##ORIGIN= UXNMR, Bruker Analytische Messtechnik GmbH
##OWNER= root
$$ XWIN-NMR		Version 3.5
$$ Wed Dec 15 11:17:11 2021 Russian Standard Time (UT+4h)  she@DPX200
##.OBSERVE FREQUENCY= 200.131346
##.OBSERVE NUCLEUS= ^1H
##.ACQUISITION MODE= SIMULTANEOUS
##.ACQUISITION SCHEME= undefined
##.AVERAGES= 8
##.DIGITISER RES= 18
##SPECTROMETER/DATA SYSTEM= spect
##.PULSE SEQUENCE= zg30
##.SOLVENT NAME= CDCl3
##.SHIFT REFERENCE= (INTERNAL, CDCl3, 0, 15.7535)
##AUDIT TRAIL= $$ (NUMBER, WHEN, WHO, WHERE, WHAT)
$$ ##TITLE= Audit trail, XWIN-NMR		Version 3.5
$$ ##JCAMPDX= 5.01
$$ ##ORIGIN= Bruker BioSpin GmbH
$$ ##OWNER= she
$$ F:/spectra/data/she/nmr/H-F/1/pdata/1/auditp.txt
$$ ##AUDIT TRAIL=  $$ (NUMBER, WHEN, WHO, WHERE, WHAT)
(   1,<2021-12-15 11:15:16.79 +0400>,<she>,<DPX200>,
      <created by zg, POWCHK disabled, PULCHK disabled
       configuration hash MD5:
       00 E9 B6 7A A2 85 ED C7 34 08 36 98 17 FE 4E 26
       data hash MD5: 16K
       C9 9B C0 CD 3D E7 D5 90 59 91 C5 D7 B9 B2 0F 51>)
(   2,<2021-12-15 11:15:21.20 +0400>,<she>,<DPX200>,
      <Start of raw data processing
       efp BC_mod = 2 LB = 0.24 FT_mod = 6 PKNL = 1 PHC0 = -16044.8 PHC1 = 31.40079 SI = 16K 
       data hash MD5: 16K
       67 06 DF 0D C8 96 30 09 33 11 DA 86 8D 6F FA 37>)
(   3,<2021-12-15 11:15:44.14 +0400>,<she>,<DPX200>,
      <pk PHC0 = 75.20332 PHC1 = 3.8 
       data hash MD5: 16K
       37 11 E1 96 DA E2 8C 2F 16 69 F5 8D 1E CE 13 83>)
(   4,<2021-12-15 11:15:47.64 +0400>,<she>,<DPX200>,
      <abs ABSG = 5 
       data hash MD5: 16K
       E0 BA E6 AF 83 92 96 AC 18 F7 7E A2 D3 90 9D 14>)
(   5,<2021-12-15 11:16:15.03 +0400>,<she>,<DPX200>,
      <pk PHC0 = 21.83282 PHC1 = -31.8 
       data hash MD5: 16K
       44 6D 90 93 EE 73 FB 03 E6 4C 1A 61 E0 16 60 0D>)
(   6,<2021-12-15 11:16:18.23 +0400>,<she>,<DPX200>,
      <abs ABSG = 5 
       data hash MD5: 16K
       93 C2 A3 23 4B 4F D9 19 8C 2D 0B 9F 47 EE 32 8E>)
$$ ##END=
$$ 
$$ hash MD5
$$ 81 FA BE 7B 14 97 23 64 72 9E E7 51 05 58 2C 49
##$RELAX= 
##$RELAX= 
##$RELAX= 
##$RELAX= 
##$RELAX= 
##$RELAX= 
$$ Bruker specific parameters
$$ --------------------------
##$DU= <F:/spectra>
##$EXPNO= 1
##$NAME= <H-F>
##$PROCNO= 1
##$TYPE= <nmr>
##$USER= <she>
##$AMP= (0..31)
100 100 100 100 100 100 100 100 100 100 100 100 100 100 100 100 100 100 
100 100 100 100 100 100 100 100 100 100 100 100 100 100 
##$AQSEQ= 0
##$AQ_mod= 1
##$AUNM= <au_zg>
##$AUTOPOS= <>
##$BF1= 200.13
##$BF2= 200.13
##$BF3= 200.13
##$BF4= 200.13
##$BF5= 200.13
##$BF6= 200.13
##$BF7= 200.13
##$BF8= 200.13
##$BYTORDA= 1
##$CFDGTYP= 0
##$CFRGTYP= 5
##$CHEMSTR= <none>
##$CNST= (0..31)
1 1 145 1 1 1 1 1 1 1 1 1 1 1 1 1 1 1 1 1 1 1 1 1 1 1 1 1 1 1 1 1 
##$CPDPRG= <>
##$CPDPRG1= <>
##$CPDPRG2= <>
##$CPDPRG3= <>
##$CPDPRG4= <mlev>
##$CPDPRG5= <mlev>
##$CPDPRG6= <mlev>
##$CPDPRG7= <mlev>
##$CPDPRG8= <mlev>
$$ [...]
##$SUBNAM2= <"">
##$SUBNAM3= <"">
##$SUBNAM4= <"">
##$SUBNAM5= <"">
##$SUBNAM6= <"">
##$SUBNAM7= <"">
##$SUBNAM8= <"">
##$SUBNAM9= <"">
##$SW= 18.0517287032376
##$SWIBOX= (0..15)
0 0 2 0 0 0 0 0 0 0 0 0 0 0 0 0 
##$SW_h= 3612.71676300578
##$TD= 16384
##$TD0= 1
##$TE= 0
##$TE2= 300
##$TE3= 300
##$TEG= 300
##$TL= (0..7)
0 120 120 120 120 120 120 120 
##$TP= (0..7)
150 150 150 150 150 150 150 150 
##$TP07= 0
##$TPNAME0= <>
##$TPNAME1= <>
##$TPNAME2= <>
##$TPNAME3= <>
##$TPNAME4= <>
##$TPNAME5= <>
##$TPNAME6= <>
##$TPNAME7= <>
##$TPOAL= (0..7)
0.5 0.5 0.5 0.5 0.5 0.5 0.5 0.5 
##$TPOFFS= (0..7)
0 0 0 0 0 0 0 0 
##$TUNHIN= 0
##$TUNHOUT= 0
##$TUNXOUT= 0
##$USERA1= <user>
##$USERA2= <user>
##$USERA3= <user>
##$USERA4= <user>
##$USERA5= <user>
##$V9= 5
##$VALIST= <valist>
##$VCLIST= <CCCCCCCCCCCCCCC>
##$VD= 0
##$VDLIST= <DDDDDDDDDDDDDDD>
##$VPLIST= <PPPPPPPPPPPPPPP>
##$VTLIST= <TTTTTTTTTTTTTTT>
##$WBST= 1024
##$WBSW= 4
##$XGAIN= (0..3)
0 0 0 0 
##$XL= 0
##$YL= 0
##$YMAX_a= 9083
##$YMIN_a= -14149
##$ZGOPTNS= <>
##$ZL1= 120
##$ZL2= 120
##$ZL3= 120
##$ZL4= 120
##$ABSF1= 15.74579
##$ABSF2= -2.30606
##$ABSG= 5
##$ABSL= 3
##$ALPHA= 0
##$AQORDER= 0
##$ASSFAC= 0
##$ASSFACI= 0
##$ASSFACX= 0
##$ASSWID= 0
##$AUNMP= <proc_1d>
##$AZFE= 0.1
##$AZFW= 0.1
##$BCFW= 0
##$BC_mod= 2
##$BYTORDP= 0
##$COROFFS= 0
##$CY= -3
##$DATMOD= 1
##$DC= 0
##$DFILT= <>
##$DTYPP= 0
##$F1P= 0
##$F2P= 0
##$FCOR= 1
##$FTSIZE= 16384
##$FT_mod= 6
##$GAMMA= 0
##$GB= 0
##$INTBC= 1
##$INTSCL= 0
##$ISEN= 128
##$LB= 0.24
##$LEV0= 0
##$LPBIN= 0
##$MAXI= 10000
##$MC2= 0
##$MEAN= 0
##$ME_mod= 0
##$MI= 1.114404
##$NCOEF= 0
##$NC_proc= -13
##$NLEV= 6
##$NOISF1= 3.799351
##$NOISF2= 2.8
##$NSP= 0
##$NTH_PI= 0
##$NZP= 0
##$OFFSET= 15.7535
##$PC= 1
##$PHC0= -15947.77
##$PHC1= 3.400791
##$PH_mod= 1
##$PKNL= yes
##$PPARMOD= 0
##$PSCAL= 0
##$PSIGN= 0
##$REVERSE= no
##$SF= 200.12999961058
##$SI= 16384
##$SIGF1= 3
##$SIGF2= 2
##$SINO= 5.538805
##$SIOLD= 16384
##$SREGLST= <1H.CDCl3>
##$SSB= 0
##$STSI= 16384
##$STSR= 0
##$SW_p= 3612.71676300578
##$SYMM= 0
##$S_DEV= 0
##$TDeff= 16384
##$TDoff= 0
##$TI= <>
##$TILT= no
##$TM1= 0
##$TM2= 0
##$TOPLEV= 0
##$USERP1= <user>
##$USERP2= <user>
##$USERP3= <user>
##$USERP4= <user>
##$USERP5= <user>
##$WDW= 1
##$XDIM= 16384
##$YMAX_p= 349991194
##$YMIN_p= -50843631
$$ End of Bruker specific parameters
$$ ---------------------------------
##NTUPLES= NMR SPECTRUM
##VAR_NAME=  FREQUENCY,     SPECTRUM/REAL,   SPECTRUM/IMAG
##SYMBOL=    X,             R,               I
##VAR_TYPE=  INDEPENDENT,   DEPENDENT,       DEPENDENT
##VAR_FORM=  AFFN,          ASDF,            ASDF
##VAR_DIM=   16384,         16384,           16384
##UNITS=     HZ,            ARBITRARY UNITS, ARBITRARY UNITS
##FACTOR=    0.220516191357247, 1,           1
##FIRST=     3152.74794581153, 0,            0
##LAST=      -459.96881719425, 0,            0
##MIN=       -459.96881719425, -50843631,    0
##MAX=       3152.74794581153, 349991194,    0
$$ Real data points
##PAGE= N=1
##DATA TABLE= (X++(R..R)), XYDATA
$$ [...]
5467B3391816O81661L81765Q3488P00325M21901J107938K230818K221059J620252
$$ 23391816 24073477 24455242 24538730 25239055 25660956 26768894 28999712 31220771 32841023
5458C2841023J958804J589613K112440J670953J174299J410033J38539n18479
$$ 32841023 34799827 36389440 38501880 40172833 41347132 42757165 42895704 42377225
5450D2377225o31513k159592j603932j654044j809717k292838k098479o36824
$$ 42377225 41745712 39586120 37982188 36328144 34518427 32225589 30127110 29490286
5442B9490286j035342j887381j706097j038643J75091r12018k00848M57319k79345
$$ 29490286 28454944 26567563 24861466 23822823 23997914 23085896 22885048 23342367 23063022
5433B3063022j077911n61943o56480R0911J16117l12238o60067r59956L56652
$$ 23063022 21985111 21423168 20766688 20857599 20973716 20661478 20001411 19041455 19398107
5424A9398107j15240r5885q0951m90571q2924L26658p69157l30795J033880j18985
$$ 19398107 19282867 19186982 19106031 18615460 18532536 18859194 18090037 17759242 18793122 18674137
5414A8674137o2749N30612k16077Q94254O62107N2785O9753p06254m14757N13742
$$ 18674137 18611388 19142000 18925923 19820177 20482284 20535069 20604822 19898568 19483811 19997553
5404A9997553n62504k90763j66363J12980N28217r69857j388846P87881O99459
$$ 19997553 19435049 19144286 18977923 19090903 19619120 18649263 17260417 18048298 18747757
5395A8747757j040573m070l59097K18041q90141k79284R88605n9053k64675n40071
$$ 18747757 17707184 17703114 17344017 17562058 16671917 16392633 17381238 17322185 17057510 16517439
5385A6517439p24254N08783O50149j026598l94706N34939P47382l29299n19670
$$ 16517439 15793185 16301968 16952117 15925519 15530813 16065752 16813134 16483835 15964165
5376A5964165J8241j63390K59882l75493k66125K12685P86853K31791n97781K05516
$$ 15964165 15982406 15819016 16078898 15703405 15437280 15649965 16436818 16668609 16070828 16276344
5366A6276344m51222p19180R48946K17523o13428L50068r38677p63272N33460
$$ 16276344 15825122 15105942 16054888 16272411 15658983 16009051 15070374 14307102 14840562
5357A4840562N34290P56287J6467l81589r35837R1802L75846N03423p79116J3715
$$ 14840562 15374852 16131139 16147606 15766017 14830180 14921982 15297828 15801251 15022135 15035850
5347A5035850m5374q1548R83357O64770j15183m1396j15723k21604m65131O41122
$$ 15035850 14990476 14908928 15892285 16557055 16441872 16400476 16284753 16063149 15598018 16239140
5337A6239140O62365q13291L87348m82068j92744L86552P16011j25721m06570
$$ 16239140 16901505 16088214 16475562 15993494 15800750 16187302 16903313 16777592 16371022
5328A6371022p34591P73773J8154n83121j51407j52476R94630N70397l68573l31524
$$ 16371022 15636431 16410204 16428358 15845237 15693830 15541354 16535984 17106381 16737808 16406284
5318A6406284P3155P46741k37336p88057O3644M59749K75922K73182m48091p2097
$$ 16406284 16479439 17226180 16988844 16200787 16264431 16724180 17000102 17273284 16825193 16753096
5308A6753096k16095K97911M32846J78164n31258Q76345P63466n49819L98133
$$ 16753096 16537001 16834912 17267758 17445922 16914664 17791009 18554475 18004656 18402789
5299A8402789M08545O88755k24456p62822m87195K34580R29144Q3110j08439O1233
$$ 18402789 18811334 19500089 19275633 18512811 18025616 18260196 19189340 19272450 19164011 19225244
5289A9225244L67376n148O35387M75143N0171M68106k22416K60076m01189O40213
$$ 19225244 19592620 19587472 20222859 20698002 20748173 21216279 20993863 21253939 20852750 21492963
5279B1492963L97858k0423m28872q9371Q60921J444406q3582n40227m71681K11099
$$ 21492963 21890821 21870398 21441526 21352155 22213076 23657482 23573900 23033673 22561992 22773091
5269B2773091j19189j65630L74654n66171K25444N31286O9858o98897N73851p6621
$$ 22773091 22653902 22488272 22862926 22296755 22522199 23053485 23123343 22424446 22998297 22921676
5259B2921676J27989j18638J17330l76633J63495n6333q41454J85429M17426K52675
$$ 22921676 23049665 22931027 23048357 22671724 22835219 22778886 21937432 22122861 22540287 22792962
5249B2792962R00552P3405K80628J85640m00607k1713j586508R57771J332191
$$ 22792962 23693514 23766919 24047547 24233187 23832580 23810867 22224359 23182130 24514321
5240B4514321r4780j22938J59119K01477P36615L36915P66296M53576l89666M12551
$$ 24514321 24419541 24296603 24455722 24657199 25393814 25730729 26497025 26950601 26560935 26973486
5230B6973486M41837k72077j63684M85651l07905J0375k19188L58399o67252L11789
$$ 26973486 27415323 27143246 26979562 27465213 27157308 27167683 26948495 27306894 26639642 26951431
5220B6951431j27644K20163J52236j85788N10088k21638Q9085l68712O78090L66292
$$ 26951431 26823787 27043950 27196186 27010398 27520486 27298848 27387933 27019221 27697311 28063603
5210B8063603o01408P13318M60938J223069L24556j362896L43037J6758L41931
$$ 28063603 27462195 28175513 28636451 29859520 30184076 28821180 29164217 29180975 29522906
5201B9522906K59112M37661J97372k34025M9788L3497k39752J18647K46554j58183
$$ 29522906 29782018 30219679 30417051 30183026 30232814 30266311 30026559 30145206 30391760 30233577
5191C0233577J99488P55812p31341J19192K31494J97779J14776l50408n21993
$$ 30233577 30433065 31188877 30457536 30576728 30808222 31006001 31120777 30770369 30248376
5182C0248376J123638o1120l76699Q38495m04185L78260J06065K89631Q60225
$$ 30248376 31372014 31310894 30934195 31772690 31368505 31746765 31852830 32142461 33002686
5173C3002686o70877K17292l11017l63554p1463O1056l28223O87712m7428L01969
$$ 33002686 32331809 32549101 32238084 31874530 31803067 31864123 31535900 32223612 32176184 32478153
5163C2478153j6114L38267L62761l02966J115271k45225j32922R2107M01426N47488
$$ 32478153 32462039 32800306 33163067 32860101 33975372 33730147 33597225 33689332 34090758 34638246
5153C4638246k05524L88436k42334r98584J015724k17036J06468N07342K13328
$$ 34638246 34432722 34821158 34578824 33580240 34595964 34378928 34485396 34992738 35206066
5144C5206066k24290N46601o53645J70167M60363N59923J71046k11775J050746
$$ 35206066 34981776 35528377 34874732 35044899 35505262 36065185 36236231 36024456 37075202
5135C7075202M4374l23810K68797K79561r6937M93459J67362N5844P88095P22306
$$ 37075202 37119576 36795766 37064563 37344124 37247187 37740646 37908008 37963852 38751947 39474253
5125C9474253M6925k14608o21142J248355L63051n82711J94135k01762Q78681
$$ 39474253 39521178 39306570 38685428 39933783 40296834 39714123 39908258 39706496 40585177
5116D0585177N26211p95221l3858J549730K83107p05571N95222J342066J60015
$$ 40585177 41111388 40316167 40282309 41832039 42115146 41409575 42004797 43346863 43506878
5107D3506878Q74844l4048K01512M80830J41359L21962J98623Q19610N91275K96483
$$ 43506878 44381722 44347674 44549186 45030016 45171375 45493337 45691960 46511570 47102845 47399328
5097D7399328N22610Q86156K28565K97944Q14357L30741K77551R63487P07142
$$ 47399328 47921938 48808094 49036659 49334603 50148960 50479701 50757252 51720739 52427881
5088E2427881R7152J175303p6006L90784m31156L8067O79001L66885R3787L95718
$$ 52427881 52525033 53700336 53624330 54015114 53583958 53622025 54301026 54667911 54761698 55157416
5078E5157416m9874p46687P09723M10337M28345l37318M92756M88484K62228j98672
$$ 55157416 55107542 54360855 55070578 55480915 55909260 55571942 56064698 56553182 56815410 56616738
5068E6616738N73024R86695L52125L64201R98244K54212M50823k32982Q43366
$$ 56616738 57189762 58176457 58528582 58892783 59891027 60145239 60596062 60363080 61206446
5059F1206446P71339J00460M94652P46832k22411N10667J436223J101771O9724
$$ 61206446 61977785 62078245 62572897 63319729 63097318 63607985 65044208 66145979 66215703
5050F6215703k54218K73457P37579J395755O71600O2018M71139O09690J423348
$$ 66215703 65961485 66234942 66972521 68368276 69039876 69101894 69573033 70182723 71606071
5041G1606071P90335O13298M54507J058909J007633k87983M89486R64643N92150
$$ 71606071 72396406 73009704 73464211 74523120 75530753 75242770 75732256 76696899 77289049
5032G7289049Q63172P35707K28737Q13701J756502J107655P95317P99498K78630
$$ 77289049 78152221 78887928 79116665 79930366 81686868 82794523 83589840 84389338 84667968
5023H4667968J450832O97968J528930K39168N38815J115674J121225J76310J342106
$$ 84667968 86118800 86816768 88345698 88584866 89123681 90239355 91360580 91536890 92878996
5014I2878996Q43196J560954J455365K96783J593819N26248J329641J001352K13938
$$ 92878996 93722192 95283146 96738511 97035294 98629113 99155361 100485002 101486354 101700292
5005A01700292J142138k23541J354633J980577J684496J026669M58987J360702
$$ 101700292 102842430 102618889 103973522 105954099 107638595 108665264 109124251 110484953
4997A10484953J121322R45796J317490J297057J193389J37614J309939J659314
$$ 110484953 111606275 112552071 113869561 115166618 116360007 116497621 117807560 119466874
4989A19466874J368924J997992J059845R69312J558399K300866Q14881R68975
$$ 119466874 120835798 122833790 123893635 124862947 126421346 128722212 129537093 130506068
4981A30506068K423888J710438J111300J605732K004903J887225K662897J886332
$$ 130506068 132929956 134640394 135751694 137357426 139362329 141249554 143912451 145798783
4973A45798783J993445J494919J724828J893802K229474K824563K441709J471217
$$ 145798783 147792228 149287147 151011975 152905777 155135251 157959814 160401523 161872740
4965A61872740J125623J135968R16799K286382N83946J99604O57214J556041R38342
$$ 161872740 162998363 164134331 165051130 167337512 167921458 168121062 168778276 170334317 171272659
4956A71272659P27053J293137K529760J328893L05705J657509K615404N96988
$$ 171272659 171999712 173292849 175822609 177151502 177457207 179114716 181730120 182327108
4948A82327108J678352J307638K414308J185241P79015K131854J904578J024566
$$ 182327108 184005460 185313098 187727406 188912647 189691662 191823516 193728094 194752660
4940A94752660Q20241K111160J349738J263786J456553J498514Q59963J509418
$$ 194752660 195572901 197684061 199033799 200297585 201754138 203252652 204112615 205622033
4932B05622033K481852J191985M40617J633781J770218J640646J413434J270315
$$ 205622033 208103885 209295870 209736487 211370268 213140486 214781132 216194566 217464881
4924B17464881P57093J569653J754912R11973P14259J622898J405252P65179J060271
$$ 217464881 218221974 219791627 221546539 222458512 223172771 224795669 226200921 226966100 228026371
4915B28026371J631751J750803J412899P56170L43554R96701J697244J680695
$$ 228026371 229658122 231408925 232821824 233577994 233921548 234918249 236615493 238296188
4907B38296188R08840Q82889M88360O82668K158703J172164J19327j38054J217434
$$ 238296188 239205028 240087917 240576277 241258945 243417648 244589812 244709139 244571085 245788519
4898B45788519J179652R77715O02817N7401J019199J012768P14004R7182P96379
$$ 245788519 246968171 247945886 248548703 248606104 249625303 250638071 251352075 251449257 252245636
4889B52245636n7957m10226L34796K12581k72036j53561n2507l58072J33363k84636
$$ 252245636 252187679 251777453 252112249 252324830 252052794 251899233 251846726 251488654 251622017 251337381
4879B51337381o49316j18367r34581j261942n24341p33457q02405M95641j186006
$$ 251337381 250688065 250569698 249635117 248373175 247848834 247115377 246312972 246808613 245622607
4870B45622607j395402j088757j391672k008369r56775p079k96785p41452j878306
$$ 245622607 244227205 243138448 241746776 239738407 238781632 238774553 238477768 237736316 235858010
4861B35858010r19893p78182j758881j351593j777488k034508q60979q53198j508910
$$ 235858010 234938117 234159935 232401054 231049461 229271973 227237465 226376486 225523288 224014378
4852B24014378k244108j169470j498296p33259j860221k292378j551789j029193
$$ 224014378 221770270 220600800 219102504 218369245 216509024 214216646 212664857 211635664
4844B11635664j888960j554379j390534r37812j012892j863347j329814j812517
$$ 211635664 209746704 208192325 206801791 205863979 204851087 202987740 201657926 199845409
4836A99845409j297876j714854j754734j260875j597488j958627q93176j662126
$$ 199845409 198547533 196832679 195077945 193817070 192219582 190260955 189367779 187705653
4828A87705653j912643j255933k437986j996207j074430k579080j740584j034788
$$ 187705653 185793010 184537077 182099091 180102884 179028454 176449374 174708790 173674002
4820A73674002j082081j163659j534447j261614j755253j452619j681918k163705
$$ 173674002 172591921 171428262 169893815 168632201 166876948 165424329 163742411 161578706
4812A61578706j891194j113231j660411j930172j082732r60498j045072k126749
$$ 161578706 159687512 158574281 156913870 154983698 153900966 152940468 151895396 149768647
4804A49768647k222219j023720j438814q71152j098050j416548k043715k087532
$$ 149768647 147546428 146522708 145083894 144212742 143114692 141698144 139654429 137566897
4796A37566897q73567k4860j954246j277147j530027j211628r38338j830028j222946
$$ 137566897 136693330 136668470 134714224 133437077 131907050 130695422 129757084 127927056 126704110
4787A26704110j04128j279064j469268p64237j404017r03460j199788j488357
$$ 126704110 126599982 125320918 123851650 123087413 121683396 120779936 119580148 118091791
4779A18091791p28443j659721j260060o7303j632875p99359p86664j591027j220764
$$ 118091791 117363348 115703627 114443567 114376264 112743389 111944030 111157366 109566339 108345575
4770A08345575o1789j570151j555084r4089r35521j035703j403964p90575j26510
$$ 108345575 108283786 106713635 105158551 105064462 104128941 103093238 101689274 100898699 100772189
4761A00772189n04924m68159q05286j580854q64081j031170o99025o35900j120177
$$ 100772189 100267265 99799106 98993820 97412966 96548885 95517715 94818690 94182790 93062613
4752I3062613q56887j035697n82335j407533q15298m30446j87998k87783j051486
$$ 93062613 92205726 91170029 90587694 89180161 88364863 87934417 87746419 87458636 86407150
4743H6407150j281786m37349n55113r78088r9587o48882j287409q80319p27203
$$ 86407150 85125364 84688015 84132902 83154814 83055227 82406345 81118936 80238617 79511414
4734G9511414k54158M99573o30221p63972o90906o90925j124975r83757j67426
$$ 79511414 79257256 79756829 79126608 78362636 77671730 76980805 75855830 74872073 74704647
4725G4704647r85571R6503j45091m16746n76055o98734j91249o98161p43061o39964
$$ 74704647 73719076 73815579 73670488 73253742 72677687 71978953 71787704 71089543 70346482 69706518
4715F9706518j417187n95066K30506m24035p94145p61143P63468j228205j517298
$$ 69706518 68289331 67694265 67924771 67500736 66706591 65945448 66708916 65480711 63963413
4706F3963413M08475q75995P2370n60836r37395r46631q50478p16925j49869j13466
$$ 63963413 64371888 63495893 63568263 63007427 62070032 61123401 60272923 59555998 59406129 59292663
4696E9292663m71614j90700J70994m59890q33320j42384q15297l74816j62343
$$ 59292663 58821049 58630349 58801343 58341453 57508133 57365749 56550452 56175636 56013293
4687E6013293M5574l02440j616859K76515p73543p79004k18881j01152k54546
$$ 56013293 56058867 55756427 54139568 54416083 53642540 52863536 52644655 52543503 52288957
4678E2288957l92811j106508J68072J12471L36683l56218o6274K72636r66934
$$ 52288957 51896146 50789638 50957710 51070181 51406864 51050646 50984372 51257008 50290074
4669E0290074m2472r87260j627147N3659J26766q98260q37610j145669P34796
$$ 50290074 50247602 49260342 47633195 47686854 47813620 46915360 46077750 44932081 45666877
4660D5666877L46813n39383j181890J88522J6708q74206q49288r4311P14926r57604
$$ 45666877 46013690 45474307 44292417 44480939 44497647 43623441 42774153 42679842 43394768 42437164
4650D2437164m65352r1828j144240m80725J99576k87300k72807n50666j71131
$$ 42437164 41971812 41879984 40735744 40255019 40454595 40167295 39894488 39343822 39172691
4641C9172691n56549j77538j95569p68573j26670j97056p13541q5127K14908k53506
$$ 39172691 38616142 38438604 38243035 37474462 37347792 37150736 36437195 36352068 36566976 36313470
4631C6313470n22205n53965m46421n35895K61111K1133R0522K18842j062426r63825
$$ 36313470 35791265 35237300 34790879 34254984 34516095 34537228 34627750 34846592 33784166 32820341
4621C2820341l50140J41208l50647N52254R2536n22807K00195p27663o2293q12637
$$ 32820341 32470201 32611409 32260762 32813016 32905552 32382745 32582940 31855277 31792984 30980347
4611C0980347n82737n64631P53104j162756K05470M09777m2198L51661p03804
$$ 30980347 30397610 29832979 30586083 29423327 29628797 30038574 29996376 30348037 29644233
4602B9644233p71912P1584K26120j157991l94228L61294l17409k18639l49669
$$ 29644233 28872321 28943905 29170025 28012034 27617806 27979100 27661691 27443052 27093383
4593B7093383p96985j13320P53890n17323o9829k08036N95083o61459k48205n64640
$$ 27093383 26296398 26183078 26936968 26419645 26349816 26141780 26736863 26075404 25827199 25262559
4583B5262559k81291p09516p90259j22044R79034K45284p66238l15464m52614
$$ 25262559 24981268 24271752 23481493 23359449 24338483 24583767 23817529 23502065 23049451
4574B3049451J88291O09192l76886l55220o12688l42857o21682o0371P37809j78971
$$ 23049451 23237742 23846934 23470048 23114828 22502140 22159283 21537601 21477230 22215039 22036068
4564B2036068n87882O538j39772p89771K48980K4398l30199o67362l85308M2571
$$ 22036068 21448186 21454724 21314952 20525181 20774161 20798559 20468360 19800998 19415690 19458261
4554A9458261Q23133m31987N4045j261273l24322L35263N61828K44712j44220
$$ 19458261 20281394 19849407 19903452 18642179 18317857 18653120 19214948 19459660 19315440
4545A9315440r49761m63733r80026K97238J18151m75580J83002O70997o796m15221
$$ 19315440 18365679 17901946 16921920 17219158 17337309 16861729 17044731 17715728 17708932 17293711
4535A7293711l49944J95639k84391o11549O53120k75559J9313P6262j87442k39509
$$ 17293711 16943767 17139406 16855015 16243466 16896586 16621027 16640340 16716602 16529160 16289651
4525A6289651n71440j3831k53666M75051j0523j6735l525J71646n11671O64002
$$ 16289651 15718211 15704380 15450714 15925765 15915242 15898507 15894982 16066628 15554957 16218959
4515A6218959q60048o15053P88543n48935l05399k67640m13904j70849o6952N28181
$$ 16218959 15358911 14743858 15532401 14983466 14678067 14410427 13996523 13825674 13758722 14286903
4505A4286903N32263j100827O2526K77454m84773j89567K08472K10544k61698
$$ 14286903 14819166 13718339 13780865 14058319 13573546 13383979 13592451 13802995 13541297
4496A3541297j07092j37475O05783K12447j46407j84333M56034P1357j42317o80596
$$ 13541297 13434205 13296730 13902513 14114960 13968553 13784220 14240254 14311611 14169294 13488698
4486A3488698J33767o39966j34610Q0578J68454M33070m08340L74364p8453N10286
$$ 13488698 13622465 12982499 12847889 12928467 13096921 13529991 13121651 13496015 13417562 13927848
4476A3927848L21317k26401p39532O19085N48459L70091j31125j191415l73005
$$ 13927848 14249165 14022764 13283232 13902317 14450776 14820867 14689742 13498327 13125322
4467A3125322J53080k04980m87555L76382M35896M45269K99074m83302j39336
$$ 13125322 13278402 13073422 12585867 12962249 13398145 13843414 14142488 13659186 13519850
4458A3519850L79487J85530m03510M73363M44473M79326R4127L81041N4755k26890
$$ 13519850 13899337 14084867 13681357 14154720 14599193 15078519 15172646 15553687 15608442 15381552
4448A5381552l16744j10557m87611M12779J131580O01196j38506Q40456N58686
$$ 15381552 15064808 14954251 14466640 14879419 16010999 16612195 16473689 17314145 17872831
4439A7872831M41312l83304K79763o53688o09563P89432J609639j2067j99542
$$ 17872831 18314143 17930839 18210602 17556914 16947351 17736783 19346422 19334355 19134813
4430A9134813k89670l79394R60658P73318L45268N08814L80142O63532J59442
$$ 19134813 18845143 18465749 19426407 20199725 20544993 21053807 21433949 22097481 22256923
4421B2256923L14738m62928J065655P77178O22808O35628p6135J410085L80538
$$ 22256923 22571661 22108733 23174388 23951566 24574374 25210002 25133867 26543952 26924490
4412B6924490Q73240O82023R22299j42283N84692J719620J877744J381270J228735
$$ 26924490 27797730 28479753 29402052 29259769 29844461 31564081 33441825 34823095 36051830
4403C6051830J510669K113620J444622J096461K174629K229701K076752K672839
$$ 36051830 37562499 39676119 41120741 42217202 44391831 46621532 48698284 51371123
4395E1371123K807115K590364K682934J915071L409834K517630K412036L495189
$$ 51371123 54178238 56768602 59451536 61366607 64776441 67294071 69706107 73201296
4387G3201296J260788K458503J990621K225306J848031J769588J056275J274780
$$ 73201296 74462084 76920587 78911208 81136514 82984545 84754133 85810408 87085188
4379H7085188L56290O83526j15494N09624q64020o23857m80658r82443j305359
$$ 87085188 87441478 88125004 88009510 88519134 87655114 87031257 86550599 85568156 84262797
4370H4262797j944961k677428k183428k783054k306327k146070k418109k467617
$$ 84262797 82317836 79640408 77456980 74673926 72367599 70221529 67803420 65335803
4362F5335803k915006k814575l461400k965419k478314k509859k519144j321110
$$ 65335803 62420797 59606222 56144822 53179403 50701089 48191230 45672086 44350976
4354D4350976l024712k296144k437287j004435j749562m86425j721363j323236
$$ 44350976 41326264 39030120 36592833 35588398 33838836 33352411 31631048 30307812
4346C0307812j774968j251363p54175q98177j839714j065748q44993q93556J12011
$$ 30307812 28532844 27281481 26527306 25629129 23789415 22723667 21878674 20985118 21097129
4337B1097129j237901n49968r91577n60210o64643m53708p18267n37941n52885
$$ 21097129 19859228 19309260 18317683 17757473 17092830 16639122 15920855 15382914 14830029
4328A4830029J44697O5007n39425l01568j61817j260486j091255Q21060l09414
$$ 14830029 14974726 15039733 14500308 14198740 14036923 12776437 11685182 12506242 12196828
4319A2196828q82364l46634k6292q41501m57352K69462n14112l53003K09726k26977
$$ 12196828 11314464 10967830 10941538 10100037 9642685 9912147 9398035 9045032 9254758 9027781
4309I027781o1591j185030n49696Q68826P39545j088082L55847J64384K63576
$$ 9027781 8966190 7781160 7231464 8100290 8839835 7751753 8107600 8271984 8535560
4300H535560o34789l84114M16912N07449m28832m37542j37902n49456K83702o68682
$$ 8535560 7900771 7516657 7933569 8441018 8012186 7574644 7436742 6887286 7170988 6502306
4290F502306p8067J8337L47436p46011M39668J64345P05517l05974L17215l23406
$$ 6502306 6424239 6442576 6790012 6044001 6483669 6648014 7353531 7047557 7364772 7041366
4280G041366o02241m87886J70856o73300J88633j73982k67317J56625k74510O22305
$$ 7041366 6439125 5951239 6122095 5448795 5637428 5463446 5196129 5352754 5078244 5700549
4270E700549O32051l57331m03963K46939k62077m69433n82164K06879Q49434l83314
$$ 5700549 6332600 5975269 5571306 5818245 5556168 5086735 4504571 4711450 5560884 5177570
4260E177570N67000O28118j242245L67857k80423L04338L41616r33812l46609
$$ 5177570 5744570 6372688 5130443 5498300 5217877 5522215 5863831 4930019 4583410
4251D583410l75236L00546J8221k30690N17392L59680l09568l16449k71306L01761
$$ 4583410 4208174 4508720 4526941 4296251 4813643 5173323 4863755 4547306 4276000 4577761
4241D577761l85115k83592j97274n16101L53283R13485m25973K86532K82846l93056
$$ 4577761 4192646 3909054 3711780 3195679 3548962 4462447 4036474 4323006 4605852 4212796
4231D212796P6180k14414l12316M39565N2383K41032o63056K46311J053182j71197
$$ 4212796 4288976 4074562 3762246 4201811 4254194 4495226 3832170 4078481 5131663 4960466
4221D960466l66275n30660m93392j89906Q02110m70381K56854l88492j011516
$$ 4960466 4594191 4063531 3570139 3380233 4182343 3711962 3968816 3580324 2568808
4212B568808l88795J527971o76052R36281m25173m58253O53463O25751j84797
$$ 2568808 2180013 3707984 3031932 3968213 3543040 3084787 3738250 4364001 4179204
4203D179204o16609L87772l92183j81202J420655K61133p20697R669n76857r9405
$$ 4179204 3562595 3950367 3558184 3376982 4797637 5058770 4338073 4347742 3770885 3671480
4193C671480J71910N41866P38857j68431j230265M64224j54962K17040J120512
$$ 3671480 3843390 4385256 5124113 4955682 3725417 4189641 4034679 4251719 5372231
4184E372231j03397j43100j66279n23175K73754p32675o90063J76902N1354R50638
$$ 5372231 5268834 5125734 4959455 4436280 4710034 3977359 3287296 3464198 3515552 4466190
4174D466190N29429J67216O60071p48402k14732j84548P44962M450p50312N76719
$$ 4466190 4995619 5162835 5822906 5074504 4859772 4675224 5420186 5424636 4674324 5251043
4164E251043K64080k81516k2406k72758O6611m5016J99573J062908Q02143m10672
$$ 5251043 5515123 5233607 5211201 4938443 5005054 4960038 5159611 6222519 7024662 6613990
4154F613990l2199j78934r6277M04459q88495Q18719L63981k11176K35893n36434
$$ 6613990 6581791 6402857 6306580 6711039 5822544 6641263 7005244 6794068 7029961 6493527
4144F493527L12825n3838K45232P07427j029447O08242J12360K28241K40460J591199
$$ 6493527 6806352 6752514 6997746 7705173 6675726 7283968 7396328 7624569 7865029 9456228
4134I456228J091q56005P24271K33543r0513j02451N94285l4436n97051k01882
$$ 9456228 9457319 8601314 9325585 9559128 9468615 9366164 9960449 9926013 9328962 9127080
4124I127080O17739N70711L1668Q1708m64709O49212J45575m79851L46561J486374
$$ 9127080 9744819 10315530 10347198 10428906 9964197 10613409 10758984 10279133 10625694 12112068
4114A2112068N36939Q451J06857M0742M85610L69749L65177l61707r2846K93251
$$ 12112068 12649007 12657458 12764315 12805057 13290667 13660416 14025593 13663886 13571040 13864291
4104A3864291J000621L66751N22043K24031J538059J69616q99670M49227N10818
$$ 13864291 14864912 15231663 15753706 15977737 17515796 17685412 16785742 17234969 17745787
4095A7745787L88752O74574L59269O47308N38668L25941M83369O27565O8197J133801
$$ 17745787 18134539 18809113 19168382 19815690 20354358 20680299 21163668 21791233 21859430 22993231
4085B2993231O62648L81928L67753J302027J35140J564530O23283O43411Q29711
$$ 22993231 23655879 24037807 24405560 25707587 25842727 27407257 28030540 28673951 29503662
4076B9503662P67333J845563K49624J021996N83602J540105J788932R33949P34773
$$ 29503662 30270995 32116558 32366182 33388178 33971780 35511885 37300817 38234766 38969539
4067C8969539N53483Q52893k36547P64766P92568N5668j07547O90309J574544
$$ 38969539 39523022 40375915 40139368 40904134 41696702 41752370 41644823 42335132 43909676
4058D3909676K19644R66731L91764L75502m29846P64049O51210J205769N56863
$$ 43909676 44129320 45096051 45487815 45863317 45433471 46197520 46848730 48054499 48611362
4049D8611362J385327Q77250Q21990J087201k016L15103R44096J061300J030460
$$ 48611362 49996689 50873939 51695929 52783130 52781114 53096217 54040313 55101613 56132073
4040E6132073O72310L87762K14198P48193J050098O9486N25336O54623k6315j8056
$$ 56132073 56804383 57192145 57406343 58154536 59204634 59274120 59799456 60454079 60427764 60409708
4030F0409708N62428Q84112J186678n09820R40974M3363j10568Q17984P25802
$$ 60409708 60972136 61856248 63042926 62533106 63474080 63517443 63406875 64224859 64950661
4021F4950661N31574R46629M39761P5272N72630j25788Q85209l47343m70858j25226
$$ 64950661 65482235 66428864 66868625 66943897 67516527 67390739 68275948 67928605 67457747 67332521
4011F7332521R04404J562379N81037M78087O64171P09436J200437J848672K208050
$$ 67332521 68236925 69799304 70380341 70858428 71522599 72232035 73432472 75281144 77489194
4002G7489194K468512J961987K413304K989364L925872M544503O100583P425707
$$ 77489194 79957706 81919693 84332997 87322361 91248233 95792736 101893319 109319026
3994A09319026Q136055Q463296R538058R292048Q796788P231875M685045J916134
$$ 109319026 117455081 125918377 135456435 144748483 153545271 160777146 165462191 167378325
3986A67378325k129764n252457p921466r747830j2291223j1399520j0498600j0113510
$$ 167378325 165248561 159996104 152074638 142326808 130035585 118636065 108137465 98023955
3978I8023955q387938o336179p071397m792459m409873l073632m094841k693922
$$ 98023955 89636017 83299838 76228441 71435982 67026109 63952477 59857636 57163714
3970E7163714j891577l000395k827915l255683j751660j526318j437292j925665
$$ 57163714 55272137 52271742 49443827 46188144 44436484 42910166 41472874 39547209
3962C9547209j689275j542515m50711j278534j154783r80777k1121j070148j172410
$$ 39547209 37857934 36315419 35864708 34586174 33431391 32450614 32429493 31359345 30186935
3953C0186935l97092q2191j386614j154217k7813J27787n54938r28329p49902
$$ 30186935 29789843 29707652 28321038 27166821 27139008 27266795 26711857 25783528 25033626
3944B5033626o52462o62049j93153k09014j055455o16811j46244j567427r41735
$$ 25033626 24381164 23719115 23525962 23316948 22261493 21644682 21498438 19931011 18989276
3935A8989276Q3479p36283l69354p63958J27905q02470o4548K7318o67785n16166
$$ 18989276 19072755 18336472 17967118 17203160 17331065 16528595 16464047 16491365 15823580 15307414
3925A5307414r18246l65987l02499n97326m31146n50750J24885K68891O97781
$$ 15307414 14389168 14023181 13720682 13123356 12692210 12141460 12266345 12535236 13233017
3916A3233017j25773l82347L26004j049105J87207L10m38586l32810Q1333n87201
$$ 13233017 13107244 12724897 13050901 12001796 12189003 12189313 11750727 11417917 11499250 10912049
3906A0912049M83752l82437j1844n3128o70012J46308j30969r44092l38348K5580
$$ 10912049 11395801 11013364 11001520 10948392 10278380 10424688 10293719 9349627 9011279 9036859
3896I036859J01821l31476l1967L59912K75019M08872n03214k60658K97016Q1801
$$ 9036859 9138680 8807204 8775237 9135149 9410168 9819040 9315826 9055168 9352184 9433985
3886I433985l07229n1913j51740m59495j71711m10321l09325J037524M23169j69619
$$ 9433985 9126756 9074843 8923103 8463608 8291897 7881576 7572251 8609775 9032944 8863325
3876H863325m78061o27369J570805k08724o53734m42140j60383k61828m26110
$$ 8863325 8385264 7757895 9328700 9119976 8466242 8024102 7863719 7601891 7175781
3867G175781P01046j13457M88021p18175K18948j19633J05965n17727J58505J057305
$$ 7175781 7876827 7763370 8251391 7533216 7752164 7632531 7738496 7220769 7379274 8436579
3857H436579J72873n96510L41620Q57594j053809p17536P15753J15012K02845
$$ 8436579 8609452 8012942 8354562 9212156 8158347 7440811 8156564 8271576 8474421
3848H474421k73370m70031M75755R10812j51573p84662P5799m856M84039j6524
$$ 8474421 8201051 7731020 8206775 9117587 8966014 8181352 8257151 8252295 8736334 8719810
3838H719810L97108K22232l62397l54188p03183N70297J75476Q9876J41855p9076
$$ 8719810 9116918 9339150 8976753 8622565 7919382 8489679 8665155 8755031 8896886 8817810
3828H817810L42498P43744j025360o04491R51340O88579p22477j00584n9389Q69735
$$ 8817810 9160308 9904052 8878692 8274201 9225541 9914120 9191643 9091059 9031670 9901405
3818I901405K27122j166823o72315P01650K25496l49403k2002O21906L74747M67648
$$ 9901405 10128527 8961704 8289389 8991039 9216535 8867132 8845130 9467036 9841783 10309431
3808A0309431m62380l73426J5392n62795K89245L1491R9442j5115J126502K44465
$$ 10309431 9847051 9473625 9489017 8926222 9215467 9246958 9346400 9331285 10457787 10702252
3798A0702252n00190l95270K97247N01716K06006M35287n01847O83762j12877
$$ 10702252 10202062 9806792 10104039 10605755 10811761 11247048 10745201 11428963 11316086
3789A1316086l28589J025705J51087r3244k96310j28385j22545j0339L68896j10123
$$ 11316086 10987497 12013202 12164289 12071045 11774735 11646350 11523805 11513466 11882362 11772239
3779A1772239J043329J201527n97317J183748k56349m55800N45706L98055k10172
$$ 11772239 12815568 14017095 13419778 14603526 14347177 13891377 14437083 14835138 14624966
3770A4624966O08976k84041L92758K98019M32230J32847p90385m93395P11550
$$ 14624966 15233942 14949901 15342659 15640678 16072908 16205755 15415370 14921975 15633525
3761A5633525K42297p3765R25485L17414l11359R65116N0474K9135j9980P15096
$$ 15633525 15875822 15802057 16727542 17044956 16733597 17698713 17749187 17778322 17758342 18473438
3751A8473438K44443J50263L37956m0031m95394k71354J122072J057777L82650
$$ 18473438 18717881 18868144 19206100 19166069 18670675 18399321 19521393 20579170 20961820
3742B0961820m54303N74695L8240J83410P21918k15114K27707K03063N50842R33803
$$ 20961820 20507517 21082212 21120452 21303862 22025780 21810666 22038373 22241436 22792278 23726081
3732B3726081o32880j3250j77656P69520Q07361K99714Q70580P84067R0141O57685
$$ 23726081 23093201 23079951 22902295 23671815 24479176 24778890 25649470 26433537 26523678 27181363
3722B7181363l87976Q10576P52101Q30693P16261l58153k87611J075648M99064
$$ 27181363 26793387 27603963 28356064 29186757 29903018 29544865 29257254 30332902 30831966
3713C0831966O14015J296578M53640K87563J30892Q22157P05954M69782K82917
$$ 30831966 31445981 32742559 33196199 33483762 33614654 34436811 35142765 35612547 35895464
3704C5895464L10166M16473M16717R73363M06282M79375n10310m20162J070310
$$ 35895464 36205630 36622103 37038820 38012183 38418465 38897840 38387530 37967368 39037678
3695C9037678R24553J132805K47221N99088k64647M59946K54069K09938O35999
$$ 39037678 39962231 41095036 41342257 41941345 41676698 42136644 42390713 42600651 43236650
3686D3236650K59537J05018P53707M25862J008181J44389M16228L22170K10816
$$ 43236650 43496187 43601205 44354912 44780774 45788955 45933344 46349572 46671742 46882558
3677D6882558Q76261Q14523Q48268J67440K37106Q17596R77496L64115M63388
$$ 46882558 47758819 48573342 49421610 49589050 49826156 50643752 51621248 51985363 52448751
3668E2448751J95487n6802R62236L83015Q16768J121321N42796N46255J70647
$$ 52448751 52644238 52587436 53549672 53932687 54749455 55870776 56413572 56959827 57130474
3659E7130474O17740K07370J064718N83822L87546N35367J377369M69162J570695
$$ 57130474 57748214 57955584 59020302 59604124 59991670 60527037 61904406 62373568 63944263
3650F3944263L89074k96350J093439O31655q13204L1719P43196P34142J019032
$$ 63944263 64333337 64036987 65130426 65762081 64948877 64980596 65723792 66457934 67476966
3641F7476966N31134J52834M304j53670R52096N84780M78986L64628L17627N25200
$$ 67476966 68008100 68160934 68165238 68011568 68963664 69548444 70027430 70392058 70709685 71234885
3631G1234885M00294N59668L82949K32378k19477m25587k27580j39310l63542
$$ 71234885 71635179 72194847 72577796 72810174 72590697 72165110 71937530 71798220 71434678
3622G1434678J408621L53672O44960l16823k98750L12984j33808o48206l30259
$$ 71434678 72843299 73196971 73841931 73525108 73226358 73539342 73405534 72757328 72427069
3613G2427069j01792n4516m86014k15128M92819k96117m11209l63549j7592r93345
$$ 72427069 72325277 72270761 71784747 71569619 72062438 71766321 71355112 70991563 70973971 69980626
3603F9980626n25138N83644L27799o87667o64844k41139q82385L34751M6578m12746
$$ 69980626 69455488 70039132 70366931 69679264 69014420 68773281 67890896 68225647 68272225 67859479
3593F7859479n05027q26891l40820j20281M57228j644882p01240k53245j90607
$$ 67859479 67354452 66527561 66186741 66066460 66523688 64878806 64177566 63924321 63733714
3584F3733714P4014l7337o03717J97607J45583P8J16846q8868l3367J100n64031
$$ 63733714 63807728 63770391 63166674 63364281 63509864 63509942 63626788 63537920 63504553 63505653 62941622
3573F2941622P97262L58548n19704k40747p9350L57680K88896J5865m23501l17274
$$ 62941622 63738884 64097432 63577728 63336981 63257631 63615311 63904207 63920072 63496571 63179297
3563F3179297M84294J41410J852l14772P6326L68084k81618M37806N12986J48308
$$ 63179297 63663591 63805001 63806853 63492081 63568407 63936491 63654873 64092679 64605665 64753973
3553F4753973N87530m05631P72188L12472p60464M00215M14116R80421J99731
$$ 64753973 65341503 64935872 65708060 66020532 65260068 65660283 66074399 67054820 67254551
3544F7254551N70414l10142K05247r6051j70834R35501R48437j21133J43774O4117
$$ 67254551 67824965 67514823 67720070 67624019 67453185 68388686 69337123 69215990 69359764 69423881
3534F9423881J353816P91034J6907K23089M34144l09583M53093L73348J147434
$$ 69423881 70777697 71568731 71585638 71808727 72242871 71933288 72386381 72759729 73907163
3525G3907163P20660M22250K56592R54495j28215L24795R66689N45183l36901
$$ 73907163 74627823 75050073 75306665 76261160 76132945 76457740 77424429 77969612 77632711
3516G7632711J048064P16468K73463O84732M94752J207472O71474J8704m08J080248
$$ 77632711 78680775 79397243 79670706 80355438 80850190 82057662 82729136 82747840 82747432 83827680
3506H3827680J116895P62912N8095J496126L74867J48707Q57756R54163P44083
$$ 83827680 84944575 85707487 85765582 87261708 87636575 87785282 88643038 89597201 90341284
3497I0341284N80784R32090N80272O43697N08141J699816L67255M87936Q33200
$$ 90341284 90922068 91854158 92434430 93078127 93586268 95286084 95653339 96141275 96974475
3488I6974475J416613N83251Q78289R83672J041785J395595J87810K035812J055366
$$ 96974475 98391088 98974339 99852628 100836300 101878085 103273680 103461490 105497302 106552668
3479A06552668N05639J044407O88136Q62286J375217N64277J178681J011087J568872
$$ 106552668 107058307 108102714 108790850 109653136 111028353 111592630 112771311 113782398 115351270
3470A15351270J187496Q90188R45002N71362J846045N50751M99148Q89759J045934
$$ 115351270 116538766 117428954 118373956 118945318 120791363 121342114 121841262 122731021 123776955
3461A23776955L83387O24082J171614Q54082J332486J22776L39513Q08033Q69028
$$ 123776955 124160342 124784424 125956038 126810120 128142606 128265382 128604895 129412928 130281956
3452A30281956r5116J43554j16643j8431l27689L53082p7124j72292K9042J25390
$$ 130281956 130186840 130330394 130213751 130195320 129867631 130220713 130143589 129971297 130000339 130125729
3442A30125729m61067q18405q18129j095286p03883n19248q41789j219808q50464
$$ 130125729 129664662 128846257 128028128 126932842 126228959 125709711 124867922 123648114 122797650
3433A22797650m04581j017824q40971l84929n94643q93321j017748j452598o22042
$$ 122797650 122393069 121375245 120534274 120149345 119554702 118661381 117643633 116191035 115568993
3424A15568993j321226j129532r51300l03567l38954j788133r90465r04340r16309
$$ 115568993 114247767 113118235 112166935 111863368 111524414 109736281 108745816 107841476 106925167
3415A06925167k59242n66716j312495j884147j013437M09923q52960j372870j251697
$$ 106925167 106665925 106099209 104786714 102902567 101889130 102299053 101446093 100073223 98821526
3406I8821526o55361j094475j873334l84710j388631j199066q28499j225740k29556
$$ 98821526 98166165 97071690 95198356 94813646 93425015 92225949 91397450 90171710 89942154
3397H9942154r96980j587320p27171J2207q17957j478439q18732j327967j74752
$$ 89942154 88945174 87357854 86630683 86642890 85824933 84346494 83527762 82199795 82025043
3388H2025043K11789l96939j364629j410586j145413N9850j91788k98889q28634
$$ 82025043 82236832 81839893 80475264 79064678 77919265 77979115 77787327 77488438 76659804
3379G6659804j60733j379554p76909K59183j43306n91752n63356m62595q15793
$$ 76659804 76499071 75119517 74342608 74601791 74458485 73866733 73303377 72840782 72024989
3370G2024989p94700k71675j89296p47065p80703M23078K41156n49189k70255
$$ 72024989 71230289 70958614 70769318 70022253 69241550 69664628 69905784 69356595 69086340
3361F9086340l58591o13404j064974k61542k68100n17199l23366l17894j90327
$$ 69086340 68727749 68114345 67049371 66787829 66519729 66002530 65679164 65361270 65170943
3352F5170943J82632l66042P4971j220155N34297l59831m50628o32589m90259
$$ 65170943 65353575 64987533 65062504 63842349 64376646 64016815 63566187 62933598 62443339
3343F2443339L05560N27414n83043L21079k09352J67033J55832m07248m82805
$$ 62443339 62748899 63276313 62693270 63014349 62804997 62972030 63127862 62720614 62237809
3334F2237809l40299k3018M66709N28233M43147l210p6217o84747O47176J56794
$$ 62237809 61897510 61874492 62341201 62869434 63312581 63309371 63233154 62548407 63195583 63352377
3324F3352377L05043j57132p1267M74614J774336j18878q3118O11975j2554N81401
$$ 63352377 63657420 63500288 63429021 63903635 65677971 65559093 65475975 66087950 66075396 66656797
3314F6656797P52966J446804O68183M6068K44870J060734O77994M24558m3710
$$ 66656797 67409763 68856567 69524750 69570818 69815688 70876422 71554416 71978974 71935264
3305G1935264J297042P45965Q39372N71688R07245J550941O82815J482930L75935
$$ 71935264 73232306 73978271 74817643 75389331 76296576 77847517 78530332 80013262 80389197
3296H0389197R28064J971475O47353M32669J888688Q85952J528501J666283R58832
$$ 80389197 81317261 83288736 83936089 84368758 86257446 87143398 88671899 90338182 91297014
3287I1297014J728217J323033J499929J419089J474507K200599Q83415K297532
$$ 91297014 93025231 94348264 95848193 97267282 98741789 100942388 101825803 104123335
3279A04123335K813882K087260J012555J847906K323588J623895K574183J705604
$$ 104123335 106937217 109024477 110037032 111884938 114208526 115832421 118406604 120112208
3271A20112208L317065J525581K629391K457679K982782K406771K473565K821248
$$ 120112208 123429273 124954854 127584245 130041924 133024706 135431477 137905042 140726290
3263A40726290L197262K186038K825517K962333L616742L891804L421532L022324
$$ 140726290 143923552 146109590 148935107 151897440 155514182 159405986 162827518 165849842
3255A65849842K901844K519859K789242L036797L206325K436482K612535K806894
$$ 165849842 168751686 171271545 174060787 177097584 180303909 182740391 185352926 188159820
3247A88159820L085442L034545K540958K042741J901556J913305J483928K223925
$$ 188159820 191245262 194279807 196820765 198863506 200765062 202678367 204162295 206386220
3239B06386220Q22451P29778R89791R61807M47553P18254q32558m57761q29779
$$ 206386220 207208671 207938449 208928240 209890047 210337600 211055854 210223296 209765535 208935756
3230B08935756j539141q16368m62424k269422k298421j872649k163863k338041
$$ 208935756 207396615 206580247 206117823 203848401 201549980 199677331 197513468 195175427
3222A95175427l317170k517330k467202k442110l223083l429921k771558k727653
$$ 195175427 191858257 189340927 186873725 184431615 181208532 177778611 175007053 172279400
3214A72279400k822380k827020k913581k231998l315733l483571k496926k622234
$$ 172279400 169457020 166630000 163716419 161484421 158168688 154685117 152188191 149565957
3206A49565957k657511j546197k955801l156735k047481k044425k002557l312565
$$ 149565957 146908446 145362249 142406448 139249713 137202232 135157807 133155250 129842685
3198A29842685l305272j124008k751437l228491q69475k020778k377990j411330
$$ 129842685 126537413 125413405 122661968 119433477 118564002 116543224 114165234 112753904
3190A12753904k407745j348016k121456j917591j969119j847204j244640j312660
$$ 112753904 110346159 108998143 106876687 104959096 102989977 101142773 99898133 98585473
3182I8585473r28954j253281q49964j050644j965452l51776l91519k048665k61965
$$ 98585473 97656519 96403238 95553274 94502630 92537178 92185402 91793883 89745218 89483253
3173H9483253o21167n30838o49197o96225n85816n74591q63626K01965l36433
$$ 89483253 88862086 88331248 87682051 86985826 86400010 85825419 84961793 85163758 84827325
3164H4827325n13503p33269M30590j53757j294771j017363Q0496l0586L98252
$$ 84827325 84313822 83580553 84011143 83857386 82562615 81545252 81625748 81595162 81993414
3155H1993414K80176j8143p82589k82378j31000j105541M12530k95191J44603
$$ 81993414 82273590 82255447 81472858 81190480 81059480 79953939 80366469 80071278 80215881
3146H0215881J5086L2729j129049j74972J224476J2581o90718k92106J35863J44895
$$ 80215881 80230967 80263696 79134647 78959675 80184151 80196732 79506014 79213908 79349771 79494666
3136G9494666L83612J15666N4702L00108K77498l76526L36459J436086q9452j87575
$$ 79494666 79878278 79993944 80048646 80348754 80626252 80249726 80586185 82022271 81932819 81745244
3126H1745244O46122M98949m06447Q66476J030135j531K63182O52951k99098P12754
$$ 81745244 82391366 82890315 82483868 83350344 84380479 84378948 84642130 85295081 84995983 85708737
3116H5708737R24500R86474J222996R88018R37930J50587M30284O95761J955144
$$ 85708737 86633237 87619711 88842707 89830725 90768655 90919242 91349526 92045287 94000431
3107I4000431l0054P46252N34415K26158J523508P44053O88572O10044j42871
$$ 94000431 93970377 94716629 95251044 95477202 97000710 97744763 98433335 99043379 98900508
3098I8900508J182723P2666L16471L25526l10221K27055J631669K3865n49278
$$ 98900508 100083231 100155897 100472368 100797894 100487673 100714728 102346397 102370262 101820984
3089A01820984N81856P8698l21722l4961k94189j009284O81641k83348j51268
$$ 101820984 102402840 102481538 102159816 102124855 101830666 100821382 101503023 101219675 101068407
3080A01068407k21700n64803K04493m40128n18089k107811j410094j119111j66385
$$ 101068407 100846707 100281904 100486397 100046269 99528180 97420369 96010275 94891164 94724779
3071I4724779j456098p45626q74242p70399o64133j209478j365678j720936p56180
$$ 94724779 93268681 92523055 91648813 90878414 90214281 89004803 87639125 85918189 85162009
3062H5162009l80114m89004j844044j742358m51738l77773j515942j397785q86485
$$ 85162009 84781895 84292891 82448847 80706489 80254751 79876978 78361036 76963251 76076766
3053G6076766J97889n84270j267083r05473n46170j617843j494278j270155n37728
$$ 76076766 76274655 75690385 74423302 73517829 72971659 71353816 69859538 68589383 68051655
3044F8051655j188997j712303k089098o05273r04915j080360o80332r80919K09189
$$ 68051655 66862658 65150355 63061257 62455984 61551069 60470709 59790377 58809458 59018647
3035E9018647j557836p18734j060521k93513k91839j809267K09936k77260m57129
$$ 59018647 57460811 56742077 55681556 55388043 55096204 53286937 53496873 53219613 52762484
3026E2762484n77438J21680j449646P22333P59213l72329j237363k26135k08220
$$ 52762484 52185046 52306726 50857080 51579413 52338626 51966297 50728934 50502799 50294579
3017E0294579o46855N21374k88305n82545p44231j062768o01193l69434l07097
$$ 50294579 49647724 50169098 49880793 49298248 48554017 47491249 46890056 46520622 46213525
3008D6213525J25346m50661j098458l11788p92324j039945p86922n74423N03663
$$ 46213525 46338871 45888210 44789752 44477964 43685640 42645695 41858773 41284350 41788013
2999D1788013j63165r44032p55430j34014J10063Q5612p17199p72628o91703n03369
$$ 41788013 41624848 40680816 39925386 39791372 39901435 39987047 39269848 38497220 37805517 37302148
2989C7302148o59828j78962n3459L32696J48013J89193n96525m99367M21302j030436
$$ 37302148 36642320 36463358 36409899 36742595 36890608 37079801 36483276 35983909 36405211 35374775
2979C5374775K50684K20951l33048n31923K75001O01131k53917j77503l13659
$$ 35374775 35625459 35846410 35513362 34981439 35256440 35857571 35603654 35426151 35112492
2970C5112492J22356m29488O8461M66191M25925j21882k11099N41577K78938q79287
$$ 35112492 35234848 34805360 34873821 35340012 35765937 35644055 35432956 35974533 36253471 35374184
2960C5374184K74276L21773P73315M18940K0517K51294N77143j73798r1947L16664
$$ 35374184 35648460 35970233 36743548 37162488 37183005 37434299 38011442 37837644 37745697 38062361
2950C8062361J844M40577m38562K93197k00301J314872J87317N95665J540363
$$ 38062361 38064205 38504782 38066220 38359417 38159116 39473988 39661305 40256970 41797333
2941D1797333L75397M40470k50621j90509N58789M41154N90776M34860L57511
$$ 41797333 42172730 42613200 42362579 42172070 42730859 43172013 43762789 44197649 44555160
2932D4555160P54203L87650P73322M02875J05321O43951Q36879P51313K57585
$$ 44555160 45309363 45697013 46470335 46873210 46978531 47622482 48459361 49210674 49468259
2923D9468259J139150P91485P74651M4793P96182J059222L47894J011621J311927
$$ 49468259 50607409 51398894 52173545 52218338 53014520 54073742 54421636 55433257 56745184
2914E6745184R58312J012304J094327J172331J221584M96050J720450J245557
$$ 56745184 57703496 58715800 59810127 60982458 62204042 62700092 64420542 65666099
2906F5666099J206592P12735J584266J567741J551994J638021J396098R86197
$$ 65666099 66872691 67585426 69169692 70737433 72289427 73927448 75323546 76309743
2898G6309743Q57077R75579J333950K145882J705636J453878K469524J934845
$$ 76309743 77166820 78142399 79476349 81622231 83327867 84781745 87251269 89186114
2890H9186114J440706J481824K198348J657389K520504K773805K817208J430273
$$ 89186114 90626820 92108644 94306992 95964381 98484885 101258690 104075898 105506171
2882A05506171K723060K713409K419600K839668K651939K118449L210764K721916
$$ 105506171 108229231 110942640 113362240 116201908 118853847 120972296 124183060 126904976
2874A26904976K923035L330482K377699L887183M326046L612620M014273L644426
$$ 126904976 129828011 133158493 135536192 139423375 143749421 147362041 151376314 155020740
2866A55020740L574978M414052M630788M059843L777303L939704L954530L629255
$$ 155020740 158595718 163009770 167640558 171700401 175477704 179417408 183371938 187001193
2858A87001193M510084M242477L867402O032197M858326M760115M678744N449864
$$ 187001193 191511277 195753754 199621156 205653353 210511679 215271794 219950538 225400402
2850B25400402N040114N861787N783712O373355O179151O545585O333432P014439
$$ 225400402 230440516 236302303 242086015 248459370 254638521 261184106 267517538 274531977
2842B74531977P430573P366357O554324P530071P730834O777105O021435O118315
$$ 274531977 281962550 289328907 295883231 303413302 311144136 317921241 323942676 330060991
2834C30060991N370334M485763M040749K390557K475784J167016q94801j654069
$$ 330060991 335431325 339917088 343957837 346348394 348824178 349991194 349096393 347442324
2826C47442324k767735l723078m656392n388360n410835p365129p905578q020764
$$ 347442324 344674589 340951511 336295119 330906759 325495924 318130795 310225217 302204453
2818C02204453p527752p597713q204114q994904q358972p780972p279799o768466
$$ 302204453 294676701 287078988 278874874 269879970 261520998 253740026 246460227 239691761
2810B39691761o573672q100603p841026p056847p334446n875993o229274n663962
$$ 239691761 233118089 225017486 217176460 210119613 202785167 196909174 190679900 185015938
2802A85015938n353232m876853n206503m546512n371180n029735l769230m735780
$$ 185015938 179662706 174785853 169579350 165032838 159661658 154631923 150862693 146126913
2794A46126913n228874l755511l554714l422298l100929l651897l365787l400184
$$ 146126913 140898039 137142528 133587814 130165516 127064587 123412690 120046903 116646719
2786A16646719k949428k847044l074327k690610k044978k327747k682487k650293
$$ 116646719 113697291 110850247 107775920 105085310 103040332 100712585 98030098 95379805
2778I5379805k015923k318186k585424k477904j889482q99811k008200k313915
$$ 95379805 93363882 91045696 88460272 85982368 84092886 83193075 81184875 78870960
2770G8870960j361984j902397j799819o94543j542352j882871j671496p37850
$$ 78870960 77508976 75606579 73806760 73112217 71569865 69686994 68015498 67277648
2762F7277648j998099j341928j026968j482332j177280j782543o13534j176768
$$ 67277648 65279549 63937621 62910653 61428321 60251041 58468498 57854964 56678196
2754E6678196q62201n86277j959240q09333j57045j361472k57799j982394o55252
$$ 56678196 55815995 55229718 53270478 52461145 52304100 50942628 50684829 48702435 48047183
2745D8047183l54955j412198K10448j277640j443698n83096r17259n00899m56262
$$ 48047183 47692228 46280030 46490478 45212838 43769140 43186044 42268785 41767886 41311624
2736D1311624p34111o70547L43997n63784j218679r42506p26559q28578o48501
$$ 41311624 40577513 39906966 40250963 39687179 38468500 37525994 36799435 35970857 35322356
2727C5322356q05721m19597q87420n57526k86987k94717k30967m73990j80763
$$ 35322356 34516635 34097038 33209618 32652092 32365105 32070388 31839421 31365431 31184668
2718C1184668k99196j605959j192861m8671k20851J77571j081799q72377k03550
$$ 31184668 30885472 29279513 28086652 28037981 27817130 27994701 26912902 26040525 25836975
2709B5836975q86827l90673K4634J13106j201102j121810M92381l94997k95128
$$ 25836975 24950148 24559475 24584109 24697215 23496113 22374303 22866684 22471687 22176559
2700B2176559k11150j264649j54616m51131j5953o82447j031395L21464l16432
$$ 22176559 21965409 20700760 20546144 20095013 20079060 19396613 18365218 18686682 18370250
2691A8370250j77054l49641j50948K57182J064445j217574j011587o44021j62126
$$ 18370250 18193196 17843555 17692607 17949789 19014234 17796660 16785073 16141052 15978926
2682A5978926J31631J14590j429282N73121J17763j124928J57976r32946k22244
$$ 15978926 16110557 16225147 14795865 15368986 15486749 14361821 14519797 13586851 13364607
2673A3364607k8333Q6356l98822M2254l04305m19453l08746N80212n12794j116148
$$ 13364607 13336274 13422630 13023808 13066062 12761757 12342304 12033558 12613770 12100976 10984828
2663A0984828l97264Q8503L22070r20682j51241j87621k03002j6410j0801N05625
$$ 10984828 10587564 10676067 10998137 10077455 9926214 9738593 9535591 9519181 9508380 10014005
2653A0014005o10975N84J1453k14620m66099L89277n3171r45938k75484J50029
$$ 10014005 9403030 9403614 9415067 9200447 8734348 9123625 9070454 8124516 7849032 7999061
2643G999061j15553L84561q5468j117146N64215m23811j57454n18258M96070n729
$$ 7999061 7883508 8268069 8182601 7065455 7629670 7205859 7048405 6530147 7026217 7020488
2633G020488O23493m28912r39762R800L45284J95365j74388O2647l75490K72600
$$ 7020488 7643981 7215069 6275307 6285107 6630391 6825756 6651368 6714015 6338525 6611125
2623F611125o73505m83862j43100M0310K30516M78660P9755K25692m88953l12186
$$ 6611125 5937620 5453758 5310658 5350968 5581484 6060144 6139899 6365591 5876638 5564452
2613E564452q9009M08852k22962k17503j176339k69515J89135M48695p40863j65513
$$ 5564452 5475443 5884295 5661333 5443830 4267491 3997976 4187111 4635806 3894943 3729430
2603C729430J56870N12027N36780o48452L68395M01221k97990n25461M89668J02171
$$ 3729430 3886300 4398327 4935107 4286655 4655050 5056271 4758281 4232820 4722488 4824659
2593D824659p40364j034025L85477J31796k56232k05336l75084K78144M2378m35156
$$ 4824659 4084295 3050270 3435747 3567543 3311311 3105975 2730891 3009035 3051413 2616257
2583B616257J002032K48895L405O27921m26021o0290j92416r50260J55806P83916
$$ 2616257 3618289 3867184 3870589 4498510 4072489 4012199 3819783 2869523 3025329 3809245
2573C809245m28079n90173m14353M31758O66193q12105j85507K56436N22906m15484
$$ 3809245 3381166 2790993 2376640 2808398 3474591 2662486 2476979 2733415 3256321 2840837
2563B840837r1521o36935k61495Q04616N35884o2342r5591k99720m12986N36851
$$ 2840837 2749316 2112381 1850886 2655502 3191386 3129044 3033453 2733733 2320747 2857598
2553B857598n97815n43042m50376J759569J31355r14m25951O59552N338r76541
$$ 2857598 2259783 1716741 1266365 3025934 3157289 3156375 2730424 3389976 3395314 2418773
2543B418773J86664l4826j081522k38437L22476J001103Q91386o84701o00585
$$ 2418773 2605437 2570611 1489089 1250652 1573128 2574231 3465617 2780916 2180331
2534B180331p82441k19328L9655J495507n54487M08083j53073m45931p87845j10247
$$ 2180331 1397890 1178562 1218217 2713724 2159237 2567320 2414247 1968316 1180471 1070224
2524A070224J2974K90380L41787j012122k81241Q3549K64879J94288K45183J2513
$$ 1070224 1083198 1373578 1715365 703243 422002 505551 770430 964718 1209901 1222414
2514A222414m74798J93260J1720l5102l9175l66140O43746m66189p52516k61268
$$ 1222414 747616 940876 952596 917494 878319 512179 1155925 689736 -62780 -324048
2504c24048O0088k73925k48756Q58116N98791N79651m69502p46649m46802M88165
$$ -324048 -263960 -537885 -786641 71475 670266 1249917 780415 33766 -413036 75129
2494G5129l64059Q30093l09865q04720L96029N6635m6826j02579j13554n2441
$$ 75129 -288930 541163 231298 -573422 -177393 -120758 -167584 -270163 -383717 -436158
2484d36158k20090J22303J75175L0432r58239K03279J135360M40479o9660j345446
$$ -436158 -656248 -533945 -358770 -328338 -1286577 -1083298 52062 492541 422881 -922565
2474i22565n35688k2931J010266J90875p66395n75549M24794K89174k50727M85132
$$ -922565 -1458253 -1481184 -470918 -280043 -1046438 -1621987 -1197193 -908019 -1158746 -673614
2464f73614M24742r73728k99919j13204n5334l20615Q05656M81920l43746o42302
$$ -673614 -248872 -1222600 -1522519 -1635723 -1691057 -2011672 -1206016 -724096 -1067842 -1710144
2454a710144K41207O40273J90933r05690J75299K87649J95908O6869p68010Q2887
$$ -1710144 -1468937 -828664 -637731 -1543421 -1368122 -1080473 -884565 -817696 -1585706 -1502819
2444a502819L03786M85623n32949K79286L32291O90405k03414J8814l26514p67953
$$ -1502819 -1199033 -713410 -1246359 -967073 -634782 55623 -147791 -128977 -455491 -1223444
2434a223444m45230R32191K7368q06091K73486L15778L7889k6172L84136n25056
$$ -1223444 -1668674 -736483 -709115 -1515206 -1241720 -925942 -888053 -914225 -530089 -1055145
2424a055145Q8263M87285m08605l75141R92791k30757k32228J52803r57818m24624
$$ -1055145 -966882 -479597 -888202 -1263343 -270552 -501309 -733537 -580734 -1538552 -1963176
2414a963176P31239J06679p73276K94531M69860j72973J5449M99100m88250n62593
$$ -1963176 -1231937 -1125258 -1898534 -1604003 -1134143 -1307116 -1291667 -792567 -1280817 -1843410
2404a843410K14839R73013J91508j176704k81916M62817N82207L034l71463m51104
$$ -1843410 -1628571 -655558 -464050 -1640754 -1922670 -1459853 -877646 -874612 -1246075 -1697179
2394a697179j48381J71011M21334p17703j91j13211j91880P00889K63040J90252
$$ -1697179 -1845560 -1674549 -1253215 -1970918 -1971109 -2084320 -2276200 -1575311 -1312271 -1122019
2384a122019m8194l97882L41235L66324m11611P02868R2574q44361M3855l59593
$$ -1122019 -1170213 -1568095 -1226860 -860536 -1272147 -569279 -476705 -1321066 -1277211 -1636804
2374a636804N60763l94360j33983r06627L42479m6314K64756j84301n8943J274408
$$ -1636804 -1076041 -1470401 -1604384 -2511011 -2168532 -2214846 -1950090 -2134391 -2193334 -918926
2364i18926N45409l78579j380571O55362N44525j82431r04375K775J3529M00578
$$ -918926 -373517 -752096 -2132667 -1477305 -932780 -1115211 -2019586 -2016811 -2003282 -1602704
2354a602704k52505o4974j71829R01942J78270o85595m54187q16511J74838O85179
$$ -1602704 -1855209 -1920183 -2092012 -1190070 -1011800 -1697395 -2151582 -2968093 -2793255 -2108076
2344b108076P88332r92538n36869J095614J41228m12820M95929M14908r59014
$$ -2108076 -1319744 -2312282 -2849151 -1753537 -1612309 -2025129 -1529200 -1114292 -2073306
2335b073306l16094k78036N24023O06302k79358j9195l3246N27766l25226R540
$$ -2073306 -2389400 -2667436 -2143413 -1537111 -1816469 -1835664 -1868910 -1341144 -1666370 -1656830
2325a656830m03683o82319o36703J344453R27944J6071M84496J87266o63899l77351
$$ -1656830 -2060513 -2742832 -3379535 -2035082 -1107138 -1091067 -606571 -419305 -1083204 -1460555
2315a460555j42555p55953K70264j009415K22567K19876Q56173K88734k76538
$$ -1460555 -1603110 -2359063 -2088799 -3098214 -2875647 -2655771 -1799598 -1510864 -1787402
2306a787402q1446K56846R75571n58410l74739M44612k57380k85007m63081j26720
$$ -1787402 -1868848 -1612002 -636431 -1194841 -1569580 -1124968 -1382348 -1667355 -2130436 -2257156
2296b257156J73637P16897o83949k20037O40486l1304n60812K07744L07137l73907
$$ -2257156 -2083519 -1366622 -2050571 -2270608 -1630122 -1661426 -2222238 -2014494 -1707357 -2081264
2286b081264j88968Q68880l41985M0745J42934j65799m1424m16252J6086m6709
$$ -2081264 -2270232 -1401352 -1743337 -1702592 -1559658 -1725457 -1766881 -2183133 -2167047 -2213756
2276b213756j40406N67523j89672m29462M73394Q9572L92704j51293j22615j386
$$ -2213756 -2354162 -1786639 -1976311 -2405773 -1932379 -1842807 -1450103 -1601396 -1724011 -1725397
2266a725397j68206k31306j23826J79905m1186K39570P77371m92287L51118k61957
$$ -1725397 -1893603 -2124909 -2248735 -2068830 -2110016 -1870446 -1093075 -1585362 -1234244 -1496201
2256a496201k65442m6817N3884J28257m01033j94861J29913K07731Q74801L3787
$$ -1496201 -1761643 -1808460 -1754576 -1626319 -2027352 -2222213 -2092300 -1884569 -1009768 -975981
2246i75981N0079n99483k99686j29369N85472n28677m24375L35278J04277l64322
$$ -975981 -925902 -1525385 -1825071 -1954440 -1368968 -1897645 -2322020 -1986742 -1882465 -2246787
2236b246787L86773Q3158j334319K1218J063439l26253j61185O14582N6533K34461
$$ -2246787 -1860014 -1776856 -3111175 -3089957 -2026518 -2352771 -2513956 -1899374 -1842841 -1608380
2226a608380l97898L11224l7307O54465l12679n6313j58723n47506M08999O2450
$$ -1608380 -2006278 -1695054 -1732361 -1077896 -1390575 -1446888 -1605611 -2153117 -1744118 -1681668
2216a681668o71433P12174N78955l99633k95090k50709J54968K09452j47875O94559
$$ -1681668 -2353101 -1640927 -1061972 -1461605 -1756695 -2007404 -1852436 -1642984 -1790859 -1096300
2206a096300o7275j229449N79688P03938n07637j8172N93708l5148j83573J03360
$$ -1096300 -1163575 -2393024 -1813336 -1109398 -1617035 -1635207 -1041499 -1076647 -1260220 -1156860
2196a156860q9867p5240J57698L24029P37855o59054l89549n92446k6031L87618
$$ -1156860 -1246727 -1321967 -1164269 -840240 -102385 -761439 -1150988 -1743434 -1769465 -1381847
2186a381847J1747k3660j30144J39225L58040j96734o56502J60825J35722L26554
$$ -1381847 -1370100 -1393760 -1523904 -1384679 -1026639 -1223373 -1879875 -1719050 -1583328 -1256774
2176a256774q35444K61812M38846L02572L63318j91510L15205J12324R0081j62011
$$ -1256774 -2092218 -1830406 -1391560 -1088988 -725670 -917180 -601975 -489651 -399570 -561581
2166e61581K12501m82503p90164k87690N74075j00872n57211N45417L50318K11287
$$ -561581 -349080 -831583 -1621747 -1909437 -1335362 -1436234 -1993445 -1448028 -1097710 -886423
2156h86423j41207O27556n07753k12759J22445L15098J70639o6997K54754L3491
$$ -886423 -1027630 -400074 -907827 -1120586 -998141 -683043 -512404 -579401 -324647 -291156
2146b91156L87574p35398j61052J2486j73932k87005O51918P84718j135624n9687
$$ -291156 96418 -638980 -800032 -787546 -961478 -1248483 -596565 188153 -947471 -1007158
2136a007158N30967k6356M93484m55026k72955J35577L89222M98871K13675R9419
$$ -1007158 -476191 -502547 -9063 -464089 -737044 -601467 -212245 286626 500301 599720
2126E99720j065429Q5924J369126J16693l85344m41089O32427K53752O80172o29735
$$ 599720 -465709 -379785 989341 1106034 720690 279601 912028 1165780 1845952 1216217
2116A216217l95529N51804L93305m9826P28837P61073o37605j59262M40154O16367
$$ 1216217 820688 1372492 1765797 1715971 2444808 3205881 2568276 2409014 2849168 3465535
2106C465535J90441p29769R74101N68390O1826J88827L16131P59339N47362J454576
$$ 3465535 3655976 2926207 3900308 4468698 4530524 4719351 5035482 5794821 6342183 7796759
2096G796759k15757L17367J201300Q63989J069849K114792J464051J181915N09183
$$ 7796759 7581002 7898369 9099669 9963658 11033507 13148299 14612350 15794265 16303448
2087A6303448P62192K97133J18364r32038o35247k88504j103614j161045j022671
$$ 16303448 17065640 17362773 17481137 16549099 15913852 15625348 14521734 13360689 12338018
2078A2338018m34904k287075j281305j644495q33350L02759j043664q3886J06380
$$ 12338018 11903114 9616039 8334734 6690239 5856889 6159648 5115984 5032098 5138478
2069E138478q04860j110437J51038o60418m71539P25190r99932M4125l37934m62814
$$ 5138478 4333618 3223181 3374219 2713801 2242262 2967452 1967520 2011645 1673711 1210897
2059A210897p7587l29918l45578k01784J748115n91573l11215J13105M2143j80549
$$ 1210897 1133310 803392 457814 256030 2004145 1412572 1101357 1214462 1256605 1076056
2049A076056k08417J11072m19439j466924k8335N66779J91769k06097o3281m9705
$$ 1076056 867639 978711 559272 -907652 -935987 -369208 -177439 -383536 -446817 -496522
2039d96522J048448j77950q18649J48091L00162J94457r32477P69938J19817p50763
$$ -496522 551926 373976 -444673 -296582 3580 198037 -734440 35498 155315 -595448
2029e95448n9476L16256l05301K1290m36403l2173K56383N7165J9339q63181j41883
$$ -595448 -654924 -338668 -643969 -622679 -1059082 -1091255 -834872 -777707 -758368 -1621549 -1763432
2018a763432Q19946m7557N60911o85853p06191L00940l56797N00145L32429N3616
$$ -1763432 -943486 -991043 -430132 -1115985 -1822176 -1521236 -1878033 -1377888 -1045459 -991843
2008i91843p44445L60616j40048k62962j58128K31564K99031k32780N32642m87585
$$ -991843 -1736288 -1375672 -1515720 -1778682 -1936810 -1705246 -1406215 -1638995 -1106353 -1593938
1998a593938l45030n9906O82531k56406n90305L92214o14735J51330Q12289o07842
$$ -1593938 -1938968 -1998874 -1316343 -1572749 -2163054 -1770840 -2385575 -2234245 -1421956 -2029798
1988b029798j39141L17216r664k9521Q42150K0846l41419j05814l68384m84596
$$ -2029798 -2168939 -1851723 -1861387 -1890908 -1048758 -1027912 -1369331 -1475145 -1843529 -2328125
1978b328125N32957N12419o9893l39428L9774p0158O22413q50420n01413Q53827
$$ -2328125 -1795168 -1282749 -1352642 -1692070 -1652296 -1722454 -1100041 -1950461 -2451874 -1598047
1968a598047M17067k14749l95282Q23270p1947j6109j020732p02477J302495M21719
$$ -1598047 -1180980 -1395729 -1791011 -967741 -1039688 -1055797 -2076529 -2779006 -1476511 -1054792
1958a054792n33562M46392K68820n59422m17034l3673J32751Q12960l41718k89524
$$ -1054792 -1588354 -1141962 -873142 -1432564 -1849598 -1883271 -1750520 -937560 -1279278 -1568802
1948a568802m36266L19090M42675n63468J09055l7145l39189k29025O15342P34296
$$ -1568802 -2005068 -1685978 -1243303 -1806771 -1697716 -1734861 -2074050 -2303075 -1687733 -953437
1938i53437q1442j09929M06402k85598m32587K40318l36179O26871l94137j237848
$$ -953437 -1034879 -1144808 -738406 -1024004 -1456591 -1216273 -1552452 -925581 -1319718 -2557566
1928b557566Q37215O89169l41262q69782N20816K47130j06782k48067k16305l29874
$$ -2557566 -1720351 -1031182 -1372444 -2242226 -1721410 -1474280 -1581062 -1829129 -2045434 -2375308
1918b375308M37597O16604K36749m22712L95724K57608o07912L4983K69098L88478
$$ -2375308 -1937711 -1321107 -1084358 -1507070 -1111346 -853738 -1461650 -1426667 -1157569 -769091
1908g69091n18845j30530o09479J032614L2234p90945R99603K2810k80000k3010
$$ -769091 -1287936 -1418466 -2027945 -995331 -963097 -1754042 -754439 -731629 -1011629 -1034639
1898a034639p51677R12048N08184q54323n40820k43452O19320n44508o02734P93141
$$ -1034639 -1786316 -874268 -366084 -1220407 -1761227 -2004679 -1385359 -1929867 -2532601 -1739460
1888a739460M89387o10757L44446j21285L58612J66873p14122m97928J313309
$$ -1739460 -1250073 -1860830 -1516384 -1637669 -1279057 -1112184 -1826306 -2324234 -1010925
1879a010925K24979l91225m02024L30788J189228j30156n93824k96822r47664
$$ -1010925 -785946 -1177171 -1579195 -1248407 -59179 -189335 -783159 -1079981 -2027645
1870b027645M95094p4827L38615J058001m23716p5944j019859P09288n30278J5398
$$ -2027645 -1532551 -1607378 -1268763 -210762 -634478 -710422 -1730281 -1020993 -1551271 -1535873
1860a535873m10872j03813l35058L5871K93518m18116o273P0496p6364J648900
$$ -1535873 -1946745 -2050558 -2385616 -2349745 -2056227 -2474343 -2480616 -2410120 -2486484 -837584
1850h37584N66645j143832M32372j36504m26252o82539L66688K90559M41656P42997
$$ -837584 -270939 -1414771 -982399 -1118903 -1545155 -2227694 -1861006 -1570447 -1128791 -385794
1840c85794o68820Q3888m44279k04111M51269J17037m48936j88782K51741j45798
$$ -385794 -1054614 -970726 -1415005 -1619116 -1167847 -1050810 -1499746 -1688528 -1436787 -1582585
1830a582585J33824p49816J84014O34507M29358j29944J40524n81902m83909M46284
$$ -1582585 -1448761 -2198577 -2014563 -1380056 -950698 -1080642 -940118 -1522020 -2005929 -1559645
1820a559645R2738Q93274r94472l43473O29220J88523q99202L51052J433758j221711
$$ -1559645 -1466907 -573633 -1568105 -1911578 -1282358 -1093835 -1993037 -1641985 -208227 -1429938
1810a429938k43593J55195L47427L35291p31315l86120l12114R96030K34943j122863
$$ -1429938 -1673531 -1518336 -1170909 -835618 -1566933 -1953053 -2265167 -1269137 -1034194 -2157057
1800b157057L03261J43014k11582K64808O18782m8319l1255l80552l6948m2547
$$ -2157057 -1853796 -1710782 -1922364 -1657556 -1038774 -1087093 -1118348 -1498900 -1535848 -1578395
1790a578395j64671K29841m24495L20652K33127o50931j99801O52024N78253P08533
$$ -1578395 -1743066 -1513225 -1937720 -1617068 -1383941 -2034872 -2234673 -1582649 -1004396 -295863
1780b95863m32847k1168j46515R3681n92899p6567M17992N3879o1420o67249k99191
$$ -295863 -728710 -749878 -896393 -802712 -1395611 -1472178 -1054186 -1000307 -1061727 -1728976 -2028167
1769b028167Q45980m88920o2455M40717p32392M47092j64184J49905O02996L76454
$$ -2028167 -1182187 -1671107 -1733562 -1292845 -2025237 -1578145 -1742329 -1592424 -989428 -612974
1759f12974m25695p76756M59696K53788l79095M41300J26161L69883l33851m62754
$$ -612974 -1038669 -1815425 -1355729 -1101941 -1481036 -1039736 -913575 -543692 -877543 -1340297
1749a340297j0354P37645M2848L75259J22696l42414k32047k00525n6105J00708
$$ -1340297 -1350651 -613006 -570158 -194899 -72203 -414617 -646664 -847189 -903294 -802586
1739h02586P43093K1882K9180o02750M69062l12586o27704O17523o17061l0617
$$ -802586 -59493 -37611 -8431 -611181 -142119 -454705 -1082409 -464886 -1081947 -1112564
1729a112564k8646O5978N13463j47195n3802m08082j45780P02112Q598n57016
$$ -1112564 -1141210 -1075232 -561769 -708964 -762766 -1170848 -1316628 -614516 -605918 -1162934
1719a162934j19148j84845l24082P78456N67342o09780L83729L34805l0513j04845
$$ -1162934 -1282082 -1466927 -1791009 -1012553 -445211 -1054991 -671262 -336457 -366970 -471815
1709d71815o05898j0492l18039K26072k29974m33914J64763L71357j74500j53022
$$ -471815 -1077713 -1088205 -1406244 -1180172 -1410146 -1844060 -1679297 -1307940 -1482440 -1635462
1699a635462L92057J96336l30533N44797k544q28266j88609j79764j48158J299393
$$ -1635462 -1243405 -1047069 -1377602 -832805 -835349 -1663615 -1852224 -2031988 -2180146 -880753
1689h80753K38188j153122N36677j29412M1151Q7472l90776M5003L33107O17295
$$ -880753 -642565 -1795687 -1259010 -1388422 -1347271 -1259799 -1650575 -1605572 -1272465 -655170
1679f55170m17203n61471J49312J1954J83928M04741m03544P27428j42104J0521
$$ -655170 -1072373 -1633844 -1484532 -1472578 -1288650 -883909 -1287453 -560025 -702129 -691608
1669f91608O78729q45639p16978k1377Q97710K23911m04234k21769k8040K36132
$$ -691608 -12879 -858518 -1575496 -1596873 -699163 -475252 -879486 -1101255 -1129295 -893163
1659h93163L46017n08827m92628P84345K23745O51472o60560l48965k66368l03800
$$ -893163 -547146 -1055973 -1548601 -764256 -540511 110961 -549599 -898564 -1164932 -1468732
1649a468732K74555J6632J0484L92464O18784j49884l28671k15926Q3823O13180
$$ -1468732 -1194177 -1177545 -1167061 -774597 -155813 -305697 -634368 -850294 -766471 -153291
1639a53291N12024o90897o10296Q15278L70296m86836M22801j136995k6073K53161
$$ -153291 358733 -332164 -942460 -127182 243114 -243722 179079 -957916 -983989 -730828
1629g30828l19286K76601Q88863r83796k64259L72105m5093J0308m60637l5029
$$ -730828 -1050114 -773513 115350 -868446 -1132705 -760600 -805693 -795385 -1256022 -1291051
1619a291051O07716N31175q58374J98100P41434L07203L2387q37307p12127k9809
$$ -1291051 -683335 -152160 -1010534 -812434 -71000 236203 268590 -568717 -1280844 -1310653
1609a310653Q56486l88963Q3452M8032q69864J37331M29954J182474K94056o5311
$$ -1310653 -454167 -843130 -759678 -711646 -1581510 -1444179 -1014225 168249 462305 396994
1599C96994J43935r20172m21374j55631J1643K65054M39472j354143N7570K73770
$$ 396994 540929 -379243 -800617 -956248 -944605 -679551 -240079 -1594222 -1536652 -1262882
1589a262882j25870K02731j3549k28740Q0482O40836O24446m51445q08361K96936
$$ -1262882 -1388752 -1186021 -1199570 -1428310 -1347828 -706992 -82546 -533991 -1342352 -1045416
1579a045416n96841n40071Q15427P27981j53473P5120K51265K0384P6922m19768
$$ -1045416 -1642257 -2182328 -1366901 -638920 -792393 -717273 -466008 -445624 -368702 -788470
1569g88470J082104J33719j557768L3268Q82227J11648l27645J66280M4886k73955
$$ -788470 293634 427353 -1130415 -1097147 -214920 -103272 -430917 -264637 -219751 -493706
1559d93706o23658j73476j2465M5780l09948Q53292j44934j13534K79827j99390
$$ -493706 -1117364 -1290840 -1303305 -1257525 -1567473 -714181 -859115 -972649 -692822 -892212
1549h92212J59045J20288k91760n30978l42818R2920J22919Q98490o0744M54095
$$ -892212 -733167 -612879 -904639 -1435617 -1778435 -1685515 -1562596 -664106 -724850 -270755
1539b70755p6309q8943j10628N01979M18143m08788n25540q0847M95049K23582
$$ -270755 -347064 -436007 -546635 -44656 373487 -35301 -560841 -641688 -146639 76943
1529G6943m35515n53160O55730P9699m14611p69704M96285q8170M16444N37417
$$ 76943 -358572 -911732 -256002 -176303 -590914 -1360618 -864333 -952503 -536059 1358
1519A358p75819j06770R5222M24947N34268J96805j45749o76577j90660J60888
$$ 1358 -774461 -881231 -786009 -361062 173206 370011 224262 -452315 -642975 -482087
1509d82087j92754K41632o79977q13966K14911Q47101k35595J61738J34928M52409
$$ -482087 -674841 -433209 -1113186 -1927152 -1712241 -865140 -1100735 -938997 -804069 -351660
1499c51660L49651n65345p6561O25598M4187n70290K22603l07233M84442J69435
$$ -351660 -2009 -567354 -643915 -18317 25870 -544420 -321817 -629050 -144608 24827
1489B4827k03873n11035p02517k35123J441187O06339j91493k14426p6068k18326
$$ 24827 -179046 -690081 -1392598 -1627721 -186534 419805 228312 13886 -62182 -280508
1479b80508l68708j31873p63470O39273M26580M10581j91853l9226n72062L74541
$$ -280508 -649216 -781089 -1544559 -905286 -478706 -68125 -259978 -299204 -871266 -496725
1469d96725J122425j99416m92288m87883k53511j55173P1461O0745J63194k96524
$$ -496725 625700 426284 -66004 -553887 -807398 -962571 -891110 -830365 -667171 -963695
1459i63695L02246l80327j15311P64915K08728q81380r17314J088860P75859l9408
$$ -963695 -661449 -1041776 -1157087 -392172 -183444 -1064824 -1982138 -893278 -117419 -156827
1449a56827N05686m4577r44057N31988r4801n67591L69705L24296R91396l9948
$$ -156827 348859 304282 -639775 -107787 -202588 -770179 -400474 -76178 915218 875270
1439H75270j003435Q2194M70669K07548o8390q17683k58667L40591m11437j1931
$$ 875270 -128165 -45971 424698 632246 563856 -253827 -512494 -171903 -583340 -595271
1429e95271M71825L86246P39425k15611j145586Q72195k59236o02525R0675L66750
$$ -595271 -123446 262800 1002225 786614 -358972 513223 253987 -348538 -257863 108887
1419A08887L67927j185721M80653K90157l23789M06951j054628j20485R43060
$$ 108887 476814 -708907 -228254 61903 -261886 145065 -909563 -1030048 -86988
1410h6988o56751N25835K17206J94272o59817j20973L47129M55428l31610j67553
$$ -86988 -743739 -217904 -698 193574 -466243 -587216 -240087 215341 -116269 -283822
1400b83822L06942m74378j83613L75463J34537k41327J36642L85207k29831l8338
$$ -283822 23120 -451258 -634871 -259408 -124871 -366198 -229556 155651 -74180 -112518
1390a12518O43390m12769J5616m625n22497J083315L10654q17797j15763K34411
$$ -112518 530872 118103 133719 129094 -393403 689912 1000566 182769 67006 301417
1380C01417j94172j47342k72177l45390L03678J80120l4374j13711M8418k09415
$$ 301417 107245 -40097 -312274 -657664 -353986 -173866 -208240 -321951 -273533 -482948
1370d82948O6060n41189M90470L01189j1824O2224q2561l74o71211L43370K43228
$$ -482948 -416888 -958077 -467607 -166418 -178242 -116018 -198579 -198953 -870164 -526794 -283566
1359b83566Q16679J30210o68409j84485j57031p1960J38720J47435K16503J44579
$$ -283566 533113 663323 -5086 -189571 -346602 -418562 -279842 -132407 84096 228675
1349B28675o24323j89659N43748L12017l76361K06044M0432j20537K67640o12901
$$ 228675 -395648 -585307 -41559 270458 -105903 100141 140573 20036 287676 -325225
1339c25225J94604K1453N6987Q73266K67024q85029p2069K51347m33880L18280
$$ -325225 -130621 -109168 -52181 821085 1088109 203080 131011 382358 -51522 266758
1329B66758m14290m73308L18981J05281o09591L56787m26686N46535q9230n49472
$$ 266758 -147532 -620840 -301859 -196578 -806169 -449382 -876068 -329533 -418763 -968235
1319i68235N51743k01542M07942n89815Q0546O01448O2515J44179j83702m91386
$$ -968235 -416492 -618034 -210092 -799907 -719361 -117913 -55398 88781 -94921 -586307
1309e86307K42918J80249j92688L11793k81257n50575L96009j35310p68883J026709
$$ -586307 -343389 -163140 -355828 -44035 -325292 -875867 -479858 -615168 -1384051 -357342
1299c57342K2486K03825P0620k57212K22662J86823o75229J09083p8305r46425
$$ -357342 -334856 -131031 -60411 -317623 -94961 91862 -583367 -474284 -552589 -1499014
1289a499014J041457K46340m51625K88187K50642M58560n07928J14994K94249
$$ -1499014 -457557 -211217 -662842 -374655 -124013 334547 -173381 -58387 235862
1280B35862n1273K61964l08835l27130M87307j59017J04206R70414m32719j12696
$$ 235862 184589 446553 137718 -189412 297895 138878 243084 1213498 780779 668083
1270F68083j76141J14007n18334L86830l58013m13782P96127L02881j91284n29474
$$ 668083 491942 605949 87615 474445 116432 -297350 498777 801658 610374 80900
1260H0900p62074J26119Q1100Q8249L47613M19601R23380j134305l33485K79046
$$ 80900 -681174 -555055 -473955 -385706 -38093 381508 1304888 170583 -162902 116144
1250A16144n80597L08511k20347j20090L45445n4451O1469l19136M87869o86730
$$ 116144 -464453 -155942 -376289 -496379 -150934 -205385 -143916 -463052 24817 -661913
1240f61913N51852N75648J53907p35929r91405J30873P58090L99669o5580P4936
$$ -661913 -110061 465587 619494 -116435 -1107840 -976967 -218877 180792 115212 190148
1230A90148l03616J69623k0402l55965l33429M04456L41316l85307k3417J19992
$$ 190148 -113468 56155 35753 -320212 -653641 -249185 92131 -293176 -316593 -196601
1220a96601Q2613J16939M20475l47390j301759M25391K55062l00043K89167P74067
$$ -196601 -113988 2951 423426 76036 -1225723 -800332 -545270 -845313 -556146 217921
1210B17921o7904M54648p47176l75429J15157k31065j49227N51227R43643L80237
$$ 217921 150017 604665 -142511 -517940 -402783 -633848 -783075 -231848 711795 1092032
1200A092032k85324k62090J6382J32585l72764R3126L24094L79759q70937m49842
$$ 1092032 806708 544618 561000 693585 320821 413947 738041 1117800 246863 -202979
1190b02979L97036N22635n94679q77815O26340K85406K04486L864j8140j3560
$$ -202979 194057 716692 122013 -755802 -129462 155944 360430 364294 346154 332594
1180C32594N37156k20991j90255k2765M16030r86257k52481l73984O25958J157635
$$ 332594 869750 648759 458504 435739 851769 -134488 -386969 -760953 -134995 1022640
1170A022640l09172Q8760k66245Q3929J75882l0365n58845j89866n69025K03535
$$ 1022640 713468 802228 535983 619912 795794 765429 206584 16718 -552307 -348772
1160c48772k29526M3181L35288K88911O5076k75535o89474n20647O37389K39138
$$ -348772 -578298 -535117 -199829 89082 154158 -121377 -810851 -1331498 -694109 -454971
1150d54971J74853J44628K94158k78294R11076k18762l36931O05903k72099K20082
$$ -454971 -280118 -135490 158668 -119626 791450 572688 235757 841660 569561 789643
1140G89643l79401Q9600N46149J55696l85578K91646k74287O744m8356j67004
$$ 789643 410242 499842 1045991 1201687 816109 1107755 833468 840212 791856 624852
1130F24852n01277j62141j74248J38497J800P1398O19518j4212N96671j350108
$$ 624852 123575 -38566 -212814 -74317 -72517 -1119 618399 604187 1200858 -149250
1120a49250J90585K93151O64925J74475q1517o45784j14305j93454M32764O35249
$$ -149250 41335 334486 999411 1173886 1092369 446585 332280 138826 571590 1206839
1110A206839J1940K75438m12003j485553O2015p9532K02448K66855J51094P41707
$$ 1206839 1218779 1494217 1082214 -403339 -341324 -420856 -218408 48447 199541 941248
1100I41248m50921m96319K91766O80297J16490J75509k94876l28685k44428n124
$$ 941248 490327 -5992 285774 966071 1082561 1258070 963194 634509 390081 384957
1090C84957j57131n34227J96887L89214k2687j307998L67171P39218p87219O4593
$$ 384957 227826 -306401 -109514 279700 257013 -1050985 -683814 55404 -731815 -667222
1080f67222N0927P2077N70366m87487L86570M51485p00185K30977O11774N4097
$$ -667222 -616295 -544218 26148 -461339 -74769 376716 -323469 -92492 519282 573379
1070E73379m90144J30506j20835P3984N58807M05883p21331J14155Q5497K81897
$$ 573379 83235 213741 92906 166890 725697 1131580 410249 524404 609901 891798
1060H91798k43578j12730K92013M68191n46292j19577k6084N64837p45231K35306
$$ 891798 648220 535490 827503 1295694 749402 629825 603741 1168578 423347 658653
1050F58653K29723k66376P550q9823M77302k02213o66447m76117O18198P83052
$$ 658653 888376 622000 629550 539727 1017029 814816 148369 -327748 290450 1073502
1040A073502j82988j1541j10235L10213q43985j5320n22518j67215R51899K31432
$$ 1073502 890514 878973 768738 1078951 234966 219646 -302872 -470087 481812 713244
1030G13244m209l37252q3632N7374N28730o73015K77671N16631o57257J36289
$$ 713244 709035 371783 288151 345525 874255 201240 478911 995542 338285 474574
1020D74574l31534j42234Q15408Q3406q0649l65823J97442k90232n08996N69766
$$ 474574 143040 806 816214 899620 818971 453148 650590 360358 -148638 421128
1010D21128j97152N5122m06409M22427O67040k94638o41287l05994J011025l87
$$ 421128 223976 279098 -127311 295116 962156 667518 26231 -279763 731262 730875
1000G30875p34051K91685q28065O42557J277972k6749j129394n36453R29342m73046
$$ 730875 -3176 288509 -539556 103001 1380973 1354224 224830 -311623 617719 144673
990A44673J52944L41249K79098j61903L33964k23858J37315p13005M37653m57204
$$ 144673 297617 638866 917964 756061 1090025 866167 1003482 290477 728130 270926
980B70926O6742q4078K52398m87900j49510L15047m8449m58492R91707L09853
$$ 270926 337668 253590 505988 18088 -131422 183625 135176 -323316 668391 978244
970I78244p10691j60799N73777L63275q648Q841k1915j053664r8223J69390P53434
$$ 978244 267553 106754 680531 1043806 1035158 1043999 1022084 -31580 -129803 39587 793021
959G93021R7342j76725M65012p91392J25152n67638N28146m9073n42317J537O10939
$$ 793021 890363 713638 1178650 387258 512410 -55228 472918 423845 -118472 -116935 494004
948D94004K61770L41960o22546k03370J011598j42903l32583l04975J3845N75116
$$ 494004 755774 1097734 475188 271818 1283416 1140513 807930 502955 516800 1091916
938A091916L016l57562Q05097r96422l68553O74104m51775l39662n39941O38554
$$ 1091916 1094932 737370 1542467 546045 177492 851596 399821 60159 -479782 158772
928A58772K77095K47653J09518k80884o57370k31606N12530N49244N65598p58944
$$ 158772 435867 683520 793038 512154 -145216 -376822 135708 684952 1250550 491606
918D91606J81621M14639L7897R6957n29248l10884k2801P13092q229j42873J19881
$$ 491606 673227 1087866 1125763 1222720 693472 382588 359787 1072879 1064650 921777 1041658
907A041658n29171L62704R98031m65976j20974q77543L86744L06692n75451J77738
$$ 1041658 512487 875191 1873222 1407246 1286272 408729 795473 1102165 526714 704452
897G04452J23692j00335n29497k31440J089953n28942m44281J05909q7086J6984
$$ 704452 828144 727809 198312 -33128 1056825 527883 83602 189511 102425 119409
887A19409L7642j10269Q68832L48047J14409r39294J81113p44929K21734L59845
$$ 119409 157051 46782 915614 1263661 1378070 438776 619889 -125040 96694 456539
877D56539K33909R21762o12193O0024L82685p96543q78906M68806R69002J50078
$$ 456539 690448 1612210 1000017 1060041 1442726 646183 -232723 236083 1205085 1355163
867A355163m83843o65290Q72453m80781k67214L20704r23420R26145m84942j10812
$$ 1355163 871320 206030 1078483 597702 330488 651192 -272228 653917 168975 58163
857E8163J76814n93747j40032P5948j8406R37443R0570l24389j22814l37109M61258
$$ 58163 234977 -358770 -498802 -422854 -441260 496183 586753 262364 139550 -197559 263699
846B63699k48013J32298P07316p16852n37860k29248Q11099R50771j18914k80882
$$ 263699 15686 147984 855300 138448 -399412 -628660 182439 1133210 1014296 733414
836G33414o8422m210M0771L42418n22813n68683N77415L16164m42182o2344L0215
$$ 733414 664992 660782 701553 1043971 521158 -47525 529890 846054 403872 341528 371743
825C71743r9607M66107k10197O5388K10363J44613L01160n04228M28869L40679
$$ 371743 272136 738243 528046 593434 803797 948410 1249570 745342 1174211 1514890
815A514890q36487L51799P8769N11667o59975o12921P341p2110J92912R51782
$$ 1514890 678403 1030202 1108971 1620638 960663 347742 355083 282973 475885 1427667
805A427667o99734J7011k0819m5188l74184J63406J74759j47387L93138L36800
$$ 1427667 727933 744944 724125 678937 304753 468159 642918 495531 888669 1225469
795A225469m93377p2653m93338r855K95448M03460j98691L98971Q4367m10024
$$ 1225469 732092 659439 166101 156246 451694 855154 656463 1055434 1139801 729777
785G29777M35087l7234j28611O03237j74762m43348M43847j9785o51067l86034
$$ 729777 1164864 1127630 999019 1602256 1427494 984146 1427993 1408208 757141 371107
775C71107K34590L36059L34029o83096K93896j1994M72092m59285j45703k6566
$$ 371107 605697 941756 1275785 592689 886585 874591 1346683 887398 741695 715129
765G15129J3732M0682j31013k53486N04294M09764L95383o47239M49580m63992
$$ 715129 728861 769543 638530 385044 889338 1299102 1694485 1047246 1496826 1032834
755A032834m38853J83626m33279K48898M72810o79309j98206N7680l29730N63392
$$ 1032834 593981 777607 344328 593226 1066036 386727 188521 246201 -83529 479863
745D79863M29269j69110L4446j72311J00623M84986p62653n77108L23095M68904
$$ 479863 909132 740022 774468 602157 702780 1187766 425113 -151995 171100 640004
735F40004K67940p72314k73663K81934N26505R53269j40157K05806o09422l81206
$$ 640004 907944 135630 -138033 143901 670406 1623675 1483518 1689324 1079902 698696
725F98696k83280l84115J15283n27739O66724O6667J83459Q2637k63686r0114
$$ 698696 415416 31301 146584 -381155 285569 352236 535695 618332 354646 264532
715B64532M98512P89047j039980p08874M77989q1959k48295K44009J004012O0801
$$ 264532 763044 1552091 512111 -196763 281226 199267 -49028 194981 1198993 1259794
705A259794l24861l73564l14734J01214k94553K05014R70025J39716k04757P47678
$$ 1259794 934933 561369 246635 347849 53296 258310 1228335 1368051 1163294 1910972
695A910972r32483n12877J73483o11255k89700M47646P46634L24632l12760M05307
$$ 1910972 978489 465612 639095 27840 -261860 185786 932420 1257052 944292 1349599
685A349599P8381k68125J01765j71940q60406J56798L21606J93586l29847j3531
$$ 1349599 1427980 1159855 1261620 1089680 229274 386072 707678 901264 571417 557886
675E57886M77323M87864q47769N0594L63907l52862k95752J4234K54256L19757
$$ 557886 1035209 1523073 675304 725898 1089805 736943 441191 455425 709681 1029438
665A029438l54593J14796J3513o95951J6522M08380L66912O8594j11046k40173
$$ 1029438 674845 789641 803154 107203 123725 532105 899017 967611 856565 616392
655F16392Q11948n9951k16913P4153o13673J29231L83113J68310k55927k84576
$$ 616392 1428340 1368389 1151476 1225629 611956 741187 1124300 1292610 1036683 752107
645G52107j20294J62180n96706j67674M79787l50166Q69498L59696j5438r87661
$$ 752107 631813 793993 197287 29613 509400 159234 1028732 1388428 1372990 385329
635C85329k31464m257j81754M3569R82782j79123n61158J93617n24166j84594
$$ 385329 153865 149608 -32146 11423 994205 815082 253924 447541 -76625 -261219
625b61219J94213n169j71373j71919L52008m18916M72731K32343j15334J07777
$$ -261219 -67006 -72175 -243548 -415467 -63459 -482375 -9644 222699 107365 215142
615B15142J04552m64771L23545M26993l89360l81185L40970O53202M00849r82598
$$ 215142 319694 -145077 178468 605461 216101 -165084 175886 829088 1229937 247339
605B47339j84205M49047j55454O17332q66426o39956m06616J136843l048p36157
$$ 247339 63134 512181 356727 974059 107633 -532323 -938939 197904 194856 -541301
595e41301J33705J257280J15446p69013M24866M81817o78956M92107k48625j75752
$$ -541301 -407596 849684 965130 196117 620983 1102800 423844 915951 667326 491574
585D91574Q3148n10651K1406L60422l4447l68499L29421O3021m71404K32091P3730
$$ 491574 574722 64071 85477 445899 411452 42953 372374 435395 -36009 196082 269812
574B69812l87353O44224J05094K62374o51068M27786o2124J77222M15946J50851
$$ 269812 -117541 526683 631777 894151 243083 670869 608745 785967 1201913 1352764
564A352764Q1763l85866k08758r7172l8932o23528Q6775J45062l4427P0735n87084
$$ 1352764 1434527 1048661 839903 742731 703799 80271 167046 312108 277681 348416 -238668
553b38668j81770J174300k87170l23783J54945M09620j27738J66897L9546K50470
$$ -238668 -420438 753862 466692 142909 297854 707474 579736 746633 786179 1036649
543A036649R0132K74703K8280q71729q52081M32301O26797J5305M7244j180234
$$ 1036649 1126781 1401484 1429764 558035 -294046 138255 765052 780357 827601 -352633
533c52633L42328K41218Q1648o29889K465L15384N07817L58375k72385J7778M61128
$$ -352633 -10305 230913 312561 -317328 -314863 521 508338 866713 594328 612106 1073234
522A073234o7561l418K3648j73602k7727Q5615n42731K26521K87648o6701J80621
$$ 1073234 1005673 1002255 1025903 852301 824574 910189 367458 593979 881627 814926 995547
511I95547l53203n53286r917J051687p89875J84922R85705l22994m25785J53322
$$ 995547 642344 89058 79141 1130828 340953 525875 1511580 1188586 762801 916123
501I16123k89516J273813p61678l11593p74232r8816j95188j09242P58591m88795
$$ 916123 626607 1900420 1138742 827149 52917 -45899 -241087 -350329 408262 -80533
491h0533O2384J06596J80901j28603J79954O35909q1550P32446J56110l83385
$$ -80533 -18149 88447 269348 140745 320699 956608 875058 1607504 1763614 1380229
481A380229J15194p56588j01701n70687k93941p2443J0601N77542O47474k06874
$$ 1380229 1495423 738835 637134 66447 -227494 -299937 -289336 288206 935680 728806
471G28806K40157M01074n26456k60112J85116n10624J25215M33305k40014K06368
$$ 728806 968963 1370037 843581 583469 768585 257961 383176 816481 576467 782835
461G82835k48000k6017J40608K68508M7428j151864Q72457q2154m62245M76740
$$ 782835 534835 508818 649426 917934 965362 -186502 685955 603801 141556 618296
451F18296k01172m17951o6577N01444J70220n22246M61391P24293o39987p6137
$$ 618296 417124 -827 -67404 434040 604260 82014 543405 1267698 627711 551574
441E51574K24381m48595k69342l16420P51409r0319o9321k35096j93923O97220
$$ 551574 775955 327360 58018 -258402 493007 402688 333367 98271 -95652 601568
431F01568m52233P9285N4024J65332k46221l00659K43578k65139L80475K49286
$$ 601568 149335 228620 282644 447976 201755 -98904 144674 -120465 260010 509296
421E09296k49324j64077P19738l04403J5547j26718N70372N0019j49609j59176
$$ 509296 259972 95895 815633 511230 526777 400059 970431 1020450 870841 711665
411G11665n95762L7886J68582k8462N79997o09937j70787K52548M16898N05124
$$ 711665 115903 153789 322371 293909 873906 263969 93182 345730 762628 1267752
401A267752r60054M26308n9574J60635L51254K651j288037L87441N14989m02352
$$ 1267752 307698 734006 674432 835067 1186321 1188972 -99065 288376 803365 401013
391D01013O8651m40657r12913M44851R78398L67054k27614R0276L9678J32985
$$ 401013 469664 29007 -883906 -439055 539343 906397 678783 769059 808737 941722
381I41722O2479r90924j38789N87388N09382m79844J88225k7723n15354P08333
$$ 941722 1004201 13277 -125512 461876 971258 491414 679639 651916 136562 844895
371H44895R2027j620l14030M25073o42294j97724Q7043N31100m43884k75762m4182
$$ 844895 936922 935302 621272 1046345 404051 206327 293370 824470 380586 104824 60642
360F0642j11371M13040O41509j96146J34703k26416l64021m39890l84679K97425
$$ 60642 -50729 362311 1003820 807674 942377 715961 351940 -87950 -472629 -175204
350a75204n26121J70988O73161K46614R5654J70145l04008K15591p36268O47204
$$ -175204 -701325 -530337 142824 389438 485092 655237 351229 566820 -169448 477756
340D77756N18618j86976k27630J25264m59800O76796k74011l76648P0825M19431
$$ 477756 996374 809398 581768 707032 247232 924028 650017 273369 344194 763625
330G63625j15226M43683K07943n02704K6694k05697M3775J11486m25302j93062
$$ 763625 648399 1092082 1300025 797321 824015 618318 662093 773579 348277 155215
320A55215L03359j43894N18971l41458r95986P45503J42557Q67292o01432r03760
$$ 155215 458574 314680 833651 492193 -503793 241710 384267 1251559 650127 -253633
310b53633K31717r3382N76366m2686K95604O5777J17905K98189r26701l09893
$$ -253633 -21916 -115298 461068 418382 713986 779763 897668 1195857 269156 -40737
300d0737m884K36000k28906R1756J12573j89413K5123m10928M33570n89853N45870
$$ -40737 -45621 190379 -38527 53229 165802 -23611 1512 -409416 24154 -565699 -19829
289a9829Q99384M89173j271319m61745R31236l90881N65310j85366j68626N72733
$$ -19829 879555 1368728 97409 -364336 566900 176019 741329 555963 387337 960070
279I60070n28182M73226k15920M6379j08580J95577j27798M33873j27593k26063
$$ 960070 431888 905114 689194 735573 626993 822570 694772 1128645 1001052 774989
269G74989j65644n16890O9806P88398j52433p48219K44352L85484K8041N3874
$$ 774989 609345 92455 162261 950659 798226 50007 294359 679843 707884 761758
259G61758O18983j34363j0186o26235o9391j87119o37384K08903O26685K67685
$$ 761758 1380741 1246378 1236192 609957 540566 353447 -283937 -75034 551651 819336
249H19336m51175M0320l18091M46957o40121M11288k20506m1672M21083m24585
$$ 819336 368161 408481 90390 537347 -102774 308514 88008 46336 467419 42834
239D2834m79432J46267n1231M62876M67854j93228p4332k90517P1212J05738K16513
$$ 42834 -436598 -290331 -341562 121314 589168 395940 321608 31091 102303 208041 424554
228D24554k55968j21165j57131n01129L59232J478209m192j022440p19333k71142
$$ 424554 168586 47421 -109710 -610839 -251607 1226602 1222410 199970 -519363 -790505
218g90505J34578J031345k0331l00775j18128P82098Q98845l53998l41108J42117
$$ -790505 -655927 375418 355087 54312 -63816 718282 1617127 1263129 922021 1064138
208A064138O64666o88727j93734L43092m80828m36679M09224O01795j149857L6587
$$ 1064138 1728804 1040077 846343 1189435 708607 271928 681152 1282947 133090 169677
198A69677m40998L03616q8843k14930L28598N9659K30727o1259q77884M30355
$$ 169677 -271321 32295 -56548 -271478 57120 116779 347506 286247 -591637 -161282
188a61282N390j60636N2670O2130N15414J68623J42840J15844m7891O59753m00123
$$ -161282 -155892 -316528 -263858 -201728 313686 482309 625149 740993 693102 1352855 952732
177I52732m5718k83211J20730k74573L06280L78796o65259k09331m0336N1058
$$ 952732 907014 623803 744533 469960 776240 1155036 489777 280446 240110 291168
167B91168m4157K84294l76434r7161j99820J78160o01559N99513M23590n24990
$$ 291168 247011 531305 154871 57710 -142110 36050 -565509 34004 457594 -67396
157f7396N25460l51768K15006M42522k30243l63241j06319p3915J27429M31881
$$ -67396 458064 106296 321302 763824 533581 170340 64021 -9894 117535 549416
147E49416L58445N1096m50184J86010J81417M8800k8764l36524m35127P7395N8311
$$ 549416 907861 958957 508773 694783 876200 925000 896236 559712 124585 201980 260291
136B60291J75256J10210l15329k69675l4079J5710J68138j45518l8964K82346
$$ 260291 435547 545757 230428 -39247 -73326 -57616 110522 -34996 -73960 208386
126B08386J23917j38321k60250O1703K56918m789p13352J63512J027982j8556
$$ 208386 332303 193982 -66268 -4565 252353 247564 -465788 -302276 725706 707150
116G07150m44502n01427O16781l95225n37411K43957j82119j55411R19754M01290
$$ 707150 262648 -238779 378002 -17223 -554634 -310677 -492796 -648207 271547 672837
106F72837M03547k8945j166121J58149j1874L73680N08388p03324N32292o38456
$$ 672837 1076384 1047439 -118682 39467 27593 401273 909661 206337 738629 100173
96A00173O382n5434n86240N66913K70010j67734k4626L75177m8950K3499m15402
$$ 100173 106555 51121 -535119 31794 301804 134070 109444 484621 435671 459170 43768
85D3768j19688J1151k37373M01051r1089K01975k96545M09036j7189M06243L09267
$$ 43768 -75920 -64769 -302142 98909 7820 209795 -86750 322286 305097 711340 1020607
74A020607j126041j48261j08147L30523Q32269J06650k64291O4070l44974k11606
$$ 1020607 -105434 -253695 -361842 -31319 800950 907600 643309 707379 362405 150799
64A50799j57864K78048J52310n0899k30418L80205L75190j2497p59156k25977
$$ 150799 -7065 270983 423293 372394 141976 522181 897371 884874 125718 -100259
54a00259J81766J17393J77387Q7248l27135k90066j47747M04607J34086k45428
$$ -100259 81507 198900 376287 463535 136400 -153666 -301413 103194 237280 -8148
44h148L75737P0528l56273l85773N46568P35485o26040m84632K06582R8906K66040
$$ -8148 367589 438117 81844 -303929 242639 978124 352084 -132548 74034 172940 438980
33D38980l55605L26204M93503n00563K95495l40457p7996j7571K1332J04243l05889
$$ 438980 83375 409579 903082 402519 698014 357557 279561 261990 283322 387565 81676
22H1676k34594M74565M2078o8317l5717J34876k21185p35079M34516J35659J22087
$$ 81676 -152918 321647 363725 295408 259691 394567 173382 -561697 -127181 8478 130565
11A30565l87112M38090o62366L96575M98292l81475q5506K67168j77928L35940
$$ 130565 -256547 181543 -480823 -84248 414044 32569 -52937 214231 36303 372243
1C72243L360
$$ 372243 375603
0C75603
$$ 375603
$$ Imaginary data points
##PAGE= N=2
##DATA TABLE= (X++(I..I)), XYDATA
16383e443551k8005O49407L99198K33150N54492o11629J15777k42095M71167k86222
$$ -5443551 -5471556 -4822149 -4422951 -4189801 -3635309 -4246938 -4131161 -4373256 -3902089 -4188311
$$ [...]
##END NTUPLES=NMR SPECTRUM
##END=
