##TITLE=1H_CA-8960Y
 DMSO
 8 sc, 
 14.12.2021
##JCAMPDX= 6.0         $$ Bruker NMR JCAMP-DX V2.0
##DATA TYPE= NMR SPECTRUM
##DATA CLASS= NTUPLES
##ORIGIN= UXNMR, Bruker Analytische Messtechnik GmbH
##OWNER= root
$$ XWIN-NMR		Version 3.5
$$ Tue Dec 14 12:43:05 2021 Russian Standard Time (UT+4h)  she@DPX200
##.OBSERVE FREQUENCY= 200.131346
##.OBSERVE NUCLEUS= ^1H
##.ACQUISITION MODE= SIMULTANEOUS
##.ACQUISITION SCHEME= undefined
##.AVERAGES= 8
##.DIGITISER RES= 18
##SPECTROMETER/DATA SYSTEM= spect
##.PULSE SEQUENCE= zg30
##.SOLVENT NAME= CDCl3
##.SHIFT REFERENCE= (INTERNAL, CDCl3, 0, 15.7678)
##AUDIT TRAIL= $$ (NUMBER, WHEN, WHO, WHERE, WHAT)
$$ ##TITLE= Audit trail, XWIN-NMR		Version 3.5
$$ ##JCAMPDX= 5.01
$$ ##ORIGIN= Bruker BioSpin GmbH
$$ ##OWNER= she
$$ F:/spectra/data/she/nmr/H-F/1/pdata/1/auditp.txt
$$ ##AUDIT TRAIL=  $$ (NUMBER, WHEN, WHO, WHERE, WHAT)
(   1,<2021-12-14 12:41:57.09 +0400>,<she>,<DPX200>,
      <created by zg, POWCHK disabled, PULCHK disabled
       configuration hash MD5:
       00 E9 B6 7A A2 85 ED C7 34 08 36 98 17 FE 4E 26
       data hash MD5: 16K
       B8 DD FB 27 60 0F DF CA DE B7 EA 3E C5 79 08 F4>)
(   2,<2021-12-14 12:41:59.57 +0400>,<she>,<DPX200>,
      <Start of raw data processing
       efp BC_mod = 2 LB = 0.24 FT_mod = 6 PKNL = 1 PHC0 = -16027.36 PHC1 = 8.400801 SI = 16K 
       data hash MD5: 16K
       9B 72 8B 8C 0F 3D F1 56 D5 CB 89 E5 82 FF 44 3B>)
(   3,<2021-12-14 12:42:18.75 +0400>,<she>,<DPX200>,
      <pk PHC0 = 152.4235 PHC1 = 2 
       data hash MD5: 16K
       AC 10 17 D9 C0 5D 2E F4 FF B7 1C DA C8 50 0E D2>)
(   4,<2021-12-14 12:42:22.21 +0400>,<she>,<DPX200>,
      <abs ABSG = 5 
       data hash MD5: 16K
       3C ED 7B 30 77 11 83 DF F9 2D BF B4 2F 94 8F DD>)
$$ ##END=
$$ 
$$ hash MD5
$$ 9F 6C 86 92 87 50 F6 8D EB F7 9C 76 72 21 9F 74
##$RELAX= 
##$RELAX= 
##$RELAX= 
##$RELAX= 
##$RELAX= 
##$RELAX= 
$$ Bruker specific parameters
$$ --------------------------
##$DU= <F:/spectra>
##$EXPNO= 1
##$NAME= <H-F>
##$PROCNO= 1
##$TYPE= <nmr>
##$USER= <she>
##$AMP= (0..31)
100 100 100 100 100 100 100 100 100 100 100 100 100 100 100 100 100 100 
100 100 100 100 100 100 100 100 100 100 100 100 100 100 
##$AQSEQ= 0
##$AQ_mod= 1
##$AUNM= <au_zg>
##$AUTOPOS= <>
##$BF1= 200.13
##$BF2= 200.13
##$BF3= 200.13
##$BF4= 200.13
##$BF5= 200.13
##$BF6= 200.13
##$BF7= 200.13
##$BF8= 200.13
##$BYTORDA= 1
##$CFDGTYP= 0
##$CFRGTYP= 5
##$CHEMSTR= <none>
##$CNST= (0..31)
1 1 145 1 1 1 1 1 1 1 1 1 1 1 1 1 1 1 1 1 1 1 1 1 1 1 1 1 1 1 1 1 
##$CPDPRG= <>
##$CPDPRG1= <>
##$CPDPRG2= <>
##$CPDPRG3= <>
##$CPDPRG4= <mlev>
##$CPDPRG5= <mlev>
##$CPDPRG6= <mlev>
##$CPDPRG7= <mlev>
##$CPDPRG8= <mlev>
##$CPDPRGB= <>
##$CPDPRGT= <>
##$D= (0..31)
0 1.2 0 0 0 0 0 0 0 0.06 0 0.03 0 0 0 0 0.0002 0 0 0 0 0 0 0 0 0 0 0 0 
0 0 0 
##$DATE= 1639471316
##$DBL= (0..7)
120 120 120 120 120 120 120 120 
##$DBP= (0..7)
150 150 150 150 150 150 150 150 
##$DBP07= 0
##$DBPNAM0= <>
##$DBPNAM1= <>
##$DBPNAM2= <>
##$DBPNAM3= <>
##$DBPNAM4= <>
##$DBPNAM5= <>
$$ [...]
##$SUBNAM2= <"">
##$SUBNAM3= <"">
##$SUBNAM4= <"">
##$SUBNAM5= <"">
##$SUBNAM6= <"">
##$SUBNAM7= <"">
##$SUBNAM8= <"">
##$SUBNAM9= <"">
##$SW= 18.0517287032376
##$SWIBOX= (0..15)
0 0 2 0 0 0 0 0 0 0 0 0 0 0 0 0 
##$SW_h= 3612.71676300578
##$TD= 16384
##$TD0= 1
##$TE= 0
##$TE2= 300
##$TE3= 300
##$TEG= 300
##$TL= (0..7)
0 120 120 120 120 120 120 120 
##$TP= (0..7)
150 150 150 150 150 150 150 150 
##$TP07= 0
##$TPNAME0= <>
##$TPNAME1= <>
##$TPNAME2= <>
##$TPNAME3= <>
##$TPNAME4= <>
##$TPNAME5= <>
##$TPNAME6= <>
##$TPNAME7= <>
##$TPOAL= (0..7)
0.5 0.5 0.5 0.5 0.5 0.5 0.5 0.5 
##$TPOFFS= (0..7)
0 0 0 0 0 0 0 0 
##$TUNHIN= 0
##$TUNHOUT= 0
##$TUNXOUT= 0
##$USERA1= <user>
##$USERA2= <user>
##$USERA3= <user>
##$USERA4= <user>
##$USERA5= <user>
##$V9= 5
##$VALIST= <valist>
##$VCLIST= <CCCCCCCCCCCCCCC>
##$VD= 0
##$VDLIST= <DDDDDDDDDDDDDDD>
##$VPLIST= <PPPPPPPPPPPPPPP>
##$VTLIST= <TTTTTTTTTTTTTTT>
##$WBST= 1024
##$WBSW= 4
##$XGAIN= (0..3)
0 0 0 0 
##$XL= 0
##$YL= 0
##$YMAX_a= 94229
##$YMIN_a= -138576
##$ZGOPTNS= <>
##$ZL1= 120
##$ZL2= 120
##$ZL3= 120
##$ZL4= 120
##$ABSF1= 15.72155
##$ABSF2= -2.330299
##$ABSG= 5
##$ABSL= 3
##$ALPHA= 0
##$AQORDER= 0
##$ASSFAC= 0
##$ASSFACI= 0
##$ASSFACX= 0
##$ASSWID= 0
##$AUNMP= <proc_1d>
##$AZFE= 0.1
##$AZFW= 0.1
##$BCFW= 0
##$BC_mod= 2
##$BYTORDP= 0
##$COROFFS= 0
##$CY= -3
##$DATMOD= 1
##$DC= 0
##$DFILT= <>
##$DTYPP= 0
##$F1P= 0
##$F2P= 0
##$FCOR= 1
##$FTSIZE= 16384
##$FT_mod= 6
##$GAMMA= 0
##$GB= 0
##$INTBC= 1
##$INTSCL= 0
##$ISEN= 128
##$LB= 0.24
##$LEV0= 0
##$LPBIN= 0
##$MAXI= 10000
##$MC2= 0
##$MEAN= 0
##$ME_mod= 0
##$MI= 1.114404
##$NCOEF= 0
##$NC_proc= -9
##$NLEV= 6
##$NOISF1= 3.799351
##$NOISF2= 2.8
##$NSP= 0
##$NTH_PI= 0
##$NZP= 0
##$OFFSET= 15.76782
##$PC= 1
##$PHC0= -15874.94
##$PHC1= 10.4008
##$PH_mod= 1
##$PKNL= yes
##$PPARMOD= 0
##$PSCAL= 0
##$PSIGN= 0
##$REVERSE= no
##$SF= 200.129996744787
##$SI= 16384
##$SIGF1= 3
##$SIGF2= 2
##$SINO= 5.538805
##$SIOLD= 16384
##$SREGLST= <1H.CDCl3>
##$SSB= 0
##$STSI= 16384
##$STSR= 0
##$SW_p= 3612.71676300578
##$SYMM= 0
##$S_DEV= 0
##$TDeff= 16384
##$TDoff= 0
##$TI= <>
##$TILT= no
##$TM1= 0
##$TM2= 0
##$TOPLEV= 0
##$USERP1= <user>
##$USERP2= <user>
##$USERP3= <user>
##$USERP4= <user>
##$USERP5= <user>
##$WDW= 1
##$XDIM= 16384
##$YMAX_p= 451690524
##$YMIN_p= -5300195
$$ End of Bruker specific parameters
$$ ---------------------------------
##NTUPLES= NMR SPECTRUM
##VAR_NAME=  FREQUENCY,     SPECTRUM/REAL,   SPECTRUM/IMAG
##SYMBOL=    X,             R,               I
##VAR_TYPE=  INDEPENDENT,   DEPENDENT,       DEPENDENT
##VAR_FORM=  AFFN,          ASDF,            ASDF
##VAR_DIM=   16384,         16384,           16384
##UNITS=     HZ,            ARBITRARY UNITS, ARBITRARY UNITS
##FACTOR=    0.220516191357247, 1,           1
##FIRST=     3155.61383697424, 0,            0
##LAST=      -457.102926031544, 0,           0
##MIN=       -457.102926031544, -5300195,    0
##MAX=       3155.61383697424, 451690524,    0
$$ Real data points
##PAGE= N=1
##DATA TABLE= (X++(R..R)), XYDATA
$$ [...]
14862b42963K39645M2269m46226J87573N16655P22895r51812q87565j84894M16672
$$ -242963 -3318 38951 -407275 -219702 296953 1019848 68036 -819529 -1004423 -587751
14852e87751R92865m61297m82871o08143L95355K74860k08905R9994K73546j83063
$$ -587751 405114 -56183 -539054 -1147197 -751842 -476982 -685887 -585893 -312347 -495410
14842d95410J73015p6019P6537J86277j55936l39069k20519N91023o0596n95319
$$ -495410 -322395 -398414 -321877 -135600 -291536 -630605 -851124 -260101 -320697 -916016
14832i16016l14988P52752N15387n02194J10446J65826L79118N5113M3582n00390
$$ -916016 -1231004 -478252 37135 -465059 -354613 -188787 190331 245444 289026 -211364
14822b11364l65893j55223K77660j91329M0052j81050P1403R1552K22435J80471
$$ -211364 -577257 -732480 -454820 -646149 -606097 -787147 -715744 -624192 -401757 -221286
14812b21286K54301L20891n33131p7564R0151M0726m63339k48461K29425m70782
$$ -221286 33015 353906 -179225 -256789 -166638 -125912 -589251 -837712 -608287 -1079069
14802a079069N01753N34937k56025L2791M39879k80483J23169l80657J54547J07379
$$ -1079069 -577316 -42379 -298404 -265613 174266 -106217 16952 -363705 -209158 -101779
14792a01779M3272m20655p02016Q28284l8788o02848K06094n73495O28880O9600
$$ -101779 -58507 -479162 -1181178 -352894 -391682 -994530 -788436 -1361931 -733051 -663451
14782f63451N024L06325M31563k77153o6725n6834l53550L51229n50477J349J16922
$$ -663451 -658427 -352102 79461 -197692 -264417 -321251 -674801 -323572 -874049 -872700 -755778
14771g55778R24454M84266m33882p08264j057185P69878R74165J32646l27354
$$ -755778 168676 652942 219060 -489204 -1546389 -776511 197654 330300 2946
14762B946k36977Q2405J22084l99402l18979M57117K30768l94242k70413R63322
$$ 2946 -234031 -151626 -29542 -428944 -747923 -290806 -60038 -454280 -724693 238629
14752B38629K71213n17179L21803j2162n5911n12546k56397K91419n83478N5192
$$ 238629 509842 -7337 314466 302304 246393 -266153 -522550 -231131 -814609 -759417
14742g59417M93669L38883k60417J03923m07258m27638M40731j33881L69043m92998
$$ -759417 -265748 73135 -187282 -83359 -490617 -918255 -477524 -611405 -242362 -735360
14732g35360m37140m00137L67190L11141l07918O77853l86631O44009l65185k79570
$$ -735360 -1172500 -1572637 -1205447 -894306 -1202224 -524371 -911002 -266993 -632178 -911748
14722i11748N24748j14932K65016m8887m34699l84689k09126K03488M60180r8261
$$ -911748 -387000 -501932 -236916 -285803 -720502 -1105191 -1314317 -1110829 -650649 -748910
14712g48910n45131M61543J33775p67242K04980M38377j12881O59826q91Q3278
$$ -748910 -1294041 -832498 -698723 -1465965 -1260985 -822608 -935489 -275663 -276554 -193276
14702a93276m88047j70173M34309J2704j11201J546777p89411n63988J65186K92664
$$ -193276 -681323 -851496 -417187 -404483 -515684 1031093 241682 -322306 -157120 135544
14692A35544o0865o61073Q3825k59108M20894J10370K00403m05982k43796L58315
$$ 135544 74679 -586394 -502569 -761677 -340783 -230413 -30010 -435992 -679788 -321473
14682c21473K57749q80191K5238L57891j83691K93404L68733J34423k37622j42356
$$ -321473 -63724 -943915 -918677 -560786 -744477 -451073 -82340 52083 -185539 -327895
14672c27895M50241M88621l74315K54583p61231J32734l7100L81323p16801q11295
$$ -327895 122346 610967 236652 491235 -269996 -137262 -174362 206961 -509840 -1321135
14662a321135j67314J164790O68888l55022l48375p45345m29072K75351J145377
$$ -1321135 -1488449 -323659 345229 -9793 -358168 -1103513 -1532585 -1257234 -111857
14653a11857J80668l99978l62288M99961o14682j57861J4813Q19840J95361q09311
$$ -111857 68811 -331167 -693455 -193494 -808176 -966037 -951224 -131384 63977 -745334
14643g45334P50171M25966n2417p0529q28118L67580j00419k67498P1728Q89276
$$ -745334 4837 430803 378386 307857 -520261 -152681 -253100 -520598 -448870 440406
14633D40406L24904j151493j74328l5136j71450j22644M08145m76360n42511J372263
$$ 440406 765310 -386183 -560511 -595647 -767097 -889741 -481596 -957956 -1500467 -128204
14623a28204J71213l01618l26713o09925Q69710m58951n59823K45552l0054p1762
$$ -128204 43009 -258609 -585322 -1195247 -325537 -784488 -1344311 -1098759 -1128813 -1200575
14613a200575K52574K43310p99787K79688Q17359N27026k31959j98701k16218
$$ -1200575 -948001 -704691 -1504478 -1224790 -407431 119595 -112364 -311065 -527283
14604e27283k42335p07759J089874M21039j51308q30507k9128M28550n0331K14521
$$ -527283 -769618 -1477377 -387503 33536 -117772 -948279 -977407 -548857 -599188 -384667
14594c84667r0918M69666J44908M5130l05868J30244m95249q3905k43415M5991
$$ -384667 -475585 -5919 138989 184119 -121749 8495 -486754 -570659 -814074 -768083
14584g68083P45074k37697Q0614l22128J22328j30490P42072o56897M45493l02206
$$ -768083 -23009 -260706 -180092 -502220 -379892 -510382 231690 -425207 20286 -281920
14574b81920r9525K28508o55129K66032K89552o67385m7804L73336M59395l05385
$$ -281920 -381445 -152937 -808066 -542034 -252482 -919867 -967671 -594335 -134940 -440325
14564d40325J66638K48352p08399k80698P73159P64883j696041n06294Q10905
$$ -440325 -273687 -25335 -733734 -1014432 -241273 523610 -1172431 -1678725 -867820
14555h67820J25987O05292N42342j88196l72596l76683j23681n25450Q90770J21506
$$ -867820 -741833 -136541 405801 217605 -154991 -531674 -655355 -1180805 -290035 -168529
14545a68529K78550l93498L15882J14469k25331Q18339q02560O6199N97231p76182
$$ -168529 110021 -283477 32405 146874 -78457 739882 -62678 3521 600752 -175430
14535a75430n46248M75769P5675j436071M20231O83255J99678o42910K92872j514
$$ -175430 -721678 -245909 -170234 -1606305 -1186074 -502819 -303141 -946051 -653179 -654693
14525f54693K74612k32087Q7154J23076K66502j32640R95253j18032o79494M49180
$$ -654693 -380081 -612168 -525014 -401938 -135436 -268076 727177 609145 -70349 378831
14515C78831p50375n4601j70495P3337j41423k41888O4654N58343m72181j3141
$$ 378831 -371544 -426145 -596640 -523303 -664726 -906614 -841960 -283617 -755798 -768939
14505g68939l8292N1337k86435j57116M75742O28080j99306m33855l52556k82237
$$ -768939 -807231 -755894 -1042329 -1199445 -723703 -95623 -294929 -728784 -1081340 -1363577
14495a363577J037772k03564J58513K21480P74856q02679m87187K8811J69015
$$ -1363577 -325805 -529369 -370856 -149376 625480 -177199 -664386 -635575 -466560
14486d66560L31598J51537j59229p76499j68438M4640K70989p94066M73013l16663
$$ -466560 -134962 16575 -142654 -919153 -1087591 -1042951 -771962 -1566028 -1093015 -1409678
14476a409678O0358O56020J001669o32490o03003J81233Q6472J23966L89917k24894
$$ -1409678 -1349320 -693300 308369 -324121 -927124 -745891 -659419 -535453 -145536 -370430
14466c70430n31638N49262n85922m14996K40556P30117k72991J62764J77595j46657
$$ -370430 -902068 -352806 -938728 -1353724 -1113168 -383051 -656042 -493278 -315683 -462340
14456d62340L02514m38412K23804N22569l51969J04789j88396J75761p02462q17232
$$ -462340 -159826 -598238 -374434 148135 -203834 -99045 -287441 -111680 -814142 -1631374
14446a631374P24395Q26428o3010l75764P94787m48015k69249j2880J59145K18074
$$ -1631374 -906979 -80551 -143561 -519325 275462 -172553 -441802 -454682 -295537 -77463
14436g7463n3884o46787k98850o09389K25338J199865N9991L69830o47944n9964
$$ -77463 -131347 -778134 -1076984 -1686373 -1461035 -261170 -201179 168651 -479293 -539257
14426e39257j14673M07117l1525L52709j17099l38341k8896J07963L45145n22190
$$ -539257 -653930 -246813 -278338 74371 -42728 -381069 -409965 -302002 43143 -479047
14416d79047M76819j49998o00736p5611J87346L69168n58283J03530K70886j46345
$$ -479047 -2228 -152226 -752962 -828573 -641227 -272059 -830342 -726812 -455926 -602271
14406f02271l59159l64810M12514L86914R9215R9260K04553o9365l88160l61370
$$ -602271 -961430 -1326240 -913726 -526812 -427597 -328337 -123784 -193149 -581309 -942679
14396i42679K21360k38031L4429N09667K58473r37362r9809L13174O28264j67649
$$ -942679 -721319 -959350 -924921 -415254 -156781 -1094143 -1193952 -880778 -252514 -420163
14386d20163J23101n07669O55148J29737k52214K57861m4121N39794J43555m82061
$$ -420163 -297062 -804731 -149583 -19846 -272060 -14199 -58320 481474 625029 142968
14376A42968j127108q69474J438150J94527r52378r8892M9303Q53965j78595p9315
$$ 142968 -984140 -1853614 -415464 -220937 -1173315 -1272207 -1222904 -368939 -547534 -626849
14366f26849o6787j25934n70754L00755L69902j60580k9620K861k10501P33814
$$ -626849 -693636 -819570 -1390324 -1089569 -719667 -880247 -909867 -907006 -1117507 -383693
14356c83693K19872K88477L36599l51129k62049K81947l52508j13265K80764L92604
$$ -383693 -163821 124656 461255 110126 -151923 130024 -222484 -335749 -54985 337619
14346C37619q10701k03755Q21105r22079N1102j6196R08180j1123m20571l4913
$$ 337619 -473082 -676837 144268 -777811 -726709 -742905 165275 154152 -266419 -301332
14336c01332K16110n82074m24548l475j88356l35224Q67206J90441K4675J94905
$$ -301332 -85222 -667296 -1091844 -1095319 -1283675 -1618899 -751693 -561252 -536577 -341672
14326c41672l03258k52628j23742L36542J58724J60127l85412o03463r0799L6403
$$ -341672 -644930 -897558 -1021300 -684758 -526034 -365907 -751319 -1354782 -1445581 -1409178
14316a409178n9307M28070l42029L99476N05394j30666k99416R03353J9232m35272
$$ -1409178 -1468485 -1040415 -1382444 -982968 -477574 -608240 -907656 -4303 14929 -420343
14306d20343j65514J21365N78024n13105N52097m2579q92473J54596N05504N42147
$$ -420343 -585857 -464492 113532 -399573 152524 109945 -782528 -627932 -122428 419719
14296D19719l7436K2473j57102J24671o9502l47133K700k45014n52901k64128
$$ 419719 382283 404756 247654 372325 302823 -44310 -41610 -286624 -839525 -1103653
14286a103653P01086O23403j58123M1800j038387J97244P40414p76474n9925L01516
$$ -1103653 -402567 220836 62713 104513 -933874 -736630 3784 -772690 -832615 -531099
14276e31099J28734K76627l65408l946L86091L22808j27525l10827l42203n2161
$$ -531099 -402365 -125738 -491146 -495092 -109001 213807 86282 -224545 -566748 -618909
14266f18909M68366J91215p78018k19967K51411q3950l50077K74326M43875l33215
$$ -618909 -150543 40672 -737346 -957313 -705902 -789852 -1139929 -865603 -421728 -754943
14256g54943j34463j55249L45338R9835n53606m49643K60494J029433q04657K66207
$$ -754943 -889406 -1044655 -699317 -599482 -1153088 -1602731 -1342237 -312804 -1117461 -851254
14246h51254k9892M51468o28894j49085m07628k19471Q27950Q28035N42977j04328
$$ -851254 -881146 -429678 -1058572 -1207657 -1615285 -1834756 -1006806 -178771 364206 259878
14236B59878r26766m85688k41085L86483J03884O60139k65005n28112P44311r82345
$$ 259878 -666888 -1152576 -1393661 -1007178 -903294 -243155 -508160 -1036272 -291961 -1274306
14226a274306O77492J85867L3203n01597Q29485J74410m55682k33034N97980M2767
$$ -1274306 -596814 -410947 -377744 -879341 -49856 124554 -331128 -564162 33818 76585
14216G6585J27111m83800q20003L73394o35719q4900P39604k44706L59682M36346
$$ 76585 203696 -280104 -1100107 -726713 -1362432 -1447332 -707728 -952434 -592752 -156406
14206a56406Q59951j52085o74005M37011j13093j097794l28243P60285L2886l26300
$$ -156406 703545 551460 -122545 314466 201373 -896421 -1224664 -464379 -431493 -757793
14196g57793n88604m29155J4403M44M35147M41888M77602N18988l4135J79464
$$ -757793 -1346397 -1775552 -1761149 -1760705 -1325558 -883670 -406068 112920 78785 258249
14186B58249O49254p12268j207089q6862j06314O02867j3259m92100O57210j4251
$$ 258249 907503 195235 -1011854 -1098716 -1205030 -602163 -615422 -1107522 -450312 -464563
14176d64563Q75060r10911m77740Q0697J1351j43504l43654L33532P48618j010423
$$ -464563 410497 -500414 -978154 -897457 -886106 -1029610 -1373264 -1039732 -291114 -1301537
14166a301537k00852Q83831M62362N36183m65454j97241M48810l94051j269630
$$ -1301537 -1502389 -618558 -156196 379987 -85467 -282708 166102 -227949 -1497579
14157a497579J181141K35414k65006k39467L89990j96330J18639L05230q05175
$$ -1497579 -316438 -81024 -346030 -585497 -195507 -391837 -273198 32032 -773143
14148g73143L84762o91107J58351M47643r5785O44654q99643l54857J019448k04313
$$ -773143 -388381 -1079488 -921137 -473494 -569279 75375 -824268 -1179125 -159677 -363990
14138c63990J74258p97020N11560m52067K35888K38403k41818J43353k19420J11225
$$ -363990 -189732 -986752 -475192 -927259 -691371 -452968 -694786 -551433 -770853 -659628
14128f59628M02425k29313O26851K43258K90915o32440p05186j09291M2051J18716
$$ -659628 -257203 -486516 140335 383593 674508 42068 -663118 -772409 -730358 -611642
14118f11642P8098r0383k26838L44471j75452R28592r89885K68491l66589k2066
$$ -611642 -533544 -623927 -850765 -506294 -681746 246846 -743039 -474548 -841137 -863203
14108h63203r60163K86663l29114R2921R35302J205089j322876l99871O40645
$$ -863203 -1823366 -1536703 -1865817 -1772896 -837594 367495 -955381 -1355252 -714607
14099g14607M90048q25066l32510j90112K62789Q07497n25393P38943Q61828J04799
$$ -714607 -224559 -1049625 -1382135 -1572247 -1309458 -501961 -1027354 -288411 573417 678216
14089F78216q08865o3550J46051L76868j363157o27730J068490p5761p02791J40238
$$ 678216 -130649 -194199 -48148 328720 -1034437 -1662167 -593677 -669438 -1372229 -1231991
14079a231991J242881J8997M39415j157037n57381J89972L42651l9788l88221
$$ -1231991 10890 29887 469302 -687735 -1245116 -1055144 -712493 -752281 -1140502
14070a140502O61163M49297O9222l36707N92194m25033N04538q34291K5310J333
$$ -1140502 -479339 -30042 39180 -297527 294667 -130366 374172 -460119 -434809 -433476
14060d33476q5453K65603P678m66960J19948K17453M23172m26387n72845J44803
$$ -433476 -518929 -253326 -245648 -712608 -592660 -375207 47965 -378422 -951267 -806464
14050h06464M94547j21669P49767m6551m75973M03413m52473j00802n38124M7944
$$ -806464 -311917 -433586 316181 269630 -206343 197070 -255403 -356205 -894329 -846385
14040h46385q8373M50750L7089n77120j68867K82504R8806m17141O20621J128083
$$ -846385 -934758 -484008 -446919 -1024039 -1192906 -910402 -811596 -1228737 -608116 519967
14030E19967r17704l13810J83064l71595l05063j0286O10406M76605l10687j76498
$$ 519967 -397737 -711547 -528483 -900078 -1205141 -1215427 -605021 -128416 -439103 -615601
14020f15601j20566L80691q45189R49176j58217q86911J268J048809O90281n05539
$$ -615601 -736167 -355476 -1200665 -251489 -409706 -1296617 -1295349 -246540 443741 -61798
14010f1798l09624j84462j01012J77379k87407o70710J47123j96784P82764L45882
$$ -61798 -371422 -555884 -656896 -479517 -766924 -1437634 -1290511 -1487295 -704531 -358649
14000c58649k9065o39717L9475j04459M65791q4495o5897L10465P5438o7411l97287
$$ -358649 -387714 -1027431 -987956 -1092415 -626624 -711119 -777016 -466551 -391113 -458524 -855811
13989h55811L26839j43313k99045O16577m55401J34661J014186j0161M7613m11031
$$ -855811 -528972 -672285 -971330 -354753 -810154 -675493 338693 328532 376145 -34886
13979c4886n01062M05505j57162k17269m59137N3110K96202j20849m9104R30925
$$ -34886 -535948 -130443 -287605 -504874 -964011 -910901 -614699 -735548 -784652 146273
13969A46273M25419n61898r17570N7715J72065j96667J84973l4194m80563M95839
$$ 146273 571692 9794 -907776 -850061 -677996 -874663 -689690 -723884 -1204447 -708608
13959g08608M50549j62386p51486k28405P96824n3829K40788O47044j691069L69506
$$ -708608 -258059 -420445 -1171931 -1400336 -603512 -657341 -416553 230491 -1460578 -1091072
13949a091072Q73217k6779l60929o03867N31979n67006j46405J330739O43864
$$ -1091072 -217855 -244634 -605563 -1209430 -677451 -1244457 -1390862 -60123 583741
13940E83741l53895l34733k12537L04138n25347K60384O60137n01387m5132j21293
$$ 583741 229846 -104887 -317424 -13286 -538633 -278249 381888 -119499 -164631 -285924
13930b85924J9783J54619Q86146m09902k90511l35507k17856M60726K00664k44241
$$ -285924 -266141 -111522 774624 364722 74211 -261296 -479152 -18426 182238 -62003
13920f2003r7409k85268p0285l80525K1489l50676K2790j04694m67063J074290
$$ -62003 -159412 -444680 -514965 -895490 -874001 -1224677 -1201887 -1306581 -1773644 -699354
13910f99354K92259m57159j51283L63176l58372O27468J40092o58008q31566J084433
$$ -699354 -407095 -864254 -1015537 -652361 -1010733 -383265 -243173 -901181 -1732747 -648314
13900f48314M775l61412n2498n4020q66528P48244J263925O0871q36127l07823
$$ -648314 -643539 -1004951 -1057449 -1111469 -1977997 -1229753 34172 95043 -741084 -1048907
13890a048907l91555L7889K96951m75957J44451M85564k04517O95480k41146K02484
$$ -1048907 -1440462 -1402573 -1105622 -1581579 -1437128 -951564 -1156081 -460601 -701747 -499263
13880d99263O69388m85833r8751K3294K84157l58467J55286M06371N8550j37138
$$ -499263 170125 -315708 -414459 -391165 -107008 -465475 -310189 96182 154732 17594
13870A7594k93409L96114o074l37279m3722k40465j052290M14382K83501k3309
$$ 17594 -275815 120299 114225 -223054 -266776 -507241 -1559531 -1145149 -861648 -884957
13860h84957j19466P07383k77439J41653M45864n22251j075057l457M65368m15357
$$ -884957 -1004423 -297040 -574479 -432826 13038 -509213 -1584270 -1587727 -1122359 -1537716
13850a537716J39088K42206P03074L31184m14798j27075P56388p84230n19942
$$ -1537716 -1398628 -1156422 -453348 -122164 -536962 -664037 92351 -691879 -1211821
13841a211821L95716J88244R1788o91793L70449O03881k23066k57855j6969Q9140
$$ -1211821 -816105 -627861 -536073 -1227866 -857417 -253536 -476602 -734457 -751426 -662286
13831f62286J28636O89849m58220M17676j145720j060594J44869N6021J75176
$$ -662286 -533650 156199 -302021 115655 -1030065 -2090659 -1945790 -1889769 -1714593
13822a714593Q22008P34873P15478m76581j006486L34642K40529j13251n10816
$$ -1714593 -892585 -157712 557766 81185 -925301 -590659 -350130 -463381 -974197
13813i74197m63549R54779L87546n05738k17677Q82703K20633j74356k44483j91824
$$ -974197 -1437746 -482967 -95421 -601159 -818836 63867 284500 110144 -134339 -326163
13803c26163M10439K67981o38917j084446L43377O03339l88680k84951O23258
$$ -326163 84276 352257 -286660 -1371106 -1027729 -424390 -813070 -1098021 -474763
13794d74763k16345K2755L35415K08301K78579o6294j35284o03122l25980m37327
$$ -474763 -691108 -668353 -332938 -124637 153942 87648 -47636 -650758 -976738 -1414065
13784a414065R88379k4626k08567k14893k51610k85885J113150o12866j042957
$$ -1414065 -425686 -450312 -658879 -873772 -1125382 -1411267 -298117 -910983 -1953940
13775a953940M95169r7180P56535R3640k19113m51216J617552O03430q80994K99960
$$ -1953940 -1458771 -1555951 -799416 -705776 -924889 -1376105 241447 844877 -36117 263843
13765B63843j29377o3120m88687l96895l6765j81993P71961m32883r01934P54816
$$ 263843 134466 71346 -417341 -814236 -851001 -1032994 -261033 -693916 -1595850 -841034
13755h41034R35666l77023o02267R26907N46523Q1479l75896l74886J44658o58025
$$ -841034 94632 -282391 -884658 42249 588772 670251 294355 -80531 64127 -593898
13745e93898R4047P1758N38890l11601N0490r7831m34446M6408J39762J91756
$$ -593898 -499851 -428093 110797 -200804 -150314 -248145 -682591 -636183 -496421 -304665
13735c04665j60020k41344j31215N43568L68064j77388J02197P0811j62441j70358
$$ -304665 -464685 -706029 -837244 -293676 74388 -103000 -803 70008 -92433 -262791
13725b62791l38248m60990L14793N81900n66201L09800L16961r3700j83747l32618
$$ -262791 -601039 -1062029 -747236 -165336 -731537 -421737 -104776 -198476 -382223 -714841
13715g14841n0779M30733j50160j24277M34495O63271q06017k31049o17579k54270
$$ -714841 -765620 -334887 -485047 -609324 -174829 488442 -317575 -548624 -1166203 -1420473
13705a420473N91649K40538M76703q29759j77155P71593J06257R14857q87506
$$ -1420473 -828824 -588286 -111583 -941342 -1118497 -346904 -240647 674210 -213296
13696b13296p07002R31524l34740m40007j8581J37561j51626K59338K19084R6967
$$ -213296 -920298 11226 -323514 -763521 -782102 -644541 -796167 -536829 -317745 -220778
13686b20778n31959J98335j29425K1932K09936K31830l4103O40080J524k82294
$$ -220778 -752737 -554402 -683827 -661895 -451959 -220129 -254232 385848 387372 105078
13676A05078j94309L99968o17090j293610K83248R46881J80594m83567j95874
$$ 105078 -89231 310737 -306353 -1599963 -1316715 -369834 -189240 -672807 -868681
13667h68681N37876n83675K35833M00219k86272k89401M0958j19605O0716K14840
$$ -868681 -330805 -914480 -678647 -278428 -564700 -854101 -813143 -932748 -872032 -657192
13657f57192l94167L46441k69040m03879r4018R25942o9380R6917l98365p85820
$$ -657192 -1051359 -704918 -973958 -1377837 -1471855 -545913 -615293 -518376 -916741 -1702561
13647a702561J068930Q1786j76589K25916L97546j28241J29542j17624j106N82779
$$ -1702561 -633631 -551845 -728434 -502518 -104972 -233213 -103671 -221295 -222401 360378
13637C60378j96338l91417M984K44801m46545p3456J003342j95544k90466q37643
$$ 360378 164040 -227377 -222393 22408 -424137 -497593 505749 310205 19739 -817904
13627h17904O06868l25437p40559N36141l1395n97912m33372J221837p0386K36130
$$ -817904 -211036 -536473 -1277032 -740891 -772286 -1370198 -1803570 -581733 -652119 -415989
13617d15989P80215n67532q88683Q00924k37733k34744l77391j31443o61103P64556
$$ -415989 364226 -203306 -1091989 -291065 -528798 -763542 -1140933 -1272376 -1933479 -1168923
13607a168923N73596J71923k04690k11086M98068k97188J49992Q61707n60993
$$ -1168923 -595327 -423404 -628094 -839180 -341112 -638300 -488308 373399 -187594
13598a87594O5425M42230o31252N88989K68412J13004q49903L8943N22780l12285
$$ -187594 -122169 320061 -311191 277798 546210 659214 -190689 -151746 371034 58749
13588E8749p38803o69992m04215O56683N23015L75480L20425J91066r3533n91033
$$ 58749 -680054 -1350046 -1754261 -1097578 -574563 -199083 121342 312408 218875 -372158
13578c72158l81103o18664l27847O38081Q97188O93338m16086k4840O81506r94525
$$ -372158 -753261 -1371925 -1699772 -1061691 -164503 528835 112749 87909 769415 -225110
13568b25110j26773K4686M49592j38698o6356J40425m42979n952J86651m3596
$$ -225110 -351883 -327197 122395 -16303 -82659 57766 -385213 -391165 -204514 -248110
13558b48110M34901m66500J27982K66022m32379j6620m65917J4382m78855l00181
$$ -248110 186791 -279709 -151727 114295 -318084 -334704 -800621 -786239 -1265094 -1565275
13548a565275O27596K77222P48112k44103p01936R57533l18976J41735P67564
$$ -1565275 -937679 -660457 87655 -156448 -858384 99149 -219827 -78092 689472
13539F89472o04886J00483K19892j83736p1489m3914l30528j74741K13105j51378
$$ 689472 84586 185069 404961 221225 149736 105822 -224706 -399447 -186342 -337720
13529c37720m00410n94379J30108K4685P52306l06883j29023o58438P9533Q44685
$$ -337720 -738130 -1332509 -1202401 -1177716 -425410 -732293 -861316 -1519754 -1440221 -595536
13519e95536M7994R63144o3982J06894k27935p4654M4747r09601N1195p3610r8099
$$ -595536 -547542 415602 351620 458514 230579 155925 200672 -708929 -657734 -731344 -829443
13508h29443L06773O81947L79089j233375K55668O44315L79310q7174k14232j222583
$$ -829443 -522670 159277 538366 -695009 -439341 204974 584284 497110 282878 -939705
13498i39705r2559Q54928n37579O68654O58616k24892K52627r39309j147608J123158
$$ -939705 -1032264 -177336 -714915 -46261 612355 387463 640090 -299219 -1446827 -323669
13488c23669J21046M4594m58080L59826j51126n7609P34790k26839M5359m88996
$$ -323669 -202623 -158029 -616109 -256283 -407409 -465018 269772 42933 88292 -400704
13478d00704q8686l85824l88358Q13231j76279l15956P53945j37386l71278O98489
$$ -400704 -489390 -875214 -1263572 -450341 -626620 -942576 -188631 -326017 -697295 1194
13468A194j64750K1620K59355j82388M4836k00203l27528j16684L02870l04891
$$ 1194 -163556 -141936 117419 -64969 -20133 -220336 -547864 -664548 -361678 -666569
13458f66569M5304p20023O0641P71886M87172K17572O54820n48180n73145o63659
$$ -666569 -621265 -1341288 -1280647 -508761 -21589 195983 850803 302623 -270522 -934181
13448i34181j04248Q97590N07845p19179j33684M26721q76385j19028J1085J25928
$$ -934181 -1038429 -140839 367006 -352173 -485857 -59136 -935521 -1054549 -1043464 -917536
13438i17536N83604L75011J37329l0645P7482Q3644o86257J76069K90821M67847
$$ -917536 -333932 41079 178408 147763 225245 308889 -377368 -201299 89522 557369
13428E57369k86170j28286l84705p02025N26196R46663J4653q1699O29548m82896
$$ 557369 271199 142913 -241792 -943817 -417621 529042 543695 461996 1091544 608648
13418F08648j356075L11541M24956J2370J22410j05677k56204J95588n53192J342952
$$ 608648 -747427 -435886 -10930 1440 123850 18173 -238031 -42443 -595635 747317
13408G47317J04937j187434K70164J63961J69782n06278K82401k53595K69781
$$ 747317 852254 -335180 -65016 98945 268727 -237551 44850 -208745 61036
13399F1036k10242l006Q5351p14001j94602K08171P58788l07507p42318l610P60123
$$ 61036 -149206 -152212 -66861 -780862 -975464 -767293 -8505 -316012 -1058330 -1061940 -301817
13388c01817N25871K35273o39436j47122p8971o0329L55359J92904k87184N19436
$$ -301817 224054 459327 -180109 -327231 -406202 -466531 -111172 81732 -205452 313984
13378C13984N2595j001176l88484J017311O44298l33802j02648J153M42329J096030
$$ 313984 366579 -634597 -1023081 -5770 638528 304726 202078 203231 645560 1741590
13368A741590q26910q83733L6377J44142o63011J76575P84522J47038M13810m16225
$$ 1741590 914680 30947 67324 211466 -451545 -274970 509552 656590 1070400 654175
13358F54175j03517j81414j14402n41650K58842j75665m75381j7841K12348N91890
$$ 654175 550658 369244 254842 -286808 -27966 -203631 -679012 -696853 -484505 107385
13348A07385M83200k27204K47400j18258l22617o9454o3154j68282P0010n02555
$$ 107385 590585 363381 610781 492523 169906 100452 37298 -130984 -60974 -563529
13338e63529O59559l35777K22948p0400N71408k30593j06317j07083n444l90970
$$ -563529 96030 -239747 -16799 -87199 484209 253616 147299 40216 34772 -356198
13328c56198J00099J14332p9022L48327n8771M15183L16466o19788m16791n28448
$$ -356198 -256099 -141767 -220789 127538 68767 483950 800416 180628 -236163 -764611
13318g64611N7224J321481o4729K26523R296O33187q17655m12630J79365o7151
$$ -764611 -707387 614094 549365 775888 785184 1418371 600716 188086 367451 300300
13308C00300M14631J18961j47781p37108j39468K80474J69526k97848L36613k65349
$$ 300300 714931 833892 686111 -50997 -190465 90009 259535 -38313 298300 32951
13298C2951p8759j5587M80787K04093m02244K77046j97979M49901K2998k81096
$$ 32951 -45808 -61395 419392 623485 221241 498287 300308 750209 773207 492111
13288D92111n60077l27246m40774O63153n4853K65602L80375N91746m71936n74083
$$ 492111 -67966 -395212 -835986 -172833 -227686 37916 418291 1010037 538101 -35982
13278c5982l1143k21480m54820j73618O89284J92927k25989L90857L006N73728
$$ -35982 -67125 -288605 -743425 -917043 -227759 -34832 -260821 130036 133042 706770
13268G06770q89627m18840L88564L15944j53653M66495N91007j51943K72062q03894
$$ 706770 -182857 -601697 -213133 102811 -50842 415653 1006660 854717 1126779 322885
13258C22885j84626J102166k22415k16804n86684j051393k30929O10170N07029
$$ 322885 138259 1240425 1018010 801206 214522 -836871 -1067800 -457630 49399
13249D9399Q8J65496O19966O2324m75134K84349r2813R91858n01312k36978m84957
$$ 49399 49487 214983 834949 897273 422139 706488 613675 1605533 1104221 867243 382286
13238C82286M4164l72773N04098K04796n44410l68118k17311J92919j54789l06504
$$ 382286 426450 53677 557775 762571 218161 -149957 -367268 -174349 -329138 -635642
13228f35642J40632m17446Q74267j04463m66450j59503L63707Q92203K37497k43711
$$ -635642 -495010 -912456 -38189 -142652 -609102 -768605 -404898 487305 724802 481091
13218D81091j99518k95027n58093O17139p13061P95244J86046J44518k90136j8485
$$ 481091 281573 -13454 -571547 45592 -667469 127775 313821 458339 168203 149718
13208A49718P98712n44129l42897J63433O24347k27517n68310K05330k82219j31464
$$ 149718 948430 404301 61404 224837 849184 621667 53357 258687 -23532 -154996
13198a54996n3050J35566L31295L04211q2297l82186n58930l3888M43039M64730
$$ -154996 -208046 -72480 258815 563026 480729 98543 -460387 -494275 -51236 413494
13188D13494L5467K12237r2281p24428k62854K3904Q35656L65586j71427m78968
$$ 413494 448961 661198 568917 -155511 -418365 -394461 441195 806781 635354 156386
13178A56386l35895l28995J0000O40070K63991K10461l23227M79084j07465M42714
$$ 156386 -179509 -508504 -498504 141566 405557 616018 292791 771875 664410 1107124
13168A107124k04160l83613m28613n44804J46760N83554N83231n0326m70123K1148
$$ 1107124 902964 519351 90738 -454066 -307306 276248 859479 809153 339030 360178
13158C60178m10057k77524P42545j08626k14519N72544j93189k59947m50053o0548
$$ 360178 -49879 -327403 415142 306516 91997 664541 471352 211405 -238648 -299196
13148b99196J79251r3471L83203N36424k7656q34845j59843N0078M84783j68253
$$ -299196 -119945 -213416 169787 706211 678555 -156290 -316133 -266055 218728 50475
13138E0475P60204J06898r4172j223515P67339K55275k44327L17932L55581l76536
$$ 50475 810679 917577 823405 -400110 367229 622504 378177 696109 1051690 675154
13128F75154m11988K78534J98721N56607m22043j02886k29834K93817j24519p49688
$$ 675154 263166 541700 740421 1297028 874985 772099 542265 836082 711563 -38125
13118c8125p7752L48318l66283M6202Q9425n7376M25610J17778o09736m81714
$$ -38125 -115877 232441 -133842 -87640 1785 -55591 370019 487797 -121939 -603653
13108f03653J025887M67436o96842O58161L82868K06778j040197J96079L23421
$$ -603653 422234 889670 192828 850989 1233857 1440635 400438 596517 919938
13099I19938m1393P71342K97813l93469m08433j17563l33903r5476k82081m8059
$$ 919938 878545 1649887 1947700 1554231 1145798 1028235 694332 598856 316775 268716
13089B68716J161095k33080k95784M67182r14402N02201j84041M47726J30358
$$ 268716 1429811 1196731 900947 1368129 453727 955928 771887 1219613 1349971
13080A349971n00197j13523J55669k51092R91778n42702m21176K32876n59285
$$ 1349971 849774 736251 891920 640828 1632606 1089904 668728 901604 342319
13071C42319o49138J84089O44424L24273k08422m46863L60525K88916o73598O2825
$$ 342319 -306819 -122730 521694 845967 637545 190682 551207 840123 166525 229350
13061B29350N70368k21620Q32418l93004q73j53424q2814m50767j08484L03959
$$ 229350 799718 578098 1410516 1017512 1016639 863215 780401 329634 221150 525109
13051E25109M19658M33695n15506M70296l76435k97293J87798j84489K03465p45763
$$ 525109 944767 1378462 862956 1333252 956817 659524 847322 662833 866298 120535
13041A20535r4269J250371l79691K60402j74247q5210M42840k39393j1673l24466
$$ 120535 26266 1276637 896946 1157348 983101 897891 1340731 1101338 1089665 765199
13031G65199M05617Q2806J79971L92872j146066k95777L97037q07624K01699L56685
$$ 765199 1170816 1253622 1433593 1826465 680399 384622 781659 -25965 175734 532419
13021E32419m138n6035n48242o85883J266597m89403N96699K35555m27740J92264
$$ 532419 528281 472246 -75996 -761879 504718 15315 612014 847569 419829 612093
13011F12093N05622O14236o90851n58719J74728J80892j89651j62586N42629N40033
$$ 612093 1117715 1731951 1041100 482381 657109 838001 648350 485764 1028393 1568426
13001A568426m67890J37394J90990k87737j08331K83642L38242m18768l48749
$$ 1568426 1100536 1237930 1428920 1141183 1032852 1316494 1654736 1235968 887219
12992H87219K42746N16594J9447j44679j6286l47593K45338k63824o48J31604
$$ 887219 1129965 1646559 1666006 1521327 1505041 1157448 1402786 1138962 1138314 1269918
12982A269918m73525l45344L13473P55438k44584K20177k48154M22073l96347
$$ 1269918 796393 451049 764522 1519960 1275376 1495553 1247399 1669472 1273125
12973A273125J18620j92068j057920k6281M89486j94184K2113J178198J62981
$$ 1273125 1391745 1199677 141757 115476 604962 410778 432891 1611089 1774070
12964A774070p39063r2999J36084p15649q329j76145N99709J85567l5074k00482
$$ 1774070 1035007 942008 1078092 362443 354114 177969 777678 963245 928171 727689
12954G27689Q48242j67853o65889k0216N16352j1025l41090l62434K43300j87851
$$ 727689 1575931 1408078 742189 721973 1238325 1227300 886210 523776 767076 579225
12944E79225R069j96027N20638J20775m14818L37193J26789N78666Q45995j063017
$$ 579225 588294 392267 912905 1033680 618862 956055 1082844 1661510 2507505 1444488
12934A444488J48707J25757m1969L41674j077350M48528q4349n45995L5515K46577
$$ 1444488 1593195 1718952 1676983 2018657 941307 1389835 1305486 759491 795006 1041583
12924A041583j61318J99298l85095K91691M1739l76043Q16160j27581L86430L13236
$$ 1041583 880265 1079563 694468 986159 1027898 651855 1468015 1340434 1726864 2040100
12914B040100j024360k77428P02736r1038J77680k09718p62030k6791J97909N64855
$$ 2040100 1015740 738312 1441048 1350010 1527690 1317972 555942 529151 727060 1291915
12904A291915n74705P5249O23061P3237l90219m63819N16203M02378k0182M64618
$$ 1291915 717210 792459 1415520 1488757 1098538 634719 1150922 1553300 1533118 1997736
12894A997736l10406K03349k83984l02606J23456k697K44360J95373p35533P30437
$$ 1997736 1687330 1890679 1606695 1304089 1427545 1424848 1669208 1864581 1129048 1859485
12884A859485q01612M40223k35486j78173L1748J8568J179179j00331p18512N1018
$$ 1859485 1057873 1498096 1262610 1084437 1116185 1134753 2313932 2213601 1495089 1546107
12874A546107K41494p95400R76129r82948k2719J289969N80160o29845k46736
$$ 1546107 1787601 992201 1968330 985382 962663 2252632 2832792 2202947 1956211
12865A956211P5631n43714L83774P8318j58817K15074m17409k03862P84251k19680
$$ 1956211 2031842 1488128 1871902 1950220 1791403 2006477 1589068 1385206 2169457 1949777
12855A949777o27137M09590j18562J03649K61749J00093m86764j1180N65861j09286
$$ 1949777 1322640 1732230 1613668 1717317 1979066 2079159 1592395 1581215 2147076 2037790
12845B037790m93090K38204j83463P21239j52045m20866K46394L30277j29672
$$ 2037790 1544700 1782904 1599441 2320680 2168635 1747769 1994163 2324440 2194768
12836B194768r03283M05822K22479N43106K58110q14567L02835j96503Q96204
$$ 2194768 1291485 1697307 1919786 2462892 2721002 1906435 2209270 2012767 2908971
12827B908971N19190o20290j50131k04684j01742j89374O8328k34056l40262K61850
$$ 2908971 3428161 2807871 2657740 2453056 2351314 2161940 2230268 1996212 1655950 1917800
12817A917800K23714r63629K05693Q54169m77385k34315N26212M00124j70719
$$ 1917800 2141514 1177885 1383578 2237747 1760362 1526047 2052259 2452383 2281664
12808B281664n08311M31763n22654L5883L68810n11045J024732M99928J74037
$$ 2281664 1773353 2205116 1682462 1718345 2087155 1576110 2600842 3100770 3274807
12799C274807l96061l43656j58822M58062k27250p99423k49620K51430L54333
$$ 3274807 2878746 2535090 2376268 2834330 2607080 1807657 1558037 1809467 2163800
12790B163800K6237j06141p3354P092j53762J207223n74887m85631k0243q12233
$$ 2163800 2190037 2083896 2010542 2017634 1863872 3071095 2496208 2010577 1990334 1178101
12780A178101J71604N32645P33200J48996J24558L04490j219247l4536J99039
$$ 1178101 1349705 1882350 2615550 2764546 2889104 3193594 1974347 1939811 2138850
12771B138850M05028j0299l2424l93418j52326O701N35407M47441K03077J24287
$$ 2138850 2543878 2533579 2501155 2107737 1955411 1962112 2497519 2944960 3148037 3272324
12761C272324m59457o3369O1390o72671K86775J064571L23022n15614p10593L13162
$$ 3272324 2812867 2749498 2810888 2138217 2424992 3489563 3812585 3296971 2586378 2899540
12751B899540j3613o07483L88656L64356M15546n1489k31775p5405J04378M69727
$$ 2899540 2885927 2278444 2667100 3031456 3447002 3395513 3163738 3088333 3192711 3662438
12741C662438p94728N25177L6265l9958n94125o4139M75612j76503O20038k01704
$$ 3662438 2867710 3392887 3429152 3389194 2795069 2730930 3206542 3030039 3650077 3448373
12731C448373j325613L8679J079388J39898m75001o30878r9287J03742k1728j64494
$$ 3448373 2122760 2161439 3240827 3380725 2905724 2274846 2175559 2279301 2257573 2093079
12721B093079L43192J061395j72263j31593O64875l134m22792m32873L55724M38821
$$ 2093079 2436271 3497666 3325403 3193810 3858685 3855551 3432759 2999886 3355610 3794431
12711C794431p24146l71828K22975o5381O92745o27150n45459O95534j88454M93853
$$ 3794431 3070285 2698457 2921432 2856051 3548796 2921646 2376187 3071721 2883267 3377120
12701C377120K78953j002176P07026k2980Q701N86983n60284M94343j8972J135052
$$ 3377120 3656073 2653897 3360923 3337943 3346644 3933627 3373343 3867686 3848714 4983766
12691D983766r50278n08813L62049N44173m64743P6648k31801L78232K46547j108744
$$ 4983766 4033488 3524675 3886724 4430897 3966154 4042802 3811001 4189233 4435780 3327036
12681C327036K45083M69605j70530m22532Q71615m15214L3654N25487O72430j006196
$$ 3327036 3572119 4041724 3871194 3448662 4320277 3905063 3938717 4464204 5136634 4130438
12671D130438N92924O23545k49946q58747N2730J359427n23319q91335M36847
$$ 4130438 4723362 5346907 5096961 4238214 4290944 5650371 5127052 4235717 4672564
12662D672564j36339p86887J5544J65127k70256M76648j59829J40342K74690O44908
$$ 4672564 4536225 3749338 3764882 3930009 3659753 4136401 3976572 4116914 4391604 5036512
12652E036512J7994m73154n68761J59115M22928n13420M94409K4147N08674J39646
$$ 5036512 5054506 4581352 4012591 4171706 4594634 4081214 4575623 4599770 5108444 5248090
12642E248090j13366o54431L22838L05167p13396J264086J32800r96792J57044
$$ 5248090 5134724 4480293 4803131 5108298 4394902 5658988 5791788 4794996 4952040
12633D952040M20104r8290p31593P06037K2159o4535O98561l90805r93874n13728
$$ 4952040 5372144 5273854 4542261 5248298 5270457 5205922 5904483 5513678 4519804 4006076
12623D006076M19367O4705k30652P41664J39406O31520m17923m81405m29271R9208
$$ 4006076 4425443 4490148 4259496 5001160 5140566 5772086 5354163 4872758 4443487 4542695
12613D542695O60114n0303O11336n54747l95846O69478k13738m82277n41138L79511
$$ 4542695 5202809 5152506 5763842 5209095 4813249 5482727 5268989 4786712 4245574 4625085
12603D625085Q58548K3049j88112O12042l93289k02580L00207r61742Q71015j00305
$$ 4625085 5483633 5506682 5318570 5930612 5537323 5334743 5634950 4673208 5544223 5443918
12593E443918p3675M95265M6759K33011m42843J5143Q75870o3451n74285O36270
$$ 5443918 5370243 5865508 5912267 6145278 5702435 5717578 6593448 6529997 5955712 6591982
12583F591982q21471o5222k45849O95378L10754p2688l33667j1989K05711k86556
$$ 6591982 5770511 5705289 5459440 6154818 6465572 6392884 6059217 6047228 6252939 5966383
12573E966383O40545k4770k03906N30662K37154o70973j86765K50205k81823K15063
$$ 5966383 6606928 6582158 6378252 6908914 7146068 6475095 6288330 6538535 6256712 6471775
12563F471775L61528m27369L04104N67942r7525o71290K24890O40310K83251n63581
$$ 6471775 6833303 6405934 6710038 7277980 7180455 6509165 6734055 7374365 7657616 7094035
12553G094035l02589P74442o87530j76421Q3041M24721N41211n03835m48999l82395
$$ 7094035 6791446 7565888 6878358 6701937 6784978 7209699 7750910 7247075 6798076 6415681
12543F415681J351435L45653N3015m90994n54755m27727N23107m33489K15761
$$ 6415681 7767116 8112769 8165784 7674790 7120035 6692308 7215415 6781926 6997687
12534F997687O80906n1978K55670l93995J25208J37865o53026k53674M11728P52266
$$ 6997687 7678593 7626615 7882285 7488290 7613498 7751363 7098337 6844663 7256391 8008657
12524H008657k67756k03726P04574J47313l88430O698J04070J41145m67013m31681
$$ 8008657 7740901 7537175 8241749 8389062 8000632 8007330 8111400 8252545 7785532 7353851
12514G353851q3113J161098n88170R09076J19042m89685j75156J61143M36085
$$ 7353851 7270738 8431836 7843666 8752742 8871784 8382099 8206943 8368086 8804171
12505H804171O20629K47433j109832l75851k29050m29863K43433J186747p03482
$$ 8804171 9424800 9672233 8562401 8186550 7957500 7527637 7771070 8957817 8254335
12496H254335J26682Q3379M92125N38061K62616M51980q4177j174289j3316Q11613
$$ 8254335 8381017 8464396 8956521 9494582 9757198 10209178 10125001 8950712 8937396 9749009
12486I749009J44834m64816L34486k97135j77269O80000l51667M02843j45289
$$ 9749009 9893843 9429027 9763513 9466378 9289109 9969109 9617442 10020285 9874996
12477I874996L92714M45960q97815j1319L54381O8621r56774J005521L6145m14829
$$ 9874996 10267710 10713670 9815855 9804536 10158917 10227538 9270764 10276285 10312430 9897601
12467I897601L91149K8545J17556o42522O85214P17314l88066K7540m0868N60952
$$ 9897601 10288750 10317295 10434851 9792329 10477543 11194857 10806791 10834331 10793463 11354415
12457A1354415m5609l61047l76151L58324R5784P3898J16086K45623l73941K43006
$$ 11354415 11308806 10947759 10571608 10929932 11025716 11099614 11215700 11461323 11087382 11330388
12447A1330388J044128l53646j09555Q6377m22300O00566P21729N87J63222k6440
$$ 11330388 12374516 12020870 11911315 11997692 11575392 12175958 12897687 12898274 13061496 13035056
12437A3035056m13028K13293q5226k85982J101039l12460q1782L90485k45101
$$ 13035056 12622028 12835321 12750095 12464113 13565152 13252692 13170910 13561395 13316294
12428A3316294O33046J23092K93659M64901l01408n56939k58597K78198o89763
$$ 13316294 13949340 14072432 14366091 14830992 14529584 13972645 13714048 13992246 13302483
12419A3302483R93115L89694q8547k40923j142688P63406J188338L36249m95617
$$ 13302483 14295598 14685292 14596745 14355822 13213134 13976540 15164878 15501127 15005510
12410A5005510j23300o2943m56240N54990J77906J15860j9958K09560N92986j00939
$$ 15005510 14882210 14819267 14363027 14918017 15095923 15211783 15191825 15401385 15994371 15893432
12400A5893432K66820k48535j6010k90961M65393M66177m61308n06645N0837Q20667
$$ 15893432 16160252 15911717 15895707 15604746 16070139 16536316 16075008 15568363 15619200 16439867
12390A6439867J89483M51285k76472k01377P70812m03334k68475N63805K48773
$$ 16439867 16629350 17080635 16804163 16602786 17373598 16970264 16701789 17265594 17514367
12381A7514367O55153n82865M35513O28949l10266j24153J52711N93592J035287
$$ 17514367 18169520 17586655 18022168 18651117 18340851 18216698 18369409 18963001 19998288
12372A9998288m80870j321619o85255Q66832J171521k51886l93699L78824M09462
$$ 19998288 19517418 18195799 17510544 18377376 19548897 19297011 18903312 19282136 19691598
12363A9691598M59246o06973Q1410O48540K62291n43162p36618Q61188J343990
$$ 19691598 20150844 19543871 19625281 20273821 20536112 19992950 19256332 20117520 21461510
12354B1461510J93414j71945m08491L33403P94991k24371L48611j7036K74643
$$ 21461510 21654924 21482979 21074488 21407891 22202882 21978511 22327122 22310086 22584729
12345B2584729r99521J61792K03074J163368J09859o7995N24457P60656n81587
$$ 22584729 21585208 21747000 21950074 23113442 23223301 23155306 23679763 24440419 23858832
12336B3858832R2674M11529K46375n818L83390L78198k96952N64539O41937l72280
$$ 23858832 23951506 24363035 24609410 24603592 24986982 25365180 25068228 25632767 26274704 25902424
12326B5902424j23208L67079K16967j11465L4704K55972j91050J460228M51075
$$ 25902424 25779216 26146295 26363262 26251797 26286501 26542473 26351423 27811651 28262726
12317B8262726L25940o9345r77648Q50503P7335j86810P16575N03852P98519J10453
$$ 28262726 28588666 28519321 27541673 28392176 28469511 28282701 28999276 29503128 30301647 30412100
12307C0412100m96894O12899O45300M58175Q16614p2944J34367r60196L80716
$$ 30412100 29915206 30528105 31173405 31631580 32448194 32375250 32509617 31549421 31930137
12298C1930137M6319q2956P42201J506918p39482K94395P47716N5936l92840m0076
$$ 31930137 31976456 31893500 32635701 34142619 33403137 33697532 34445248 34501184 34108344 34068268
12288C4068268P45467l16116L59759J224149J79179N14820P21042k88918j13958
$$ 34068268 34813735 34497619 34857378 36081527 36260706 36775526 37496568 37207650 37093692
12279C7093692M64586q9228Q30208R9764M83557O93062P3807L86778J44959L92888
$$ 37093692 37558278 37469050 38299258 38399022 38882579 39575641 39649448 40036226 40181185 40574073
12269D0574073P54088P89785J76183M82554J014685R3490P5939P99115l03415
$$ 40574073 41328161 42117946 42294129 42776683 43791368 43884858 43960797 44759912 44456497
12260D4456497R18497K48184r9747Q86950N98113J100712L93555J62343J49525
$$ 44456497 45374994 45623178 45523431 46410381 47008494 48109206 48502761 48665104 48814629
12251D8814629O1407n08726j0228J261519J060748N79621P72737P31598n61915
$$ 48814629 48876036 48367310 48357082 49618601 50679349 51258970 52031707 52763305 52201390
12242E2201390Q75354O74014P74197P90652K6831P68795J493897K66737N14032
$$ 52201390 53076744 53750758 54524955 55315607 55342438 56111233 57605130 57871867 58385899
12233E8385899k6285O80438J461861L47173r2831P94267J113581m2858J192273
$$ 58385899 58359614 59040052 60501913 60849086 60756255 61550522 62664103 62621245 63813518
12224F3813518P89432N69526O22952R89158J501388L34327N56061L17330J024013
$$ 63813518 64602950 65172476 65795428 66784586 68285974 68620301 69176362 69493692 70517705
12215G0517705O84024J315345J161750Q39544M68251O63487N37529N46966J066961
$$ 70517705 71201729 72517074 73678824 74518368 74986619 75650106 76187635 76734601 77801562
12206G7801562R06122P5408Q57688J194088L26549K163640J724940P34263M96084
$$ 77801562 78707684 78783092 79640780 80834868 81161417 83325057 85049997 85784260 86280344
12197H6280344N60574K139680J037158J266294P66653O90497J367954K050101
$$ 86280344 86840918 88980598 90017756 91284050 92050703 92741200 94109154 96159255
12189I6159255J761616Q68189P34771M63638P74134J778454J432839J456867J997945
$$ 96159255 97920871 98789060 99523831 99987469 100761603 102540057 103972896 105429763 107427708
12180A07427708O62304R49868J404516K179975J515668M45770J522038K144786
$$ 107427708 108090012 109039880 110444396 112624371 114140039 114585809 116107847 118252633
12172A18252633K596047J681508R86104J529600J614018K353006J472866K085656
$$ 118252633 120848680 122530188 123516292 125045892 126659910 129012916 130485782 132571438
12164A32571438J663800K082355J654670K208292J612832J650232K362644J437530
$$ 132571438 134235238 136317593 137972263 140180555 141793387 143443619 145806263 147243793
12156A47243793K399215K908423K014339K080194J285303K020574K720504K680656
$$ 147243793 149643008 152551431 154565770 156645964 157931267 159951841 162672345 165353001
12148A65353001K336742L646991K006094K102161K260747K190516L116578J921251
$$ 165353001 167689743 171336734 173342828 175444989 177705736 179896252 183012830 184934081
12140A84934081K676458L381351K580343K484915L254293L183054L895753K896873
$$ 184934081 187610539 190991890 193572233 196057148 199311441 202494495 206390248 209287121
12132B09287121L447950K879800K635122L617240K836866K514291M011026L717956
$$ 209287121 212735071 215614871 218249993 221867233 224704099 227218390 231229416 234947372
12124B34947372M085830L154272L098764M169045L767506L568553L995469M251703
$$ 234947372 239033202 242187474 245286238 249455283 253222789 256791342 260786811 265038514
12116B65038514M116249L538163K498507M638696M380682M259507M166635M231621
$$ 265038514 269154763 272692926 275191433 279830129 284210811 288470318 292636953 296868574
12108B96868574M530184M472928L798214L735148N580188M690441M392393M489449
$$ 296868574 301398758 305871686 309669900 313405048 318985236 323675677 328068070 332557519
12100C32557519L694760L599649M658916M742930M296184L661199N552337M914173
$$ 332557519 336252279 339851928 344510844 349253774 353549958 357211157 362763494 367677667
12092C67677667M612036M263081M180785L217108M523700L952668M269450M318698
$$ 367677667 372289703 376552784 380733569 383950677 388474377 392427045 396696495 401015193
12084D01015193L807759L655803L609126L649933L869230K871019K939896L386323
$$ 401015193 404822952 408478755 412087881 415737814 419607044 422478063 425417959 428804282
12076D28804282L024234K603777K068229K807259J751249K274567J966142J700038
$$ 428804282 431828516 434432293 436500522 439307781 441059030 443333597 445299739 446999777
12068D46999777M86993J146248R65424J266238Q25844m53915n79711M99508o4304
$$ 446999777 447486770 448633018 449598442 450864680 451690524 451236609 450656898 451156406 451092102
12059D51092102p93997r76442j457085j957029j448153j296870q51595k063173
$$ 451092102 450298105 449321663 447864578 445907549 444459396 443162526 442310931 440247758
12051D40247758k120072k789354k169295l053899k856768l799666l659236l814519
$$ 440247758 438127686 435338332 433169037 430115138 427258370 423458704 419799468 415984949
12043D15984949l287599l325530l322903l264089m193358m590097m799297l480770
$$ 415984949 412697350 409371820 406048917 402784828 398591470 394001373 389202076 385721306
12035C85721306m650653m608876m499983l750525m689530m510971m499432m331629
$$ 385721306 381070653 376461777 371961794 368211269 363521739 359010768 354511336 350179707
12027C50179707m760124n117010m059049m619777l835924m459631m665651m591742
$$ 350179707 345419583 340302573 336243524 331623747 327787823 323328192 318662541 314070799
12019C14070799l932005m017201m569174m810207n037927m194503m662633m379604
$$ 314070799 310138794 306121593 301552419 296742212 291704285 287509782 282847149 278467545
12011B78467545l729118l888636m494198l797611m043275l836336l708977l293503
$$ 278467545 274738427 270849791 266355593 262557982 258514707 254678371 250969394 247675891
12003B47675891l277085m158238m167535l463220l642375m144760m306680l026174
$$ 247675891 244398806 240240568 236073033 232609813 228967438 224822678 220515998 217489824
11995B17489824l404571l372960k841256l099736l966292k930556k991171k842900
$$ 217489824 214085253 210712293 207871037 204771301 200805009 197874453 194883282 192040382
11987A92040382k342465k647273k657334k482317k629751l606013k987415l028808
$$ 192040382 189697917 187050644 184393310 181910993 179281242 175675229 172687814 169659006
11979A69659006k600703k713618j488033k372932k569177k801060k829754j443671
$$ 169659006 167058303 164344685 162856652 160483720 157914543 155113483 152283729 150840058
11971A50840058j442120k412521j916378k494149k973902j301691k197910k135798
$$ 150840058 149397938 146985417 145069039 142574890 139600988 138299297 136101387 133965589
11963A33965589j432878k044333j416551j993868k217806k174471j730648j207993
$$ 133965589 132532711 130488378 129071827 127077959 124860153 122685682 120955034 119747041
11955A19747041j706588j368779j749984j529510k173377j442602j726967j367459
$$ 119747041 118040453 116671674 114921690 113392180 111218803 109776201 108049234 106681775
11947A06681775j112554j595683j333378j244872j751881j426827j992088j088517
$$ 106681775 105569221 103973538 102640160 101395288 99643407 98216580 96224492 95135975
11939I5135975j659084p14223q35381j707325j288243n81089j169591j122304
$$ 95135975 93476891 92762668 91927287 90219962 88931719 88350630 87181039 86058735
11931H6058735r59387l42474j528965k002121k72965j310572j279154r94189j454360
$$ 86058735 85099348 84756874 83227909 81225788 80952823 79642251 78363097 77368908 75914548
11922G5914548l82122n68836r95438r3999j901185p99242n85165n87628m57605
$$ 75914548 75532426 74963590 73968152 73874153 71972968 71173726 70588561 70000933 69543328
11913F9543328j200963j053821n30034j373048j484938m97200j13347j555750
$$ 69543328 68342365 67288544 66758510 65385462 63900524 63403324 63289977 61734227
11905F1734227m72605k47810n98692k02248j413729q18833q92442k80134J58896
$$ 61734227 61261622 61013812 60415120 60212872 58799143 57980310 57087868 56807734 56966630
11896E6966630q97478p34664K07113j660926j90492j69227n45607o88231j043445
$$ 56966630 56069152 55334488 55541601 53880675 53690183 53520956 52975349 52287118 51243673
11887E1243673j346144m53736N1709q42398l01992m41172l91703r62617p10639
$$ 51243673 49897529 49443793 49495502 48653104 48351112 47909940 47518237 46555620 45844981
11878D5844981j86239M73787o05109r26340j549340n13443j99050J14111J37813
$$ 45844981 45658742 46132529 45527420 44601080 43051740 42538297 42339247 42453358 42591171
11869D2591171j051239J15992o17534n17147K56542q80456l60339o39794m19378
$$ 42591171 41539932 41655924 41038390 40521243 40777785 39897329 39536990 38897196 38477818
11860C8477818l13493n26537k72289l38618j416114j47307j37804k56727j96801
$$ 38477818 38164325 37637788 37365499 37026881 35610767 35463460 35325656 35068929 34872128
11851C4872128j44434k15650P7061K10315j175895j065690l33149m34799K28443
$$ 34872128 34727694 34512044 34589105 34799420 33623525 32557835 32224686 31789887 32018330
11842C2018330J856p85765J55146j83084n65285N7371j193667O2394N87307j32561
$$ 32018330 32020186 31234421 31389567 31206483 30641198 30698569 29504902 29567296 30154603 30022042
11832C0022042q59943m27429q11204l53545K44225k0366n49617j91748j016965
$$ 30022042 29162099 28734670 27923466 27569921 27814146 27793780 27244163 27052415 26035450
11823B6035450k06247J27171o65796p66430q62227L56134J077766n81951o05224
$$ 26035450 25829203 25956374 25290578 24524148 23661921 24018055 25095821 24513870 23908646
11814B3908646N82813k18512l43409p40092m7375k24646q3240L90898j90220k42954
$$ 23908646 24491459 24272947 23929538 23189446 23142071 22917425 22834185 23225083 23034863 22791909
11804B2791909r57681Q9902r9635n06061k59325l70946L83987m99197L51085M18326
$$ 22791909 21834228 21924130 21824495 21318434 21059109 20688163 21072150 20572953 20924038 21342364
11794B1342364K68181j337671P6092N00985n14654n92586p44819m85036J065709
$$ 21342364 21610545 20272874 20348966 20849951 20335297 19742711 18997892 18512856 19578565
11785A9578565Q04400k52943j087309k31582P655m30164m73440O12273m78056
$$ 19578565 20382965 20130022 19042713 18811131 18818786 18388622 17915182 18527455 18049399
11776A8049399J95852P52840j165601n6356j34000o06641O57j41684J06714J9119
$$ 18049399 18245251 18998091 17832490 17776134 17642134 17035493 17036150 16894466 17001180 17020299
11766A7020299m9814m93204k45108j18243m99615N4360L19845l39585j04030l90057
$$ 17020299 16970485 16477281 16232173 16113930 15614315 15668675 15988520 15648935 15544905 15154848
11756A5154848j14754m65861L3837n62333M98848O00324p27544m23028r4974O4445
$$ 15154848 15040094 14574233 14608070 14045737 14544585 15144909 14417365 13994337 13899363 13963808
11746A3963808L98864k80207K85915J51122q34846J19607m35375O41630J79386
$$ 13963808 14362672 14082465 14368380 14519502 13684656 13804263 13368888 14010518 14189904
11737A4189904q53600J31043J9644j161398l64899J41510M34444j84038k62105
$$ 14189904 13336304 13467347 13486991 12325593 11960694 12102204 12536648 12352610 12090505
11728A2090505j05268n91624q27426K57932k2336L72612l92510J21394P99924
$$ 12090505 11985237 11393613 10566187 10824119 10801783 11174395 10781885 10903279 11703203
11719A1703203j33642p1431o47699O74632j86424m58185j31564m933j94201M350
$$ 11703203 11569561 11498130 10850431 11525063 11338639 10880454 10748890 10743957 10549756 10554106
11709A0554106l13226p27055P20628K2226n59368o55687N24378M17490j50677
$$ 10554106 10240880 9513825 10234453 10256679 9697311 9041624 9566002 9983492 9832815
11700I832815O72911m75320r07898l81323J70622J77066J6303N42752J223489
$$ 9832815 10505726 10030406 9122508 8741185 8911807 9088873 9105176 9647928 10871417
11691A0871417o95104m50676j16012j039667l81783J05090O80110O36624l28328
$$ 10871417 10176313 9725637 9609625 8569958 8188175 8293265 8973375 9609999 9281671
11682I281671m97322K65150l03209m65883K75343L13670m5763K43884p22189L61394
$$ 9281671 8784349 9049499 8746290 8280407 8555750 8869420 8823657 9067541 8345352 8706746
11672H706746R11116o49871k48852l56420j259462L46920n49059l83217O38440
$$ 8706746 9617862 8967991 8719139 8362719 7103257 7450177 6901118 6517901 7156341
11663G156341L60665N44396r90530n89239Q08896l81700n12583K32220M32030
$$ 7156341 7517006 8061402 7070872 6481633 7290529 6908829 6396246 6628466 7060496
11654G060496m29497O1741M54960j47044K01730L28673M30791j33218j543816
$$ 7060496 6630999 6692740 7147700 7000656 7202386 7531059 7961850 7828632 6284816
11645F284816k45377j11511K89214J30140L99382K36600o23260j99643J12890
$$ 6284816 6039439 5927928 6217142 6347282 6746664 6983264 6360004 6160361 6273251
11636F273251n22633J45484N12268j44620m06890Q32884L1049p53161l3874J73956
$$ 6273251 5750618 5896102 6408370 6263750 5856860 6689744 6720793 5967632 5933758 6107714
11626F107714o33505J549M92205j49337n01302L86613L79861k80579N50052k97672
$$ 6107714 5474209 5475758 5967963 5818626 5317324 5703937 6083798 5803219 6353271 6055599
11616F055599o09025J80579L81807q25805K38283k2114m78193O05446k60585M92195
$$ 6055599 5446574 5627153 6008960 5183155 5421438 5399324 4921131 5526577 5265992 5758187
11606E758187k40706O9692n70271k83004K44880k18877L23861o20559M71764k37452
$$ 5758187 5517481 5587173 5016902 4733898 4978778 4759901 5083762 4463203 4934967 4697515
11596D697515k17514j44894K46864K42031K94942o79326q8373L0359M02681K19229
$$ 4697515 4480001 4335107 4581971 4824002 5118944 4439618 4351245 4381604 4784285 5003514
11586E003514O36436l79278j07454p6439L10648j2264n55899J46391l09838r45247
$$ 5003514 5639950 5260672 5153218 5076779 5387427 5375163 4819264 4965655 4655817 3710570
11576C710570m7546L62446M16489P04224r22086O0584k21027Q6488J54895j04242
$$ 3710570 3663024 4025470 4441959 5146183 4224097 4284681 4063654 4150142 4305037 4200795
11566D200795J22281k90609l46520K02110J92571p09377P11640O1277k09823m87425
$$ 4200795 4323076 4032467 3685947 3888057 4080628 3371251 4082891 4144168 3934345 3446920
11556C446920l55463l7485j46786O87651J42863k35317M04332O413K61405j344240
$$ 3446920 3091457 3053972 2907186 3594837 3737700 3502383 3906715 3913128 4174533 2830293
11546B830293n90577j29576N12652J07696n0713P96875l06510L00097M5272j57044
$$ 2830293 2239716 2110140 2622792 2730488 2679775 3476650 3170140 3470237 3515509 3358465
11536C358465N22409l99330p50056N01124L36434m77300j2160N2246j85415j09711
$$ 3358465 3880874 3481544 2731488 3232612 3569046 3091746 3079586 3131832 2946417 2836706
11526B836706j95616n3643m09415K25352K928N14169J82829k25648j06307N7013
$$ 2836706 2641090 2587447 2178032 2403384 2406312 2920481 3103310 2877662 2771355 2828368
11516B828368m19083Q50423j06011m63772K7551Q09752m00992p12094N31807n854
$$ 2828368 2409285 3259708 3153697 2689925 2717476 3527228 3126236 2414142 2945949 2940095
11506B940095l00790n33259M23460J564N62382l02818j085166J014443O99123
$$ 2940095 2639305 2106046 2529506 2531070 3093452 2790634 1705468 2719911 3419034
11497C419034j89544n31779l92281m23684j13311O16665K94795J362519q62939
$$ 3419034 3229490 2697711 2305430 1881746 1768435 2385100 2679895 4042414 3179475
11488C179475n63837K05286k87882n61155p31228M20291O98244K07696r32104
$$ 3179475 2615638 2820924 2533042 1971887 1240659 1660950 2359194 2566890 1634786
11479A634786M24893l5002L45170J50275l03496J09340N84530j04171j5495k07767
$$ 1634786 2059679 2024677 2369847 2520122 2216626 2325966 2910496 2806325 2790830 2583063
11469B583063M95569m14982L63734k41269o47725l17512J80136M81749q80084
$$ 2583063 3078632 2663650 3027384 2786115 2138390 1820878 2001014 2482763 1602679
11460A602679N4784j22166J065884n4301K19381N0177m6142o11096j71032J27529
$$ 1602679 1657463 1535297 2601181 2546880 2766261 2816438 2770296 2159200 1988168 2115697
11450B115697l84132J58911p48105m98522Q37691j99205n57186l64806L62076
$$ 2115697 1731565 1890476 1142371 643849 1481540 1282335 725149 360343 722419
11441G22419O73568N1386O70069N4475o96981p58801N63134R66858l69457j243434
$$ 722419 1395987 1447373 2117442 2171917 1474936 716135 1279269 2246127 1876670 633236
11431F33236M50835m7630P13960j08620L57433M48697r03665K57177J86681j5295
$$ 633236 1084071 1036441 1750401 1641781 1999214 2447911 1544246 1801423 1988104 1972809
11421A972809r18347K33778k9279j394969j74888Q42543J095947l8287p17154
$$ 1972809 1054462 1288240 1258961 -136008 -310896 531647 1627594 1589307 872153
11412H72153J13512L18108k141N41909J93208r18572P33259p03414o29674j71257
$$ 872153 985665 1303773 1301632 1843541 2036749 1118177 1851436 1148022 518348 347091
11402C47091l66874L85798N20711O80871k61815k30780k46875K0635M05771O25653
$$ 347091 -19783 366015 886726 1567597 1305782 1075002 828127 848762 1254533 1880186
11392A880186q14518j12304n3369k58295M94187K26040K58973l21435l92779o73121
$$ 1880186 1065668 953364 899995 641700 1135887 1361927 1620900 1299465 906686 233565
11382B33565q15395R22320O50799K59045M61242p75361r3557P36354j12297n00203
$$ 233565 -581830 340490 991289 1250334 1711576 936215 842658 1579012 1466715 966512
11372I66512L1641p70104P4398Q61206J04894l55651J039744o11606n11377M07850
$$ 966512 998153 228049 302447 1163653 1268547 912896 1952640 1341034 829657 1237507
11362A237507o06595K25437J69586q10393j02243M12132L53692p4280m90924L11412
$$ 1237507 630912 856349 1025935 215542 113299 525431 879123 804843 313919 625331
11352F25331k01265J19505K97939k40061O61735k41395r29973j77404M89050K2908
$$ 625331 424066 543571 841510 601449 1263184 1021789 91816 -85588 403462 426370
11342D26370K77156K43016N02180m59635K96034j05474j37185O89612k71247p19850
$$ 426370 703526 946542 1448722 989087 1285121 1179647 1042462 1732074 1460827 740977
11332G40977M35359j36049j82717l39391Q6959o3875q8105R34361o17922l57473
$$ 740977 1176336 1040287 857570 518179 605138 541263 453158 1387519 769597 412124
11322D12124q6154K48509k47822K93505K89135m30895k93993N0962J6543q3532
$$ 412124 325970 574479 326657 620162 909297 478402 184409 235371 251914 168382
11312A68382P19452L80850j001190P57912j0809L58843k97377j80109j69047o99282
$$ 168382 887834 1268684 267494 1025406 1014597 1373440 1076063 895954 726907 27625
11302B7625m11381M67277K50414r07383J04806J961199K88710r99280p89239m89802
$$ 27625 -383756 83521 333935 -573448 -468642 1492557 1781267 781987 -7252 -497054
11292d97054j42157R04632R57754j113231L21952J64841p11228L515M93946N9320
$$ -497054 -639211 265421 1223175 109944 431896 596737 -114491 -110976 382970 442290
11282D42290o89492Q42748L47913r29724l55137q2885N60120o41072J29028k03643
$$ 442290 -247202 595546 943459 13735 -341402 -424287 135833 -505239 -376211 -579854
11272e79854M6367K82061L13707K34106n59442J64656K23899l13560p4629J15233
$$ -579854 -533487 -251426 62281 296387 -263055 -98399 125500 -188060 -262689 -147456
11262a47456j19170o6761k42556L16529j41461M48849L29467O39645m4327j149269
$$ -147456 -266626 -333387 -575943 -259414 -400875 47974 377441 1017086 972759 -176510
11252a76510m9737J49002j43016O81940K2317q51874n72434J086991K4464k94314
$$ -176510 -226247 -77245 -220261 461679 483996 -367878 -940312 146679 171143 -123171
11242a23171k11187r95979O49411L06437j50210Q79674N93881j92139m05871r67965
$$ -123171 -334358 -1330337 -680926 -374489 -524699 354975 948856 756717 350846 -617119
11232f17119j96768m2082J13882n5441Q58128P68997j7775k50020O55462l86910
$$ -617119 -813887 -855969 -742087 -797528 60600 829597 811822 561802 1217264 830354
11222H30354j73229k49349n36368k70270M08309P68979J48637l48264j95354J3250
$$ 830354 657125 407776 -128592 -398862 9447 778426 927063 578799 383445 396695
11212C96695p73504J40704q7651R50581J92667q66351m39304O49069k77213j74933
$$ 396695 -376809 -236105 -323756 626825 819492 -46859 -486163 162906 -114307 -289240
11202b89240K0792l99507j10436K67730K64317O3468k07809K78893L7307j79624
$$ -289240 -268448 -667955 -778391 -510661 -246344 -182876 -390685 -111792 -74485 -254109
11192b54109K69537J05642L35560j038684L76891J31334l35206N57341l58418
$$ -254109 15428 121070 456630 -582054 -205163 -73829 -409035 148306 -210112
11183b10112m92133r5695j72536P12599k16774q26292O13824M67351l77318j128527
$$ -210112 -702245 -797940 -970476 -257877 -474651 -1300943 -687119 -219768 -597086 -1725613
11173a725613O98163j3565k38849Q18285j86885m91204j40984R87290k31802l6646
$$ -1725613 -1027450 -1041015 -1279864 -461579 -648464 -1139668 -1280652 -293362 -525164 -561810
11163e61810k85531R577L44597l67248k43250Q59163m36050l50152O07801M37762
$$ -561810 -847341 -837764 -493167 -860415 -1103665 -244502 -680552 -1030704 -422903 14859
11153A4859n03712r87102Q12550j91417K14079J043572o10362K25151J5215L28255
$$ 14859 -488853 -1475955 -663405 -854822 -640743 402829 -207533 17618 32833 361088
11143C61088j32257k4032K48774l94637k59615k27465L35056j66204n86121k48086
$$ 361088 228831 204799 453573 58936 -200679 -428144 -93088 -259292 -845413 -1093499
11133a093499L84622l16060k0464j5049n79947r8978O77719j36424N25635J35801
$$ -1093499 -708877 -1024937 -1045401 -1060450 -1640397 -1739375 -1061656 -1198080 -672445 -536644
11123e36644L7139O86174l00436m08500m51052j75456Q67105P6792p71212p6626
$$ -536644 -499505 186669 -113767 -522267 -973319 -1148775 -281670 -204878 -976090 -1052716
11113a052716O23917l02384l2929J6197K87927R0687l0921L04904R3354j29509
$$ -1052716 -428799 -731183 -764112 -747915 -459988 -369301 -400222 -95318 -1964 -131473
11103a31473j71062O8700O26834p47980j102714N59448M87475O00328n70121k79007
$$ -131473 -302535 -233835 392999 -354981 -1457695 -898247 -410772 189556 -380565 -659572
11093f59572o8485p26420m36114O06471j21458J14001R97274l39664J15596k00735
$$ -659572 -728057 -1454477 -1890591 -1284120 -1405578 -1291577 -294303 -633967 -518371 -719106
11083g19106j83379K78478j44531R0002L96537Q2261o86567J86685M24475q7640
$$ -719106 -902485 -624007 -768538 -678536 -281999 -199738 -886305 -699620 -275145 -362785
11073c62785j73795l08441o33434K87323L56140p97040L59244O42522J87163K25299
$$ -362785 -536580 -845021 -1478455 -1191132 -834992 -1632032 -1272788 -630266 -443103 -217804
11063b17804n17942J55418j49139K63195N84558r87215j49710m04109J115712
$$ -217804 -735746 -580328 -729467 -466272 118286 -868929 -1018639 -1422748 -307036
11054c07036N08745j570758j1440J63683k4548M8474N34436N66199q2509m43115
$$ -307036 201709 -1369049 -1380489 -1216806 -1241354 -1192880 -658444 -92245 -174754 -617869
11044f17869Q0076R51972l99819k42726l07369j98109n12939L53253J10116L00111
$$ -617869 -537793 414179 14360 -228366 -535735 -733844 -1246783 -893530 -783414 -483303
11034d83303J60790m15989M07662N4885q32845n6244O27352J23954q3254m88924
$$ -483303 -322513 -738502 -330840 -275955 -1108800 -1165044 -537692 -413738 -496992 -985916
11024i85916J86492k73872k16608o88886K2879N29129J04847k78900K95277R3708
$$ -985916 -799424 -1073296 -1289904 -1978790 -1955911 -1426782 -1321935 -1600835 -1305558 -1211850
11014a211850J060732p54558r51152O85338N82676k68865o6816P04505J79584
$$ -1211850 -151118 -905676 -1856828 -1171490 -588814 -857679 -924495 -219990 -40406
11005d0406j180237M61754Q6114o66009N28004q41688L76170L46503q02090M92187
$$ -40406 -1220643 -758889 -672775 -1338784 -810780 -1652468 -1276298 -929795 -1731885 -1239698
10995a239698Q77510M4079q63350m0618M51464j36495n94380J193174O59430j141732
$$ -1239698 -362188 -318109 -1181459 -1222077 -770613 -907108 -1501488 -308314 351116 -790616
10985g90616J89597m00953j76373Q6180k1682l14624Q42794m44126K81285k8195
$$ -790616 -601019 -1001972 -1178345 -1092165 -1113847 -1428471 -585677 -1029803 -748518 -776713
10975g76713J8552N70247k19068P18660m50187q14806k30734j6282N88199K61957
$$ -776713 -758161 -187914 -406982 311678 -138509 -953315 -1184049 -1200331 -612132 -350175
10965c50175L26230q9582n86516L8816L4748k02228k79873l396K84188m17147
$$ -350175 -23945 -113527 -700043 -661227 -626479 -828707 -1108580 -1111976 -827788 -1244935
10955a244935j21939k11711J03347Q40642M73415o49351j241793K55112M84864
$$ -1244935 -1366874 -1578585 -1475238 -634596 -161181 -810532 -2052325 -1797213 -1312349
10946a312349N76670k9779k92767K59901l58345k19013n60116J06938O73423O15203
$$ -1312349 -735679 -765458 -1058225 -798324 -1156669 -1375682 -1935798 -1828860 -1155437 -540234
10936e40234j58733k40475J27979l20054r0461o58215K18469J19207Q10132L01477
$$ -540234 -698967 -939442 -811463 -1131517 -1221978 -1880193 -1661724 -1542517 -732385 -430908
10926d30908J8859L216K99359n74219k8768j20173K74400m7707o46247k60801
$$ -430908 -412049 -408833 -109474 -683693 -712461 -832634 -558234 -605941 -1252188 -1512989
10916a512989M20074k45251Q7761M00506K93863L10443l27216J89153j1579L54592
$$ -1512989 -1092915 -1338166 -1250405 -849899 -556036 -245593 -572809 -383656 -395235 -40643
10906d0643j81723p39077p576l08015k80845R64029J06809k88614k07222L43723
$$ -40643 -222366 -961443 -969019 -1277034 -1557879 -593850 -487041 -775655 -982877 -639154
10896f39154k43089m09376P51143J65138j65315p48354j97166J73952n60814M34479
$$ -639154 -882243 -1291619 -540476 -375338 -540653 -1289007 -1486173 -1312221 -1873035 -1438556
10886a438556N5909M15323N08355M10873q34503K35839M7166J84890J54520Q0200
$$ -1438556 -1382647 -967324 -458969 -48096 -882599 -646760 -599594 -414704 -260184 -179984
10876a79984o01087j7038j64320l67738P76585N12062p34872k3699l95233j33259
$$ -179984 -781071 -798109 -962429 -1330167 -553582 -41520 -776392 -800091 -1195324 -1328583
10866a328583Q60850m34079L89382k74573m08638l99537J17778k75275j66550
$$ -1328583 -467733 -901812 -512430 -787003 -1195641 -1595178 -1477400 -1752675 -1919225
10857a919225K10268Q2178M14732J27521Q14647K33473l07106m20447L3193k45475
$$ -1919225 -1708957 -1626779 -1212047 -1084526 -269879 -36406 -343512 -763959 -730766 -976241
10847i76241m532M64307o324m03307j65961O21501O96894n036j71262q27115l71197
$$ -976241 -980773 -516466 -522790 -926097 -1092058 -470557 226337 221301 50039 -777076 -1148273
10836a148273Q5888k13156o48386M33082N9805L55800q4167L5096L29753j08112
$$ -1148273 -1062385 -1275541 -1923927 -1490845 -1431040 -1075240 -1159407 -1124311 -794558 -902670
10826i02670J06339r61180K41508P42330j30861j084294N90841L65697O11409
$$ -902670 -796331 -1757511 -1516003 -773673 -904534 -1988828 -1397987 -1032290 -420881
10817d20881l52887l00109J48416M35013m57790O98586j201279J03786R84456
$$ -420881 -773768 -1073877 -925461 -490448 -948238 -249652 -1450931 -1347145 -362689
10808c62689k78119j49852r03446j66017l32822O1824Q25862L06969o95903N57279
$$ -362689 -640808 -790660 -1694106 -1860123 -2192945 -2131121 -1305259 -998290 -1694193 -1136914
10798a136914K8560L23775P48785k09802m41760j41083K26220j71439K088j04278
$$ -1136914 -1108354 -784579 -35794 -245596 -687356 -828439 -602219 -773658 -771570 -875848
10788h75848k63498K36646j278043Q60037L3646J41402j82006j36762Q9236l20169
$$ -875848 -1139346 -902700 -2180743 -1320706 -1287060 -1145658 -1327664 -1464426 -1375190 -1695359
10778a695359P33702k65338K32096p6517L27451M55068k03874o25429k09669O45922
$$ -1695359 -961657 -1226995 -994899 -1071416 -743965 -288897 -492771 -1118200 -1327869 -681947
10768f81947M07505o02555k32434k06211O72298l27541K35600o40194j17244J419751
$$ -681947 -274442 -876997 -1109431 -1315642 -643344 -970885 -735285 -1375479 -1492723 -72972
10758g2972l49455j38419o70777K59240K53700J44495l69649n05531P10327l96019
$$ -72972 -422427 -560846 -1231623 -972383 -718683 -574188 -943837 -1449368 -739041 -1135060
10748a135060N60652n42437Q6930n6192O3828K19781r48280O97358N99437l71698
$$ -1135060 -574408 -1116845 -1029915 -1086107 -1022279 -802498 -1750778 -1053420 -453983 -825681
10738h25681j46526k9880L66172j76258k76451j80415l96714O9870l10260O09408
$$ -825681 -972207 -1002087 -635915 -812173 -1088624 -1269039 -1665753 -1595883 -1906143 -1296735
10728a296735O43899k50361Q3208j27140l26668K91173j58676J95462K01688P0908
$$ -1296735 -652836 -903197 -819989 -947129 -1273797 -982624 -1141300 -945838 -744150 -673242
10718f73242o92762o55769R65867n84471m59294P48259L01482K67600L10180l98966
$$ -673242 -1366004 -2021773 -1055906 -1640377 -2099671 -1351412 -1049930 -782330 -472150 -871116
10708h71116L16811J34454K26731n00655k11955R6376l32361N00155l94590K04469
$$ -871116 -554305 -419851 -193120 -693775 -905730 -809354 -1141715 -641560 -1036150 -831681
10698h31681o9738k65862o7358L96921o54545O13067K69605Q3560p98109l26932
$$ -831681 -901419 -1167281 -1234639 -837718 -1492263 -879196 -609591 -526031 -1324140 -1651072
10688a651072L64465M42258J75511j21647q57732K27439J25314k97491q37779
$$ -1651072 -1286607 -844349 -668838 -790485 -1648217 -1420778 -1295464 -1592955 -2430734
10679b430734K41001K36943J95398N60065P3396K55850p9468M07351j13054q39877
$$ -2430734 -2189733 -1952790 -1757392 -1197327 -1123931 -868081 -947549 -540198 -653252 -1493129
10669a493129l81193N31778K93432L83455j116057K05303R1538K91240j7913l1331
$$ -1493129 -1874322 -1342544 -1049112 -665657 -1781714 -1576411 -1484873 -1193633 -1211546 -1242877
10659a242877M43618K88841o88386P2679M44568l59716K36860l04441j3069m8546
$$ -1242877 -799259 -510418 -1198804 -1126125 -681557 -1041273 -804413 -1108854 -1121923 -1170469
10649a170469N79496L84226l80357m58151O1478L5447o53269L97377p0576J01902
$$ -1170469 -590973 -206747 -587104 -1045255 -983777 -948330 -1601599 -1204222 -1274798 -1172896
10639a172896j05639j348633J246795M91061m31442M1801K76737k78399n68563
$$ -1172896 -1278535 -2627168 -1380373 -889312 -1320754 -1278953 -1002216 -1280615 -1849178
10630a849178J13907J97608K66720M41978n14423k03621K24038J78542m2393O92156
$$ -1849178 -1735271 -1537663 -1270943 -828965 -1343388 -1547009 -1322971 -1144429 -1186822 -494666
10620d94666j34695r98528j88499n69985L85221M98098L17715J32165Q682n36885
$$ -494666 -629361 -1627889 -1816388 -2386373 -2001152 -1503054 -1185339 -1053174 -1044492 -1581377
10610a581377L61020M73040m00633n39355L35711m9354j27009P3906L60548j72709
$$ -1581377 -1220357 -747317 -1147950 -1687305 -1351594 -1400948 -1527957 -1454051 -1093503 -1266212
10600a266212K17431k39137O3204p059J19015K21817j46074l96967M73763J2673
$$ -1266212 -1048781 -1287918 -1224714 -1231773 -1112758 -890941 -1037015 -1433982 -960219 -947546
10590i47546k60209M95576n25475o95115K42089J09270n71961O65647K74605n11350
$$ -947546 -1207755 -712179 -1237654 -1932769 -1690680 -1581410 -2153371 -1487724 -1213119 -1724469
10580a724469N90308n95017O32545r3987l70896M26461k20402J95340l84785R23132
$$ -1724469 -1134161 -1729178 -1096633 -1190620 -1561516 -1135055 -1355457 -1160117 -1544902 -621770
10570f21770l25688l21690O03919q05108K26183L03469J77482m09251p70898j19453
$$ -621770 -947458 -1269148 -665229 -1470337 -1244154 -940685 -763203 -1172454 -1943352 -2062805
10560b062805L08874Q85359O2389j32493M30322K69598r31581M14945l19878j022061
$$ -2062805 -1753931 -868572 -806183 -938676 -508354 -238756 -1170337 -755392 -1075270 -2097331
10550b097331J052848J304671m00006r18701r9542m38125r6802P18211O42767
$$ -2097331 -1044483 260188 -139818 -1058519 -1158061 -1596186 -1692988 -974777 -332010
10541c32010j72502J53028k42370r86652N62521j93244o16796P49802J69470o98030
$$ -332010 -504512 -351484 -593854 -1580506 -1017985 -1211229 -1828025 -1078223 -908753 -1606783
10531a606783L27077j26601O7824L76386k98547L76004L90628N02584o1684o92497
$$ -1606783 -1279706 -1406307 -1338483 -962097 -1260644 -884640 -494012 8572 -53112 -745609
10521g45609n02060K08761K65308j17376j115223n6783Q05779j73715n55058L84525
$$ -745609 -1247669 -1038908 -773600 -890976 -2006199 -2062982 -1257203 -1430918 -1985976 -1601451
10511a601451j61745p14355Q33746m74188j89066L86206M10006J022749O86298
$$ -1601451 -1763196 -2477551 -1643805 -2117993 -2307059 -1920853 -1510847 -488098 198200
10502A98200o26969o34889k94502J066845q14609L49726L75614q23831q96926
$$ 198200 -428769 -1063658 -1358160 -291315 -1105924 -756198 -380584 -1204415 -2101341
10493b101341j49150O21223J89577J60410Q9988O0681j20114L17885L54485j83708
$$ -2101341 -2250491 -1629268 -1439691 -1279281 -1189293 -1128612 -1248726 -930841 -576356 -760064
10483g60064p33395K07524K18086J64609K9352o42680o1292r8670O84K49678m11487
$$ -760064 -1493459 -1285935 -1067849 -903240 -873888 -1516568 -1577860 -1676530 -1675846 -1426168 -1837655
10472a837655M65982J28007j68209K74119k61358l37696L76558k72476P88462
$$ -1837655 -1371673 -1243666 -1411875 -1137756 -1399114 -1736810 -1360252 -1632728 -844266
10463h44266K5612m62159K88809J16518K48013K00997m30909m39264M12866k53993
$$ -844266 -818654 -1280813 -992004 -875486 -627473 -426476 -857385 -1296649 -883783 -1137776
10453a137776k81565O17418p06174l43994N03429L86870L15164K66164M4117m41932
$$ -1137776 -1419341 -801923 -1508097 -1852091 -1348662 -961792 -646628 -380464 -336347 -778279
10443g78279l899p41551J43480n4288N66545J27734n68385N65072k66955K15769
$$ -778279 -782178 -1523729 -1380249 -1434537 -867992 -740258 -1308643 -743571 -1010526 -794757
10433g94757Q10759M5993o77178J042n76439n40681L06388O54152q0230L01234
$$ -794757 16002 61995 -615183 -614141 -1190580 -1731261 -1424873 -770721 -850951 -549717
10423e49717l99321K55448l29477l62780R14568P8901m72212p3097P92224k63031
$$ -549717 -949038 -693590 -1023067 -1385847 -471279 -392378 -864590 -937687 -145463 -408494
10413d08494j118637K33144J059260j37298n76001o05167l20361m20007P48984
$$ -408494 -1527131 -1293987 -234727 -372025 -948026 -1553193 -1873554 -2293561 -1544577
10404a544577L69134J08679k0483j5716J84872j62845j23793k22799n16457Q46215
$$ -1544577 -1175443 -1066764 -1087247 -1102963 -918091 -1080936 -1204729 -1427528 -1943985 -1097770
10394a097770p4420L36348P36307p85849o00764L70240P26380J75847n18650o34969
$$ -1097770 -1172190 -835842 -99535 -885384 -1486148 -1115908 -389528 -213681 -732331 -1367300
10384a367300J59142K24986M57130p83662k78644N01048Q3462m76169K22704j33534
$$ -1367300 -1208158 -983172 -526042 -1309704 -1588348 -1087300 -1003838 -1480007 -1257303 -1390837
10374a390837j50188k23728P11245L59387q18219p0782K90823K38646J1358O12178
$$ -1390837 -1541025 -1764753 -1053508 -694121 -1512340 -1583122 -1292299 -1053653 -1042295 -430117
10364d30117q763k27383n31547q7281O832j81554N37156n17345l42777J144835
$$ -430117 -438880 -666263 -1197810 -1285091 -1278259 -1459813 -922657 -1440002 -1782779 -637944
10354f37944L66938J82385n5951m88361M76564K40698k99564r67126k94359K10658
$$ -637944 -271006 -88621 -144572 -632933 -156369 84329 -215235 -1182361 -1476720 -1266062
10344a266062K58064M16131M79491l90967q0246L00516j133138k4928M85833n4991
$$ -1266062 -1007998 -591867 -112376 -503343 -583589 -283073 -1416211 -1441139 -955306 -1010297
10334a010297J28952N61514J89621n9922j099644q1559J19696J44359K97457j62985
$$ -1010297 -881345 -319831 -130210 -190132 -1289776 -1371335 -1251639 -1107280 -809823 -972808
10324i72808j34397J086235J39145j90196k89308J12602m6999r77511P3091O67134
$$ -972808 -1107205 -20970 118175 -72021 -361329 -248727 -295726 -1273237 -1200146 -533012
10314e33012N69442j90210J14979k35066K1269k46475m60244l62172J77438j85785
$$ -533012 36430 -153780 -38801 -273867 -252598 -499073 -959317 -1321489 -1144051 -1329836
10304a329836M56396k00822l80327N87028J25529r15959M84095M99156Q1827m21207
$$ -1329836 -873440 -1074262 -1454589 -867561 -742032 -1657991 -1173896 -674740 -592913 -1014120
10294a014120L15840M98521J55822p14156o51860J31352Q96723J52957j138377
$$ -1014120 -698280 -199759 -43937 -758093 -1409953 -1278601 -381878 -228921 -1367298
10285a367298M18182L92898K89340j52414q42522m48817P65977N13891n59550
$$ -1367298 -949116 -556218 -266878 -419292 -1261814 -1710631 -944654 -430763 -990313
10276i90313M65756j47914m76463K47846K9751L37496j77377r64126k0429p7822
$$ -990313 -524557 -672471 -1148934 -901088 -871337 -533841 -711218 -1675344 -1695773 -1773595
10266a773595n9704K53465L67190L29133l0709P11308q05526l64037N08005K6082
$$ -1773595 -1833299 -1579834 -1212644 -883511 -914220 -202912 -1008438 -1372475 -864470 -838388
10256h38388k03734M40844M49015j75828m316q86820L63130Q22735l59050j26349
$$ -838388 -1042122 -601278 -152263 -328091 -332407 -1219227 -856097 -33362 -392412 -518761
10246e18761k8313J65302l7345j71456P49487N10235r47046L43979n86545M61085
$$ -518761 -547074 -381772 -419117 -590573 158914 669149 -277897 66082 -520463 -59378
10236e9378K49185K85758m67740k16646N44701o20958n83658L71843n89651j77322
$$ -59378 189807 475565 7825 -208821 335880 -285078 -868736 -496893 -1086544 -1263866
10226a263866r8962N15557P85996m33118P63535L7497K17157K8272o64868j0916
$$ -1263866 -1362828 -847271 -61275 -494393 269142 306639 523796 552068 -112800 -123716
10216a23716n6605O59372n0964p9666k79816j13402j52200q9262N28796n02724
$$ -123716 -180321 479051 428087 348421 68605 -44797 -196997 -286259 242537 -260187
10206b60187R701P06591m37247l6361p1830o79115P77434n52878M42207L39545
$$ -260187 -250486 456105 18858 -17503 -89333 -768448 8986 -543892 -101685 237860
10196B37860o07711j06550Q84498M53870k35503L01035j88967M5192K14669q16934
$$ 237860 -369851 -476401 408097 861967 626464 927499 738532 783724 998393 181459
10186A81459j03272N43888j15905K07385l7476j07587L78636L23650j40139r80687
$$ 181459 78187 622075 506170 713555 676079 568492 947128 1270778 1130639 149952
10176A49952q1310M74152L13544m38490j84908M06586J7665l9920j5715p35836
$$ 149952 68642 542794 856338 417848 232940 639526 657191 617271 601556 -134280
10166a34280P51134P30099M59163N7331J4240M27494m59328k88992o39989j87399
$$ -134280 616854 1346953 1806116 1863447 1877687 2305181 1845853 1556861 916872 729473
10156G29473N781M72594Q60686k31995P57057m38600J0973l15011m74836K25995
$$ 729473 735254 1207848 2068534 1836539 2593596 2154996 2165969 1850958 1376122 1602117
10146A602117L51374J83703j071356N98078M56024K21716k84997N3263O86141
$$ 1602117 1953491 2137194 1065838 1663916 2119940 2341656 2056659 2109922 2796063
10137B796063n33221L00466K9030k75533q8825N74056o5689L4700O64856n08336
$$ 2796063 2262842 2563308 2592338 2316805 2227980 2802036 2736347 2771047 3435903 2927567
10127B927567L1762P19019j148l76772R79291O9365N1434P9192n13773J01476
$$ 2927567 2959329 3678348 3677200 3300428 4279719 4349084 4400518 4479710 3965937 4067413
10117D067413r16796k12049J56365Q0194J62327J199719n1437j401654m13028
$$ 4067413 3150617 2938568 3094933 3175127 3337454 4537173 4485736 3084082 2671054
10108B671054q5013L43579O27853K22286N10449m16802k49963J329008n82425
$$ 2671054 2586041 2929620 3557473 3779759 4290208 3873406 3623443 4952451 4370026
10099D370026m57164q22139L01423L15487L64318K16921K78712l96138K66398
$$ 4370026 3912862 3090723 3392146 3707633 4071951 4288872 4567584 4171446 4437844
10090D437844k16794j08463L95568m00663K03812O36682K59172J78512K2007p14806
$$ 4437844 4221050 4112587 4508155 4107492 4311304 4947986 5207158 5385670 5407677 4692871
10080D692871Q0951o30778K91190P6434j12933o8593M26038O53339p85241n3521
$$ 4692871 4773822 4143044 4434234 4510668 4397735 4329142 4755180 5408519 4623278 4569757
10070D569757n1605p75674J01868R99965q04233k92688J5752L08611O70932m58304
$$ 4569757 4518152 3742478 3844346 4844311 4040078 3747390 3763142 4071753 4742685 4284381
10060D284381m29483O67370P933k52143j86031K16036R4607J77900K33702n00798
$$ 4284381 3854898 4522268 4530201 4278058 4092027 4308063 4402670 4580570 4814272 4313474
10050D313474n60147m63956J07061J153514O59935q27720o82626k89806R552J54628
$$ 4313474 3753327 3289371 3396432 4549946 5209881 4382161 3699535 3409729 3419281 3573909
10040C573909q12917M08810J277971k6330k09577N23092m38249L6587l69156L18580
$$ 3573909 2760992 3169802 4447773 4421443 4211866 4734958 4296709 4333296 3964140 4282720
10030D282720J21570O5810R2434m36765j03286l03496J21353R7070L5076p38670
$$ 4282720 4404290 4470100 4562534 4125769 4022483 3718987 3840340 3937410 3972486 3233816
10020C233816R08659q84099k1115j9242P60291M35722q0849p90332M68473M66884
$$ 3233816 4142475 3258376 3237261 3218019 3978310 4414032 4333183 3542851 4011324 4478208
10010D478208p34073l21865O80230L7104L15219m81376j23834J086986K04797
$$ 4478208 3744135 3422270 4102500 4139604 4454823 3973447 3849613 4936599 5141396
10001E141396q76567J6314M06440m61675o40M49591m9731o04499K22803j0620
$$ 5141396 4264829 4281143 4687583 4225908 4225268 4674859 4625128 4020629 4243432 4232812
9991D232812k70364J171619m72163o54760N04911n50779J41302L36658Q8975l17290
$$ 4232812 3962448 5134067 4661904 4007144 4512055 3961276 4102578 4439236 4528211 4210921
9981D210921K93471j32104N2640P45467r8224p05372K07436n8827J029971p47899
$$ 4210921 4504392 4372288 4424928 5170395 5072171 4366799 4574235 4515408 5545379 4797480
9971D797480k87698l21652L75625N81608M70405J30131k02288j11029L91663L7112
$$ 4797480 4509782 4188130 4563755 5145363 5615768 5745899 5543611 5432582 5824245 5861357
9961E861357n5234l56790j216569j2664J0750m75339P68313O6692l24214Q19840
$$ 5861357 5806123 5449333 4232764 4220100 4230850 3755511 4523824 4590516 4266302 5086142
9951E086142m5143N37119J28669o15892J42347J84068K32765J99588j319566K73265
$$ 5086142 5040999 5578118 5706787 5090895 5233242 5417310 5650075 5849663 4530097 4803362
9941D803362j166467K83433M43377k68030M47343O13736k3718l00400M2760k60224
$$ 4803362 3636895 3920328 4363705 4095675 4543018 5156754 5133036 4832636 4875396 4615172
9931D615172p25669L86402P58308r12006p2372n1191L21764r7609l09322o1135
$$ 4615172 3889503 4275905 5034213 4122207 4049835 3998644 4320408 4222799 3913477 3852342
9921C852342n1889k69027j75651J62208L66226o25755j11677J42680p6039O09213
$$ 3852342 3800453 3531426 3355775 3517983 3884209 3258454 3146777 3289457 3213418 3822631
9911C822631K39249k11300J01321n48601O17508l26874r85136J013533J60334
$$ 3822631 4061880 3850580 3951901 3403300 4020808 3693934 2708798 3722331 3882665
9902C882665j314088L62822Q04423R1070j331838K95853P4445J11660K8245L7204
$$ 3882665 2568577 2931399 3735822 3826892 2495054 2790907 2865352 2977012 3005257 3042461
9892C042461p2159q04309M33654K66021k75728K19546r47367r5411J30847J87378
$$ 3042461 2970302 2165993 2599647 2865668 2589940 2809486 1862119 1766708 1897555 2084933
9882B084933L50381k56512Q09714r84572j99667k75930M29666P6957O92027n60555
$$ 2084933 2435314 2178802 2988516 2003944 1804277 1528347 1958013 2034970 2726997 2166442
9872B166442k08544o7434q45268j91236N06655j45141m9611N27001k89568Q16862
$$ 2166442 1957898 1890464 1045196 853960 1360615 1215474 1165863 1692864 1403296 2220158
9862B220158J46957p49134k19769n70672m21976J144743L96395N0027k08493n87763
$$ 2220158 2367115 1617981 1398212 827540 405564 1550307 1946702 1996729 1788236 1200473
9852A200473j92536K96228l9879M87980k24504r31585L44407L14055J99082l67365
$$ 1200473 1007937 1304165 1264286 1752266 1527762 596177 940584 1254639 1453721 1086356
9842A086356J30143m11958L87460m93987j67559p03231k58884R13093M14981P9446
$$ 1086356 1216499 804541 1192001 698014 530455 -172776 -431660 481433 896414 975860
9832I75860k54746j51423j86797O02536l17025m2405k39427l29584l90995K73754
$$ 975860 721114 569691 382894 985430 668405 626000 386573 56989 -334006 -60252
9822f0252k52222R2233L10742p85109Q26806j40151Q27255N4657r38269n6112
$$ -60252 -312474 -220241 90501 -694608 132198 -7953 819302 873959 -64310 -120422
9812a20422N60052K03598l05280J56526l92561J1217Q707k24615R4267J137464
$$ -120422 439630 643228 337948 494474 101913 113130 121837 -102778 -8511 1128953
9802A128953j78252j156074L15094k5977J92645P45552l00077n69454L46870M63113
$$ 1128953 950701 -205373 109721 83744 276389 1021941 721864 152410 499280 962393
9792I62393j83128q56208L30174j71535n4223M00531j54611j06312l95794P27492
$$ 962393 779265 -76943 253231 81696 27473 428004 273393 167081 -228713 498779
9782D98779K66943m33625m42399l6635j88776O5422j05845L60159K33589O55891
$$ 498779 765722 332097 -110302 -146937 -335713 -270291 -376136 -15977 217612 873503
9772H73503J54614n15378n25756k91824j54865j45705N14244o43436q9433R06968
$$ 873503 1028117 512739 -13017 -304841 -459706 -605411 -91167 -734603 -824036 82932
9762H2932J06086O70326N39817m61608p05716l31676k73256j63130K06457K63379
$$ 82932 189018 859344 1399161 937553 231837 -99839 -373095 -536225 -329768 -66389
9752f6389j10284n83230q9527m34184K57189n3556l9788K00571Q4849N83734k54423
$$ -66389 -176673 -759903 -849430 -1283614 -1026425 -1079981 -1119769 -919198 -834349 -250615 -505038
9741e05038J30742J8802J174322p96223j26141N22273J68373k14972l41244K32108
$$ -505038 -374296 -355494 818828 22605 -103536 418737 587110 372138 30894 263002
9731B63002R00266n16177n41838M01198j167769M591o51210P01799O34986j54809
$$ 263002 1163268 647091 105253 506451 -661318 -656727 -1307937 -606138 28848 -125961
9721a25961q3271l18110Q59366k13484l39450K39561o69403k29919O32818M55229
$$ -125961 -209232 -527342 332024 118540 -220910 18651 -650752 -880671 -247853 207376
9711B07376j81201N07035m22145m26679l33716l24624O07545r1223k0181n72066
$$ 207376 26175 533210 111065 -315614 -649330 -973954 -366409 -457632 -477813 -1049879
9701a049879Q50350J50614p57417O9238K92250M1492J043002o62478k83578J87302
$$ -1049879 -199529 -48915 -806332 -737094 -444844 -403352 639650 -22828 -306406 -119104
9691a19104l14712l3565k30663J175530j65210n0069L21365N01259J77717Q6074
$$ -119104 -433816 -467381 -698044 477486 312276 262207 583572 1084831 1262548 1348622
9681A348622j066732l05802n04939Q65905K89455k68637l57400m17223J8731k30360
$$ 1348622 281890 -23912 -528851 337054 626509 357872 472 -416751 -398020 -628380
9671f28380j33926L91551K87236P5460M15588m71698o7439M21112N60459p45104
$$ -628380 -762306 -370755 -83519 -8059 407529 -64169 -131608 289504 849963 104859
9661A04859M81463K53038n80040k93027n05585j10360O54706R03158l63905K77041
$$ 104859 586322 839360 259320 -33707 -539292 -649652 5054 908212 544307 821348
9651H21348l51916j72079L20123L42O92026q79016j46284J91072O69285O32341
$$ 821348 469432 297353 617476 617818 1309844 430828 284544 475616 1144901 1777242
9641A777242K65425M5195K42096j221254o20244O06739Q7663M55715j217547R45009
$$ 1777242 2042667 2087862 2329958 1108704 488460 1095199 1182862 1638577 421030 1366039
9631A366039m75254l11093K98882J65806m12117m49647P66180O6399J91622r833
$$ 1366039 890785 579692 878574 1044380 632263 182616 948796 1015195 1206817 1196984
9621A196984o42798j92006Q66628j091210K92408J155440l53238p97040M56121
$$ 1196984 554186 362180 1228808 137598 430006 1585446 1232208 435168 891289
9612H91289M57384q54207m00109k0842K19451n24031M89492n22143L33683N53293
$$ 891289 1348673 494466 94357 73515 292966 -231065 258427 -263716 69967 623260
9602F23260l50879r26554k28133j20846L64252O38007m74223j50608L23374J24573
$$ 623260 272381 -654173 -882306 -1003152 -638900 -893 -475116 -625724 -302350 -177777
9592a77777p0310r02526k8218J300448O72702J0714k061783P20235K67611M83060
$$ -177777 -248087 -1150613 -1178831 121617 794319 805033 -1256750 -536515 -268904 214156
9582B14156P1102p76724J39556M84566P54740n63288K1870N7738m25659j1896
$$ 214156 285258 -491466 -351910 132656 887396 324108 345978 403716 -21943 -33839
9572c3839m0709o95498P70019L79203l01338L91956k55973m93567M05308j30693
$$ -33839 -74548 -770046 -27 379176 77838 469794 213821 -279746 125562 -5131
9562e131J0706j60816K01799L14125M87512k70570o24894m5838K72225O70712
$$ -5131 5575 -155241 46558 360683 848195 577625 -47269 -93107 179118 849830
9552H49830m99641P37864r33872J39075K28061J69626j41544p55361K29962N73049
$$ 849830 350189 1088053 154181 293256 521317 690943 549399 -205962 24000 597049
9542E97049M0407m56229L46589o22930K21424R59003R7459j196139n38093N88087
$$ 597049 637456 181227 527816 -95114 126310 1085313 1182772 -13367 -551460 36627
9532C6627J77591M55457l98261p18164j02620J8719K26597k4762M64602m0233
$$ 36627 214218 669675 271414 -446750 -549370 -530651 -304054 -328816 135786 95553
9522I5553m11342J19756L96979L10830q16503N76473m4919l07021l61103j44956
$$ 95553 -315789 -196033 200946 511776 -304727 271746 226827 -80194 -441297 -586253
9512e86253K74431J04736R41517M39435k31107O9262N86505k0402q70934m83641
$$ -586253 -311822 -207086 734431 1173866 942759 1012021 1598526 1578124 707190 223549
9502B23549j95896j92519p10831J157286M69408p01302O47943l60837m55289Q916
$$ 223549 27653 -164866 -875697 281589 750997 49695 697638 336801 -118488 -109572
9492a09572K45774J96449p08791M31484J68797k72419r378L50199j66871Q4172
$$ -109572 136202 332651 -376140 55344 224141 -48278 -57656 292543 125672 209844
9482B09844M77887j3207p8658K72590L45808Q53013K16929o06813m76952m34076
$$ 209844 687731 674524 595866 868456 1214264 2067277 2284206 1677393 1200441 766365
9472G66365n23714M61564O68323k16724M4025l21988K48621r09619K68595Q14705
$$ 766365 242651 704215 1372538 1155814 1199839 877851 1126472 216853 485448 1300153
9462A300153K73190q41925p26684M98304R22517K99774o27093k22982l28011l65052
$$ 1300153 1573343 731418 4734 503038 1425555 1725329 1098236 875254 547243 182191
9452A82191P15456l55194J229497n9253j14174m24834j98195L63030Q6228k35587
$$ 182191 897647 542453 1771950 1712697 1598523 1173689 975494 1338524 1424752 1189165
9442A189165o28071L59462q28102J318467o32712m0498J004989j111708O74865
$$ 1189165 561094 920556 92454 1410921 778209 737711 1742700 630992 1305857
9433A305857k14406k16159J75830m17396k74242P38713P56672l35869k35403j68435
$$ 1305857 1091451 875292 1051122 633726 359484 1098197 1854869 1519000 1283597 1115162
9423A115162l04306K23732K32607J31863k48443p04107q30514P43165J48157j74069
$$ 1115162 810856 1034588 1267195 1399058 1150615 446508 -384006 359159 507316 333247
9413C33247j50761r6245J167442L80553l66993J80091l10822P82820k79932L30312
$$ 333247 182486 86241 1253683 1634236 1267243 1447334 1136512 1919332 1639400 1969712
9403A969712j31885m73865J56429j81357J32771J84428J98071K57281L17956p04970
$$ 1969712 1837827 1363962 1520391 1339034 1471805 1656233 1854304 2111585 2429541 1724571
9393A724571J88286J03033j6322O9380p9241o47953l0076k90690M3544M82354
$$ 1724571 1912857 2015890 1999568 2068948 1989707 1341754 1311678 1020988 1064532 1546886
9383A546886l80097N30685p9268j49981K13751l8306L49020m29083l97511Q0618
$$ 1546886 1166789 1697474 1618206 1468225 1681976 1643670 1992690 1563607 1166096 1246714
9373A246714k32866L02984L65205j04104P93579J86454L35580k93024P76423l43140
$$ 1246714 1013848 1316832 1682037 1577933 2371512 2557966 2893546 2600522 3376945 3033805
9363C033805J30393l2912R7987r96502J39930N09287l21472J56820J8055m12016
$$ 3033805 3164198 3131286 3229273 2232771 2372701 2881988 2560516 2717336 2735391 2323375
9353B323375R71059k79533r67244N88782L43909L66794L61177N9080l71722k22441
$$ 2323375 3294434 3014901 2047657 2636439 2980348 3347142 3708319 3767399 3395677 3173236
9343C173236q83607J3104O73251O67028K09851L92713K25122m70014m87462J32169
$$ 3173236 2289629 2302733 2975984 3643012 3852863 4245576 4470698 4000684 3513222 3645391
9333C645391K4757L21025n14966j85866Q2047J12237q11421J92660J87139m64656
$$ 3645391 3670148 3991173 3476207 3290341 3372388 3484625 2673204 2865864 3053003 2588347
9323B588347J16229N23417N40878n81933N72173j194361j51445N76947K84484
$$ 2588347 2704576 3227993 3768871 3186938 3759111 2564750 2413305 2990252 3274736
9314C274736J83132l6935L35089k31034o07864M06640j41725p760J015115K07669
$$ 3274736 3457868 3420933 3756022 3524988 2917124 3323764 3182039 3174279 4189394 4397063
9304D397063n57754n37858k83570k58214J65592o3412m49291r1162N35690Q91732
$$ 4397063 3839309 3301451 3017881 2759667 2925259 2861847 2412556 2321394 2857084 3748816
9294C748816J86314m92775J018788m65145l24801n15043j41431l47971j49351
$$ 3748816 3935130 3442355 4461143 3995998 3671197 3156154 3014723 2666752 2517401
9285B517401M34391L50369q64192J57766L89740j34555N3344n13147J149548J52822
$$ 2517401 2951792 3302161 2437969 2595735 2985475 2850920 2904264 2391117 3540665 3693487
9275C693487K21129j66312n42283o24050m83546N12578J52920k09906L56733Q41478
$$ 3693487 3914616 3748304 3206021 2581971 2098425 2611003 2763923 2554017 2910750 3752228
9265C752228l98796M9788N22126K968k56604q8457N51553j79988J77429K19556
$$ 3752228 3353432 3403220 3925346 3928314 3671710 3583253 4134806 3954818 4132247 4351803
9255D351803m8425K53562M31970k6550n02635m96810k04376M26697j34581M41150
$$ 4351803 4303378 4556940 4988910 4962360 4459725 3962915 3758539 4185236 4050655 4491805
9245D491805j19978k41274l86449q7422L63125l75904N52141M73060j42122M27006
$$ 4491805 4371827 4130553 3744104 3656682 4019807 3643903 4196044 4669104 4526982 4953988
$$ [...]
##END NTUPLES=NMR SPECTRUM
##END=
