##TITLE=1H_CA-8960
 DMSO
 8 sc, 
 13.12.2021
##JCAMPDX= 6.0         $$ Bruker NMR JCAMP-DX V2.0
##DATA TYPE= NMR SPECTRUM
##DATA CLASS= NTUPLES
##ORIGIN= UXNMR, Bruker Analytische Messtechnik GmbH
##OWNER= root
$$ XWIN-NMR		Version 3.5
$$ Mon Dec 13 11:21:06 2021 Russian Standard Time (UT+4h)  she@DPX200
##.OBSERVE FREQUENCY= 200.131346
##.OBSERVE NUCLEUS= ^1H
##.ACQUISITION MODE= SIMULTANEOUS
##.ACQUISITION SCHEME= undefined
##.AVERAGES= 8
##.DIGITISER RES= 18
##SPECTROMETER/DATA SYSTEM= spect
##.PULSE SEQUENCE= zg30
##.SOLVENT NAME= DMSO
##.SHIFT REFERENCE= (INTERNAL, DMSO, 0, 15.7414)
##AUDIT TRAIL= $$ (NUMBER, WHEN, WHO, WHERE, WHAT)
$$ ##TITLE= Audit trail, XWIN-NMR		Version 3.5
$$ ##JCAMPDX= 5.01
$$ ##ORIGIN= Bruker BioSpin GmbH
$$ ##OWNER= she
$$ F:/spectra/data/she/nmr/H-F/1/pdata/1/auditp.txt
$$ ##AUDIT TRAIL=  $$ (NUMBER, WHEN, WHO, WHERE, WHAT)
(   1,<2021-12-13 11:19:38.93 +0400>,<she>,<DPX200>,
      <created by zg, POWCHK disabled, PULCHK disabled
       configuration hash MD5:
       00 E9 B6 7A A2 85 ED C7 34 08 36 98 17 FE 4E 26
       data hash MD5: 16K
       8C 4A 10 87 83 59 43 51 58 17 69 36 D7 84 F7 58>)
(   2,<2021-12-13 11:19:41.34 +0400>,<she>,<DPX200>,
      <Start of raw data processing
       efp BC_mod = 2 LB = 0.24 FT_mod = 6 PKNL = 1 PHC0 = -15872.55 PHC1 = 14.0008 SI = 16K 
       data hash MD5: 16K
       C6 31 22 A2 86 1E 09 E6 08 A7 A2 37 7C C5 33 08>)
(   3,<2021-12-13 11:20:06.51 +0400>,<she>,<DPX200>,
      <pk PHC0 = -0.3306184 PHC1 = -4.6 
       data hash MD5: 16K
       98 42 75 3A 79 FA 8E 03 7B 4B 0B 93 AC E3 6A 3E>)
(   4,<2021-12-13 11:20:10.10 +0400>,<she>,<DPX200>,
      <abs ABSG = 5 
       data hash MD5: 16K
       14 72 01 04 A8 9A 14 E7 B8 82 C2 A3 4D F0 7A 27>)
$$ ##END=
$$ 
$$ hash MD5
$$ 8B B5 7A 57 DF 02 85 5C 14 50 A8 0E 26 F5 C4 E2
##$RELAX= 
##$RELAX= 
##$RELAX= 
##$RELAX= 
##$RELAX= 
##$RELAX= 
$$ Bruker specific parameters
$$ --------------------------
##$DU= <F:/spectra>
##$EXPNO= 1
##$NAME= <H-F>
##$PROCNO= 1
##$TYPE= <nmr>
##$USER= <she>
##$AMP= (0..31)
100 100 100 100 100 100 100 100 100 100 100 100 100 100 100 100 100 100 
100 100 100 100 100 100 100 100 100 100 100 100 100 100 
##$AQSEQ= 0
##$AQ_mod= 1
##$AUNM= <au_zg>
##$AUTOPOS= <>
##$BF1= 200.13
##$BF2= 200.13
##$BF3= 200.13
##$BF4= 200.13
##$BF5= 200.13
##$BF6= 200.13
##$BF7= 200.13
##$BF8= 200.13
##$BYTORDA= 1
##$CFDGTYP= 0
##$CFRGTYP= 5
##$CHEMSTR= <none>
##$CNST= (0..31)
1 1 145 1 1 1 1 1 1 1 1 1 1 1 1 1 1 1 1 1 1 1 1 1 1 1 1 1 1 1 1 1 
##$CPDPRG= <>
##$CPDPRG1= <>
##$CPDPRG2= <>
##$CPDPRG3= <>
##$CPDPRG4= <mlev>
##$CPDPRG5= <mlev>
##$CPDPRG6= <mlev>
##$CPDPRG7= <mlev>
##$CPDPRG8= <mlev>
##$CPDPRGB= <>
##$CPDPRGT= <>
##$D= (0..31)
0 1.2 0 0 0 0 0 0 0 0.06 0 0.03 0 0 0 0 0.0002 0 0 0 0 0 0 0 0 0 0 0 0 
0 0 0 
##$DATE= 1639379978
##$DBL= (0..7)
120 120 120 120 120 120 120 120 
##$DBP= (0..7)
150 150 150 150 150 150 150 150 
##$DBP07= 0
##$DBPNAM0= <>
##$DBPNAM1= <>
##$DBPNAM2= <>
##$DBPNAM3= <>
##$DBPNAM4= <>
$$ [...]
##$SUBNAM2= <"">
##$SUBNAM3= <"">
##$SUBNAM4= <"">
##$SUBNAM5= <"">
##$SUBNAM6= <"">
##$SUBNAM7= <"">
##$SUBNAM8= <"">
##$SUBNAM9= <"">
##$SW= 18.0517287032376
##$SWIBOX= (0..15)
0 0 2 0 0 0 0 0 0 0 0 0 0 0 0 0 
##$SW_h= 3612.71676300578
##$TD= 16384
##$TD0= 1
##$TE= 0
##$TE2= 300
##$TE3= 300
##$TEG= 300
##$TL= (0..7)
0 120 120 120 120 120 120 120 
##$TP= (0..7)
150 150 150 150 150 150 150 150 
##$TP07= 0
##$TPNAME0= <>
##$TPNAME1= <>
##$TPNAME2= <>
##$TPNAME3= <>
##$TPNAME4= <>
##$TPNAME5= <>
##$TPNAME6= <>
##$TPNAME7= <>
##$TPOAL= (0..7)
0.5 0.5 0.5 0.5 0.5 0.5 0.5 0.5 
##$TPOFFS= (0..7)
0 0 0 0 0 0 0 0 
##$TUNHIN= 0
##$TUNHOUT= 0
##$TUNXOUT= 0
##$USERA1= <user>
##$USERA2= <user>
##$USERA3= <user>
##$USERA4= <user>
##$USERA5= <user>
##$V9= 5
##$VALIST= <valist>
##$VCLIST= <CCCCCCCCCCCCCCC>
##$VD= 0
##$VDLIST= <DDDDDDDDDDDDDDD>
##$VPLIST= <PPPPPPPPPPPPPPP>
##$VTLIST= <TTTTTTTTTTTTTTT>
##$WBST= 1024
##$WBSW= 4
##$XGAIN= (0..3)
0 0 0 0 
##$XL= 0
##$YL= 0
##$YMAX_a= 90686
##$YMIN_a= -189516
##$ZGOPTNS= <>
##$ZL1= 120
##$ZL2= 120
##$ZL3= 120
##$ZL4= 120
##$ABSF1= 15.71714
##$ABSF2= -2.334709
##$ABSG= 5
##$ABSL= 3
##$ALPHA= 0
##$AQORDER= 0
##$ASSFAC= 0
##$ASSFACI= 0
##$ASSFACX= 0
##$ASSWID= 0
##$AUNMP= <proc_1d>
##$AZFE= 0.1
##$AZFW= 0.1
##$BCFW= 0
##$BC_mod= 2
##$BYTORDP= 0
##$COROFFS= 0
##$CY= -3
##$DATMOD= 1
##$DC= 0
##$DFILT= <>
##$DTYPP= 0
##$F1P= 0
##$F2P= 0
##$FCOR= 1
##$FTSIZE= 16384
##$FT_mod= 6
##$GAMMA= 0
##$GB= 0
##$INTBC= 1
##$INTSCL= 0
##$ISEN= 128
##$LB= 0.24
##$LEV0= 0
##$LPBIN= 0
##$MAXI= 10000
##$MC2= 0
##$MEAN= 0
##$ME_mod= 0
##$MI= 1.114404
##$NCOEF= 0
##$NC_proc= -9
##$NLEV= 6
##$NOISF1= 3.799351
##$NOISF2= 2.8
##$NSP= 0
##$NTH_PI= 0
##$NZP= 0
##$OFFSET= 15.74138
##$PC= 1
##$PHC0= -15872.88
##$PHC1= 9.400801
##$PH_mod= 1
##$PKNL= yes
##$PPARMOD= 0
##$PSCAL= 0
##$PSIGN= 0
##$REVERSE= no
##$SF= 200.130002034876
##$SI= 16384
##$SIGF1= 3
##$SIGF2= 2
##$SINO= 5.538805
##$SIOLD= 16384
##$SREGLST= <1H.CDCl3>
##$SSB= 0
##$STSI= 16384
##$STSR= 0
##$SW_p= 3612.71676300578
##$SYMM= 0
##$S_DEV= 0
##$TDeff= 16384
##$TDoff= 0
##$TI= <>
##$TILT= no
##$TM1= 0
##$TM2= 0
##$TOPLEV= 0
##$USERP1= <user>
##$USERP2= <user>
##$USERP3= <user>
##$USERP4= <user>
##$USERP5= <user>
##$WDW= 1
##$XDIM= 16384
##$YMAX_p= 514860990
##$YMIN_p= -2881310
$$ End of Bruker specific parameters
$$ ---------------------------------
##NTUPLES= NMR SPECTRUM
##VAR_NAME=  FREQUENCY,     SPECTRUM/REAL,   SPECTRUM/IMAG
##SYMBOL=    X,             R,               I
##VAR_TYPE=  INDEPENDENT,   DEPENDENT,       DEPENDENT
##VAR_FORM=  AFFN,          ASDF,            ASDF
##VAR_DIM=   16384,         16384,           16384
##UNITS=     HZ,            ARBITRARY UNITS, ARBITRARY UNITS
##FACTOR=    0.220516191357247, 1,           1
##FIRST=     3150.32235896848, 0,            0
##LAST=      -462.394404037303, 0,           0
##MIN=       -462.394404037303, -2881310,    0
##MAX=       3150.32235896848, 514860990,    0
$$ Real data points
##PAGE= N=1
##DATA TABLE= (X++(R..R)), XYDATA
$$ [...]
7602A210604p44480n33703J78310J31555M45236q9920j69916n0169k50280r0867
7592C6370j86300J09215j24210m42960k61725P62258O30066m16129o1703K91299
7582C36181m48552j08102R7968N03580L59638k28229l826K38474n14586J14670
7572C47216j89002J64301L6666n25680M91653R7114k54097J10025j51580Q89248
7562A015864l76211n15523P91180l72499q71610k65631N90869r1543O35681K97306
7552H37883n59407k85492M55941J34515K2660n6091l89140J64740L45766m4723
7542F26652J38572j128599N51254L01447o74089q59012L84352Q88818O48490p4680
7532H03205r47153o4906M73227j19093M29412Q8206m92682P26977p57025M8610
$$ y = [1210604, 466124, -67579, 110731, 242286, 687522, 597602, 427686, 377517, 127237, 36370, -149930, -40715, -164925, -607885, -869610, -107352, 522714, 106585, 44882, 336181, -112371, -220473, -122505, 381075, 740713, 512484, 508658, 747132, 232546, 347216, 158214, 322515, 359181, -166499, 325154, 422268, 168171, 278196, 126616, 1015864, 639653, 124130, 915310, 542811, -328799, -594430, -3561, -95104, 540577, 837883, 278476, -7016, 448925, 583440, 606100, 550009, 160869, 325609, 671375, 626652, 765224, -363375, 187879, 489326, -184763, -1043775, -659423, 229395, 877885, 803205, -143948, -208854, 264373, 145280, 574692, 662898, 170216, 897193, 140168, 188778]
7522A88778M37299m91274j132284L15870P66452O83521o96912P2483L46230M60244
7512I50407J20549L80173o66260j37575m152K42393l69096J98824m93328o26019
7502d04084l86917l90286M44815J023622K79268l56337J76547l66156L28603m20043
7492g0968K70766n04113M94695L85355q66253n34884O95570K5935J344805N96311
7482A837219j191390P3639m04136m22371j2828R8888k74932L50016O29430J96911
7472H80446q1025p0951k41337k3516n33742l30407j14999m14741l02852l84391
7462a617515J143903P10416l66230K03948N83117O18647j217637L14314M7727
7453D20690l90198M63267n11951L40496M2894R02109p46382k46165m93574J86357
$$ y = [188778, 626077, 134803, -997481, -681611, 84841, 768362, 71450, 143933, 490163, 950407, 1070956, 1451129, 784869, 647294, 643142, 885535, 516439, 715263, 221935, -404084, -791001, -1181287, -736472, 287150, 566418, 210081, 386628, 20472, 349075, -70968, 199798, -304315, 190380, 575735, -290518, -825402, -129832, -103897, 1240908, 1837219, 645829, 719468, 315332, -107039, -119867, -20979, -295911, 54105, 683535, 880446, 799421, 728470, 487133, 463617, -70125, -400532, -515531, -930272, -1233124, -1617515, -473612, 236804, -129426, 74522, 657639, 1276286, 58649, 372963, 420690, 30492, 493759, -18192, 322304, 365198, 1267307, 520925, 274760, -218814, -32457]
7443c2457N15556K41808K99268r04660L02421j31413o40635K91396K5063l9891
7433g3544L95719O72117l56154m97050L73778k19228J37976N49268j67214K20078
7423A035746K42918j36046m48864M67500j67620j09454M27103Q5453r63561O3017
7413D96192K08979m97466Q4175m87451j65590J12734K15709L61959J28750k83919
7403A74072R0422N61469k18678N60661j010046L22195R11888o00563p27570p50239
7393f86389L88027j93698n30516J90004L42625M0198N62085L20644j54767J61409
7383D39622o2621N06242P16977q85105N79236k55710l22858L18398q71171M20469
7373E83479O14221m3972m6275q47038J81735O9818l96951L8605J90015l06309
$$ y = [-32457, 483099, 724907, 1024175, 119515, 421936, 290523, -350112, -58716, -33653, -73544, 322175, 994292, 638138, 141088, 514866, 295638, 433614, 982882, 815668, 1035746, 1278664, 1142618, 693754, 1161254, 993634, 884180, 1311283, 1396736, 433175, 496192, 705171, 207705, 291880, -195571, -361161, -248427, -32718, 329241, 457991, 174072, 264494, 825963, 607285, 1167946, 157900, 480095, 1391983, 791420, 63850, -686389, -298362, -492060, -1022576, -832572, -489947, -449749, 112336, 432980, 278213, 439622, 377001, 883243, 1600220, 715115, 1294351, 1038641, 715783, 1034181, 163010, 583479, 1197700, 1153728, 1107453, 260415, 442150, 511968, 115017, 153622, 343637, 37328]
7363C7328N70351l21193K50932K49932o026R0754K1682n16821j06446M89700r6891
7352F63302j39713L5834j097545k43595J336640K55942J21005M40952p20964n1063
7342F00795L09726l09857p27235J034790L17645j82955J08033J13196j24383n45
7332A139210j38765j38071k18789J34462J86620o73K99745o87913l04944J95192
7322D66074N18205m17446l95546j04811O27156m66332k01959O38559O0867n28597
7312A96170J84428k70140n580q3366K19805j49445M67689j18435K88054M693j35957
7301E97916j45057N42095L86320n67052o3134o82591j1256J19970J513512Q53239
7291B543962j55712p78472n69172M41789K79745N06605r41976m81045N24467j14332
$$ y = [37328, 607679, 286486, 537418, 787350, 781324, 872078, 893760, 376939, 270493, 760193, 663302, 523589, 559423, -538122, -781717, 554923, 810865, 931870, 1372822, 651858, 600795, 910521, 600664, -126571, 908219, 1225864, 1042909, 1150942, 1264138, 1139755, 1139210, 1000445, 862374, 643585, 778047, 964667, 963994, 1263739, 575826, 270882, 466074, 984279, 566833, 171287, 66476, 693632, 227300, 25341, 663900, 724767, 196170, 380598, 110458, 104878, 21512, 241317, 91872, 559561, 441126, 729180, 733873, 597916, 452859, 994954, 1381274, 814222, 751088, 68497, 57241, 177211, 1690723, 2543962, 2388250, 1609778, 1040606, 1482395, 1762140, 2268745, 1326769, 845724, 1370191, 1255859]
7281A255859r1122k51791M04964k99024l25716k13449l8214L25386j3253K19345
7271I72985k1285l71387J69391M58096J37588k31353J77946l1679j094323l25199
7261a59220R16604M2981l87748P76526j94623P7709J11963K67061m567j17611
7251A329075k97390m53955m86411P15808R0903k09186o80672P85083N49842j47500
7241A195597p79873J35128J233483p76927j85332m40317J53480J62766K42454
7232I40459K64725p08439L82739R03192o53982j138010m2302R83911k29214L29336
7222A032415p958O19367l64845m61061N16213k63173l28891j00747k30919L35210
7212G45611M75992q2327N03275K41709J97914j554015o81387O06981P24569K4402
$$ y = [1255859, 1164737, 912946, 1317910, 1018886, 693170, 479721, 441507, 766893, 753640, 972985, 951700, 580313, 749704, 1207800, 1345388, 1114035, 1291981, 1260302, 165979, -159220, 757384, 800365, 412617, 1189143, 994520, 1072229, 1184192, 1451253, 1446686, 1329075, 1031685, 577730, 91319, 807127, 898030, 688844, 8172, 793255, 1343097, 1195597, 415724, 550852, 1784335, 1007408, 822076, 381759, 535239, 698005, 940459, 1205184, 496745, 879484, 1782676, 1128694, -9316, -51618, 932293, 703079, 1032415, 1024457, 1643824, 1278979, 817918, 1334131, 1070958, 742067, 641320, 410401, 745611, 1221603, 1139276, 1642551, 1884260, 2082174, 528159, -153228, 453753, 1178322, 1202724]
7202A202724o19141M89008l04488K3096j73761L71960L35567k56319k43419j53895
7192F71332L8809l42243Q1972L77040N61691O26514N17775n89449p51310L0879
7182A223010j99411M56587o40724j82572M93687N12297n34106K0104K13837K37965
7172A600674m0727m4196K0853m4896l63049o1075J1849K90465j8377N834Q3192
7161A440547k59503J05423J77384j17334K33895k21579k19113Q1793L058M86575
7151A711146n27180k33525j11712M96615L11949K22726q92979j71372J33741K04615
7141A144024L29788J06522J30083J7062m48272j59450O88635P1332j41435o37257
7131A101032j89751j30575Q19446o7593q7542L42830q84322l80156L18859N9083
$$ y = [1202724, 583583, 1072591, 768103, 791199, 617438, 989398, 1324965, 1068646, 825227, 671332, 710141, 367898, 449870, 826910, 1388601, 2015115, 2532890, 1943441, 1192131, 1223010, 1023599, 1480186, 839462, 656890, 1150577, 1662874, 1128768, 1148872, 1362709, 1600674, 1559947, 1515751, 1536604, 1491708, 1128659, 1067584, 1079433, 1369898, 1351521, 1357355, 1440547, 1181044, 1286467, 1463851, 1346517, 1580412, 1358833, 1139720, 1221513, 1224571, 1711146, 1183966, 950441, 838729, 1335344, 1647293, 1870019, 977040, 805668, 939409, 1144024, 1473812, 1580334, 1710417, 1727479, 1279207, 1119757, 1808392, 1879724, 1738289, 1101032, 911281, 780706, 1600152, 1532559, 1445017, 1787847, 903525, 523369, 842228, 901311]
7121I01311K43581j06931O69295j010554M19381O42001m56252K34910l86431l7780
7111A112531o0766R83241L83368q39508p82803p2855J27504J088703q7691j0498
7101A841226L42504m30940j03363J074269J16158n25419o52862M51975p58525
7092A355023K72248K0019L06129q34694k08705M28924L59585M36713N30723n11071
7082B154894k97101k644J047454L10319o00310j51038J14761p80237J80259l49057
7072A627300L79770N36214j42104L39628R0421R700p59031j3099J35772j64289
7062B040282j111178o2252J60830Q87627k47589n28970M60505Q1782j55720j56274
7052A369043l13656Q65709N01797K954j90864j3185j56197L90374j39273N26391
$$ y = [901311, 1144892, 1037961, 1707256, 696702, 1116083, 1758084, 1301832, 1536742, 1150311, 1112531, 1051765, 2035006, 2418374, 1578866, 796063, 723208, 850712, 1939415, 1851724, 1841226, 2183730, 1752790, 1649427, 2723696, 2839854, 2314435, 1661573, 2113548, 1355023, 1627271, 1647290, 1953419, 1118725, 910020, 1338944, 1698529, 2135242, 2665965, 2154894, 1857793, 1855149, 2902603, 3212922, 2612612, 2461574, 2576335, 1796098, 1976357, 1627300, 2007070, 2543284, 2401180, 2740808, 2831229, 2840929, 2081898, 2068799, 2204571, 2040282, 929104, 866852, 1027682, 1915309, 1667720, 1138750, 1599255, 1681037, 1525317, 1369043, 1055387, 1921096, 2422893, 2425847, 2234983, 2221798, 2065601, 2455975, 2316702, 2843093]
7042B843093n89294j05690K37440k86929J10205L44875M8837K06197r06328l05592
7032A596814K34054J75037L26982L75295l76926Q3536k42539M6852L57808n91597
7022A985316k12438o63L13945J077023o45821m91046P06879L78416m13405j26024
7012B572182r8226m82672p08081J434798k97997j146527K88262J37667J23817
7003A823223k91284M97643K13797J44457K37142J66239k7846O71236m87901o79890
6993B266816P4630J031597m22379p62963K18541M30340p66659M33106P83977r19030
6983B367976k14767J145308L95885n83290J78340o34952j88232p83786J024836
6974B707318K48933o85k94958m76158r468K68337L75765M41337o97768j095457
$$ y = [2843093, 2253799, 2148109, 2385549, 2098620, 2208825, 2553700, 2602537, 2808734, 1902406, 1596814, 1830868, 2005905, 2332887, 2708182, 2331256, 2414792, 2172253, 2219105, 2576913, 1985316, 1772878, 1772215, 2086160, 3163183, 2517362, 2026316, 2733195, 3111611, 2698206, 2572182, 2473956, 1991284, 1283203, 2718001, 2420004, 1273477, 1561739, 1699406, 1823223, 1531939, 2029582, 2243379, 2387836, 2624978, 2791217, 2763371, 3434607, 2946706, 2266816, 2341446, 3373043, 2950664, 2187701, 2406242, 2836582, 2069923, 2503029, 3287006, 2367976, 2153209, 3298517, 3694402, 3111112, 3289452, 2654500, 2466268, 1682482, 2707318, 2956251, 2955566, 2660608, 2184450, 2174982, 2443319, 2819084, 3260421, 2562653, 1467196]
6964A467196P60631j36869J87841K2771P56035k129N09916o88470q00023N1986
6954B128885P81273J028373p58183j209721O29155p0300j19288J36192K03021
6945B749407K68562o57978M14239O8520J11105m51447k61264J110819k05212q978
6935C137773J97962k43222l82983L88689k59763r4417J22908m22797n137R42112
6925C381125r4524n41012N19843p35444o64619O84424L23198l30332J025479l23501
6915C244637k75422L19858j68479Q6394L73545q65903q12646K03564l12018N48509
6905B342039r1210o5895J3474l75908N75493L11767K5387L11577n54480J79991
6895B672235l61840J65188P9484R73634K17463O33083k73374k31877m57059p79976
$$ y = [1467196, 2227827, 2090958, 2278799, 2301570, 3057605, 3055476, 3565392, 2876922, 2076899, 2128885, 2910158, 3938531, 3180348, 1970627, 2599782, 2529482, 2410194, 2546386, 2749407, 3017969, 2359991, 2774230, 2842750, 2953855, 2502408, 2241144, 3351963, 3146751, 3137773, 3335735, 3092513, 2709530, 3098219, 2838456, 2744039, 2866947, 2444150, 2439013, 3381125, 3286601, 2745589, 3265432, 2529988, 1865369, 2549793, 2872991, 2542659, 3568138, 3244637, 2969215, 3289073, 3120594, 3206988, 3580533, 2714630, 1901984, 2105548, 1793530, 2342039, 2250829, 2184934, 2198408, 1822500, 2397993, 2709760, 2735147, 3046724, 2492244, 2672235, 2310395, 2475583, 2555067, 3528701, 3746164, 4379247, 4105873, 3873996, 3416937, 2636961]
6885B636961J88787k13166O24101M78581J92363o44033P3623n81995L51788M61510
6875C568520j112973N51576L7573p60951Q66112L65180o93589R9231Q908N56625
6865C486212P80883n99294k11149N6748J63288j14029q61500k30102L18346K49930
6855C039333R57763m4210O4626K40072q16626K96811k33680r32704k22438N28733
6845B877680P38891j91952l48414l83325Q58180Q31361l13448o98416R25r2131
6835C279351J18507l50459O47387j0600K26613k04593k12426J38830k06656o23535
6825B802419J49553K86967n70617m08158L39532J158630N04241n40710k29755
6816C492102K00353M41523l75k09511j57593n50556k55709K1461k22013K99401
$$ y = [2636961, 2825748, 2612582, 3236683, 3715264, 3907627, 3263594, 3337217, 2755222, 3107010, 3568520, 2455547, 3007123, 3044696, 2283745, 3149857, 3515037, 2821448, 2920679, 2929587, 3486212, 4267095, 3667801, 3456652, 3513400, 3676688, 3562659, 2701159, 2471057, 2789403, 3039333, 3997096, 3952886, 4017512, 4257584, 3440958, 3737769, 3504089, 2571385, 2348947, 2877680, 3616571, 3424619, 3076205, 2692880, 3551060, 4382421, 4068973, 3370557, 3371482, 3279351, 3397858, 3047399, 3694786, 3684186, 3910799, 3706206, 3493780, 3632610, 3425954, 2802419, 2951972, 3238939, 2668322, 2260164, 2599696, 3758326, 4262567, 3721857, 3492102, 3692455, 4133978, 4133603, 3924092, 3766499, 3215943, 2960234, 2981695, 2759682, 3059083]
6806C059083j30710L85238l13448N2009J46226M71003J050908m11156j200672
6797C108481K86258Q46359o09282j68525N17861O23321J87991o45295k40081N0264
6787C957352K09606M77072p65637K94987q86145p913N944L55998R20596q4452
6777D477408j333298N86156N54206O344k37093Q51248m60072r93629N94500j91505
6767C854265N10661l3938o99011n75080P19552L21430N9556r7341j40410r0618
6757C829066Q69342k5539m89277k11790n1215J71374M03391k11649j160182J136686
6747D260207J457433m39609l19016l27871L18951J92783o79312j13049O00826
6738D951343O0652n03144q3137J23983O70458m05260r52152L5941N47439r1287
$$ y = [3059083, 2928373, 3313611, 3000163, 3052172, 3198398, 3669401, 4720309, 4309153, 3108481, 3394739, 4241098, 3631816, 3463291, 3981152, 4604473, 4792464, 4147169, 3907088, 3957352, 4166958, 4644030, 3878393, 4173380, 3287235, 3279322, 3285266, 3641264, 4561860, 4477408, 3144110, 3730266, 4284472, 4290816, 4053723, 4904971, 4444899, 3451270, 4045770, 3854265, 4364926, 4330988, 3631977, 3056897, 3776449, 4097879, 4157435, 4060094, 3919684, 3829066, 4698408, 4672869, 4183592, 3971802, 3920587, 4091961, 4495352, 4283703, 3123521, 4260207, 5717640, 5278031, 4959015, 4631144, 4950095, 5142878, 4463566, 4350517, 4951343, 5011995, 4508851, 4425714, 4549697, 5220155, 4814895, 3862743, 3898684, 4446123, 4354836]
6728D354836l25853J1159m02458k86181O17878J01408j15350L31344j73803k53490
6718C859490J29283m33368k24181J326396L27332l80189J6242j99415M99834l96697
6708D524727L0498o05063J39950N03064j64296L17869R39392n48265j174592M53468
6698D416752M66224m14208k15964r6402j31605r0657O78131L55094m86170J32642
6688D613837L79811m42865J50878Q12017k84375m5308m90950p5009m98253M97198
6678D616981O48992m27135k04437j37876Q86234n39569l6713L6846k80932P6053
6668D638444j70172L54193j50966M6215M01001N1029j55925l83693q02148J161012
6658D988990P4343j13453J05563l48996K35911M24041j88109k06253K4403L80709
$$ y = [4354836, 4028983, 4040142, 3637684, 3351503, 3969381, 4070789, 3955439, 4286783, 4112980, 3859490, 3988773, 3555405, 3331224, 4657620, 4984952, 4604763, 4621005, 4421590, 4921424, 4524727, 4555225, 3950162, 4090112, 4593176, 4428880, 4746749, 5686141, 5137876, 3963284, 4416752, 4882976, 4468768, 4252804, 4156402, 4024797, 3934140, 4612271, 4967365, 4481195, 4613837, 4993648, 4550783, 4701661, 5513678, 5229303, 5183995, 4693045, 4618036, 4119783, 4616981, 5265973, 4838838, 4634401, 4496525, 5382759, 4843190, 4806477, 4843323, 4562391, 4638444, 4468272, 4822465, 4671499, 4717714, 5118715, 5169744, 5013819, 4630126, 3827978, 4988990, 5063333, 4949880, 5055443, 4706447, 4942358, 5366399, 5178290, 4972037, 4996440, 5377149]
6648E377149l2667M18301m3423O3603K38083n24931M06747J82416j45791k93610
6638E645877p79450p12815P36260K10881p10454O61588l7744M01628J40990J94040
6628E750801j32521m98941K71999j15417N19409p87827O28514L10561k5123k83578
6618E637877l12640m974M00527O69748L8456J94419n61766J20288J128440q2820
6608G227555j014277m95210L78192k83112Q94346k48182l71234l563r33814P57572
6598E908273O93657R34039m5533q71831o00942k23337k94636P77188O64728l30894
6588F610712m81499M8964k88350j34413M86886k36744R0264P19479l31088Q42754
6578G326965J14413o10453m64591M15183K80481q42027O33573P36519J98441n74697
$$ y = [5377149, 5344482, 5762783, 5719360, 5782963, 6021046, 5496115, 5902862, 6085278, 5939487, 5645877, 4866427, 4153612, 4889872, 5100753, 4390299, 5051887, 5014143, 5415771, 5556761, 5750801, 5618280, 5119339, 5391338, 5275921, 5795330, 5007503, 5636017, 5946578, 5921455, 5637877, 5325237, 5320263, 5720790, 6390538, 6428994, 6623413, 6061647, 6181935, 7310375, 7227555, 6213278, 5718068, 6096260, 5813148, 6707494, 6459312, 6088078, 6084515, 5150701, 5908273, 6601930, 7535969, 7490436, 6618605, 6017663, 5794326, 5499690, 6276878, 6941606, 6610712, 6129213, 6178177, 5889827, 5755414, 6242300, 6005556, 6095820, 6815299, 6484211, 7326965, 7441378, 6830925, 6366334, 6781517, 7061998, 6219971, 6853544, 7590063, 7788504, 7213807]
6568G213807n65675q86210J216413O63645l55601J287927o53246m42370n40775
6559F937915l51096m5200K6692n28374P2796M58103n60362o5514J171443K40926
6549G357329R0981l50916l92915k89215M2158L68483K70823L87314n55840L18675
6539G246877q18381N67105J32487m37690J29089k43048M02802J667166o78086
6530G968321J47603K57738q0181o61808n76683N80384j193471J212078M90073
6521H144054r76494P42133m97680m35081N68924P07305j84621l2953N54728k33961
6511H356354k23028m67038l14448J01492n13477N08656K33708m5555M2165j26646
6501G552183n7384l95651K38103J94766M1511L15156M08683l35112J13363n93105
$$ y = [7213807, 6648132, 5761922, 6978335, 7641980, 7286379, 8574306, 7921060, 7478690, 6937915, 6586819, 6541619, 6568311, 6039937, 6112733, 6570836, 6010474, 5944960, 7116403, 7357329, 7448310, 7097394, 6704479, 6415264, 6457422, 6825905, 7096728, 7484042, 6928202, 7246877, 6428496, 6995601, 7128088, 6690398, 6819487, 6576439, 6979241, 8646407, 7968321, 8115924, 8373662, 8293481, 7631673, 7054990, 7635374, 6441903, 7653981, 8144054, 7167560, 7909693, 7412013, 6976932, 7545856, 8253161, 8068540, 8035587, 8590315, 8356354, 8133326, 7666288, 7351840, 7453332, 6939855, 7448511, 7682219, 7636664, 7678829, 7552183, 7494799, 7099148, 7337251, 7532017, 7573528, 7888684, 8297367, 7962255, 8075618, 7482513]
6491G482513O27274J166859R0826q53152l97377l5991N13369p77680J59593J65732
6481H141966o29709J06411J018631Q18778j26307J35715j43478q6054l26L73610
6471I609237n61253L43149j89644m61334m52236M696K07366K90367J19233M63211
6461I372792K59590j75612j85454m717k08109o1207l08982k09395Q24646j7054
6451I286498k9375m37615K28064K80189k43649m24891q9891L29237R5258K84785
6441I278610j07391m11320l84184L39424o88968n17143Q89009k0840r652J09264
6431H476809K31109J63377M53301m52114P942N19114K9554J10774j14777n15523
6421H909566l85592N85500O32977J27691j69949j81176K91842M4125j81689k59703
$$ y = [7482513, 8109787, 9276646, 9367472, 8514320, 8116943, 8080952, 8594321, 7816641, 7976234, 8141966, 7512257, 7618668, 8637299, 9456077, 9329770, 9465485, 9322007, 9235953, 9235627, 9609237, 9047984, 9391133, 9201489, 8740155, 8287919, 8292615, 8499981, 8790348, 8909581, 9372792, 9632382, 9456770, 9271316, 9266599, 9058490, 8997283, 8688301, 8478906, 9303552, 9286498, 9257123, 8819508, 9047572, 9327761, 9084112, 8659221, 8569330, 8898567, 8993825, 9278610, 9171219, 8759899, 8375715, 8715139, 8026171, 7509028, 8398037, 8377197, 8367545, 8476809, 8707918, 8871295, 9324596, 8872482, 8880424, 9399538, 9429092, 9539866, 9425089, 8909566, 8523974, 9109474, 9742451, 9870142, 9700193, 9519017, 9810859, 9854984, 9673295, 9413592]
6411I413592l35635K41390L99075Q67896k94709J00339q41815l60928J01977O66510
6401I957692K77516j75400L971k8753L48546Q928m2118j63612M50348J51032M3560
6390A0831710m2119m43366m03780n75462l84736Q78883K91817K69481L7900K73473
6380A0733801L64318O8175p76694J52839L31612m58330L58983m38045k66470l55980
6370I714209K14917J41471l057O99014p53360N12520L95191n81708n3691L914
6360A0289420N26230m77231M21659N39063l12156p6925J46463O1196j45681J29996
6350A1102034k55788q1217M2501M27760m30224N4856L60418m5573K84772j54560
6340A1304979Q94302K28891j76347k83416k54505L07747Q4726L00385M66270n64114
$$ y = [9413592, 9077957, 9319347, 9718422, 10586318, 10291609, 10391948, 9550133, 9189205, 9291182, 9957692, 10235208, 10059808, 10063779, 10035026, 10383572, 10392500, 10350382, 10186770, 10637118, 10788150, 10831710, 10789591, 10346225, 9942445, 9366983, 8982247, 9861130, 10152947, 10422428, 10460328, 10733801, 11098119, 11166294, 10389600, 10542439, 10874051, 10415721, 10774704, 10336659, 10070189, 9714209, 9929126, 10070597, 10067540, 10766554, 10013194, 10525714, 10920905, 10339197, 10285506, 10289420, 10815650, 10338419, 10760078, 11299141, 10986985, 10910060, 11056523, 11117719, 10972038, 11102034, 10846246, 10765029, 10807530, 11235290, 10805066, 10859922, 11220340, 11174767, 11459539, 11304979, 12199281, 12428172, 12251825, 11968409, 11713904, 12021651, 12106377, 12406762, 12873032, 12308918]
6330A2308918k57453o52824M01245K60784K41520R2559k08098M60034n74372K47127
6320A2319440K31885J19402N76849J940q78705J12869p91098N49677L50381L88320
6310A2980960m93084M6297K41140q87026J241426J091620l09828j48520r37289
6301A2825696J83285O69143j57305o22770L00222m93330J93268M77428j56988
6292A3218649k12782O84540l7346o31872M52411M01209R79793n96818o53060j93691
6282A3411033R50179q9686j32158l33986p53302J528949j02507n95354L87916
6273A4271084m57348j96284q15469P22010P49110r559M64306Q68608j27397j46399
6263A5322662K09794n37645r08516R55534J23078m45797L69070K61658j18248
$$ y = [12308918, 12051465, 11398641, 11799886, 12060670, 12302190, 12394749, 12186651, 12646685, 12072313, 12319440, 12551325, 12670727, 13247576, 13249516, 12370811, 12483680, 11692582, 12242259, 12592640, 12980960, 12487876, 12534173, 12775313, 11888287, 13129713, 14221333, 13911505, 13762985, 12825696, 13008981, 13678124, 13520819, 12898049, 13198271, 12704941, 12898209, 13375637, 13218649, 13005867, 13690407, 13653061, 13021189, 13473600, 13874809, 14854602, 14257784, 13604724, 13411033, 14361212, 14271526, 14139368, 13805382, 13052080, 14581029, 14478522, 13883168, 14271084, 13813736, 13617452, 12801983, 13523993, 14273103, 14263544, 14727850, 15596458, 15469061, 15322662, 15532456, 14994811, 14086295, 15041829, 15164907, 14719110, 15088180, 15349838, 15231590]
6254A5231590k01764M06198M27049j36443l307K52717N88387N3720k25316j065295
6244A5327536P35048J6094Q79581m81271m72438J72841n10612N44761J02536L57209
6234A6671285n6559l7356n24576P5514M94564N52638j55320l65736j49712M36580
6224A6941322J51464P7077K05367o21828j00760J96332l18379N91288N77005J50843
6214A7849731m1209Q8304l65487K37136M2279J19899l36995k98684M77009N59393
6204A8331376P81871O29985j257719J17809L76084j175900j5393N4482Q71653
6195A8714248N11617O55841j18133r65562o89048M11317M883J91119O54581N17349
6185A9888212n85635l82922M79141K78601P5386m90264P36263j78608J523492
$$ y = [15231590, 15029826, 15436024, 15863073, 15726630, 15723323, 15976040, 16564427, 16618147, 16392831, 15327536, 16062584, 16078678, 16958259, 16476988, 16004550, 16177391, 15666779, 16211540, 16314076, 16671285, 16614726, 16577370, 16052794, 16128308, 16622872, 17175510, 17020190, 16654454, 16504742, 16941322, 17092786, 17169863, 17375230, 16753402, 16652642, 16848974, 16530595, 17121883, 17698888, 17849731, 17808522, 17896826, 17531339, 17768475, 17810754, 17930653, 17593658, 17294974, 17771983, 18331376, 19113247, 19743232, 18485513, 18603322, 18979406, 17803506, 17788113, 17842595, 18714248, 19225865, 19881706, 19763573, 18798011, 18108963, 18520280, 18525163, 18716282, 19370863, 19888212, 19302577, 18919655, 19398796, 19677397, 19752783, 19262519, 19998782, 19820174, 21343666]
6176B1343666P8155q20884Q1501r1437J074098m85237J52480j40947n69891M66904
6166B1088408k28865L44460j90327J07917J44056j79000n1978l69287l8314M16847
6156B1043917N3770M73819J28880r19243J67267P69044m39534k91942k13231L19615
6146B1092362K59334K05287O23041n28637l47010J184806j59527L31309p7215
6137B2583750l25581j61986J73398k93850j74057O81793m77351J92754K45618
6128B2444488O0195k43738M59733j44290J98586P7573j72153J122943m33843L10816
6118B3680310L35977Q2465L63312P4220m41570J71196k7002j041956M35704M74409
6108B4107065R86003o76331l93770Q60650j5096J9824l29480J08711N21662J85839
$$ y = [21343666, 21421821, 20600937, 20682438, 20591001, 21665099, 21179862, 21332342, 21191395, 20621504, 21088408, 20859543, 21204003, 21013676, 21121593, 21265649, 21086649, 21034671, 20665384, 20627070, 21043917, 21097687, 21571506, 21700386, 20781143, 20948410, 21717454, 21277920, 20985978, 20772747, 21092362, 21351696, 21556983, 22180024, 21651387, 21304377, 22489183, 22329656, 22660965, 22583750, 22258169, 22096183, 22269581, 21975731, 21801674, 22483467, 22006116, 22198870, 22444488, 22504683, 22260945, 22720678, 22576388, 22774974, 22852547, 22680394, 23803337, 23369494, 23680310, 24016287, 24098752, 24462064, 24536284, 24094714, 24265910, 24238908, 23196952, 23632656, 24107065, 25093068, 24416737, 24022967, 24883617, 24868521, 24888345, 24558865, 24667576, 25189238, 25375077]
6098B5375077q05040J56053l5519K96259N42817m37794k6089j378277P36741Q37425
6088B5261653L06580k6980j19322K19218M34031O03330l00399k75044n7910R371
6078B6054528P90533j98609j17475l60260Q42776Q08373k79270m91952J78215
6069B7226859l2073l12008k08656P09482O13367O39487R8355p81639l81339L56097
6059B7927932L26507J78871M1335K53688O54160m67123L35929J63098l10090R71343
6049C0075650N80486o90769q586l39545N19172N11659L57278J114977L6586p53738
6039C1403170K48195l45994P3504N09421l68286l49840Q3105K13072Q2126N73258
6029C2121731o19960p79987Q55025M59410J45395L4034N21255M7337m34729P19110
$$ y = [25375077, 24570037, 24726090, 24690571, 24986830, 25529647, 25091853, 25065764, 23687487, 24424228, 25261653, 25568233, 25541253, 25421931, 25641149, 26075180, 26678510, 26378111, 26103067, 26045157, 26054528, 26845061, 26646452, 26528977, 26168717, 27011493, 27819866, 27540596, 27048644, 27226859, 27194786, 26882778, 26674122, 27383604, 27996971, 28636458, 28734813, 27953174, 27571835, 27927932, 28254439, 28433310, 28474645, 28728333, 29382493, 28915370, 29251299, 29414397, 29104307, 30075650, 30656136, 29965367, 29956781, 29617236, 30136408, 30648067, 31005345, 32120322, 32156908, 31403170, 31651365, 31305371, 31378875, 31888296, 31520010, 31170170, 31253275, 31466347, 31548473, 32121731, 31501771, 30721784, 31576809, 32036219, 32181614, 32215648, 32736903, 32784240, 32349511, 33068621]
6019C3068621L71639n80207K55955M21851J30130M8483O87048P537k56221K67594
6009C4422430K94783o37484n07653J37212M01007O03723Q2986P16506K22466l04815
5999C5431161n6023L78058J218518k63434j01562M51830j34602p57330O02471
5990C6769087j36521j55704P06769Q04858P7285k25260Q83840R4013k87456k14467
5980C8316444L61511j51804P40899K75763j69837j86417M30629J94658L56924
5971D0168770J75629J64251L54628J48451o27732k05375O84630J427347N95573
5962D2886172m28718J45339J61939Q38597o1334L24214o3941O47651K73629L17977
5952D5041525J174540J72631l63060O27181K04617r5056K60869l95566P28453
$$ y = [33068621, 33440260, 32860053, 33116008, 33537859, 33667989, 33716472, 34403520, 34411057, 34154836, 34422430, 34717213, 34079729, 33572076, 33709288, 34110295, 34714018, 34797004, 35513510, 35735976, 35431161, 35375138, 35753196, 36971714, 36708280, 36606718, 37058548, 36923946, 36166616, 36769087, 36632566, 36476862, 37183631, 37988489, 38065774, 37840514, 38724354, 38818367, 38530911, 38316444, 38677955, 38526151, 39267050, 39542813, 39372976, 39186559, 39617188, 39811846, 40168770, 40344399, 40508650, 40863278, 41011729, 40383997, 40178622, 40863252, 42290599, 42886172, 42457454, 42602793, 42764732, 43603329, 43541995, 43866209, 43802268, 44449919, 44723548, 45041525, 46216065, 46388696, 46025636, 46652817, 46857434, 46762378, 47023247, 46627681, 47356134]
5943D7356134J594163n59001m75210P15326L61885O56192O10332L24377K69356
5934E0853554N512J056044Q39509K75892J37615M89093L19211k41952M23346k14368
5924E3943456N56545P14447K81543l23412J168877Q68321J294499k70095j85392
5915E8048789O84335K77307J278576O12987Q18110R2090K94288L76943O38731
5906F3122156J106282N3916P82468P92933l21536m06156P29349Q68930K03083
5897F6931425L25894M27949J27328Q23440J16504M53399R42754J07061O77860
5888G0933614M33126Q23442J170269n2652O069M23295O11474J250357m10038N92540
5878G5781496J127529R79958j22415L61509M12344N99221O36579N10269Q49739
$$ y = [47356134, 48950297, 48391296, 47916086, 48631412, 48993297, 49649489, 50259821, 50584198, 50853554, 50859066, 51915110, 52754619, 53030511, 53168126, 53657219, 53976430, 53734478, 54157824, 53943456, 54500001, 55214448, 55495991, 55172579, 56341456, 57209777, 58504276, 58234181, 58048789, 58733124, 59010431, 60289007, 60901994, 61720104, 61812194, 62106482, 62483425, 63122156, 64228438, 64282354, 65064822, 65857755, 65536219, 65130063, 65859412, 66728342, 66931425, 67257319, 67685268, 67812596, 68636036, 68752540, 69205939, 70148693, 70255754, 70933614, 71366740, 72190182, 73360451, 73307799, 73313868, 73737163, 74348637, 75598994, 75188956, 75781496, 76909025, 77888983, 77766568, 78128077, 78540421, 79139642, 79776221, 80286490, 81136229]
5869H1136229J68672J56354J73620Q62703j00545l47460p673Q81196K66284L14695
5859H3504075m99009O03289N04348k62537O5840J057216m09110j064177p2752
5850H3427183P83672L41282m34782N26026o20431K1050j24356J93689p57843l25213
5840H3030277L85960k45709R04758J13639K82353n01514J09906P32185P27935
5831H5539790K70061J29812O24269O61518k33609k89193L79683L14682J210089
5822H8607102R6949O16738L14724N00949O01335M51747K38389O79474R43376O51387
5812I3702170j28617O02099M27324J248217N41774n36416Q83964k13095L01937
5803I6829357J016766L15894n486L51580K96706K82803O66654K28606O00913n35064
$$ y = [81136229, 81304901, 81461255, 81634875, 82497578, 82397033, 82049573, 82041900, 82923096, 83189380, 83504075, 83005066, 83608355, 84112703, 83850166, 83916006, 84973222, 84564112, 83499935, 83427183, 84210855, 84552137, 84117355, 84643381, 84022950, 84044000, 83919644, 84113333, 83355490, 83030277, 83416237, 83170528, 84075286, 84188925, 84471278, 83969764, 84079670, 84811855, 85539790, 85809851, 85939663, 86563932, 87225450, 86991841, 86702648, 87082331, 87397013, 88607102, 88704051, 89320789, 89635513, 90136462, 90737797, 91189544, 91427933, 92107407, 93050783, 93702170, 93573553, 94175652, 94602976, 95851193, 96392967, 95856551, 96740515, 96527420, 96829357, 97846123, 98162017, 98156531, 98508111, 98804817, 99087620, 99754274, 99982880, 100583793, 100048729]
5793A00048729L24197n0757L37850M05846N62989J55056K81175l89397L22395
5784A01998083J801623P76659r86779P83861P32265j019744J01237Q13905k2699
5775A04978411R9405M56775l71416o3465J11906J272519l07108j025156o6645
5766A05085226Q30778N95768n6815o44103L05766J07287L03525k00888O10873
5757A06937417k46024q10482Q06755K17731n82439k4161R79867k65864o69425
5748A06343375O76645m04382K15802N49712p49790M07146P61069m96670O19356
5739A07922263J41868l08539N4671K81839l54257k10771p2767L84925P8897k92255
5729A07625874O74949M28441k46276J00808l19704l95912L24049N65416l44054
$$ y = [100048729, 100372926, 100322169, 100660019, 101065865, 101628854, 101783910, 102065085, 101675688, 101998083, 103799706, 104576365, 103589586, 104373447, 105105712, 104085968, 104187205, 105001110, 104978411, 105077816, 105534591, 105163175, 105099710, 105211616, 106484135, 106177027, 105151871, 105085226, 105916004, 106511772, 106454957, 105810854, 106116620, 106223907, 106527432, 106326544, 106937417, 106691393, 105880911, 106687666, 106905397, 106322958, 106298797, 107278664, 107012800, 106343375, 107020020, 106615638, 106831440, 107381152, 106631362, 107038508, 107799577, 107302907, 107922263, 108064131, 107755592, 107810263, 108092102, 107737845, 107527074, 107454307, 107839232, 107918129, 107625874, 108300823, 108729264, 108482988, 108583796, 108264092, 107868180, 108192229, 108757645, 108413591]
5720A08413591j72472K33038L66922O29556L55638j89153k09366k39968o3401
5711A09124385J247254K04603M09185L85478m36616O80328K0439J7262J37104
5702A11789422k61379m84911j6929R64593L57352m3258m52576M52340J024740
5693A13329394K26806m40750n05302M89527M25688K63807J8400J29500L5229O62312
5683A14634611J15565J3424O56423q2029K80133M24762P98142m97840Q1111M04220
5673A16828522K31818m28705k65151L41420Q20478K45419p24204N17365O80893
5664A18247855n64682p47971K59380N01887L15542J85309n88672L90041K70306
5655A18268995j07165O07276q14882K96929R51453p68835m44674J049918P90600
$$ y = [108413591, 108241119, 108474157, 108841079, 109470635, 109826273, 109637120, 109427754, 109187786, 109124385, 110371639, 110576242, 110985427, 111370905, 110934289, 111614617, 111635056, 111652318, 111789422, 111528043, 111043132, 111026203, 111990796, 112348148, 112304890, 111852314, 112304654, 113329394, 113556200, 113115450, 112610148, 113099675, 113525363, 113789170, 113807570, 113937070, 113972299, 114634611, 114750176, 114763600, 115420023, 115337994, 115618127, 116042889, 116841031, 116343191, 116424302, 116828522, 117060340, 116631635, 116366484, 116707904, 117528382, 117773801, 117049597, 117566962, 118247855, 117683173, 116935202, 117194582, 117696469, 118012011, 118197320, 117608648, 117998689, 118268995, 118161830, 118769106, 117954224, 118251153, 119202606, 118433771, 117989097, 119039015, 119829615]
5646A19829615j271194o02149J088092P09317p11283o97704n96860J052973Q42513
5637A19643320n41289K1317J71035m14250j78047K6643O09192l05455N34666O84865
5627A20251997o1920N31500J17246k81743j351607Q6405L86011n62356J001453
5618A20116986j19975J46061M89010p88769p07597q69082Q01610R26997p3321
5609A19921920k57927n78321L43152k76699k57664Q0608k20563O47578K71889
5600A19673973q1111o69436J50886k11562k59593P99211k30967p29830L59055
5591A18800626P7375O48509l37972q43975l26123M230J67307j43855m22863K59669
5581A17882928R31833p68501M55259n11915N12731M22083o76960r52903m8721
$$ y = [119829615, 118558421, 117956272, 119044364, 119753681, 119042398, 118344694, 117747834, 118800807, 119643320, 119102031, 119123348, 119294383, 118880133, 118702086, 118728729, 119337921, 119032466, 119567132, 120251997, 120190077, 120721577, 120838823, 120557080, 119205473, 119291878, 119677889, 119115533, 120116986, 119997011, 120143072, 120632082, 119843313, 119135716, 118266634, 119068244, 119995241, 119921920, 119663993, 119085672, 119428824, 119152125, 118894461, 118975069, 118754506, 119402084, 119673973, 119592862, 118923426, 119074312, 118862750, 118603157, 119402368, 119171401, 118441571, 118800626, 118878001, 119526510, 119188538, 118344563, 118018440, 118022670, 118189977, 118046122, 117623259, 117882928, 118814761, 118046260, 118501519, 117989604, 118502335, 118924418, 118247458, 117294555, 117245834]
5572A17245834J19105j048194k14030R0966K68120l97373j35326j23707M04453
5563A16209848m45866j92463o2113l22166K06412n22073J50288N799j366793N02594
5553A14163467m90935r25378q20231j91232O59957J54898J88578M41252p85132
5544A12395244l49531J40597l77871n50708j96270k71722k39642r15779o51241
5535A08983077L3618o93283O29468k77112n55149M99918l53484l32762j336787
5526A06597504Q4803n7504m68573O55142j27074R17089j172822j227336M29778
5517A05631007m0333J67149k17939j080225j128200o3380P0278K88557k50425
5508A03376489k02881p47905q67142Q2644j51421p08460p32502J87616q83237
$$ y = [117245834, 117364939, 116316745, 116102715, 116193681, 116461801, 116064428, 115929102, 115805395, 116209848, 115763982, 115571519, 115509406, 115187240, 115393652, 114871579, 115021867, 115027666, 113660873, 114163467, 113672532, 112747154, 111926923, 111735691, 112395648, 112550546, 112739124, 113180376, 112395244, 112045713, 112186310, 111808439, 111257731, 111061461, 110789739, 110550097, 109634318, 108983077, 109016695, 108323412, 108952880, 108675768, 108120619, 108620537, 108267053, 107934291, 106597504, 106682307, 106624803, 106156230, 106811372, 106684298, 107601387, 106428565, 105201229, 105631007, 105590674, 105757823, 105539884, 104459659, 103331459, 103268079, 103338357, 103626914, 103376489, 103173608, 102425703, 101558561, 101641205, 101489784, 100781324, 100048822, 100236438, 99353201]
5499I9353201l41817N84485K81421j443304j254982m71243O75188o76585k68082
5490I6438282O1952n03001k77107l30629m21136m77994j69268j21871p63732j035642
5480I2399854Q9902L25926k50180l68288k11029j087128k30274R66506j98824
5471I1436465n83979k62324n23662p70886l51061q07171o26798J3960j277612
5462H6246932j15407N05105j066894O37616Q69992j341465P5427l42239l49088
5453H5119979l34279j96416j067332p56442m23468R7309o41974l95968K40336
5444H1641745J93153k63675q70196l25584l97802J96010L53006j172535p55871
5435G8598251p9718n20283M720k77767k514J7625k4335j036431q00589n26554
$$ y = [99353201, 99011384, 99595869, 99877290, 98433986, 97179004, 96707761, 97382949, 96706364, 96438282, 96500234, 95997233, 95720126, 95389497, 94968361, 94490367, 94321099, 94199228, 93435496, 92399854, 92489756, 92815682, 92565502, 92197214, 91986185, 90899057, 90668783, 91635289, 91436465, 90852486, 90590162, 90066500, 89295614, 88944553, 88137382, 87510584, 87524544, 86246932, 86131525, 86636630, 85569736, 86207352, 87077344, 85735879, 85811306, 85469067, 85119979, 84785700, 84589284, 83521952, 82765510, 82342042, 82439351, 81797377, 81401409, 81641745, 81834898, 81571223, 80701027, 80375443, 79977641, 80173651, 80526657, 79354122, 78598251, 78518533, 77998250, 78002970, 77725203, 77722689, 77740314, 77715979, 76679548, 75878959, 75352405]
5425G5352405k23600m71078l69618o82117K09945m5972M50005m0313l97660j042147
5415G2739850o32485p80603l54495O08596n28152o23631n52304K75473k52316
5406F9899933m23929K10090q15206q42291N28420n36469p04320j37620k58201
5397F6920407j78603p2930n28100J64685J06977k71429m51910j380175l50867
5388F3958055O02730O8245k6718k89417l30165n62648q5041j011427p7349p2469
5378F2173796j15420q33548r63282K25832L07237m741p28972P2572J94582j421584
5368E8906472O0944K75069m00562m17144j183834R76798l56027j03256k88218
5359E7470242N8249K401J10186J60274J67842q93144o80125j223781o81795Q29854
$$ y = [75352405, 75128805, 74657727, 74288109, 73605992, 73815937, 73769965, 74219970, 74179657, 73781997, 72739850, 72107365, 71326762, 70972267, 71580863, 71052711, 70429080, 69876776, 70152249, 69899933, 69476004, 69686094, 68870888, 68028597, 68557017, 68020548, 67316228, 67178608, 66920407, 66741804, 66668874, 66140774, 66305459, 66412436, 66141007, 65689097, 64308922, 63958055, 64560785, 64629030, 64602312, 64312895, 63982730, 63420082, 63335041, 62323614, 62246265, 62173796, 62058376, 61224828, 60261546, 60487378, 60794615, 60789874, 60060902, 60133474, 60328056, 58906472, 58967416, 59242485, 58841923, 58424779, 57240945, 58217743, 57861716, 57758460, 57470242, 57528491, 57530892, 57641078, 57801352, 57969194, 57076050, 56395925, 55172144, 54490349, 55320203]
5349E5320203k17354l07428j73311L89956n51985j01394R93040j009485j055337
5340E3286905N1851J62227j19113l45290p57940K7323K493p75085n17025m56206
5330E0560140K23625o72797l09469J09331O85518p11484n65114k6131N21402k90846
5320D9524175q6918J18804n80011m7817o92606n76902l9287J36375m69821k57175
5310D7028817o4049N97248m52158j8278L34424l21345O70580p76325o54907N03072
5300D6847079J39132p88149J53190K46976n26694L13645L93783o13614N82527
5291D6747875L54241L11047l43642n10424P40570Q99671j66440q72147O93747
5282D7854498R5556o01685p07943m07006l746k42600j152870o88191k95651p49163
$$ y = [55320203, 55102849, 54795421, 54622110, 55012066, 54460081, 54358687, 55351727, 54342242, 53286905, 53338756, 53500983, 53381870, 53036580, 52278640, 52305963, 52308456, 51533371, 51016346, 50560140, 50783765, 50110968, 49801499, 49910830, 50596348, 49884864, 49319750, 49293619, 49815021, 49524175, 49437257, 49556061, 48976050, 48928233, 48235627, 47658725, 47619438, 47755813, 47285992, 47028817, 46964768, 47562016, 47109858, 47091580, 47426004, 47104659, 47775239, 46998914, 46344007, 46847079, 46986211, 46198062, 46351252, 46598228, 46071534, 46385179, 46778962, 46165348, 46747875, 47102116, 47413163, 47069521, 46559097, 47299667, 48199338, 48032898, 47160751, 47854498, 47950054, 47348369, 46640426, 46233420, 46229674, 45987074, 44834204, 44146013, 43850362, 43101199]
5272D3101199k50942n29630p20971K9722p08606K39114L35348r12779M07045J51348
5262D1140848n33889j447701N3316J200844J64563j24957p01852k57245l42295
5253C9151632n42374j0725R56129k25195n64358M15106o4565m55603m7295K47676
5243C8860428q7727m61206L44517n54285j017881L03786K02036j77866l66128
5234C7045674r57352N92550M37795Q1191r91511K89812K26908p71028R70692m85791
5224C6438940q0922K3210N82250r47405K9560J5309K41675R19881r8452P4622
5214C7198668K75964j421173Q9520k18427j68901O4622m99764Q10079K83364k02300
5204C6211652K46779O8527j60966J61587Q19281n02585O9437l4140o10685M47832
$$ y = [43101199, 42850257, 42320627, 41599656, 41629378, 40920772, 41159886, 41495234, 40582455, 40989500, 41140848, 40606959, 39159258, 39212574, 40413418, 40577981, 40453024, 39751172, 39493927, 39151632, 38609258, 38598533, 39554662, 39329467, 38765109, 39180215, 39115650, 38660047, 38612752, 38860428, 38772701, 38311495, 38656012, 38101727, 37083846, 37387632, 37589668, 37411802, 37045674, 36088322, 36680872, 37118667, 37199858, 36208347, 36498159, 36725067, 35954039, 36924731, 36438940, 36358018, 36381228, 36963478, 36016073, 36045633, 36060942, 36302617, 37222498, 37124046, 37198668, 37474632, 36053459, 36142979, 35924552, 35755651, 35820273, 35320509, 36130588, 36413952, 36211652, 36458431, 36526958, 36365992, 36527579, 37346860, 36844275, 36913712, 36879572, 36268887, 36716719]
5194C6716719m65667N82387q28826o15101K34583O66614j1223O00539p66832m19200
5184C5693993Q58978N52695o47895p22121J35418k0194j92578L5410l62601j33640
5174C5197465l10984L45797L58133N88995j77221n16565k61982n32183J15925
5165C4807380M53365J55061r3133j26828j073895n52707m89993J62996L10169
5156C3552415k10967k50085R27551J22260j308312K43779l28901n10714q4975
5147C2152051r107j36155m18051M6649N2433m10608n28666o47839R7870P53042
5137C0951619P73663r3235r19610m81977n3679j6442j16297M06866J54591m6090
5127C0559409k60033l01322q39262R1685M22779l66167l23372M35599P50253R3221
$$ y = [36716719, 36251052, 36833439, 36004613, 35389512, 35624095, 36290709, 36279486, 36880025, 36113193, 35693993, 36552971, 37105666, 36457771, 35735650, 35871068, 35850874, 35658296, 35693706, 35331105, 35197465, 34886481, 35232278, 35590411, 36179406, 36002185, 35485620, 35223638, 34691455, 34807380, 35260745, 35415806, 35322673, 35195845, 34121950, 33569243, 33079250, 33242246, 33552415, 33341448, 33091363, 34018914, 34141174, 32832862, 33076641, 32747740, 32237026, 32152051, 32142944, 32006789, 31588738, 31635387, 31687820, 31277212, 30748546, 30100707, 30198577, 30951619, 31725282, 31632047, 30712437, 30230460, 30176781, 30160339, 30044042, 30450908, 30605499, 30559409, 30299376, 29998054, 29158792, 29250477, 29673256, 29307089, 28983717, 29419316, 30169569, 30262790]
5117C0262790p1939r27964K11484O00286j08804m92983Q08286K81779m86357L31837
5107C0408415q17208q72653N31105M40195k02852L07315o75498O55959O33715
5098C0408493n04346j36299j62742n61328K77598k24007l0685K18981q42105M26522
5088B8870082J020656M31016j077813n01021k443K40403P78349l01898J142055
5079C0599386m81642L06246P05964j31433m86323k99894l19271Q21633O54660
5070C1369326n18872K97490m33962N43443L16360P0201k22190J32568L13808l58479
5060C1509693n9540P13267Q93795l12572L42324N8588M91718l09646L4060J76474
5050C3538161p5193J35710o757M90020N90735Q16245L3265K53059J39688q0438
$$ y = [30262790, 30190851, 29262887, 29474371, 30074657, 29965853, 29472870, 30281156, 30562935, 30076578, 30408415, 29591207, 28718554, 29249659, 29689854, 29487002, 29794317, 29118819, 29774778, 30408493, 29904147, 29767848, 29605106, 29043778, 29321376, 29097369, 29066684, 29285665, 28443560, 28870082, 29890738, 30321754, 29243941, 28742920, 28740477, 28980880, 29759229, 29457331, 30599386, 30117744, 30423990, 31129954, 30998521, 30512198, 30212304, 29893033, 30714666, 31369326, 30850454, 31147944, 30713982, 31257425, 31573785, 31643986, 31421796, 31554364, 31868172, 31509693, 31450153, 32163420, 33057215, 32744643, 33086967, 33145555, 33637273, 33327627, 33361687, 33538161, 33462968, 33598678, 33591921, 34081941, 34672676, 35488921, 35522186, 35775245, 35914933, 35834495]
5040C5834495l59805J116962O40372K79041n01735L28184J066673K14687n2348
5031C8566526J59099N18913L18320K11220L48326M24909K44148M98111R09423
5022D2198995J04166m67951R78915P91231Q1639J702811J367565L43902N81936
5013D7683209M99807J117569R01953O99003J08984J089160J382280Q10749Q27591
5004E5120305N00531J475561J817078J52918R27235J418647J217715K216427J666788
4995F6513205J080680K199892J452677J218093K141835J643253J725975K535387
4987H0510997L643234K664484L908257M025402M258614N149558O272592O060142
4979A16493280Q023323J0382450J1626760J2663907J1029139J0369453J2201958
$$ y = [35834495, 35474690, 36591652, 37232024, 37511065, 37009330, 37337514, 38404187, 38618874, 38566526, 38725625, 39244538, 39562858, 39774078, 40122404, 40547313, 40791461, 41289572, 42198995, 42303161, 41835210, 42814125, 43605356, 43686995, 45389806, 46757371, 47101273, 47683209, 48183016, 49300585, 50202538, 50901541, 51010525, 52099685, 53481965, 54292714, 55120305, 55620836, 57096397, 58913475, 59066393, 59993628, 61412275, 62629990, 64846417, 66513205, 67593885, 69793777, 71246454, 72464547, 74606382, 76249635, 77975610, 80510997, 84154231, 86818715, 90726972, 94752374, 99010988, 104160546, 110433138, 116493280, 124516603, 134899053, 146525813, 159189720, 170218859, 180588312, 192790270]
4972A92790270O890503j0803101j9288457j6653946j4100828j1126558j0012337
4965A17695546o838358n121280m403296l203975k609925j689698p41018j404111
4957I1683885j688851n79801l46654J92153Q4513l30284o96399M91787L08235
4948H9118584J357320k7458O30685J276289O84486N11242M00170P74915R44396
4939I5670629J797601L95271O61039K122155J225658J199727J205985J184381
4931A05462446Q80011J911716K379942J773079J850414K124856J659312K172425
4923A20214201L232786K627332K079430J999874K395470K770193L478250K294424
4915A41091960K503679L128956L518144K494826K775089K093565K603032L210954
$$ y = [192790270, 199680773, 188877672, 169589215, 152935269, 138834441, 127707883, 117695546, 110857188, 105735908, 101332612, 98128637, 95518712, 93829014, 93087996, 91683885, 89995034, 89415233, 89068579, 89260732, 89345245, 89014961, 88318562, 88810349, 89118584, 90475904, 90448446, 91079131, 92355420, 93039906, 93551148, 93951318, 94726233, 95670629, 97468230, 97863501, 98524540, 100646695, 101872353, 103072080, 104278065, 105462446, 106342457, 108254173, 110634115, 112407194, 114257608, 116382464, 118041776, 120214201, 123446987, 126074319, 128153749, 130153623, 132549093, 135319286, 138797536, 141091960, 143595639, 146724595, 150242739, 152737565, 155512654, 157606219, 160209251, 163420205]
4907A63420205L796350M364380M333814L998116L804459L933801N484966N922575
4899A99058666O027944O549424O360754N968833P407318P825042Q945959Q526777
4891B56670717R073143J0152245R828191J1485626J2167289J2419347J3391766
4884C35188324J3171277J4363266J6210267J5496682J6121270J6958482J6619504
4877D44129072J5319902J3841112J4032585J1811672Q472451O025059J229137
4870E14860990k906792o934209j0736800j4573417j5927567j8411404j8967185
4863D26403616j9362047j9070653j8627052j7314934j6708522j5525147j4738451
4856C05056810j4031436j2444765j1556858j0809473j0108872j0213414r241429
$$ y = [163420205, 167216555, 171580935, 175914749, 179912865, 183717324, 187651125, 193136091, 199058666, 205086610, 211636034, 217996788, 223965621, 231372939, 239197981, 248143940, 256670717, 265743860, 275896105, 285724296, 297209922, 309377211, 321796558, 335188324, 348359601, 362722867, 378933134, 394429816, 410551086, 427509568, 444129072, 459448974, 473290086, 487322671, 499134343, 507606794, 513631853, 514860990, 511954198, 505019989, 494283189, 479709772, 463782205, 445370801, 426403616, 407041569, 387970916, 369343864, 352028930, 335320408, 319795261, 305056810, 291025374, 278580609, 267023751, 256214278, 246105406, 235891992, 226650563]
4849B26650563p693882q087371p437635p754465p676906n660903n317980n212529
4841A71808892n407722m722780m244509m669707l600590l940823l365558l226953
4833A38630250m277800l228826k916649k925023l839872k968381k145287l045091
4825A13283321l281697k526641k345965k357104j995042k611131j840491j039581
4817I5285669k147178j906871k216111j237525j195497j130817r90764k095189
4809H2365717j370449l41555p01301j808598j195031r05177j232014k75365n03935
4800G4032292r49554j391710j698537j020519n79365j419189o09373j063560j593522
4791F3706963L48848q31430q71157r75020j188434n91392r03772m38614j48049
$$ y = [226650563, 218956681, 210869310, 203431675, 195677210, 188000304, 182339401, 177021421, 171808892, 166401170, 161678390, 157433881, 152764174, 149163584, 145222761, 141857203, 138630250, 134352450, 131123624, 128206975, 125281952, 121442080, 118473699, 116328412, 113283321, 110001624, 107474983, 105129018, 102771914, 100776872, 98165741, 96325250, 95285669, 93138491, 91231620, 89015509, 87777984, 86582487, 85451670, 84460906, 82365717, 80995268, 80653713, 79952412, 78143814, 76948783, 76043606, 74811592, 74536227, 74032292, 73082738, 71691028, 69992491, 68971972, 68392607, 66973418, 66364045, 65300485, 63706963, 64055811, 63224381, 62353224, 61378204, 60189770, 59598378, 58694606, 58255992, 58107943]
4782E8107943j459507j101251P8622o39692l33037j378745k94648j44187j076583
4773E1758915q78160p75118m21399m32012J23960K29228q84138p05405q73101
4764D7142770q40681J17241m04761p2666l38571k38751j203399p22496l66556
4755D3072130J51405l74777J66065j42096L55364j178822j52551l03402k65631
4746D1327685l87437n69394q42863N94588k53129p47968k50988k31909l22498
4737C8316087l85894o75902m29046l22321k7358K44778k46780k52376n96038J17020
4727C5742170m20127l32199l36592k83595M2727m36263q03717o43711n50260R5293
4717C2073726L66535O09069p39664j29146o74823p67316O29994P88772p15728
$$ y = [58107943, 56648436, 55547185, 55625807, 54986115, 54653078, 53274333, 52979685, 52835498, 51758915, 50880755, 50105637, 49684238, 49252226, 49376186, 49605414, 48721276, 48015871, 47142770, 46302089, 46419330, 46014569, 45941903, 45603332, 45364581, 44161182, 43438686, 43072130, 43223535, 42848758, 43014823, 42872727, 43228091, 42049269, 41896718, 41593316, 41327685, 40940248, 40370854, 39527991, 40122579, 39869450, 39121482, 38870494, 38638585, 38316087, 37930193, 37254291, 36825245, 36502924, 36475566, 36720344, 36473564, 36221188, 35625150, 35742170, 35322043, 34989844, 34653252, 34369657, 34412384, 33976121, 33172404, 32528693, 31978433, 32073726, 32440261, 33049330, 32309666, 32180520, 31505697, 30738381, 31368375, 32157147, 31441419]
4708C1441419j096652p97430L53307l90967L83070N56899q01427j71710N9716
4699B9536225o45476n78880J363888M04190j104418K46847N24593j188191l56942
4690B8201836l43638P4051L4745n92242O61234j015279q9141k57717q10106J75450
4680B6039193j20901k58584J84016J80839o77731k78050K46311p14011j019203
4671B3581879K98415l50656q73915k14143j5616K84286J14277r20355P3907K6085
4661B2004164k73501L48463m19356l41528k79106O11530r5257r2798j75080l77386
4651B0910145n90685q10997M1430P25250j42059O28020j52035K7113l35808m02545
4641A9897829N5359k73590K03793O99639j022452J87575r9824q2388k37555O32863
$$ y = [31441419, 30344767, 29547337, 29900644, 29509677, 29892747, 30449646, 29648219, 29476509, 29536225, 28890749, 28311869, 29675757, 30079947, 28975529, 29222376, 29746969, 28558778, 28201836, 27858198, 27932249, 27966994, 27374752, 28035986, 27020707, 26931566, 26673849, 25863743, 26039193, 25918292, 25659708, 25843724, 26024563, 25346832, 25068782, 25315093, 24601082, 23581879, 23880294, 23529638, 22655723, 22441580, 22425964, 22710250, 22824527, 21904172, 21978079, 22004164, 21730663, 22079126, 21659770, 21318242, 21039136, 21650666, 21555409, 21462611, 21287531, 20910145, 20319460, 19508463, 19549893, 20275143, 20133084, 20761104, 20609069, 20636182, 20300374, 19897829, 19953188, 19679598, 19883391, 20583030, 19560578, 19748153, 19648329, 19565941, 19328386, 19961249]
4631A9961249n91209r67672k5462r72642k75228p03299k64220k15230J34707J07165
4621A6188159k62926m59362R77646k42577r9699m43356j58045o51245k99078j2449
4611A4537068k78368n84436K01505L89677n88004l69802L48446q32918k79645
4602A2543523M47586q7826K07596J0909J0625n16235J03558L50973M20257L219
4592A3494185n36671j37272M01397j71646m55440m16053k90747O96567J16980
4583A2701300p3158M8760p74807j8323P45186j02645O7346N27503l08315q96740
4573A1916107M45346q02870q1560K65013L10927M53723p75404k66609L24775L7080
4563A1826528N66264j15232j912523Q14196J929141p19703K42904p53432j339546
$$ y = [19961249, 19370040, 18402368, 18376906, 17404264, 17129036, 16425737, 16161517, 15946287, 16080994, 16188159, 15925233, 15465871, 16443517, 16200940, 16101241, 15657885, 15499840, 14848595, 14549517, 14537068, 14258700, 13674264, 13875769, 14265446, 13677442, 13307640, 13656086, 12823168, 12543523, 12991109, 12903283, 13110879, 13121788, 13132413, 12616178, 12719736, 13070709, 13490966, 13494185, 12957514, 12820242, 13221639, 13049993, 12594553, 12178500, 11887753, 12584320, 12701300, 12628142, 12676902, 11902095, 11883772, 12628958, 12526313, 12593659, 13121162, 12812847, 11916107, 12361453, 11558583, 11477023, 11742036, 12052963, 12506686, 11731282, 11464673, 11789448, 11826528, 12392792, 12277560, 10365037, 11179233, 13108374, 12388671, 12631575, 11878143, 10538597]
4554A0538597L03840O05375j1119J398605L12345m24138k75116R2730K2999k05200
4544A2358918m40139j13397N3626n11069L68666j48009l20127J5783M5543n85518
4534A0724277k44309J77834O79303o5356k81949l88387J00786o7140P99165q240
4524A1425984j31885j130057q691L92598L90512j24124Q88187n90779l98113K64850
4514A0978482n69575J90128k30997J51576K05061M73994n13832m1602n84151O96577
4504A0755661m45888p40301Q73921L34057L27267j29097o99775m33812M29494
4495A0271527J48901N19866R67j83751O1085R3141L64169j20197J09792k54436
4485A1011064m71041M31316M37527m89813j7156P45800J47422Q0632L53277K99253
$$ y = [10538597, 10842437, 11447812, 11436693, 12835298, 13147643, 12723505, 12448389, 12541119, 12564118, 12358918, 11918779, 11805382, 11859008, 11347939, 11716605, 11568596, 11248469, 11264252, 11309795, 10724277, 10479968, 10657802, 11337105, 11271749, 10989800, 10601413, 10702199, 10635059, 11434224, 11425984, 11294099, 10164042, 10155351, 10547949, 10938461, 10814337, 11702524, 11111745, 10713632, 10978482, 10408907, 10599035, 10368038, 10519614, 10724675, 11198669, 10684837, 10643235, 10059084, 10755661, 10309773, 9569472, 10443393, 10777450, 11104717, 10975620, 10275845, 9842033, 10271527, 10420428, 10940294, 10941261, 10757510, 10818595, 10911736, 11275905, 11155708, 11265500, 11011064, 10540023, 10971339, 11408866, 10919053, 10901897, 11647697, 11795119, 11875751, 12229028, 12528281]
4475A2528281J61157p5146O91443n01498K47250K53275j4353L71976m63406K38020
4465A3436999P37530J63837M87507m38993L44452k0777k36734M60447R69479J514893
4455A7418640q06618r49357J674578O33162p34399O1781J88255O13269J189971
4446A9289282l52790q88066J371527Q9478N82032Q05834n64771J0546Q27147P20410
4436B1890629M25174J073557J238740l782M44445Q71698K15026M60640K61544
4427B6877671O65568R08768J95687R69152J186108Q44451Q38016J290283J249416
4418C5025120J741514N53254J104144J295523J799579J135975J376860K399604
4410D6431573J095624K447089K168546K251058K679718K556741K697649L123288
$$ y = [12528281, 12689438, 12614292, 13305735, 12804237, 13051487, 13304762, 13290409, 13662385, 13198979, 13436999, 14174529, 14338366, 14825873, 14386880, 14731332, 14710555, 14473821, 14934268, 15903747, 17418640, 16612022, 15662665, 17337243, 17970405, 17236006, 17297787, 17486042, 18099311, 19289282, 18936492, 18048426, 19419953, 19509431, 20091463, 20897297, 20332526, 20343072, 21170219, 21890629, 22315803, 23389360, 24628100, 24624318, 25068763, 25940461, 26155487, 26616127, 26877671, 27543239, 28452007, 28647694, 29616846, 30802954, 31647405, 32485421, 33775704, 35025120, 36766634, 37319888, 38424032, 39719555, 41519134, 42655109, 44031969, 46431573, 47527197, 49974286, 52142832, 54393890, 57073608, 59630349, 62327998, 65451286]
4402F5451286L758322M268740N180789N179891N091996O509969O297019O825384
4394A08563396P181284P124705O285740N077129N885528O381644O262521O841205
4386A59603152P296213O819876N168140K251347K199095K528516K500811K531714
4378A90898864L795565J839728L37666j909871n001768o787018o131767m992105
4370A72049294n276006m019179m228532o179536q519567q532078p763813p708037
4362A19822546p974811o102902n496595n053247o510474o336829o189118o782979
4354F9375591m573264m720532n172467l510001l045852k322030l142354j832051
4346D1057040k328455j554457j320436k293875q12554j600826l29473q98720k055294
$$ y = [65451286, 69209608, 73478348, 78659137, 83839028, 88931024, 95440993, 101738012, 108563396, 115744680, 122869385, 129155125, 134232254, 140117782, 146499426, 152761947, 159603152, 166899365, 173719241, 178887381, 181138728, 183337823, 185866339, 188367150, 190898864, 194694429, 196534157, 196871823, 194961952, 189960184, 183173166, 177041399, 172049294, 166773288, 162754109, 158525577, 152346041, 143826474, 135294396, 127530583, 119822546, 111847735, 105744833, 100248238, 95194991, 88684517, 82347688, 76158570, 69375591, 64802327, 60081795, 54909328, 51399327, 48353475, 46031445, 42889091, 41057040, 38728585, 37174128, 35853692, 33559817, 32747263, 31146437, 30816964, 29918244, 27862950]
4337B7862950n84639j041969o66532j086306j113546o47504j11990o10781j029637
4328B0970046l94609p28991m22173p19247k62587l75567q57250l12900p25197
4319A6171525K82669L04658q13339k75571N09640o24125j566765L29695M11110
4310A4729497r04482q63232l193q2948K878O8679l53196p63760L25349j98299
4300A1957293l19152k24927p72552j4198l5162n92570M26696m17128j06801N81896
4290A0483395j92738o62679J43692j22921n93173l34106J37870L44100N88589
4281I792029m97383q19282K05668O2231j06916J36833L46001o95117o25330O32609
4271H431343p84839l92854J86866L73l05033n45062Q37082N9010m17779L89529
$$ y = [27862950, 27278311, 26236342, 25569810, 24483504, 23369958, 22722454, 22610464, 21999683, 20970046, 20575437, 19846446, 19424273, 18705026, 18442439, 18066872, 17209622, 16896722, 16171525, 16454194, 16758852, 15945513, 15669942, 16179582, 15555457, 13988692, 14318387, 14729497, 13825015, 12961783, 12958590, 12875642, 12878520, 12947199, 12594003, 11830243, 12155592, 11957293, 11638141, 11413214, 10640662, 10626464, 10591302, 9998732, 10425428, 10008300, 9901499, 10483395, 10290657, 9627978, 9771670, 9648749, 9055576, 8721470, 8859340, 9203440, 9792029, 9294646, 8475364, 8681032, 8743263, 8636347, 8773180, 9119181, 8424064, 7798734, 8431343, 7646504, 7253650, 7440516, 7440889, 7135856, 6590794, 7427876, 7486886, 7069107, 7458636]
4261G458636m54625r28372K99802M7891o33609j88968L67478N64463K16650j10368
4251F638978o1286K13945L03542p28561l66642l38903K4690N45369P33445k5642
4241F938935n49863k12196M1266m43682L09874M31699k2719j13831q03537M78323
4231F054269j42294K35962N11968r79003l08243J0245M93060k44935n49370K20912
4221E302571P8871k42838m37037l91549l19227Q24847Q05656M56904n47132O3749
4211E594815J072113o57791j320674L2250R83546k37342o34142Q1472l849O25463
4201E535861Q0578q61550L59597m31533J76354J74690P66134p6676k30397l68646
4191E124412n5938N15091l45574l21431j54058R2545k79567L53137J54805K84772
$$ y = [7458636, 7004011, 6075639, 6375441, 6423332, 5789723, 5600755, 5968233, 6532696, 6749346, 6638978, 6577692, 6791637, 7095179, 6366618, 5999976, 5661073, 5685763, 6231132, 6964577, 6938935, 6389072, 6176876, 6218142, 5774460, 6084334, 6516033, 6493314, 6379483, 5575946, 6054269, 5911975, 6147937, 6659905, 5680902, 5372659, 5382904, 5875964, 5631029, 5081659, 5302571, 5381442, 5138604, 4701567, 4310018, 3990791, 4815638, 5621294, 6078198, 5531066, 5594815, 6666928, 6009137, 4688463, 4720713, 5704259, 5466917, 4832775, 4914247, 4910398, 5535861, 5616439, 4754889, 5114486, 4682953, 4859307, 5033997, 5800131, 5723455, 5493058, 5124412, 5068474, 5583565, 5237991, 4916560, 4762502, 4855047, 4575480, 4928617, 5083422, 5368194]
4181E368194J27415j43427q45952M3679J86730J49274Q44093j53129J52767q331
4171E721313n29666J04287L3147o60984L41050M94350j21237o9579N99465L4339
4161E946485K1385K41348Q331j36895j15767O41982j63150m6600l20688L98439
4151F474870k99381N22078J38740l1830j04m22092m8249O43466o47930P11050
4141G040618J192382o89900P25277O22216j073530n36188k26483l00049J040217
4132G794560o59502L95692j43986j68401l8038j52267L8150m16682M64424J201315
4122H315265M50920K85261k01873K94485L27685J89272o69861m62806M36805K0816
4112H985969O70339M71646J69408m3771l06829O58668R54186l65221R4228K48312
$$ y = [5368194, 5495609, 5352182, 4506230, 4549909, 4736639, 4885913, 5730006, 5576877, 5729644, 5721313, 5191647, 5295934, 5329081, 4668097, 5009147, 5503497, 5382260, 5312681, 5912146, 5946485, 5967870, 6209218, 6217549, 6080654, 5964887, 6606869, 6443719, 6397119, 6076431, 6474870, 6175489, 6697567, 6836307, 6804477, 6804373, 6382281, 6334032, 6977498, 6329568, 7040618, 8233000, 7543100, 8268377, 8890593, 7817063, 7280875, 7054392, 6754343, 7794560, 7135058, 7530750, 7386764, 7218363, 7180325, 7028058, 7066208, 6649526, 7113950, 8315265, 8766185, 9051446, 8849573, 9144058, 9471743, 9661015, 8991154, 8528348, 8965153, 8985969, 9656308, 10127954, 10297362, 10253591, 9946762, 10605430, 11559616, 11194395, 11288623, 11536935]
4102A1536935L88651J7671l12828M10781P06300k37724P65559K93344J50643J58456
4092A3877788M17006J59566l68014O09577O05083O90407R32301k74480J34501
4083A6783735Q28449L13644R49690Q83822Q46521j30285M71301O56726J001935
4074B2605538O25273k47837Q21450O29871Q40380O48099P54844R43889L43371
4065B7964878N30521K80412P65545J351688N50038J040212M50092L61367o755
4056C3287998J085794J20218Q47643J383258o04234Q18369K05945J42760P42395
4047C8030146M04679J42790J034619Q34063Q84057o8873M98322L29440P34994
4038D2824237M05033M64115L77771j68553K07340j35034R9295J87034Q35030L37884
$$ y = [11536935, 11925586, 11943257, 11630429, 12041210, 12747510, 12509786, 13275345, 13568689, 13719332, 13877788, 14294794, 14454360, 14086346, 14695923, 15301006, 15991413, 16923714, 16649234, 16783735, 17612184, 17925828, 18875518, 19759340, 20605861, 20475576, 20946877, 21603603, 22605538, 23230811, 22982974, 23804424, 24434295, 25274675, 25922774, 26677618, 27621507, 27964878, 28495399, 28775811, 29541356, 30893044, 31443082, 32483294, 32933386, 33294753, 33287998, 34373792, 34494010, 35341653, 36724911, 36120677, 36939046, 37144991, 37287751, 38030146, 38434825, 38577615, 39612234, 40446297, 41330354, 41261481, 41759803, 42089243, 42824237, 43229270, 43693385, 44071156, 43902603, 44109943, 43974909, 44074204, 44261238, 45096268, 45434152]
4028D5434152N28131j91826J01065j45423L02640J34590Q94967Q91846M41872
4019D8392014J19059j67935O94037J511624M70639O62396Q58185R46147J761572
4010E5247738K477982J969443K157986L553870L009752M017630M505256N464976
4002H2404633O309962P467449J0138590J2110583J2902724J1097017J1368102
3995A53799060J2360719J2276075m895740k1525799k1753361j8936986j4850285
3988I6473683j3403920j0290373q511185o104799n594953l208324m058970l107967
3980D2193192k678006k315400k340244j472918j705357j731445j140001j147090
3972B7662731j023220j141637p24818j085164q78151q58041n92822j44543J85643
$$ y = [45434152, 45962283, 45770457, 45871522, 45726099, 46028739, 46163329, 47058296, 47950142, 48392014, 48511073, 48343138, 49037175, 50548799, 51019438, 51681834, 52540019, 53486166, 55247738, 57725720, 59695163, 61853149, 65407019, 68416771, 72434401, 76939657, 82404633, 88714595, 96182044, 106320634, 118431217, 131333941, 142430958, 153799060, 166159779, 178435854, 173540114, 152014315, 130260954, 111323968, 96473683, 83069763, 72779390, 64268205, 58163406, 52568453, 49360129, 45301159, 42193192, 39515186, 37199786, 34859542, 33386624, 31681267, 29949822, 28809821, 27662731, 26639511, 25497874, 24773056, 23687892, 22809741, 21951700, 21358878, 21214335, 21399978]
3963B1399978o85722j020925j015406j052081n63835j13848j52134j081926p10418
3954A5003683k50285j19885o16642k95770R9266l22746p64673l4039p01541m51397
3944A1545971k99636K81517K9708n43667M32393o95871M58939j1114k84668m93555
3934A0420017J26231m35396j78425O22923j033589K07040M84883q68197m93035
3925H852452l77496q8307L47185J60672j1154Q8428k69036J48434n62652q1269
3915H207257m63152K51626j77018n61941M4084M81024k10845m78824l38511m45566
3905F308134o36992P42786L25050p4481L50252n52809n69476P67269p4722L61263
3895F946274J81413r97198L93306J87910j91237r43677j093165J176800J61369
$$ y = [21399978, 20714256, 19693331, 18677925, 17625844, 17062009, 16948161, 16796027, 15714101, 15003683, 14753398, 14633513, 14016871, 13721101, 13820367, 13497621, 12732948, 12698909, 11997368, 11545971, 11246335, 11527852, 11557560, 11013893, 11446286, 10750415, 11209354, 11198240, 10913572, 10420017, 10546248, 10110852, 9932427, 10555350, 9521761, 9728801, 10213684, 9345487, 8852452, 8474956, 8386649, 8733834, 8894506, 8883352, 8971780, 8702744, 8851178, 8288526, 8207257, 7744105, 7995731, 7818713, 7256772, 7300856, 7781880, 7571035, 7092211, 6753700, 6308134, 5671142, 6413928, 6738978, 6664497, 7014749, 6461940, 5892464, 6659733, 6585011, 6946274, 7127687, 6130489, 6523795, 6711705, 6520468, 5576791, 4483626, 5660426, 5821795]
3886E821795J220928k32382q57229j43526q92553L32335P22397m84303l71653
3877E115809M63117J59535o7102J62551m45823o23979P5713N4330P54424J83441
3867E832016m81800o81244P59636j71285J98769N6082j35101o3909L56881j29518
3857E540527l85674m5313k5097K23816m9049j50608m90879P4095N7465M67016
3847E216299m85767n5343M63403j79613N4762n65582j68569M60385K62236l76958
3837D625253L19396j42262J81591J02953m82928M14810M02509K41190Q6514o12858
3827E136168m01735n0625N49700k68893N78228m57662o7233p9250J0298J083787
3817F032783k6936n45820p99173P21785L26820k17743k34457N367p0747l08590
$$ y = [5821795, 7042723, 6810341, 5953112, 5809586, 4917033, 5249368, 5971765, 5487462, 5115809, 5578926, 5738461, 5671359, 5833910, 5388087, 4764108, 4839821, 4894151, 5648575, 5832016, 5350216, 4668972, 5428608, 5257323, 5456092, 5512174, 5377073, 5313164, 5670045, 5540527, 5154853, 5109540, 5084443, 5308259, 5259210, 5108602, 4617723, 4691818, 4749283, 5216299, 4730532, 4675189, 5138592, 4958979, 5013741, 4448159, 4279590, 4739975, 5002211, 4625253, 4944649, 4802387, 4983978, 5086931, 4604003, 5018813, 5421322, 5662512, 5749026, 5136168, 4734433, 4683808, 5233508, 4964615, 5542843, 5085181, 5017948, 4938698, 4948996, 6032783, 6005847, 5460027, 4660854, 5382639, 5709459, 5491716, 5257259, 5262626, 5191879, 4883289]
3807D883289M35304O176J65192o42716M35997Q80021L83686j50785q31143j61864
3797E403157J74217k96139J19172N59630K48336M99553m2737p82419J21297J4787
3787F018854L77794j56702J93147O41334r18983L35851R30680q14270k44486k02559
3777F160660M64127l78693r434J201298o7383K23166q07643Q35829j10493j83484
3767G327950m67114l45662P15510P29653M11455j624946j58583M05427J57421
3758G151111O72549p742J19995K91996K7414k99265N65957o57471L1764L52492
3748H248800J66585j09871P45030L08942L74627J8719Q3332N86454q04138N09184
3738A0127664l25423L52098O27603l08201n6701O24920O19814m7099l82584m04893
$$ y = [4883289, 5318593, 5324769, 5489961, 4847245, 5283242, 6163263, 6546949, 6396164, 5565021, 5403157, 5577374, 5281235, 5400407, 5960037, 6208373, 6707926, 6665189, 5882770, 6004067, 6018854, 6396648, 6239946, 6433093, 7074427, 6155444, 6491295, 7421975, 6607705, 6363219, 6160660, 6624787, 6246094, 6236660, 7437958, 7370575, 7593741, 6786098, 7621927, 7511434, 7327950, 6860836, 6515174, 7230684, 7960337, 8371792, 6746846, 6588263, 6993690, 7151111, 7823660, 7815918, 7935913, 8227909, 8255323, 7956058, 8522015, 7864544, 7896308, 8248800, 8415385, 8305514, 9050544, 9359486, 9734113, 9752832, 9836164, 10422618, 9618480, 10127664, 9802241, 10154339, 10781942, 10473741, 10417040, 11041960, 11661774, 11614675, 11232091, 10827198]
3728A0827198N82015l88696O37074j95196L86504P58771k74387o0285J16922J160454
3718A3550374N764m50221N11368Q79505L6071j48221n32144p5297j6866Q36219
3708A4596552M85083N04406M67881l42147n21401J017740O90037L25417m70933
3699A6752635K38987J322447J38227l43315o72179J192690J458571J61293j49506
3690B0099850Q27849M05010j28187k15395R4075K49514l3659M60190l75672O89943
3680B2073518J88851o12263Q91850J61199M65117k81148l86850k83433R7469N55364
3670B2869674K69824J61280J07088Q86954m48428j10106Q43316Q7860p50230J826
3660B3919058R4760J260319L15507N81361J571488r2801K44225L31009k20084
$$ y = [10827198, 11409213, 11020517, 11657591, 11462395, 11848899, 12607670, 12333283, 12272998, 12389920, 13550374, 13556138, 13105917, 13617285, 14496790, 14532861, 14384640, 13852496, 13777199, 13760333, 14596552, 15081635, 15586041, 16053922, 15711775, 15190374, 16208114, 16898151, 17223568, 16752635, 16991622, 18314069, 18452296, 18108981, 17436802, 18629492, 20088063, 20249356, 20099850, 20927699, 21332709, 21204522, 20989127, 21083202, 21332716, 21299057, 21759247, 21383575, 22073518, 22262369, 21650106, 22541956, 22703155, 23168272, 22887124, 22500274, 22216841, 22314310, 22869674, 23139498, 23300778, 23407866, 24294820, 23846392, 23736286, 24579602, 24667462, 23917232, 23919058, 24013818, 25274137, 25589644, 26171005, 27742493, 27649692, 27893917, 28224926, 28004842]
3651B8004842N60086N03430P31089Q10291J61619J326691k32122J006997J116463
3642C3989386R98787K19510n23254R51170J104887J112753J89226p13641O80837
3633C8009661N12450R47616J13150K83160J568688n67397n80729j79L78482K36534
3623D0901436O04616K52021k07936J5755l5734J44854O30195q62197J9926N23156
3613D1986092l23015P80697l16434K68061j32474J35204L91788N25044k05233
3604D3109730k23737j50547Q6959L1142R5224o86963k76434j06441N21210M99333
3594D2899476m38203m81647p11962K68401k65724k48547m04656l40138K803l82573
3584C9897230j568586j29022o05313k59812j008814j167099J26575m93324J31125
$$ y = [28004842, 28564928, 29068358, 29799447, 30609738, 30771357, 32098048, 31865926, 32872923, 33989386, 34988173, 35207683, 34684429, 35635599, 36740486, 37853239, 38042465, 37328824, 38009661, 38522111, 39469727, 39582877, 39866037, 41434725, 40867328, 40286599, 40286420, 40664902, 40901436, 41506052, 41758073, 41550137, 41565892, 41530158, 41675012, 42305207, 41443010, 41462936, 41986092, 41663077, 42443774, 42127340, 42395401, 42262927, 42398131, 42789919, 43314963, 43109730, 42885993, 42735446, 42822405, 42853547, 42948771, 42261808, 41985374, 41878933, 42400143, 42899476, 42461273, 41979626, 41267664, 41536065, 41270341, 41021794, 40617138, 40277000, 40279803, 39897230, 38328644, 38199622, 37594309, 37334497, 36325683, 35158584, 35285159, 34791835, 34922960]
3575C4922960p17324l82702J19544o47172o73309p83426O27466p22370n14109
3566C1229558q5649Q880j12819l6413M04906n19833j38032Q55227l45830o02675
3556C0657320p89584Q06540L38139j12222M18744n69884L1108j41547M2291N49551
3546C1230456J064558o67369j58947J39519L17672r97734m14393O09570j28560
3537C0994772J395362J07833k40787K47802m69319p05979Q25563K15800N56185
3528C2927232J47524n68322l6207K45868P99798j5684R81048P296O65228J2037
3518C5165818K80092P59438J159538M60384j380470J10291R09045M01701j29695
3509C7736142M66201r0245J500502J37014n67606N22151p2493j14613O06706L41357
$$ y = [34922960, 34205636, 33822934, 33942478, 33295306, 32621997, 31838571, 32466037, 31743667, 31229558, 31143909, 31152789, 31039970, 31003557, 31408463, 30888630, 30750598, 31605825, 31259995, 30657320, 29867736, 30674276, 31012415, 30900193, 31318937, 30749053, 30780161, 30638614, 30680905, 31230456, 32295014, 31627645, 31468698, 31608217, 31925889, 30928155, 30513762, 31123332, 30994772, 32390134, 32497967, 32257180, 32504982, 32035663, 31329684, 32155247, 32371047, 32927232, 33074756, 32506434, 32470227, 32716095, 33515893, 33500209, 34481257, 34488553, 35153781, 35165818, 35445910, 36205348, 37364886, 37825270, 36444800, 36555091, 37464136, 37865837, 37736142, 38202343, 38112098, 39612600, 39749614, 39182008, 39704159, 39631666, 39517053, 40123759, 40465116]
3499D0465116q7850n97498O12470J3746k20386L9373Q32879P00146o85256m42512
3489D0630228M04011M65904M20947L35348m471m89051L67203K04905N57665N77821
3479D3470510k44798J286264M70729j70481P87890P76817P80878J227572O35087
3470D9020468R24402O76027N98685L81634J542107O50082J501914J225487P51377
3461E7272183N42982J397696J641217O26996J975612J204603J99126N55275N83014
3452F5998704J322645J283788O07005J035089J241044J11988P50588P07022R47120
3443G4004993M06346k91905J94848J923998J553970J161656L98048J255828J162084
3434H1769866K06046P59160n61785Q22966P38967n72560k22285k03408o22034
$$ y = [40465116, 40377266, 39779768, 40392238, 40405984, 40185598, 40224971, 41057850, 41757996, 41072740, 40630228, 41034239, 41500143, 41921090, 42256438, 42251967, 41762916, 42130119, 42335024, 42892689, 43470510, 43225712, 44511976, 44982705, 44812224, 45600114, 46376931, 47157809, 48385381, 49020468, 49944870, 50620897, 51219582, 51601216, 53143323, 53793405, 55295319, 56520806, 57272183, 57815165, 59212861, 60854078, 61481074, 63456686, 64661289, 64860415, 65415690, 65998704, 67321349, 68605137, 69212142, 70247231, 71488275, 71600263, 72350851, 73057873, 74004993, 74411339, 74119434, 74314282, 76238280, 77792250, 78953906, 79351954, 80607782, 81769866, 81975912, 82735072, 82173287, 82996253, 83735220, 83162660, 82940375, 82736967, 82114933]
3425H2114933j136562j186635j137497p23308j097936r63113j633630r15668j046088
3416G2274496j596735j078748q29997n93305r11253p90460o30323m07055o18425
3407F4818195p30415r61896l00657j52291j192864k77312r5929q14359o93137
3398E9599335n3148j03634j24702j96418n30614r51242j153233o76517p28068
3389E5081759J87324j05071q24026j375898j013078n72954p38031j262339p41648
3380D8636038l6010m82812p72060m80860o05644P5202j492516p70232n01329j431592
3370D2138185m44855j69757o94318j97134o75530m82131k84653K02982n40040
3361C8852749j2533m921k37576K4592j95981M30219K32724N70489j86380j101589
$$ y = [82114933, 80978371, 79791736, 78654239, 77930931, 76832995, 75869882, 74236252, 73320584, 72274496, 70677761, 69599013, 68769016, 68175711, 67264458, 66473998, 65843675, 65436620, 64818195, 64087780, 63125884, 62825227, 62672936, 61480072, 61202760, 61106831, 60292472, 59599335, 59546187, 59442553, 59317851, 59121433, 58590819, 57639577, 56486344, 55809827, 55081759, 55269083, 55164012, 54339986, 52964088, 51951010, 51378056, 50640025, 49377686, 48636038, 48600028, 48117216, 47345156, 46864296, 46258652, 46333854, 44841338, 44071106, 43569777, 42138185, 41693330, 41523573, 40829255, 40632121, 39956591, 39474460, 39189807, 39392789, 38852749, 38840216, 38835295, 38597719, 38622311, 38426330, 38856549, 39089273, 39659762, 39473382, 38371793]
3351C8371793m83669m92866P19590J485198o1262K9440o99427k08376K29007k54173
3341C8635255j60846q1301L60743M55804Q52621K77789j426476p03007Q38212
3332C9048794p044m38980m93040J24445j01473N54737M69294l46580N90981Q16188
3322D0217322k46918l14663j38839Q11614m23301k15151n19784O51714M23385
3313D0245379J08450J209064J7486N79243N26714L11205R70780Q87909N02599
3304D5358829P2402m26114O89941M05393J100834J040316O90848N54355J164342
3295E0651146Q47179R9331M34201J299895J125502P53332R82527J679890P29158
3286E8602161J248281J377436J597232J336794J400548K100440J999856J380009
$$ y = [38371793, 37888124, 37395258, 38114848, 39600046, 39538784, 39568224, 38868797, 38660421, 38889428, 38635255, 38474409, 38393108, 38753851, 39209655, 40062276, 40340065, 38913589, 38210582, 39048794, 39041750, 38602770, 38109730, 38234175, 38132702, 38687439, 39156733, 38810153, 39401134, 40217322, 39970404, 39655741, 39516902, 40328516, 39905215, 39690064, 39170280, 39821994, 40245379, 40353829, 41562893, 41580379, 42159622, 42686336, 42997541, 43968321, 44856230, 45358829, 45431231, 45005117, 45695058, 46100451, 47201285, 48241601, 48932449, 49486804, 50651146, 51498325, 51597656, 52031857, 53331752, 54457254, 55210586, 56193113, 57873003, 58602161, 59850442, 61227878, 62825110, 64161904, 65562452, 67662892, 69662748, 71042757]
3278G1042757J707792J666051J573354K602603J723529O09313K804138J533099
3270H5262636J156296K835599L043178K654453K510815K183979K271583K796059
3262A04714598L036863K945472J967786K562737K635313K926866K420858K241414
3254A25451907J895596K489188J081739J017291J208234M59459O03360J43373
3246A34350147p62537j5594o29906m81853r10438j243881j320067k204776k718735
3237A24062360k122444j311121k127772l845722l121942k116529k149100k692713
3229A04575017k084764k857163k349859k176095k789580j417906k759896j302772
3221H6836982j318035j570016j685009k458233l121527q24080k249053k449961
$$ y = [71042757, 72750549, 74416600, 75989954, 78592557, 80316086, 80925399, 83729537, 85262636, 86418932, 89254531, 92297709, 94952162, 97462977, 99646956, 101918539, 104714598, 107751461, 110696933, 112664719, 115227456, 117862769, 120789635, 123210493, 125451907, 127347503, 129836691, 130918430, 131935721, 133143955, 133603414, 134206774, 134350147, 133587610, 133572016, 132942110, 132460257, 131549819, 130305938, 128985871, 126781095, 124062360, 121939916, 120628795, 118501023, 114655301, 111533359, 109416830, 107267730, 104575017, 102490253, 99633090, 97283231, 95107136, 92317556, 90899650, 88139754, 86836982, 85518947, 83948931, 82263922, 79805689, 76684162, 75860082, 73611029, 71161068]
3213G1161068j331744j242778j775819j320492j550437j583875j864697k326265
3205E8164961j172534j081838r85322p90868r56155r26051p83026l52450l11341
3196E0805376j832821n56686p37142K723k13740o11954r29863n18454m12476k27850
3186D4767113J76201l95654k69950L49322J83745n19024K99090l9162m362n80199
3176D3967120M49795Q49823L81165R18704M75217n90019K603P83784o17521j389649
3166D5231022J90220l70073L95218L05260r39499n4444M46213o40060k30839j87538
3156D4145480n88955n92157q17749j87508l7479K74787k03155n63393L56708J39442
3146D1926021P62056R45736l73574k40989M11969M08862J24989m68074K57126
$$ y = [71161068, 69829324, 68586546, 66810727, 65490235, 63939798, 62355923, 60491226, 58164961, 56992427, 55910589, 54925267, 54134399, 53178244, 52252193, 51469167, 51116717, 50805376, 48972555, 48415869, 47678727, 47681450, 47467710, 46855756, 45925893, 45407439, 44994963, 44767113, 44943314, 44547660, 44277710, 44627032, 44810777, 44291753, 44590843, 44551681, 44547319, 43967120, 44416915, 45266738, 45647903, 46566607, 47041824, 46451805, 46454408, 47238192, 46620671, 45231022, 45421242, 45051169, 45446387, 45751647, 44812148, 44757704, 45203917, 44563857, 44333018, 44145480, 43556525, 42964368, 42146619, 41959111, 41921632, 42196419, 41993264, 41429871, 41786579, 41926021, 42688077, 43633813, 43260239, 43019250, 43431219, 43840081, 43965070, 43496996, 43754122]
3137D3754122L80538O02894Q92284l53181M92054J25884p93769q8703R81601O11686
3127D6605410L57258Q10767P42177P75622J149233Q69027O11434K71081M05803
3118E2597812J50692O48251O81912K30735M565M01635M53807L09220k79783p2731
3108E5126115p3086n82834m68332p92096r36404j087885l04267k03932l79518
3099E0297761k45098j004809p12384M70530k4483p69647p13742l87421P60164
3090D7670871J27971n51892M93198Q21447j25432J03955n62938K22932n66921
3081D7633191o74567L74777L7573l16251P95201q37725l59419k011790r61455
3072D3679535j21404j027879m58064r12798r17685k57812j207647j175686j264375
$$ y = [43754122, 44134660, 44737554, 45629838, 45276657, 45768711, 45894595, 45100826, 45012123, 45993724, 46605410, 46962668, 47773435, 48515612, 49291234, 50440467, 51309494, 51920928, 52192009, 52597812, 52748504, 53396755, 54078667, 54309402, 54313967, 54715602, 55169409, 55478629, 55198846, 55126115, 55053029, 54470195, 54001863, 53209767, 52273363, 51185478, 50881211, 50677279, 50297761, 50052663, 49047854, 48335470, 48806000, 48781517, 48011870, 47298128, 46910707, 47670871, 47798842, 47246950, 47740148, 48561595, 48436163, 48540118, 47977180, 48200112, 47633191, 46958624, 47333401, 47370974, 47054723, 47849924, 47012199, 46652780, 44640990, 43679535, 43558131, 42530252, 42072188, 41159390, 40241705, 39983893, 38776246, 37600560, 36336185]
3063C6336185n13051j592570q01317k57573j159389o28914n56783q18681n02152
3054B9505755L7663j196547n95976n39066k71423l6527j080438r34561P3229j14499
3044B4847610k16353r46080K81j689J41460p39324J3375L73930J3037l5620m56230
3033B2994397n35654M79983n59452j754K70432p4550L68931K60007L29631P32030
3023B4264001k12012l58776p02048J28544m19425n51065R5400M1186r31470o65557
3013B0688778m4627K60703o46830l48527k09900k18043k79196L23356p97230m94844
3003A8233640N6782p08489M5750l23378p95703k15545m50482j18310R66802N10391
2993A7201458l79327P0780k84488l05590N30605M42395q87749l32582j62883n66158
$$ y = [36336185, 35823134, 34230564, 33429247, 33171674, 32012285, 31383371, 30826588, 30007907, 29505755, 29543418, 28346871, 27750895, 27211829, 26940406, 26903879, 25823441, 24888880, 24962109, 24847610, 24631257, 23685177, 23685458, 23683769, 23825229, 23085905, 23099280, 23473210, 23486247, 23450627, 22994397, 22458743, 22938726, 22379274, 22377520, 22647952, 22573402, 22942333, 23202340, 23531971, 24264001, 24051989, 23693213, 22991165, 23119709, 22700284, 22149219, 22244619, 22285805, 21354335, 20688778, 20644151, 20904854, 20258024, 19909497, 19699597, 19481554, 19202358, 19525714, 18728484, 18233640, 18290422, 17581933, 17627683, 17304305, 16508602, 16293057, 15842575, 15724265, 16691067, 17201458, 16822131, 16892911, 16608423, 16302833, 16833438, 17275833, 16388084, 16055502, 15892619, 15326461]
2983A5326461O39254k18342n04290m18017k90091O17710Q8115L82523P6107O36455
2973A6335885K39537p27243M68110J35483l04620R42438J041180m69449n98842
2964A7062479l50665L03519m15831n04285R72739N1539O53641J248736k183j187093
2954A7832596m82650P93459J43960j02498P91855J38014p43329Q2885J230966
2945A9685258L147j177214R3498J035072L67841J216454j40948o23894J668975
2936B2128189N80285J1798k54903J458741M42012o8641M75468M27963K74234J53654
2926B5628800O28873P39369Q29808L31726r5131R84018N19254l91356M8106P92265
2916C0015732P03798J174623P8455J064547P89499Q35752J03979L89884R24038
$$ y = [15326461, 15965715, 15747373, 15243083, 14825066, 14534975, 15152685, 15240800, 15623323, 15699430, 16335885, 16575422, 15848179, 16316289, 16451772, 16147152, 17089590, 18130770, 17661321, 17062479, 16711814, 17015333, 16599502, 16095217, 17067956, 17119495, 17773136, 19021872, 19019689, 17832596, 17349946, 18143405, 18287365, 18184867, 18976722, 19114736, 18371407, 18454292, 19685258, 19688405, 18511191, 18604689, 19639761, 20007602, 21224056, 21083108, 20459214, 22128189, 22708474, 22720272, 22465369, 23924110, 24366122, 24297481, 24772949, 25200912, 25475146, 25628800, 26257673, 26997042, 27826850, 28158576, 28063445, 29047463, 29566717, 29175361, 29223467, 30015732, 30719530, 31894153, 31972608, 33037155, 33826654, 34662406, 34766385, 35156269, 36080307]
2907C6080307Q82656J121784R33470M40017J096094P90525O99816R25129J747075
2898D4716873J117045J166300R19034L27346J799894M16938R50851K232055J649104
2889E5295440J755152J598095J297015K371856K587033J456914K300225J458804
2881G0120534K387432K138916K052788J778790K570474J647108J541438K148386
2873H6385866J634604Q14264J632875K095475J258230J965721K677828K656411
2865A01121274K198625K890097K872178K475774L269920M244365M008172M186380
2857A27266785L539276N071801O180577N922884O330505P080829Q128174P519042
2849A77039873Q449746R768552Q381439R658948R352045Q664753P945035P142949
$$ y = [36080307, 36962963, 38084747, 39018217, 39458234, 40554328, 41344853, 42044669, 42969798, 44716873, 45833918, 47000218, 47919252, 48246598, 50046492, 50463430, 51414281, 53646336, 55295440, 57050592, 58648687, 59945702, 62317558, 64904591, 66361505, 68661730, 70120534, 72507966, 74646882, 76699670, 78478460, 81048934, 82696042, 84237480, 86385866, 88020470, 88834734, 90467609, 92563084, 93821314, 95787035, 98464863, 101121274, 103319899, 106209996, 109082174, 111557948, 114827868, 119072233, 123080405, 127266785, 130806061, 135877862, 142058439, 147981323, 154311828, 161392657, 169520831, 177039873, 185489619, 195258171, 203639610, 213298558, 222650603, 231315356, 239260391, 246403340]
2841B46403340N728318L060766K08480k193489m936807o822454q976855j0190278
2833B22281021j1577175j0165546j0230894r713654r613310r267678q608003p608768
2825A45495993p178844p102983o120304n960639n936388n697232l469078m028276
2817A00002249l638696l842471m269571k659341l271971k023108k947203k641639
2809G4708249k788256j824818l538893k245657k149830k016443j617758j473620
2801E7052974k008356k537011j336627j693989q24289j503997j083527j071747
2793D4993431j304057j029173o62307q84310p61392j149477p42569j444506r95898
2784C6019742L35928m89710j279805m16235n92728l65441p92727o27111n87405
$$ y = [246403340, 252131658, 255192424, 255400904, 253207415, 248270608, 241448154, 232471299, 222281021, 210703846, 200538300, 190307406, 180593752, 170980442, 161712764, 153104761, 145495993, 138317149, 131214166, 125093862, 119133223, 113196835, 107499603, 104030525, 100002249, 96363553, 92521082, 88251511, 85592170, 82320199, 80297091, 77349888, 74708249, 71919993, 70095175, 66556282, 64310625, 62160795, 60144352, 58526594, 57052974, 55044618, 52507607, 51170980, 49476991, 48652702, 47148705, 46065178, 44993431, 43689374, 42660201, 41997894, 41113584, 40352192, 39202715, 38460146, 37015640, 36019742, 36355670, 35865960, 34586155, 34169920, 33577192, 33211751, 32419024, 31791913, 31204508]
2775C1204508j437302m59954R5528p35454r82155o37535Q59291j23111o52041
2766B7131775p02993q17997l48654p30025o03263l30182J50686j67832P3211n42646
2756B3112080n27313j211437K96800k15026J45811k07003p47532N9619l83271
2747B0322728k73737m24387p06733m22384j95693M05607j2567p33409n99334j96923
2737A7163168j04568k50498L58665m03268q416o80200J57787M7185k1755o49919
2727A5608181K1134O67611j032920L30524m66111k90755J66849o17323N09986
2718A4897176j250137p92320J98080j11165j008222k28817k78673p70710o13515
2709A0041697k43832L82205M08344N17042K57830j012821n08920j79594O2870
$$ y = [31204508, 29767206, 29307252, 29402780, 28667326, 27685171, 27047636, 27906927, 27783816, 27131775, 26428782, 25610785, 25262131, 24532106, 23928843, 23598661, 23749347, 23581515, 23654726, 23112080, 22584767, 21373330, 21670130, 21455104, 21600915, 21393912, 20646380, 20705999, 20322728, 20048991, 19624604, 18917871, 18495487, 18299794, 18705401, 18692834, 17959425, 17360091, 17163168, 17058600, 16808102, 17166767, 16763499, 16755083, 16074883, 16232670, 16279855, 16258100, 15608181, 15629315, 16296926, 15264006, 15594530, 15128419, 14837664, 15004513, 14387190, 14897176, 13647039, 12854719, 13052799, 12941634, 11933412, 11704595, 11425922, 10655212, 10041697, 9797865, 10180070, 10588414, 11105456, 11363286, 10350465, 9841545, 9661951, 9724821]
2700I724821j336717q9292j11079M59814M07452j152424o95650J53373P61065
2691H121363K27883j84037j52062r5749n57968n14931J93016J52479n8460J49701
2681G281235m04519N51363n41691m70454Q23672j105832q35078P7702k35817N22013
2671E662594n26936o55299M05244J92739m77500N31774K73009j34622Q1862p26561
2661D626304K60375l69887M3160N04278m56007q56030M60555J436989l04872j007614
2651D337251o61427l19901L63051R07033M39854j076268k84981m66483J71522
2642C409651K56573n35595M7862Q63o2955N17722R5148o76420k08966o4145O94538
2631C474276M04934L1578r53220k59138k06851j5957O39492m55369m6183L85939
$$ y = [9724821, 8388104, 8298812, 8187733, 8647547, 9054999, 7902575, 7206925, 7360298, 8121363, 8349246, 8165209, 8013147, 7917398, 7359430, 6844499, 7037515, 7189994, 7131534, 7281235, 6876716, 7428079, 6886388, 6415934, 7239606, 6133774, 5298696, 5376398, 5140581, 5662594, 5135658, 4480359, 4885603, 5078342, 4600842, 5132616, 5405625, 5271003, 5352865, 4626304, 4886679, 4516792, 4559952, 5064230, 4608223, 3752193, 4212748, 5649737, 5344865, 4337251, 3675824, 3355923, 3718974, 4626007, 5065861, 3989593, 3704612, 3238129, 3409651, 3666224, 3130629, 3178491, 3179354, 3116399, 3634121, 3729269, 3052849, 2843883, 2779738, 3474276, 3879210, 3910788, 2957568, 2698430, 2491579, 2475622, 3115114, 2659745, 2613562, 2999501]
2621B999501P9069J03887Q9110M0537n86612q5072K99239Q9500l02800j05953
2611B620406L22100M13486L30620k14681q30393K94027n22476j42978P35783j02422
2601B903472M4026l43058j8315M88287m37819k49154m73596K35687K59294K10991
2591B619815R9412j17569J96073K16616j128465J4599j75185O07417o26683n44178
2581A161852J039442r8342J56918R32090m9896n09865q5656j52864P27279o96141
2571B424817J29767k44494M00788n8976k81515L40624j07208n20494r7360J28642
2561B114591J49645O59125j51940R4738L2538l13651N53721k16963j23093M1100
2551B839811n03907J71932j72859O44739q07791k17766R1360J89540j72370q89555
$$ y = [2999501, 3078570, 3182457, 3271567, 3312104, 2725492, 2640420, 2939659, 3029159, 2726359, 2620406, 2942506, 3355992, 3686612, 3471931, 2641538, 2935565, 2413089, 2270111, 3005894, 2903472, 2947498, 2604440, 2586125, 3074412, 2636593, 2387439, 1913843, 2149530, 2408824, 2619815, 2719227, 2601658, 2797731, 3014347, 1885882, 1900481, 1725296, 2332713, 1706030, 1161852, 2201294, 2102952, 2259870, 3191960, 3142064, 2632199, 2546543, 2393679, 3120958, 2424817, 2554584, 2310090, 2710878, 2651902, 2370387, 2711011, 2603803, 2083309, 1985949, 2114591, 2264236, 2923361, 2771421, 2866159, 2898697, 2585046, 3138767, 2921804, 2798711, 2839811, 2335904, 2507836, 2334977, 2979716, 2171925, 1954159, 2045519, 2235059, 2062689, 1173134]
2541A173134R23291J63492o81905k71622k24654j70523J67573j58334q08696K44060
2531C55816J007004m7770O64802m77320p30706M1126L97887m57054n56365P31254
2521I28674O32813J81037j59065j55934n18345K66608n97131K6971K91560j93279
2511G03909O18956p54694L18860R371K73049l93847j30748J7867m31549N5181
2501B86355l79831J438232m28475K1602k04932o21178L15037N11504R23155L20613
2491B182082o82605l80131K83694q33355l70767p2832M74905N29761k01663o265
2481I22824l82461n18426j42o26384M90335N18552J11077j38512L70737q887j3712
2470G25001K02755J58614n96558N0810M05388m66059N08529L15945l16140j191129
$$ y = [1173134, 2096425, 2259917, 1578012, 1306390, 1081736, 911213, 1078786, 920452, 111756, 355816, 1362820, 1315050, 1979852, 1502532, 771826, 812952, 1210839, 753785, 197420, 928674, 1561487, 1742524, 1583459, 1427525, 909180, 1175788, 578657, 605628, 897188, 703909, 1322865, 568171, 887031, 896402, 1169451, 775604, 644856, 662723, 231174, 286355, -93476, 1344756, 916281, 937883, 732951, 111773, 426810, 938314, 1861469, 2182082, 1499477, 1119346, 1403040, 569685, 198918, 126086, 600991, 1130752, 929089, 922824, 540363, 21937, 21795, -604589, -114254, 404298, 515375, 376863, 747600, 738713, 725001, 927756, 1086370, 489812, 540622, 946010, 479951, 988480, 1304425, 988285, -202844]
2460b02844m58746K83017M31212k62129m5942K01539J88084k71212n17678J16109
2450e38590J020180K22356p48028n50356L20621k62577n35835L96536l23744Q83103
2440a16334R23979n51792r21036M54683P77389j94858k68975k25825j81373K29681
2430g4461o98300J34846M27505O34033K40497k91176k79105N66324o8986k78979
2420C12198L05014K27352M20582p5897n90507o21046K28115j42276J4820L54805
2410D33160l03575k85103J16948o1220O8969R33107n12998J58675k61428M91853
2400G78388L49959l56226m06538j8850K80784L91261j41711J94089Q0414r74144
2390A77426P03670o13099n88511L64050N45177q9554n86579J7706J15344N54219
$$ y = [-202844, -661590, -378573, 52639, -209490, -255432, -53893, 134191, -137021, -654699, -538590, 481590, 703946, -44082, -594438, -273817, -536394, -1072229, -675693, -999437, -116334, 807645, 255853, -665183, -210500, 566889, 372031, 103056, -122769, -304142, -74461, -772761, -637915, -210410, 423623, 664120, 372944, 93839, 660163, 591177, 312198, 617212, 844564, 1265146, 1189249, 598742, -22304, 205811, 63535, 78355, 433160, 129585, -155518, -38570, -99790, -30821, 902286, 389288, 547963, 286535, 778388, 1128347, 772121, 365583, 346733, 627517, 1018778, 877067, 1071156, 1151570, 177426, 881096, 267997, -320514, 43536, 588713, 499159, -87420, -69714, 45630, 599849]
2380E99849j65256k88818K43308k93881J08102M82864L74026m49600P2580L63288
2370A046462j45457p24262J130681n2214n61187q5099K7316K82753J36k34474
2360F84655p19954L47516P23936l16566o83552J82669L18928k56989K00418k97002
2350A84059K68469j2159q2312j25388M48302K2105q6150J63691k18620N9224P79452
2339A400673o68056k72586k49889l06602l06075L87381k40021M03679R8166J185260
2329A431930q23208q49041M55370r56365j45915Q60422M97180m38167K49763k84765
2319b796N67180L0583j39621m82583N98599j6805O7154k18907o26840Q21037l07422
2308B89579J50192M22634o84198o89018N64679N38735K43343j208474K60458Q76972
$$ y = [599849, 434593, 145775, 389083, 95202, 203304, 686168, 1060194, 610594, 683174, 1046462, 901005, 176743, 1307424, 1255210, 694023, 608924, 636240, 918993, 919129, 684655, -35299, 312217, 1036153, 719587, 36035, 218704, 537632, 280643, 481061, 184059, 452528, 440369, 358057, 232669, 680971, 703076, 616926, 780617, 561997, 621221, 1400673, 732617, 460031, 210142, -96460, -402535, -15154, -255175, 148504, 246670, 1431930, 608722, -240319, 215051, -741314, -887229, -26807, 470373, 32206, 281969, -2796, 564384, 594967, 455346, -27237, 571362, 554557, 621711, 402804, -224036, 597001, 289579, 439771, 862405, 178207, -510811, 53868, 592603, 835946, -372528, -112070, 764902]
2298G64902L52285j091967l32015O01850L0927M56918j74799P9874j027519O94743
2288C55199k93936P16308O97426j90958l07316p68266m9098J140614k20978p05438
2278C73557k7520p25754M38020l50828M235Q53647r21442j23389M06307Q80484
2268H07317J71405p66462K91899M03033j13064r0764K34449L3636K04275O00520
2258A776244j070529L8419q66380R60878l34473m15592M03272j24065m21977L1654
2248b2549M46415L92932j62879M11097n71012l07147K3057l55963L2043J038490
2238I24484p38215k16379R67207l50658R4376l52311K00854l18694J64838P88128
2228A163630j75529j15026k94896m85732O30700K05042l56888l49272j07807J90439
$$ y = [764902, 1117187, 25220, -306795, 295055, 325982, 782900, 608101, 687975, -339544, 355199, 61263, 777571, 1474997, 1284039, 976723, 208457, 159359, 1299973, 1078995, 373557, 346037, -379717, 58303, -292525, -288290, 565357, -356085, -479474, -73167, 807317, 978722, 212260, 504159, 907192, 794128, 703364, 937813, 971449, 1175724, 1776244, 705715, 744134, -122246, 838632, 504159, 88567, 491839, 367774, -54203, -22549, 423866, 816798, 653919, 1065016, 494004, 186857, 209914, -146049, -114006, 924484, 186269, -30110, 937097, 586439, 680815, 328504, 529358, 210664, 375502, 1163630, 988101, 873075, 578179, 92447, 723147, 928189, 571301, 222029, 114222, 304661]
2218C04661M09083P622L15461J01213M3562o19215q14625q7075L58457K55746
2208B74890P39127k18703o30005O84585P99557N12146J758o81818L16914m19988
2198A378463L82568m960n45816m2257N2898M88959P5390l91421M10820o03918
$$ y = [304661, 713744, 721366, 1036827, 1138040, 1181602, 562387, -252238, -339313, 19144, 274890, 1014017, 795314, 165309, 849894, 1649451, 2161597, 2163355, 1481537, 1798451, 1378463, 1761031, 1756071, 1210255, 1167998, 1220896, 1709855, 1785245, 1393824, 1804644, 1200726]
$$ [...]
##END NTUPLES=NMR SPECTRUM
##END=
