##TITLE=1H_CA-8960-x
 DMSO
 8 sc, 
 15.12.2021
##JCAMPDX= 6.0         $$ Bruker NMR JCAMP-DX V2.0
##DATA TYPE= NMR SPECTRUM
##DATA CLASS= NTUPLES
##ORIGIN= UXNMR, Bruker Analytische Messtechnik GmbH
##OWNER= root
$$ XWIN-NMR		Version 3.5
$$ Wed Dec 15 10:59:34 2021 Russian Standard Time (UT+4h)  she@DPX200
##.OBSERVE FREQUENCY= 200.131346
##.OBSERVE NUCLEUS= ^1H
##.ACQUISITION MODE= SIMULTANEOUS
##.ACQUISITION SCHEME= undefined
##.AVERAGES= 8
##.DIGITISER RES= 18
##SPECTROMETER/DATA SYSTEM= spect
##.PULSE SEQUENCE= zg30
##.SOLVENT NAME= CDCl3
##.SHIFT REFERENCE= (INTERNAL, CDCl3, 0, 15.7458)
##AUDIT TRAIL= $$ (NUMBER, WHEN, WHO, WHERE, WHAT)
$$ ##TITLE= Audit trail, XWIN-NMR		Version 3.5
$$ ##JCAMPDX= 5.01
$$ ##ORIGIN= Bruker BioSpin GmbH
$$ ##OWNER= she
$$ F:/spectra/data/she/nmr/H-F/1/pdata/1/auditp.txt
$$ ##AUDIT TRAIL=  $$ (NUMBER, WHEN, WHO, WHERE, WHAT)
(   1,<2021-12-15 10:58:25.75 +0400>,<she>,<DPX200>,
      <created by zg, POWCHK disabled, PULCHK disabled
       configuration hash MD5:
       00 E9 B6 7A A2 85 ED C7 34 08 36 98 17 FE 4E 26
       data hash MD5: 16K
       A4 25 CD 40 C0 6F 8D FE ED 28 88 79 95 AD D7 6C>)
(   2,<2021-12-15 10:58:28.18 +0400>,<she>,<DPX200>,
      <Start of raw data processing
       efp BC_mod = 2 LB = 0.24 FT_mod = 6 PKNL = 1 PHC0 = -16016.33 PHC1 = -5.99921 SI = 16K 
       data hash MD5: 16K
       17 E0 63 39 C3 27 55 B7 27 40 F1 F2 B9 3E 72 76>)
(   3,<2021-12-15 10:58:45.93 +0400>,<she>,<DPX200>,
      <pk PHC0 = 76.03683 PHC1 = 0 
       data hash MD5: 16K
       AA DC 37 D5 26 24 E1 EA 3E DD F5 CC 8B 93 D6 BD>)
$$ ##END=
$$ 
$$ hash MD5
$$ 4E 6A BF 2A 9F 4F 89 77 6E 95 00 5D 39 76 1D 9B
##$RELAX= 
##$RELAX= 
##$RELAX= 
##$RELAX= 
##$RELAX= 
##$RELAX= 
$$ Bruker specific parameters
$$ --------------------------
##$DU= <F:/spectra>
##$EXPNO= 1
##$NAME= <H-F>
##$PROCNO= 1
##$TYPE= <nmr>
##$USER= <she>
##$AMP= (0..31)
100 100 100 100 100 100 100 100 100 100 100 100 100 100 100 100 100 100 
100 100 100 100 100 100 100 100 100 100 100 100 100 100 
##$AQSEQ= 0
##$AQ_mod= 1
##$AUNM= <au_zg>
##$AUTOPOS= <>
##$BF1= 200.13
##$BF2= 200.13
##$BF3= 200.13
##$BF4= 200.13
##$BF5= 200.13
##$BF6= 200.13
##$BF7= 200.13
##$BF8= 200.13
##$BYTORDA= 1
##$CFDGTYP= 0
##$CFRGTYP= 5
##$CHEMSTR= <none>
##$CNST= (0..31)
1 1 145 1 1 1 1 1 1 1 1 1 1 1 1 1 1 1 1 1 1 1 1 1 1 1 1 1 1 1 1 1 
##$CPDPRG= <>
##$CPDPRG1= <>
##$CPDPRG2= <>
##$CPDPRG3= <>
##$CPDPRG4= <mlev>
##$CPDPRG5= <mlev>
##$CPDPRG6= <mlev>
##$CPDPRG7= <mlev>
##$CPDPRG8= <mlev>
##$CPDPRGB= <>
##$CPDPRGT= <>
##$D= (0..31)
0 1.2 0 0 0 0 0 0 0 0.06 0 0.03 0 0 0 0 0.0002 0 0 0 0 0 0 0 0 0 0 0 0 
0 0 0 
##$DATE= 1639551505
##$DBL= (0..7)
120 120 120 120 120 120 120 120 
##$DBP= (0..7)
150 150 150 150 150 150 150 150 
##$DBP07= 0
##$DBPNAM0= <>
##$DBPNAM1= <>
##$DBPNAM2= <>
##$DBPNAM3= <>
##$DBPNAM4= <>
##$DBPNAM5= <>
##$DBPNAM6= <>
##$DBPNAM7= <>
##$DBPOAL= (0..7)
0.5 0.5 0.5 0.5 0.5 0.5 0.5 0.5 
##$DBPOFFS= (0..7)
0 0 0 0 0 0 0 0 
##$DE= 6
##$DECBNUC= <off>
$$ [...]
##$SUBNAM1= <"">
##$SUBNAM2= <"">
##$SUBNAM3= <"">
##$SUBNAM4= <"">
##$SUBNAM5= <"">
##$SUBNAM6= <"">
##$SUBNAM7= <"">
##$SUBNAM8= <"">
##$SUBNAM9= <"">
##$SW= 18.0517287032376
##$SWIBOX= (0..15)
0 0 2 0 0 0 0 0 0 0 0 0 0 0 0 0 
##$SW_h= 3612.71676300578
##$TD= 16384
##$TD0= 1
##$TE= 0
##$TE2= 300
##$TE3= 300
##$TEG= 300
##$TL= (0..7)
0 120 120 120 120 120 120 120 
##$TP= (0..7)
150 150 150 150 150 150 150 150 
##$TP07= 0
##$TPNAME0= <>
##$TPNAME1= <>
##$TPNAME2= <>
##$TPNAME3= <>
##$TPNAME4= <>
##$TPNAME5= <>
##$TPNAME6= <>
##$TPNAME7= <>
##$TPOAL= (0..7)
0.5 0.5 0.5 0.5 0.5 0.5 0.5 0.5 
##$TPOFFS= (0..7)
0 0 0 0 0 0 0 0 
##$TUNHIN= 0
##$TUNHOUT= 0
##$TUNXOUT= 0
##$USERA1= <user>
##$USERA2= <user>
##$USERA3= <user>
##$USERA4= <user>
##$USERA5= <user>
##$V9= 5
##$VALIST= <valist>
##$VCLIST= <CCCCCCCCCCCCCCC>
##$VD= 0
##$VDLIST= <DDDDDDDDDDDDDDD>
##$VPLIST= <PPPPPPPPPPPPPPP>
##$VTLIST= <TTTTTTTTTTTTTTT>
##$WBST= 1024
##$WBSW= 4
##$XGAIN= (0..3)
0 0 0 0 
##$XL= 0
##$YL= 0
##$YMAX_a= 5611
##$YMIN_a= -8853
##$ZGOPTNS= <>
##$ZL1= 120
##$ZL2= 120
##$ZL3= 120
##$ZL4= 120
##$ABSF1= 0
##$ABSF2= 0
##$ABSG= 0
##$ABSL= 0
##$ALPHA= 0
##$AQORDER= 0
##$ASSFAC= 0
##$ASSFACI= 0
##$ASSFACX= 0
##$ASSWID= 0
##$AUNMP= <proc_1d>
##$AZFE= 0.1
##$AZFW= 0.1
##$BCFW= 0
##$BC_mod= 2
##$BYTORDP= 0
##$COROFFS= 0
##$CY= -3
##$DATMOD= 1
##$DC= 0
##$DFILT= <>
##$DTYPP= 0
##$F1P= 0
##$F2P= 0
##$FCOR= 1
##$FTSIZE= 16384
##$FT_mod= 6
##$GAMMA= 0
##$GB= 0
##$INTBC= 1
##$INTSCL= 0
##$ISEN= 128
##$LB= 0.24
##$LEV0= 0
##$LPBIN= 0
##$MAXI= 10000
##$MC2= 0
##$MEAN= 0
##$ME_mod= 0
##$MI= 1.114404
##$NCOEF= 0
##$NC_proc= -14
##$NLEV= 6
##$NOISF1= 3.799351
##$NOISF2= 2.8
##$NSP= 0
##$NTH_PI= 0
##$NZP= 0
##$OFFSET= 15.74579
##$PC= 1
##$PHC0= -15940.29
##$PHC1= -5.99921
##$PH_mod= 1
##$PKNL= yes
##$PPARMOD= 0
##$PSCAL= 0
##$PSIGN= 0
##$REVERSE= no
##$SF= 200.130001153435
##$SI= 16384
##$SIGF1= 3
##$SIGF2= 2
##$SINO= 5.538805
##$SIOLD= 16384
##$SREGLST= <1H.CDCl3>
##$SSB= 0
##$STSI= 16384
##$STSR= 0
##$SW_p= 3612.71676300578
##$SYMM= 0
##$S_DEV= 0
##$TDeff= 16384
##$TDoff= 0
##$TI= <>
##$TILT= no
##$TM1= 0
##$TM2= 0
##$TOPLEV= 0
##$USERP1= <user>
##$USERP2= <user>
##$USERP3= <user>
##$USERP4= <user>
##$USERP5= <user>
##$WDW= 1
##$XDIM= 16384
##$YMAX_p= 442785651
##$YMIN_p= -6412365
$$ End of Bruker specific parameters
$$ ---------------------------------
##NTUPLES= NMR SPECTRUM
##VAR_NAME=  FREQUENCY,     SPECTRUM/REAL,   SPECTRUM/IMAG
##SYMBOL=    X,             R,               I
##VAR_TYPE=  INDEPENDENT,   DEPENDENT,       DEPENDENT
##VAR_FORM=  AFFN,          ASDF,            ASDF
##VAR_DIM=   16384,         16384,           16384
##UNITS=     HZ,            ARBITRARY UNITS, ARBITRARY UNITS
##FACTOR=    0.220516191357247, 1,           1
##FIRST=     3151.20487637898, 0,            0
##LAST=      -461.511886626796, 0,           0
##MIN=       -461.511886626796, -6412365,    0
##MAX=       3151.20487637898, 442785651,    0
$$ Real data points
##PAGE= N=1
##DATA TABLE= (X++(R..R)), XYDATA
$$ [...]
$$ plain form
5368 50488660 51245390 49603405 50358983 52401727 51879416 50626534 50333150 50907123 49947063
5359 49947063 49825170 49410928 51667173 50592016 50295402 50503845 49032162 49217009 52109625
5350 52109625 53381378 51717807 51056222 50220054 49551885 49415301 50358391 49540320 48525476
5341 48525476 47766241 49503972 48298133 48432738 49633261 49573219 50349907 50417801 50242152
5332 50242152 49458215 48795611 50753782 51104360 50582104 51116687 51589957 51654929 50783383
5323 50783383 50725075 49842905 52343095 51715917 50069962 49065182 49680067 50386413 49873696
5314 49873696 53112725 52284392 51183537 49875186 49819662 50872048 51290406 49937973 50568956
5305 50568956 49836010 50152343 50652536 52124367 51694834 51165290 52667998 52348945 51305666
$$ packed form
5368E0488660P56730j641985P55578K042744n22311j252882k93384N73973r60060
5359D9947063j21893m14242K256245j075157k96614K08443j471683J84847K892616
5350E2109625J271753j663571o61585q36168o68169j36584R43090q18071j014844
5341D8525476p59235J737731j205839J34605J200523o0042P76688O7894j75649
5332E0242152p83937o62604J958171L50578n22256N34583M73270O4972q71546
5323E0783383n8308q82170K500190o27178j645955j004780O14885P06346n12717
5314D9873696L239029q28333j100855j308351n5524J052386M18358j352433O30983
5305E0568956p32946L16333N00193J471831m29533n29544J502708l19053j043279
$$ plain form
5296 51305666 51214362 52020338 54183529 53763487 52115605 52617738 50834827 51836350 54493921
5287 54493921 53599857 53079760 52926133 54659413 54586320 54219822 55166816 55654239 54991271
5278 54991271 54777473 54312300 54040752 53073876 52222390 54054911 54167839 52839066 54492766
5269 54492766 54674005 54470590 54637874 53919459 53162817 53787377 53397550 52977386 54757809
5260 54757809 53981449 53788243 54797582 55587968 54799096 53710993 53964662 54234786 54528145
5251 54528145 54181185 53669893 54321701 54994273 55254900 56963988 57173090 53891651 54703924
5242 54703924 56559111 56539370 58356287 58118432 55640250 57631021 57931864 57147717 58000342
5233 58000342 59255352 59157527 59002406 58110640 56727164 56379866 57724078 57374268 56362996
$$ packed form
5296E1305666r1304Q05976K163191m20042j647882N02133j782911J001523K657571
5287E4493921q94064n20097j53627J733280p3093l66498R46994M87423o62968
5278E4991271k13798m65173k71548r66876q51486J832521J12928j328773J653700
5269E4492766J81239k03415J67284p18415p56642O24560l89827m20164J780423
5260E4757809p76360j93206J009339P90386p88872j088103K53669K70124K93359
5251E4528145l46960n11292O51808O72572K60627J709088K09102l281439Q12273
5242E4703924J855187j9741J816917k37855k478182J990771L00843p84147Q52625
5233E8000342J255010r7825j55121q91766j383476l47298J344212l49810j011272
$$ plain form
5224 56362996 57672985 57903573 56487093 56716525 57447907 57959021 56843778 55844899 56507369
5215 56507369 57298077 57110989 58195587 58513412 58719385 59060998 58646870 60063452 60811635
5206 60811635 61286215 61200297 63140860 63116967 62661446 63481341 61724338 60148558 60122869
5197 60122869 59042920 59104589 59579807 59024326 58599447 59518265 60232152 61274613 61916964
5188 61916964 61495772 60759356 61124364 60893640 60897520 61899469 60483029 59661794 60062293
5179 60062293 60915508 59374972 59792614 60574662 62244849 63616362 62593410 62299904 62756912
5170 62756912 61067732 62792735 61574051 61093982 61097302 62520881 62472360 62429044 62959628
5161 62959628 62689251 62078207 62135063 61958305 61388616 64469185 63484452 62380411 61015371
$$ packed form
5224E6362996J309989K30588j416480K29432P31382N11114j115243r98879O62470
5215E6507369P90708j87088J084598L17825K05973L41613m14128J416582P48183
5206F0811635M74580q5918J940563k3893m55521Q19895j757003j575780k5689
5197F0122869j079949O1669M75218n55481m24879R18818P13887J042461O42351
5188F1916964m21192p36416L65008k30724L880J001949j416440q21235M00499
5179F0062293Q53215j540536M17642P82048J670187J371513j022952k93506M57008
5170F2756912j689180J725003j218684m80069L320J423579m8521m3316N30584
5161F2959628k70377o11044N6856j76758n69689L080569r84733j104041j365040
$$ plain form
5152 61015371 60998855 62426617 62952836 61838894 62741530 64395664 63753381 63442536 65056747
5143 65056747 63586081 64758577 64364092 65359981 65410089 64773669 65461172 64932931 66483833
5134 66483833 65019954 64878495 65512870 66448103 66837684 64226399 65512750 66430056 67213776
5125 67213776 65590061 65810265 66807810 67339894 67664305 68417153 68227844 68795942 69894377
5116 69894377 69096272 68447967 69757489 69899677 68907356 69547885 71162686 71005982 69651199
5107 69651199 69524654 69788237 71163867 71163845 71441906 73133849 73189410 72601496 74589855 76314638
5097 76314638 75193694 72760652 74110301 75176956 77088899 76610907 76557350 77502355 77405871
5088 77405871 76415191 77466629 76462510 77294516 79413443 80060226 79171911 80557075 80442833
$$ packed form
5152F1015371j6516J427762N26219j113942R02636J654134o42283l10845J614211
5143F5056747j470666J172496l94485R95889N0108o36420O87503n28241J550902
5134F6483833j463879j41459O34375R35233L89581k611285J286351R17306P83720
5125F7213776j623715K20204R97545N32084L24411P52848j89309N68098J098435
5116F9894377p98105o48305J309522J42188r92321O40529J614801j56704j354783
5107F9651199j26545K63583J375630k2K78061J691943N5561n87914J988359J724783
5097G6314638j120944k433042J349649J066655J911943m77992n3557R45005r6484
5088G7405871r90680J051438j004119Q32006K118927O46783q88315J385164j14242
$$ plain form
5079 80442833 80136560 80943306 81908927 82245082 81433944 81671355 80645720 82460034 83343680
5070 83343680 84043132 83669429 84363953 84858474 85656972 85200738 85655198 86165710 85193722
5061 85193722 86417388 86633953 86561340 87977339 89541189 89923610 90136832 91523943 91624736
5052 91624736 92421182 92710488 92278327 94630116 95643278 98303456 99002891 98710041 98004727
5043 98004727 98246572 98936830 100607892 101584089 102192431 102622919 104031485 104183459 104328821
5034 104328821 106366993 107102294 106491384 107298398 108354575 108694690 110020562 110398272 111521386
5025 111521386 110933734 111775488 113798782 114257498 113943525 114804736 116420784 118370418 117939887
5016 117939887 118752123 121188701 122626597 122533710 124392444 125584609 126387659 126841214 126888247
$$ packed form
5079H0442833l06273Q06746R65621L36155q11138K37411j025635J814314Q83646
5070H3343680O99452l73703O94524M94521P98498m56234M54460N10512r71988
5061H5193722J223666K16565p2613J415999J563850L82421K13222J387111J00793
5052I1624736P96446K89306m32161K351789J013162K660178O99435k92850p05314
5043I8004727K41845O90258J671062R76197O08342M30488J408566J51974J45362
5034A04328821K038172P35301o10910Q07014J056177L40115J325872L77710J123114
5025A11521386n87652Q41754K023294M58716l13973Q61211J616048J949634m30531
5016A17939887Q12236K436578J437896r2887J858734J192165Q03050M53555M7033
$$ plain form
5007 126888247 128393445 130426514 132162591 131565529 132343696 134504352 135374535 136747754
4999 136747754 138239124 138716845 138957007 140987455 142597137 143303186 143895877 147495184 149070347
4990 149070347 151869667 152972026 152800899 156460807 159592282 160761924 163240937 166042435
4982 166042435 169303119 172651307 176327529 180107003 185636870 190401803 196549174 203959187
4974 203959187 210716470 218081767 224701372 231523254 235359345 232215291 224784270 216241258
4966 216241258 208731645 204656619 201189482 198337473 195626412 195477559 194955158 195202139
4958 195202139 194987853 194519138 194441803 196286448 198273331 199199061 198624292 196166993 197453003
4949 197453003 200544185 202545610 202639173 203768858 204954770 206515920 206917079 207417176 210210610
$$ packed form
5007A26888247J505198K033069J736077n97062P78167K160656Q70183J373219
4999A36747754J491370M77721K40162K030448J609682P06049N92691L599307J575163
4990A49070347K799320J102359j71127L659908L131475J169642K479013K801498
4982A66042435L260684L348188L676222L779474N529867M764933O147371P410013
4974B03959187O757283P365297O619605O821882L836091l144054p431021q543012
4966B16241258p509613m075026l467137k852009k711061j48853n22401K46981
4958A95202139k14286m68715p7335J844645J986883R25730n74769k457299J286010
4949A97453003L091182K001425R3563J129685J185912J561150M01159N00097K793434
$$ plain form
4940 210210610 210414610 212153932 212052308 212405880 215379216 215180046 214176260 216810346 219621059
4931 219621059 220753355 219726518 217939253 217988107 219864547 222100628 223481746 224905338
4923 224905338 225251648 225581225 226033529 224567409 224881478 226895590 227636262 229227762 228944622
4914 228944622 230358251 232843935 231351405 231083606 232643519 234650781 234773449 236162109
4906 236162109 236348183 237976464 238434658 239013509 239079262 239897362 239842188 240207413 240534322
4897 240534322 240651658 241913180 240384276 241342797 241800522 241925101 242144963 243084055 243934576
4888 243934576 243252511 243913795 245413243 245813753 243893433 242628276 242666222 243724422 244447811
4879 244447811 243848385 242603655 241860630 243243662 244310773 242956967 242085626 241364782 241530515
$$ packed form
4940B10210610K04000J739322j01624L53572K973336j99170j003786K634086K810713
4931B19621059J132296j026837j787265M8854J876440K236081J381118J423592
4923B24905338L46310L29577M52304j466120L14069K014112P40672J591500k83140
4914B28944622J413629K485684j492530k67799J559913K007262J22668J388660
4906B36162109J86074J628281M58194N78851O5753Q18100n5174L65225L26909
4897B40534322J17336J261522j528904R58521M57725J24579K19862R39092Q50521
4888B43934576o82065O61284J499448M00510j920320j265157L7946J058200P23389
4879B44447811n99426j244730p43025J383032J067111j353806q71341p20844J65733
$$ plain form
4870 241530515 241671987 239667916 238391831 237334601 235894471 235319063 235468033 234998323 234695906
4861 234695906 234070986 231320717 232408519 232728178 230653039 230256087 228642946 228936830 227188282
4852 227188282 225838194 223944364 224422898 223625751 222127668 221556685 221484864 220122394 218350174
4843 218350174 218383883 218453327 218146785 214692053 214143650 213688272 212511748 210359072 210928181
4834 210928181 209187659 208398555 208986346 207958307 206229867 204312415 203365296 201297139
4826 201297139 199474909 199486117 197965530 197212126 196293440 194255860 192501861 189742094 191140862
4817 191140862 191464218 190308522 187306225 186390102 184247983 183110137 182232550 180425943
4809 180425943 178719020 177135598 176068833 176686613 174407333 173213675 169903694 169130012
$$ packed form
4870B41530515J41472k004071j276085j057230j440130n75408J48970m69710l02417
4861B34695906o24920k750269J087802L19659k075139l96952j613141K93884j748548
4852B27188282j350088j893830M78534p97147j498083n70983p1821j362470j772220
4843B18350174L3709O9444l06542l454732n48403m55378j176524k152676N69109
4834B10928181j740522p89104N87791j028039j728440j917452r47119k068157
4826B01297139j822230J1208j520587p53404r18686k037580j753999k759767J398768
4817A91140862L23356j155696l002297r16123k142119j137846q77587j806607
4809A80425943j706923j583422j066765O17780k279280j193658l309981p73682
$$ plain form
4801 169130012 169866548 167498329 166339034 165459076 164760219 162385558 161220269 161344354 159944975
4792 159944975 158300473 160108877 157799149 155458644 154532786 152109333 151886270 150735318
4784 150735318 150452344 150916975 149574274 149802779 146824432 144372773 143470531 141304847 140678014
4775 140678014 139870395 138594109 136484165 136451266 136510355 134723511 133545879 133747033 132930205
4766 132930205 132480558 131388351 129443746 128663215 128823844 127015424 124890977 123706834
4758 123706834 123416280 122543555 123029003 123526604 122600658 122184350 121762774 121144877 120559310
4749 120559310 119905778 118580253 116206903 114905707 114261773 113326073 113518639 112647919 112244738
4740 112244738 112757310 111876915 109723538 110078418 109318172 106524976 106364978 106060316 107107873
$$ packed form
4801A69130012P36536k368219j159295q79958o98857k374661j165289J24085j399379
4792A59944975j644502J808404k309728k340505r25858k423453k23063j150952
4784A50735318k82974M64631j342701K28505k978347k451659r02242k165684o26833
4775A40678014q07619j276286k109944l2899N9089j786844j177632K01154q16828
4766A32930205m49647j092207j944605p80531J60629j808420k124447j184143
4758A23706834k90554q72725M85448M97601r25946m16308m21576o17897n85567
4749A20559310o53532j325525k373350j301196o43934r35700J92566q70720m03181
4740A12244738N12572q80395k153377L54880p60246k793196j59998l04662J047557
$$ plain form
4731 107107873 108737077 107417659 105729101 103795955 102658255 102232280 101394304 100613664
4723 100613664 100694709 99446109 98451833 97207579 97897804 98448838 97779777 96784095 96180883
4714 96180883 95511277 93465718 92623797 92356689 92445510 92873041 91422420 90830937 90192556
4705 90192556 91063152 90126532 89011765 87930134 87581105 87638204 88473196 87281498 86453438
4696 86453438 85320482 85442395 86306211 86267836 84291014 82775052 83869270 84086972 83065763
4687 83065763 82067819 82438210 81022877 80979115 80273004 77999189 77812082 77717599 77733379 76962541
4677 76962541 77895640 79083112 78629725 76935896 77085370 77467334 76677131 75923128 75292321
4668 75292321 74816249 74746964 74223861 72700150 72127037 70004081 68922138 69200905 68979819
$$ packed form
4731A07107873J629204j319418j688558j933146j137700m25975q37976p80640
4723A00613664Q1045j248600r94276j244254O90225N51034o69061r95682o03212
4714I6180883o69606k045559q41921k67108Q8821M27531j450621n91483o38381
4705I0192556Q70596r36620j114767j081631l49029N7099Q34992j191698q28060
4696H6453438j132956J21913Q63816l8375j976822j515962J094218K17702j021209
4687H3065763r97944L70391j415333m3762p06111k273815j87107r4483J5780p70838
4677G6962541R33099J187472m53387j693829J49474L81964p90203p54003o30807
4668G5292321m76072o9285n23103j523711n73113k122956j081943K78767k21086
$$ plain form
4659 68979819 69213467 69372508 69439079 68520760 68768881 68901895 67612778 66987365 67540650
4650 67540650 67113153 64005086 63299021 64121980 64057103 64401488 64298113 64699240 65515413
4641 65515413 64204758 62379394 61186264 63013914 61344264 61868905 60265741 58095709
4633 58095709 58823347 59351230 60517456 60531374 59107847 59429308 59659978 60034030 58913315
4624 58913315 56857319 56080098 56653299 56090572 56172636 55878235 57047786 56919398 56469638
4615 56469638 55704539 54432945 52645914 52784698 53132370 54214466 55068661 54448761 54119365
4606 54119365 53439130 51963007 51442975 52232361 52416578 51512014 50324230 50211763 49882213
4597 49882213 51153072 51337149 50467381 48831632 49450086 49166354 48522259 47904277 49541536
$$ packed form
4659F8979819K33648J59041O6571r18319K48121J33014j289117o25413N53285
4650F7540650m27497l108067p06065Q22959o4877L44385j03375M01127Q16173
4641F5515413j310655j825364j193130J827650j669650N24641j603164k170032
4633E8095709P27638N27883J166226J3918j423527L21461K30670L74052j120715
4624E8913315k055996p77221N73201n62727Q2064k94401J169551j28388m49760
4615E6469638p65099j271594j787031J38784L47672J082096Q54195o19900l29396
4606E4119365o80235j476123n20032P89386J84217r04564j187784j12467l29550
4597D9882213J270859J84077q69768j635749O18454k83732o44095o17982J637259
$$ plain form
4588 49541536 50541435 50389637 49543373 47303134 47354654 48106147 48021574 47089388 45907324
4579 45907324 45451739 46649610 46620002 46087591 44453177 43046003 43750748 44061783 43539529
4570 43539529 43135359 44986578 43872784 42520219 42279450 42987053 43034568 41210313 41201918
4561 41201918 40618724 41557776 42017591 41443348 40802903 40610313 41124243 40393165 40041381
4552 40041381 41604451 41784024 38650346 39791947 38972862 38773711 39081944 37623384 38237083
4543 38237083 38718169 39324416 37935535 37969405 38630386 39381406 38588063 37890564 37136666
4534 37136666 37236010 37805888 38241306 38357452 36964695 37064209 36206881 35281435 35845958 37543122
4524 37543122 35363843 36370280 35940996 36526776 35606995 36003058 35975222 35879798 35056039
$$ packed form
4588D9541536R99899j51798q46264k240239N1520P51493q4573r32186j182064
4579D5907324m55585J197871k9608n32411j634414j407174P04745L11035n22254
4570D3539529m04170J851219j113794j352565k40769P07603M7515j824255q395
4561D1201918n83194R39052M59815n74243o40445j92590N13930p31078l51784
4552D0041381J563070J79573l133678J141601q19085j99151L08233j458560O13699
4543C8237083M81086O06247j388881L3870O60981P51020p93343o97499p53898
4534C7136666R9344N69878M35418J16146j392757R9514q57328r25446N64523J697164
4524C7543122k179279J006437m29284N85780r19781L96063k7836r5424q23759
$$ plain form
4515 35056039 34834020 34652945 34700048 35086424 35580781 35317977 34205043 35184466 34215473
4506 34215473 34341404 34772153 35500649 35848004 35362171 35796732 33994709 32641742 34092826
4497 34092826 34453913 34738971 34446365 35655851 34860166 34965008 33715828 31981602 30291574
4488 30291574 31541535 31757115 31677018 32704226 33106600 34499951 33445658 32718559 34129682
4479 34129682 34217839 31935836 32527483 32285181 32690997 33840495 35156933 34401450 32962264
4470 32962264 34122853 34235495 34461177 34220478 34586806 33970642 33832214 32866468 34498320
4461 34498320 36874606 35916017 35292634 35194372 33734127 34131256 34837006 35772674 35964193
4452 35964193 37429243 36703046 36190393 37260135 38260427 37811401 37573479 38271373 39014265
$$ packed form
4515C5056039k22019j81075M7103L86376M94357k62804j112934R79423r68993
4506C4215473J25931M30749P28496L47355m85833M34561j802023j352967J451084
4497C4092826L61087K85058k92606J209486p95685J04842j249180j734226j690028
4488C0291574J249961K15580q0097J027208M02374J393351j054293p27099J411123
4479C4129682Q8157k282003N91647k42302M05816J149498J316438p55483j439186
4470C2962264J160589J12642K25682k40699L66328o16164j38428r65746J631852
4461C4498320K376286r58589o23383r8262j460245L97129P05750R35668J91519
4452C5964193J465050p26197n12653J069742J000292m49026k37922O97894P42892
$$ plain form
4443 39014265 39575195 38637486 38888048 38624869 37926698 37958037 39455136 40769811 41022070
4434 41022070 40934911 40415926 42317369 41691485 41724081 43516883 43156099 43113708 43646499 44672887
4424 44672887 45890375 48237439 48717060 48531069 50085939 51244890 52480858 52014351 53183596
4415 53183596 56238850 57368280 58314924 60370024 62068127 64065368 66751884 68446641
4407 68446641 69526453 72993548 77927681 82088879 87292132 91506210 98587874 105910558
4399 105910558 111145056 117070825 124401611 133969533 141979161 151260853 160560380 168020528
4391 168020528 176681435 184445314 192856505 202227462 211191518 217405931 223806202 229223975
4383 229223975 235246913 239348570 242232490 247286997 250115451 252786231 252847913 249230815
$$ packed form
4443C9014265N60930r37709K50562k63179o98171L1339J497099J314675K52259
4434D1022070q7159n18985J901443o25884L2596J792802l60784m2391N32791J026388
4424D4672887J217488K347064M79621j85991J554870J158951J235968m66507J169245
4415E3183596L055254J129430R46644K055100J698103J997241K686516J694757
4407F8446641J079812L467095M934133M161198N203253M214078P081664P322684
4399A05910558N234498N925769P330786R567922Q009628R281692R299527P460148
4391A68020528Q660907P763879Q411191R370957Q964056O214413O400271N417773
4383B29223975O022938M101657K883920N054507K828454K670780O1682l617098
$$ plain form
4375 249230815 244933910 240651777 234556354 228755094 221597447 216907867 212297178 203077346
4367 203077346 193598639 183286810 175410343 165075789 155439671 145295414 139695341 133032647
4359 133032647 124846228 116780429 107757438 101741661 95026369 86315169 81770562 78670386
4351 78670386 74570828 71049592 67718558 64508601 61965008 61037855 58019695 55863807
4343 55863807 54062388 52019491 51699803 50126968 48072828 43696221 42633600 43584644
4335 43584644 42188557 42893656 43305602 41881696 39678660 39167511 38517913 37670816 38382394
4326 38382394 36783501 34810155 36075759 34829349 33283378 33764788 33190428 32368729 32288992
4317 32288992 32172581 31133792 32149135 31800227 29815940 29925287 29563322 29455897 29270938
$$ packed form
4375B49230815m296905m282133o095423n801260p157647m689580m610689r219832
4367B03077346r478707j0311829p876467j0334554r636118j0144257n600073o662694
4359A33032647q186419q065799r022991o015777o715292q711200m544607l100176
4351G8670386m099558l521236l331034l209957k543593r27153l018160k155888
4343E5863807j801419k042897l19688j572835k054140m376607j062621R51044
4335D3584644j396087P05099M11946j423906k203036n11149o49598q47097P11578
4326C8382394j598893j973346J265604j246410j545971M81410n74360q21699p9737
4317C2288992j16411j038789J015343l48908j984287J09347l61965j07425j84959
$$ plain form
4308 29270938 28350382 28417965 28071608 28977786 27716300 26319539 26649720 27568444 26748211
4299 26748211 25839442 25836510 24817329 25995361 25120403 25911552 25117072 25441214 25817358
4290 25817358 25424109 24047574 24108703 23535933 23112289 22860647 22838378 23397623 21936027
4281 21936027 21620618 22891015 22840133 24103732 23242342 23069819 23631734 23417326 23541898
4272 23541898 22288825 21948752 21026372 19370093 19812598 20496681 20324703 20919550 19765284
4263 19765284 18839017 20724376 21027875 21005122 21309640 20911418 21096659 20576360 20622897 20150653
4253 20150653 19778232 20412660 17800160 18403530 19680606 18552965 19542940 19320312 20103993
4244 20103993 19545614 18502994 19383069 19659431 20783714 20599087 19930668 21100127 20308475
$$ packed form
4308B9270938r20556O7583l46357R06178j261486j396761L30181R18724q20233
4299B6748211r08769k932j019181J178032q74958P91149p94480L24142L76144
4290B5817358l93249j376535O1129n72770m23644k51642k2269N59245j461596
4281B1936027l15409J270397n0882J263599q61390j72523N61915k14408J24572
4272B3541898j253073l40073r22380j656279M42505O84083j71978N94847j154266
4263A9765284r26267J885359L03499k2753L04518l98222J85241n20299M6537m72244
4253B0150653l72421O34428k612500O03370J277076j127641R89975k22628P83681
4244B0103993n58379j042620Q80075K76362J124283j84627o68419J169459p91652
$$ plain form
4235 20308475 18485572 17629696 16712222 18168040 19186590 19249911 18544974 18668545 18356102
4226 18356102 18144973 17560327 18312428 19421838 17470532 18943728 19200026 18276554 17369881
4217 17369881 17146007 15936600 16692878 18456364 18612319 18954558 18374619 19781292 19686409
4208 19686409 18080382 19342728 19898122 19445812 18487004 17548104 16800220 18243801 18210498
4199 18210498 17837302 17652263 17946928 17852472 18232214 18335089 17753649 18252493 18378648 18427367
4189 18427367 16595472 15220194 18206896 18162229 17394565 17750755 17719551 17134324 16927442
4180 16927442 18196531 18287893 17811774 17435867 17754367 18861955 18771360 19180296 19364430
4171 19364430 20306606 20124906 17825418 18177684 19242725 18914872 18470364 18605965 18564870
$$ packed form
4235B0308475j822903q55876r17474J455818J018550O3321p04937J23571l12443
4226A8356102k11129n84646P52101J109410j951306J473196K56298r23472r06673
4217A7369881k23874j209407P56278J763486J55955L42239n79939J406673r4883
4208A9686409j606027J262346N55394m52310r58808r38900p47884J443581l3303
4199A8210498l73196j85039K94665r4456L79742J02875n81440M98844J26155M8719
4189A8427367j831895j375278K986702m4667p67664L56190l1204n85227k06882
4180A6927442J269089R1362m76119l75907L18500J107588r0595M08936J84134
4171A9364430R42176j81700k299488L52266J065041l27853m44508J35601m1095
$$ plain form
4162 18564870 19069024 18608393 17121206 18353588 18636746 19407281 19970860 19751338 20159116
4153 20159116 18493452 19114583 19776256 18329394 18522863 18111840 18955000 19442700 20435037
4144 20435037 20520545 18507822 19362672 19931969 20548263 20621701 21740309 21792194 20713303
4135 20713303 22024843 23189881 21321902 22079637 22208040 22558802 22174317 21879464 23894599
4126 23894599 24575218 24743152 25998393 25920098 25985455 26303856 27424960 27826125 26612481
4117 26612481 26064464 26570393 26602067 27819260 28575920 27288301 26182561 27486587 28587779
4108 28587779 29231665 29199265 28255956 30250005 30734820 31768089 33708488 32916306 34351171
4099 34351171 35648213 35709318 36495213 36123496 36703625 37263602 38423250 38987287 40800150
$$ packed form
4162A8564870N04154m60631j487187J232382K83158P70535N63579k19522M07778
4153B0159116j665664O21131O61673j446862J93469m11023Q43160M87700R92337
4144B0435037Q5508k012723Q54850N69297O16294P3438J118608N1885j078891
4135B0713303J311540J165038j867979P57735J28403L50762l84485k94853K015135
4126B3894599O80619J67934J255241p8295O5357L18401J121104M01165j213644
4117B6612481n48017N05929L1674J217193P56660j287619j105740J304026J101192
4108B8587779O43886l2400r43309J994049M84815J033269J940399p92182J434865
4099C4351171J297042O1105P85895l71717N80129N59977J159648N64037J812863
$$ plain form
4090 40800150 41280274 43381882 43970627 44677997 46155578 45717202 47221621 47709431 48115794
4081 48115794 48586540 51073684 52189331 52104983 53444025 55678262 57636157 60751521 62768277
4072 62768277 63505709 63792794 64042012 65720665 66413028 66587954 64816499 66330729 67117737
4063 67117737 65890767 66676355 68969825 69610139 69824293 70135396 70355780 70713045 69401128
4054 69401128 69751828 71231562 72797050 73214368 73564662 72639281 72961089 72174446 72861785
4045 72861785 72218017 71295439 72688419 72282549 72560021 73076002 73305806 71855536 72250882
4036 72250882 74638467 75603332 74065386 73789815 72993526 72392394 74441600 73730692 73321561
4027 73321561 74349425 74371680 73074916 72666553 72957964 74905675 74111981 73908887 75028539
$$ packed form
4090D0800150M80124K101608N88745P07370J477581m38376J504419M87810M06363
4081D8115794M70746K487144J115647q4348J339042K234237J957895L115364K016756
4072F2768277P37432K87085K49218J678653O92363J74926j771455J514230P87008
4063F7117737j226970P85588K293470O40314K14154L11103K20384L57265j311917
4054F9401128L50700J479734J565488M17318L50294r25381L21808p86643O87339
4045G2861785o43768r22578J392980m05870K77472N15981K29804j450270L95346
4036G2250882K387585R64865j537946k75571p96289o01132K049206p10908m09131
4027G3321561J027864K2255j296764m08363K91411J947711p93694k03094J119652
$$ plain form
4018 75028539 75750673 77106266 76621720 78745361 78714942 80536539 82133763 84538563 87413230
4009 87413230 89527104 94510845 98902486 105134807 111442304 118295850 126824622 136302393
4001 136302393 148269380 161902935 177292898 195724052 217659234 241339488 268555392
3994 268555392 297934773 326325973 345522317 345680013 321942917 281656532 239258640
3987 239258640 203598232 173941676 152924277 135145006 120095143 108339572 99986679
3980 99986679 94696747 87169992 83543912 77948757 73605605 70076800 67733216 65563269
3972 65563269 62686704 59744523 58241093 57464763 55301052 52635979 49131660 46808799
3964 46808799 46958408 46186762 43926178 42638993 42682124 42182181 41030320 41157421 39669855
$$ packed form
4018G5028539P22134J355593m84546K123641l0419J821597J597224K404800K874667
4009H7413230K113874M983741M391641O232321O307497O853546Q528772R477771
4001A36302393J1966987J3633555J5389963J8431154K1935182K3680254K7215904
3994B68555392K9379381K8391200J9196344J57696k3737096m0286385m2397892
3987B39258640l5660408k9656556k1017399j7779271j5049863j1755571q352893
3980I9986679n289932p526755l626080n595155m343152l528805k343584k169947
3972F5563269k876565k942181j503430p76330k163711k665073l504319k322861
3964D6808799J49609p71646k260584j287185M3131m99943j151861J27101j487566
$$ plain form
3955 39669855 39561597 37789657 35963881 35251798 33105763 32897554 32740528 32941662 32281470
3946 32281470 32724335 31663968 30663592 28891957 27465214 28608386 29553403 30381424 28972540
3937 28972540 27877652 28638048 27832933 26199276 25685648 26015881 26564415 24412785 24235332
3928 24235332 24379428 25529004 26648496 26231156 25293670 24388159 25734191 25887893 24928352
3919 24928352 23321827 22823234 20845121 22392550 24303725 22500530 22549428 22441111 21565923
3910 21565923 21621556 20069030 18771108 19050636 18968347 19339352 18972372 19549030 19881971
3901 19881971 21575600 20840301 20551632 19669186 18184398 19137158 19893160 18245804 18277944
3892 18277944 18336760 18843246 18590559 18659564 17718640 16419237 16486327 16675073 16137686 18112941
$$ packed form
3955C9669855j08258j771940j825776p12083k146035k08209j57026K01134o60192
3946C2281470M42865j060367j000376j771635j426743J143172R45017Q28021j408884
3937B8972540j094888P60396q05115j633657n13628L30233N48534k151630j77453
3928B4235332J44096J149576J119492m17340r37486r05511J346032J53702r59541
3919B4928352j606525m98593j978113J547429J911175j803195M8898j08317q75188
3910B1565923N5633j552526j297922K79528q2289L71005l66980N76658L32941
3901A9881971J693629p35299k88669q82446j484788R52760P56002j647356L2140
3892A8277944N8816N06486k52687O9005r40924j299403O7090J88746n37387J975255
$$ plain form
3882 18112941 18615044 17884490 18357552 18622946 17830905 17954866 19398236 18850639 17792162
3873 17792162 16747930 16277753 17174760 16856033 16877321 16343625 16996216 16967388 17293218 17537626
3863 17537626 17407451 18263500 17560660 18449152 17612811 16908939 16972902 17206142 17324793 16770835
3853 16770835 17299593 17840317 18659797 17600290 16979563 17845424 17179661 16370863 17197638
3844 17197638 16754290 15929902 17340818 18308296 18561696 16661699 17238463 16488278 18054040
3835 18054040 17905690 17005412 16533257 18750381 19539421 19056987 19863347 20158278 17219302
3826 17219302 18593689 19143874 18313041 18537571 17648579 17341774 17286257 16181653 17169930
3817 17169930 18315809 18786357 17982177 18578888 20001514 18679275 17907956 18009434 18675635
$$ packed form
3882A8112941N02103p30554M73062K65394p92041J23961J443370n47597j058477
3873A7792162j044232m70177Q97007l18727K1288n33696O52591k8828L25830K44408
3863A7537626j30175Q56049p02840Q88492q36341p03872O3963K33240J18651n53958
3853A6770835N28758N40724Q19480j059507o20727Q65861o65763q08798Q26775
3844A7197638m43348q24388J410916R67478K53400j899997N76764p50185J565762
3835A8054040j48350r00278m72155K217124P89040m82434Q06360K94931k938976
3826A7219302J374387N50185q30833K24530q88992l06805n5517j104604R88277
3817A7169930J145879M70548q04180N96711J422626j322239p71319J01478O66201
$$ plain form
3808 18675635 18545364 18091525 18630713 19990543 20140095 18587553 17284152 19882674 21468921
3799 21468921 18381281 16774027 17522586 17956086 20029354 21459764 22164411 21853336 19716816
3790 19716816 20670166 21949400 21231384 20833086 19318561 19046399 19522690 21776878 22236523
3781 22236523 23102515 23673145 23533115 21469307 21893938 22197228 24075614 24795902 22718341
3772 22718341 22713640 24166506 24469186 24433805 24698797 25270974 25025402 24416813 25559323 24955729
3762 24955729 26322813 25942791 26562660 25221623 25042977 26171385 26680274 25558416 24888469
3753 24888469 25886030 25635749 25403836 28330230 28079105 27080787 28210725 29211644 29859110
3744 29859110 31688546 32694394 31496645 31587859 32544786 32825174 31098399 32338370 32672323
$$ packed form
3808A8675635j30271m53839N39188J359830J49552j552542j303401K598522J586247
3799B1468921l087640j607254P48559M33500K073268J430410P04647l11075k136520
3790A9716816R53350J279234p18016l98298j514525k72162M76291K254188M59645
3781B2236523Q65992N70630j40030k063808M24631L03290J878386P20288k077561
3772B2718341m701J452866L02680l5381K64992N72177k45572o08589J142510o03594
3762B4955729J367084l80022O19869j341037j78646J128408N08889j121858o69947
3753B4888469R97561k50281k31913K926394k51125r98318J129938J000919O47466
3744B9859110J829436J005848j197749R1214R56927K80388j726775J239971L33953
$$ plain form
3735 32672323 33511688 33845567 34206327 34429027 34911773 35998384 37004588 35799439 34949343
3726 34949343 36859864 37922677 37360389 37270835 37609849 37482576 39008662 40872611 40448018
3717 40448018 41577324 40480864 40276718 40690787 40846216 40948264 43757179 45045811 45131425
3708 45131425 46317245 45545563 46227307 48766114 48567910 47804493 49055891 50371904 49282575
3699 49282575 50788458 50423087 50811639 51763738 52365662 52208729 52172555 52342545 53201910
3690 53201910 54038103 55015606 54870010 55781419 57386238 56642423 56483497 57040363 57918358
3681 57918358 58550081 60093485 60481736 60023664 61629011 61795795 62954614 64154078 64198094
3672 64198094 63950691 64393515 65253349 65054984 65139838 65309857 67851339 68406815 70172200
$$ packed form
3735C2672323Q39365L33879L60760K22700M82746J086611J006204j205149q50096
3726C4949343J910521J062813n62288q9554L39014j27273J526086J863949m24593
3717D0448018J129306j096460k04146M14069J55429J02048K808915J288632Q5614
3708D5131425J185820p71682O81744K538807j98204p63417J251398J316013j089329
3699D9282575J505883l65371L88552R52099O01924j56933l6174J69990Q59365
3690E3201910Q36193R77503j45596R11409J604819p43815j58926N56866Q77995
3681E7918358O31723J543404L88251m58072J605347J66784J158819J199464M4016
3672F4198094k47403M42824Q59834j98365Q4854J70019K541482N55476J765385
$$ plain form
3663 70172200 69520318 70721984 70866073 72589044 74432341 75066695 75702072 76599482 76299638
3654 76299638 76284489 75607133 75710110 77218518 79288500 79929533 80098758 79724554 80403495
3645 80403495 80956615 82068385 83025819 82502211 82664360 83388235 83724243 84575335 85563672
3636 85563672 85184562 84823853 84560288 86638956 88568129 87933889 87434306 85824218 84722378
3627 84722378 85392556 85590772 84920028 85955599 86074306 86117113 86905676 86464358 86454874 85545935
3617 85545935 86809374 85293981 83268113 84695017 83877379 82844972 83017933 83174806 82173052
3608 82173052 82211499 81549057 82033214 82669397 80089461 81513731 81587936 80076811 80777626
3599 80777626 80898388 80718886 79997938 79389530 79054430 79781287 78881955 77522436 78151715
$$ packed form
3663G0172200o51882J201666J44089J722971J843297O34354O35377Q97410k99844
3654G6299638j5149o77356J02977J508408K069982O41033J69225l74204O78941
3645H0403495N53120J111770R57434n23608J62149P23875L36008Q51092R88337
3636H5563672l79110l60709k63565K078668J929173o34240m99583j610088j101840
3627H4722378O70178J98216o70744J035571J18707M2807P88563m41318r484r08939
3617H5545935J263439j515393k025868J426904q17638j032407J72961J56873j001754
3608H2173052L8447o62442M84157O36183k579936J424270P4205j511125P00815
3599H0777626J20762j79502p20948o08408l35100P26857q99332j359519O29279
$$ plain form
3590 78151715 78227080 76084150 75433923 74965188 75371184 75792059 76016825 75884019 77264135
3581 77264135 78715942 77788783 75401750 75600463 76054348 77782050 74948353 72662300 73643652
3572 73643652 74048922 75739264 75808114 75704788 74002863 74287422 73712851 73954330 75190963
3563 75190963 75426918 75163109 74624350 75034456 75828261 75208596 76142432 74208378 74582754
3554 74582754 76601318 76434765 76387259 75266751 76019852 75960432 76316959 77718837 76876977
3545 76876977 77712288 78887594 80072079 79621032 79349943 79643241 80510268 79691451 80742655
3536 80742655 81245154 80153964 80765655 82624014 83661286 83757405 84644502 85386421 84958390
3527 84958390 85793571 87063154 85960315 88742761 89009818 88514822 90154484 91566435 92354544
$$ packed form
3590G8151715P5365k142930o50227m68735M05996M20875K24766j32806J380116
3581G7264135J451807r27159k387033J98713M53885J727702k833697k286053R81352
3572G3643652M05270J690342O8850j03326j701925K84559n74571K41479J236633
3563G5190963K35955k63809n38759M10106P93805o19665R33836j934054L74376
3554G4582754K018564j66553m7506j120508P53101n9420L56527J401878q41860
3545G6876977Q35311J175306J184485m51047k71089K93298Q67027q18817J051204
3536H0742655N02499j091190O11691J858359J037272R6119Q87097P41919m28031
3527H4958390Q35181J269583j102839K782446K67057m94996J639662J411951P88109
$$ plain form
3518 92354544 92040875 92776685 92585030 93146704 92229157 92779284 93620164 95071610 95347564
3509 95347564 95447867 96756158 98212378 99407312 99069151 98200975 99680157 101831647 102431720
3500 102431720 103414866 103938742 103663035 105063681 105982503 106380804 107112371 109932772 110364094
3491 110364094 110991664 111141868 113830081 115861758 115882914 116913596 118129031 120391639 121241093
3482 121241093 123174838 124677690 125251308 124972825 125412052 127242929 129484215 129474245 132167548
3473 132167548 133226622 134864403 135272431 136765294 137966989 136098313 136457832 138986859
3465 138986859 141699458 141693739 143832667 143356170 142769516 145105659 146278311 146916494 145277879
3456 145277879 145234536 146601063 147039959 146929211 146398588 146984338 146971870 146914647 146281297 146053265
$$ packed form
3518I2354544l13669P35810j91655N61674r17547N50127Q40880J451446K75954
3509I5347564J00303J308291J456220J194934l38161q68176J479182K151490O00073
3500A02431720R83146N23876k75707J400646R18822L98301P31567K820401M31322
3491A10364094O27570J50204K688213K031677K1156J030682J215435K262608Q49454
3482A21241093J933745J502852N73618k78483M39227J830877K241286r970K693303
3473A32167548J059074J637781M08028J492863J201695j868676L59519K529027
3465A38986859K712599n719K138928m76497n86654K336143J172652O38183j638615
3456A45277879m3343J366527M38896j10748n30623N85750j2468n7223o33350k28032
$$ plain form
3446 146053265 144637186 144843089 143331062 142816843 142405169 140466789 139419733 138519653 139570048
3437 139570048 138480044 138030061 135256160 135684642 136602023 134587356 132035255 131377520 129892377
3428 129892377 130694308 129331464 126123550 126478380 125561187 123060538 121483880 120093616
3420 120093616 118346359 119061620 117867417 117883191 118750424 116968653 116462098 115444759 114694703
3411 114694703 114264302 112656438 110679440 109056637 107074169 105710217 105235482 102696637
3403 102696637 101220567 101896234 101009423 100236212 99064428 98657574 96489658 97446492 95906134
3394 95906134 96185017 95256986 94551005 94189058 92680300 89126257 88894031 88627732 88711028
3385 88711028 88678595 87220460 86867578 85831343 85396637 85673676 84920739 82615300 81906944
$$ packed form
3446A46053265j416079K05903j512027n14219m11674j938380j047056r00080J050395
3437A39570048j090004m49983k773901M28482R17381k014667k552101o57735j485143
3428A29892377Q01931j362844l207914L54830r17193k500649j576658j390264
3420A20093616j747257P15261j194203J5774Q67233j781771n06555j017339p50056
3411A14694703m30401j607864j976998j622803j982468j363952m74735k538845
3403A02696637j476070O75667q86811p73211j171784m06854k167916R56834j540358
3394I5906134K78883r28031p05981l61947j508758l554043k32226k66299Q3296
3385H8711028l2433j458135l52882j036235m34706K77039p52937k305439p08356
$$ plain form
3376 81906944 81490822 83095725 83650893 82352051 80742538 79413243 78963968 80315891 80231473
3367 80231473 81619708 79726104 78143799 78089846 78093616 76279547 76757314 75828268 77549587
3358 77549587 79136891 77889334 75616394 75323477 75002312 74819264 74448717 74025618 73326676
3349 73326676 72803115 73570156 73201020 71856184 72275976 72848103 73662360 72770169 71503143
3340 71503143 72139751 72256399 72390438 74534055 73945336 73446290 72816183 71705532 73838227
3331 73838227 73535086 74980582 75579615 74004286 73285997 73999250 75791574 75964107 77797145
3322 77797145 78384919 79175041 79623667 79035378 80669168 81319559 81857852 83498130 84831870
3313 84831870 85425841 86764343 87537603 87255988 88794917 90657219 91553445 94074728 95470852
$$ packed form
3376H1906944m16122J604903N55168j298842j609513j329295m49275J351923q4418
3367H0231473J388235j893604j582305n3953L770j814069M77767r29046J721319
3358G7549587J587304j247557k272940k92917l21165j83048l70547m23099o98942
3349G3326676n23561P67041l69136j344836M19792N72127Q14257q92191j267026
3340G1503143O36608J16648J34039K143617n88719m99046o30107j110651K132695
3331G3838227l03141J445496N99033j575329p18289P13253J792324J72533J833038
3322G7797145N87774P90122M48626n88289J633790O50391N38293J640278J333740
3313H4831870N93971J338502P73260k81615J538929J862302Q96226K521283J396124
$$ plain form
3304 95470852 95909861 95801072 97576291 99487458 101384391 101933471 102851677 105007658 107413817
3295 107413817 108477777 110973341 113020676 114485445 117391831 119019245 120852895 121829609
3287 121829609 123886640 127817792 132741295 135390598 136575112 138870609 142310390 146319698
3279 146319698 149796260 153851009 155805140 158591919 163011793 167199941 171803027 175852258
3271 175852258 181461896 186779849 190843556 194470204 198860623 202283406 207208842 213510532
3263 213510532 218388816 221461605 225127845 229203531 233377170 237917221 241898525 244620160
3255 244620160 247663228 248729915 251289957 254469055 255105403 255776824 255383051 254784280 256137073
3246 256137073 256133098 257316536 257133581 255079952 252854255 248780303 247173364 243061619 239049717
$$ packed form
3304I5470852M39009j08789J775219J911167J896933N49080R18206K155981K406159
3295A07413817J063960K495564K047335J464769K906386J627414J833650R76714
3287A21829609K057031L931152M923503K649303J184514K295497L439781M009308
3279A46319698L476562M054749J954131K786779M419874M188148M603086M049231
3271A75852258N609638N317953M063707L626648M390419L422783M925436O301690
3263B13510532M878284L072789L666240M075686M173639M540051L981304K721635
3255B44620160L043068J066687K560042L179098O36348O71421l93773n98771J352793
3246B56137073l975J183438j82955k053629k225697m073952j606939m111745m011902
$$ plain form
3237 239049717 234475754 233061332 228474119 224275562 220807524 215597770 213017553 209868570
3229 209868570 205722488 201870474 196915748 194995608 191849111 185582562 181457281 178270809
3221 178270809 174997961 171936560 168476070 163809243 160413047 157023730 152977143 149820873
3213 149820873 146517429 142240198 138580598 136200918 132811730 130766175 127939954 124935218
3205 124935218 123874979 121563930 119628141 115910176 113077849 110628661 108190091 106489155
3197 106489155 105477249 105946622 102745711 100111861 98240748 97679027 98349657 97469875 95777409
3188 95777409 93798463 95145620 92265850 91452746 91382696 91491085 90702194 88617469 89326624
3179 89326624 88741067 88825721 88466194 87718678 86559978 86335100 85884391 86449149 89640384
$$ packed form
3237B39049717m573963j414422m587213m198557l468038n209754k580217l148983
3229B09868570m146082l852014m954726j920140l146497o266549m125281l186472
3221A78270809l272848l061401l460490m666827l396196l389317m046587l156270
3213A49820873l303444m277231l659600k379680l389188k045555k826221l004736
3205A24935218j060239k311049j935789l717965k832327k449188k438570j700936
3197A06489155j011906M69373l200911k633850j871113n61721O70630q79782j692466
3188I5777409j978946J347157k879770q13104p0050J08389p88891k084725P09155
3179H9326624n85557Q4654l59527p47516j158700k24878m50709N64758L191235
$$ plain form
3170 89640384 86743811 87053669 87703270 85563575 84336443 84709769 83933084 84524464 84019123
3161 84019123 82641198 82675732 82403483 82366140 81786478 82851962 82198589 81178307 80469675
3152 80469675 82256002 81837191 82902252 82859493 82900899 82744452 82102554 82727407 84165265
3143 84165265 83672701 84967141 86076679 87090603 86920310 87229733 86364758 87134234 89741219
3134 89741219 91183188 92556415 93975736 93231846 94135675 95842218 96632063 97283863 97145024
3125 97145024 97215237 98842603 101146154 101997707 104777702 105509144 107145616 108134237 108357713
3116 108357713 110309814 110644123 111022327 112909637 112519575 113932891 112739071 113866659
3108 113866659 113806574 114950316 115164478 114674893 114970132 115045964 114896622 114553328 113060381
$$ packed form
3170H9640384k896573L09858O49601k139695j227132L73326p76685N91380n05341
3161H4019123j377925L4534k72249l7343n79662J065484o53373j020282p08632
3152H0469675J786327m18811J065061m2759M1406j56447o41898O24853J437858
3143H4165265m92564J294440J109538J013924j70293L09423q64975P69476K606985
3134H9741219J441969J373227J419321p43890R03829J706543P89845O51800j38839
3125I7145024P0213J627366K303551Q51553K779995P31442J636472R88621K23476
3116A08357713J952101L34309L78204J887310l90062J413316j193820J127588
3108A13866659o0085J143742K14162m89585K95239P5832j49342l43294j492947
$$ plain form
3099 113060381 112790313 112505178 111674167 111990282 113047622 113486853 112762516 110973331 109901105
3090 109901105 110818011 111660441 112469749 110524492 110809589 109757114 108356216 106733931 106244884
3081 106244884 105083885 101224730 99888204 99146789 98051725 96809910 95760460 94289632
3073 94289632 91963416 89935831 89094698 87917251 86290803 86130741 84370547 83444397 83375989
3064 83375989 82579581 81484004 80963465 80502071 80826789 80914679 78069336 77098303 77983931
3055 77983931 77179749 77969269 75589420 74023465 72967312 70442414 69521152 67959198 66147479
3046 66147479 64790747 63669940 62330314 61677002 59583739 58190630 57522253 58007025 57353929
3037 57353929 57081968 56108309 56012269 56019275 55467288 56159950 56316145 57620296 56188800 55397855
$$ packed form
3099A13060381k70068k85135q31011L16115J057340M39231p24337j789185j072226
3090A09901105R16906Q42430Q09308j945257K85097j052475j400898j622285m89047
3081A06244884j160999l859155j336526p41415j095064j241815j049450j470828
3073I4289632k326216k027585q41133j177447j626448j60062j760194r26150o8408
3064H3375989p96408j095577n20539m61394L24718Q7890k845343r71033Q85628
3055G7983931q04182P89520k379849j565955j056153k524898r21262j561954j811719
3046F6147479j356732j120807j339626o53312k093263j393109o68377M84772o53096
3037E7353929k71961r73659r6040P006n51987O92662J56195J304151j431496p90945
$$ plain form
3027 55397855 56503855 57851161 55453808 56509018 56793790 57008490 57039326 56870362 53732742
3018 53732742 52183264 52563444 49368806 48674234 48407074 46922127 45227243 47322641 45010049
3009 45010049 44536703 43822542 43688571 43517752 43452485 42532239 41285331 41500780 39191503
3000 39191503 41192155 41437054 40976134 41281334 39783790 39827388 38183701 37798499 39427657
2991 39427657 39732552 40736009 39662425 38123950 38036395 37771456 39370556 37753660 37470971
2982 37470971 36264273 36959647 36277302 36993656 37627392 36358346 36976704 37296087 38572665
2973 38572665 37854459 36623854 36123434 38385711 39474030 38317439 39297367 39497743 39525742
2964 39525742 40501699 39997978 39103691 40711656 39996553 38746132 38910930 40856597 42326684
$$ packed form
3027E5397855J106000J347306k397353J055210K84772K14700L0836j68964l137620
3018E3732742j549478L80180l194638o94572k67160j484947j694884K095398k312592
3009D5010049m73346p14161j33971j70819o5267r20246j246908K15449k309277
3000C9191503K000652K44899m60920L05200j497544M3598j643687l85202J629158
2991C9427657L04895J003457j073584j538475q7555k64939J599100j616896k82689
2982C7470971j206698O95374o82345P16354O33736j269046O18358L19383J276578
2973C8572665p18206j230605n00420K262277J088319j156591R79928K00376K7999
2964C9525742R75957n03721q94287J607965p15103j250421J64798J945667J470087
$$ plain form
2955 42326684 42976276 43646819 43909621 44729325 44962831 44718404 44621029 44266900 44497409 45001587
2945 45001587 45300445 47933211 46010675 46217592 48035424 49747397 49647685 50175622 51618249
2936 51618249 50937464 52344850 54015517 54489090 54925655 54402889 56716917 58147849 58335207
2927 58335207 60016358 60523483 61151676 63820669 64024463 63597137 65407694 66864974 67311991
2918 67311991 68538077 70713862 72851433 73564573 76023509 77929828 79929947 79305433
2910 79305433 80695100 83257892 84706077 87609058 88904252 90394216 93502104 93996267
2902 93996267 96297722 98853814 100459495 101962534 103392437 105912128 108705693 111307215
2894 111307215 112761746 115448497 119011387 121631383 124185359 127995386 131521829 134918665
$$ packed form
2955D2326684O49592O70543K62802Q19704K33506k44427r7375l54129K30509N04178
2945D5001587K98858K632766j922536K06917J817832J711973r9712N27937J442627
2936E1618249o80785J407386J670667M73573M36565n22766K314028J430932J87358
2927E8335207J681151N07125O28193K668993K03794m27326J810557J457280M47017
2918F7311991J226086K175785K137571P13140K458936J906319K000119o24514
2910G9305433J389667K562792J448185K902981J295194J489964L107888M94163
2902I3996267K301455K556092J605681J503039J429903K519691K793565K601522
2894A11307215J454531K686751L562890K619996K553976L810027L526443L396836
$$ plain form
2886 134918665 137662288 140038651 144859486 148748624 153347266 157651711 162339842 168552326
2878 168552326 173659834 178820486 183838399 191087565 196475829 201266512 206277164 212747072
2870 212747072 216356188 221615880 228464446 234292125 241348617 249850567 255866962 261159395
2862 261159395 268913057 278670595 288347093 297341247 307296514 318317822 329356406 339230470
2854 339230470 349743082 360549019 371024273 381999001 392200484 403454436 412556055
2847 412556055 419378831 428163782 434385453 439309516 442785651 442666837 440157359 437602307
2839 437602307 432875343 425895913 417096464 406436605 396897633 385338875 374550843 362164193
2831 362164193 350187510 337759517 326621376 315647654 303454889 292094675 282577605
$$ packed form
2886A34918665K743623K376363M820835L889138M598642M304445M688131O212484
2878A68552326N107508N160652N017913P249166N388264M790683N010652O469908
2870B12747072L609116N259692O848566N827679P056492Q501950O016395N292433
2862B61159395P753662R757538R676498Q994154R955267J1021308J1038584R874064
2854C39230470J0512612J0805937J0475254J0974728J0201483J1253952R101619
2847D12556055O822776Q784951O221671M924063L476135j18814k509478k555052
2839D37602307m726964o979430q799449j0659859r538972j1558758j0788032j2386650
2831C62164193j1976683j2427993j1138141j0973722j2192765j1360214r517070
$$ plain form
2824 282577605 273117086 263000015 254615339 246831546 237324887 229091072 220209290 211955167
2816 211955167 205130520 199138132 192012583 185027478 180034671 174754861 168709675 163151159
2808 163151159 157964314 152914115 147069989 142478503 138377983 133855997 129927736 125048844
2800 125048844 122348785 120996037 117383983 113528937 109954146 107138720 103953407 100520518
2792 100520518 97807543 95938954 95098323 92776913 89782614 86576705 84893636 82877703
2784 82877703 81970663 79762623 77133658 74873625 73002069 71613424 71032430 70116292 68857011
2775 68857011 66099653 63922616 64124316 64695954 61737934 60578632 61587862 60151610
2767 60151610 58719499 57978963 56490169 56606871 55742170 53725774 52974228 51737260 51991060
$$ packed form
2824B82577605r460519j0117071q384676p783793r506659q233815q881782q254123
2816B11955167o824647n992388p125549o985105m992807n279810o045186n558516
2808A63151159n186845n050199n844126m591486m100520m521986l928261m878892
2800A25048844k700059j352748l612054l855046l574791k815426l185313l432889
2792A00520518k712975j868589q40631k321410k994299l205909j683069k015933
2784H2877703r07040k208040k628965k260033j871556j388645n80994r16138j259281
2775F8857011k757358k177037K01700N71638k958020j159302J009230j436252
2767F0151610j432111p40536j488794J16702q64701k016396p51546j236968K53800
$$ plain form
2758 51991060 50905955 49213582 48869703 48388104 47340441 46494682 46612446 46880509 47695909
2749 47695909 46307861 46275028 45943273 45367790 43717562 40544393 40036129 42356121 41282161
2740 41282161 40374853 40763125 39904908 39554769 37229115 37284784 38614520 37397502 35747298
2731 35747298 35507868 35070249 35439337 33303440 32187600 32218769 31509789 32561698 31705848
2722 31705848 30725519 30300881 28706412 28048682 26597532 28133448 28001943 25770901 26202130
2713 26202130 27192941 26679938 25945360 24560306 23483648 24058637 23474095 22820622 21162665
2704 21162665 22423493 22512071 21599376 20797550 21014250 19887534 19931506 21483161 20659905
2695 20659905 19846626 18844840 18390494 19820110 19218080 17856305 16015909 15835335 16578376
$$ packed form
2758E1991060j085105j692373l43879m81599j047663q45759J17764K68063Q15400
2749D7695909j388048l2833l31755n75483j650228l173169n08264K319992j073960
2740D1282161r07308L88272q58217l50139k325654N5669J329736j217018j650204
2731C5747298k39430m37619L69088k135897j115840L1169p08980J051909q55850
2722C1705848r80329m24638j594469o57730j451150J535916j31505k231042M31229
2713B6202130R90811n13003p34578j385054j076658N74989n84542o53473j657957
2704B1162665J260828Q8578r12695q01826K16700j126716M3972J551655q23256
2695B0659905q13279j001786m54346J429616o02030j361775j840396j80574P43041
$$ plain form
2686 16578376 16388611 15059468 15674789 16227428 15511651 15131085 14831114 14225869 13983934
2677 13983934 14851836 14542804 13659445 13138748 12368091 11963758 12155629 13081320 13863467
2668 13863467 14468930 12922647 11715430 12849635 12815014 12322013 10287355 10518105 10196951
2659 10196951 10344391 10544510 11196397 12250281 12163493 12572326 11419393 9515661 9950402
2650 9950402 8786997 7740424 7098637 7185461 6351780 7816542 8461050 8505840 8653024
2641 8653024 10092241 8857531 8257769 8985118 8528441 7728022 6943837 7065549 6801217
2632 6801217 7715291 7693480 7926455 8231130 8728604 7441565 7657216 7434251 6825949 7079908
2622 7079908 7344776 8343719 5826926 5278317 5081355 5439036 6132070 4902556 5280576
$$ packed form
2686A6578376j89765j329143O15321N52639p15777l80566k99971o05245k41935
2677A3983934Q67902l09032q83359n20697p70657m04333J91871R25691P82147
2668A3863467O05463j546283j207217J134205l4621m93001k034658K30750l21154
2659A0196951J47440K00119O51887J053884q6788M08833j152933j903732M34741
2650I950402j163405j046573o41787Q6824q33681J464762O44508M4790J47184
2641H653024J439217j234710n99762P27349m56677q00419p84185J21712k64332
2632F801217R14074k1811K32975L04675M97474j287039K15651k22965o08302K53959
2622G079908K64868R98943k516793n48609j96962L57681O93034j229514L78020
$$ plain form
2613 5280576 5716322 6542258 6387104 7626426 7048788 6655792 5814689 5586892 5219277
2604 5219277 4653115 5104145 4766814 4874057 3506269 5001284 5774358 4997812 5541341
2595 5541341 4949738 5813983 7578220 6614364 5930008 6422167 6288626 4617194 4574711
2586 4574711 5577165 5371916 4999261 4812905 5565084 6853092 6952588 7456800 4925496
2577 4925496 3189155 4647289 3798270 4490355 4475278 4404389 3848123 3057648 5604230
2568 5604230 6876999 4817330 2561837 3722171 4262730 2831032 4227933 5113065 4371865
2559 4371865 5202374 6610235 5379453 5681559 5635965 5655536 5857057 5277665 6431729
2550 6431729 4839062 4792882 4841562 3693623 2937146 3559240 4735193 4416019 3503537
$$ packed form
2613E280576M35746Q25936j55154J239322n77638l92996q41103k27797l67615
2604E219277n66162M51030l37331J07243j367788J495015P73074p76546N43529
2595E541341n91603Q64245J764237r63856o84356M92159j33541j671432m2483
2586D574711J002454k05249l72655j86356P52179J288008R9496N04212k531304
2577D925496j736341J458134q49019O92085j5077p0889n56266p90475K546582
2568E604230J272769k059669k255493J160334N40559j431698J396901Q85132p41200
2559D371865Q30509J407861j230782L02106m5594J9571K01521n79392J154064
2550F431729j592667m6180M8680j147939p56477O22094J175953l19174r12482
$$ plain form
2541 3503537 3163049 3604435 4082669 3196227 2046437 4058631 5535304 4009402 4286594
2532 4286594 3621462 3873297 3078160 1439689 2549644 2308952 1646074 1402358 2174693
2523 2174693 1565290 1086613 1710220 2069013 3447313 2966005 1484690 1197440 2586159
2514 2586159 2702347 1069709 1510689 1489335 3463375 2002535 2651983 2889660 2165136
2505 2165136 1803439 1565691 1683347 1435728 1782369 2257763 1350738 2736435 3454032
2496 3454032 1801551 1331976 1233837 2325835 2730954 2820233 2980700 1348903 1101422
2487 1101422 1712066 1507245 3409172 2603551 1476763 1557956 1772218 519492 1299702
2478 1299702 1813801 2606394 853196 -1257574 427562 1254568 1798128 1825149 809575
$$ packed form
2541C503537l40488M41386M78234q86442j149790K012194J476673j525902K77192
2532D286594o65132K51835p95137j638471J109955k40692o62878k43716P72335
2523B174693o09403m78677O23607L58793J378300m81308j481315k87250J388719
2514B586159J16188j632638M40980k1354J974040j460840O49448K37677p24524
2505B165136l61697k37748J17656k47619L46641M75394r07025J385697P17597
2496C454032j652481m69575r8139J091998M05119Q9279J60467j631797k47481
2487A101422O10644k04821J901927q05621j126788Q1193K14262j252726P80210
2478A299702N14099P92593j753198k110770J685136Q27006N43560K7021j015574
$$ plain form
2469 809575 31113 499334 642477 599184 70374 843156 622273 308093 -955522 -1509991
2459 -1509991 -480023 246906 77052 1530789 -392650 -949166 -222132 -789046 -1116648
2450 -1116648 -448892 1371815 1958693 766907 822158 -25720 597904 610426 13002 445419
2440 445419 387479 1462993 8691 50385 14635 102170 -265133 650672 1688083 2419068
2430 2419068 2133471 2578052 1584024 863209 497272 2528277 1945940 1602624 1915928
2421 1915928 1586114 1351809 1930528 1342683 1770657 1496491 1166472 1834355 1211625 734805
2411 734805 -44698 -405080 -465138 -310938 262000 600947 672752 674028 -1103920 -1854192
2401 -1854192 263512 1578412 1344811 1155470 648810 1414506 2147035 2158944 1982764
$$ packed form
2469H09575p78462M68221J43143m3293n28810P72782k20883l14180j263615n54469
2459a509991J029968P26929j69854J453737j923439n56516P27034n66914l27602
2450a116648O67756J820707N86878j191786N5251q47878O23624J2522n97424M32417
2440D45419n7940J075514j454302M1694l5750Q7535l67303R15805J037411P30985
2430B419068k85597M44581r94028p20815l65937K031005n82337l43316L13304
2421A915928l29814k34305N78719n87845M27974k74166l30019O67883o22730m76820
2411G34805p79503l60382o0058J54200N72938L38947P1805J276j777948p50272
2401a854192K117704J314900k33601j89341n06660P65696P32529J1909j76180
$$ plain form
2392 1982764 682782 -110420 617196 1297797 738551 1363535 929543 -1211085 -1026682
2383 -1026682 -76316 -420430 -1269851 -775580 -206135 -103436 -301811 722974 -1440922
2374 -1440922 -963939 1308346 522147 471044 1602290 1820706 1159983 480999 -77866
2365 -77866 446274 -454395 -1171284 -309870 755974 407704 -703060 482388 532589 587256
2355 587256 62638 -485292 -86488 1038402 930099 1052754 -58315 -155236 749437 -1083103
2345 -1083103 -1652986 -996992 183869 -60915 56784 584807 303202 57101 12964 -20214
2335 -20214 636685 969357 973131 -320899 215239 746827 1049670 79154 -1929619 -1136863
2325 -1136863 -723162 303872 -425768 -612385 -746098 -26032 -723163 -1098116 -889975
$$ packed form
2392A982764j299982p93202P27616O80601n59246O24984m33992k140628J84403
2383a026682R50366l44114q49421M94271N69445J02699j98375J024785k163896
2374a440922M76983K272285p86199n1103J131246K18416o60723o78984n58865
2365g7866N24140r00669p16889Q61414J065844l48270j110764J185448N0201N4667
2355E87256n24618n47930L98804J124890j08303J22655j111069r6921R04673j832540
2345a083103n69883O55994J180861k44784J17699N28023k81605k46101m4137l3178
2335b0214O56899L32672L774j294030N36138N31588L02843r70516k008773P92756
2325a136863M13701J027034p29640j86617j33713P20066o97131l74953K08141
$$ plain form
2316 -889975 -2524762 -3039299 -2571307 -1667054 -1199291 -766868 -1047757 -729175 -160586 829105
2306 829105 -269505 -299032 179922 -1028057 -2474252 -1482279 -892653 116530 247326
2297 247326 -427154 -1163846 -428165 -294561 -1837267 -1892721 -2307574 -384050 -211208 -222579
2287 -222579 -380604 -748538 -1017968 -489366 820692 -276788 -852376 -783742 -975462 714433
2277 714433 95252 -1075118 -258477 48021 121456 509464 -20356 159266 -46881 -198142
2267 -198142 -699573 -1421440 128141 -422150 -1561273 -948658 365989 -1076015 -499981
2258 -499981 -32231 -20450 133275 1268372 1403660 -312698 -1570877 -2649757 -1044228
2249 -1044228 526440 696913 -474243 -2488154 -2587658 -1617702 -1345033 -414922 -956410
$$ packed form
2316h89975j634787n14537M67992R04253M67763M32423k80889L18582N68589R89691
2306H29105j098610k9527M78954j207979j446195R91973N89626J009183J30796
2297B47326o74480p36692P35681J33604j542706n5454m14853J923524J72842j1371
2287b22579j58025l67934k69430N28602J310058j097480n75588O8634j91720J689895
2277G14433o19181j170370Q16641L06498P3435L88008n29820J79622k06147j51261
2267a98142n01431p21867J549581n50291j139123O12615J314647j442004N76034
2258d99981M67750J1781J53725J135097J35288j716358j258179j078880J605529
2249a044228J570668J70473j171156k013911r9504R69956K72669R30111n41488
$$ plain form
2240 -956410 102265 192863 312014 169728 -130649 -415766 128422 206302 1069432 -243218
2230 -243218 -1399094 -379243 -457278 -1205549 -1344863 -579903 -508653 -1793315 -1718052 230799
2220 230799 -1090911 -1497192 -466260 -668103 -457639 1213688 2130893 105599 -1106811
2211 -1106811 -777600 241950 1014144 989433 156469 -1000927 -3021222 -2047181 -674812
2202 -674812 -994972 -1078430 36132 -1131465 -53202 2463342 1717508 612656 1155669
2193 1155669 670788 1061215 1593711 413149 -5349 -787985 -408152 -522090 -5691
2184 -5691 -596647 407097 -1384534 58559 1268218 -782337 907605 2260139 720670
2175 720670 1973013 893110 606694 1249966 1977556 995645 756186 957617 1328298
$$ packed form
2240i56410J058675R0598J19151j42286l00377k85117N44188P7880Q63130j312650
2230b43218j155876J019851p8035p48271j39314P64960P1250j284662P5263J948851
2220B30799j321710m06281J030932k01843K10464J671327R17205k025294j212410
2211a106811L29211J019550P72194k4711q32964j157396k020295R74041J372369
2202f74812l20160q3458J114562j167597J078263K516544p45834j104852N43013
2193A155669m84881L90427N32496j180562m18498p82636L79833j13938N16399
2184e691n90956J003744j791631J443093J209659k050555J689942J352534j539469
2175G20670J252343j079903k86416O43272P27590r81911k39459K01431L70681
$$ plain form
2166 1328298 -49939 -740439 -621900 582236 1064616 -653624 -529072 -769108 -148770
2157 -148770 1365364 1206242 1169461 3290137 1134347 1763768 1024341 -27988 1463871
2148 1463871 837080 1236440 2441470 2696074 3811717 4530835 912243 450835 1397780
2139 1397780 109176 1702552 1972802 2109591 2723381 3439791 3110748 3524123 3161299
2130 3161299 2991180 2372870 2665485 2766577 2864681 2299370 2707711 5294931 6025449 5504547
2120 5504547 5939521 5916301 6365618 6937261 6414547 8247510 9091902 9524933 9877501 11705952
2110 11705952 13732536 15167835 14930410 16736995 18280822 19085955 19948494 22841626 24777169
2101 24777169 27020921 31558312 36848771 42540318 48732948 56118540 61903633 66734554
$$ packed form
2166A328298j378237o90500J18539J204136M82380j718240J24552k40036O20338
2157a48770J514134j59122l6781K120676k155790O29421p39427j052329J491859
2148A463871o26791L99360J205030K54604J115643P19118l618592m61408R46945
2139A397780j288604J593376K70250J36789O13790P16410l29043M13375l62824
2130C161299j70119o18310K92615J01092R8104n65311M08341K587220P30518n20902
2120E504547M34974k3220M49317N71643n22714J832963Q44392M33031L52568J828451
2110A1705952K026584J435299k37425J806585J543827Q05133Q62539K893132J935543
2101B4777169K243752M537391N290459N691547O192630P385592N785093M830921
$$ plain form
2093 66734554 69167828 65878119 59931645 52289626 42881682 34757495 30407255 26280223
2085 26280223 22378679 19856179 16946109 16388442 14852652 13336829 12113661 13258848
2077 13258848 11957547 10114912 10097747 8804172 10252218 10190114 7824010 6430058 5395147
2068 5395147 6415655 6173835 4680828 3516496 4103146 4434734 4306677 4761493 3501358
2059 3501358 3280215 3145519 2760923 2970057 2316822 1709888 2393952 3144622 1266995
2050 1266995 399482 -755549 -751051 200162 -321434 -86338 -130406 186850 1165989 1708202
2040 1708202 305935 805714 -239191 -1630390 -224194 367629 1620392 1584498 -369788
2031 -369788 1717888 702689 -184886 897574 1241900 1269954 -519245 226514 -4028
$$ packed form
2093F6734554K433274l289709n946474p642019r407944q124187m350240m127032
2085B6280223l901544k522500k910070n57667j535790j515823j223168J145187
2077A3258848j301301j842635j7165j293575J448046o2104k366104j393952j034911
2068E395147J020508k41820j493007j164332N86650L31588j28057M54816j260135
2059C501358k21143j34696l84596K09134o53235o06934O84064P50670j877627
2050A266995q67513j155031M498R51213n21596K35096m4068L17256R79139N42213
2040A708202j402267M99779j044905j391199J406196N91823J252763l5894j954286
2031c69788K087676j015199q87575J082460L44326K8054j789199P45759k30542
$$ plain form
2022 -4028 98237 -2159259 -1616767 -391679 676226 257777 663756 1205726 2287485
2013 2287485 843326 392992 -426939 -291398 22601 -397635 433105 389229 608959 -385849
2003 -385849 465798 -554574 -1141060 -1243225 -992134 -1125377 -623186 -813146 -981874 -967128
1993 -967128 -1261213 -340022 -378213 28976 90892 -1242009 320088 -933529 -1529462 -1000690
1983 -1000690 -575294 1845808 1398670 -592049 -1954143 -60068 -509914 -1255257 -372187
1974 -372187 -958814 -1185370 -1364133 -896625 -1624583 -1120377 -106152 -326484 -1591920
1965 -1591920 -2283071 -1571559 -1660191 -260073 -623493 -78137 -141528 -1524743 -1223571 -748899
1955 -748899 143792 -351102 3398 -1350601 -1007114 -2009113 -425656 -905394 -1883017
$$ packed form
2022d028J02265k257496N42492J225088J067905m18449M05979N41970J081759
2013B287485j444159m50334q19931J35541L13999m20236Q30740m3876K19730r94808
2003c85849Q51647j020372n86486j02165K51091j33243N02191j89960j68728J4746
1993i67128k94085R21191l8191M07189O1916j332901J562097j253617n95933N28772
1983a000690M25396K421102m47138j990719j362094J894075m49846p45343Q83070
1974c72187n86627k26556j78763M67508p27958N04206J014225k20332j265436
1965a591920o91151P11512q8632J400118l63420N45356o3391j383215L01172M74672
1955g48899Q92691m94894L54500j353999L43487j001999J583457m79738r77623
$$ plain form
1946 -1883017 -1265397 -2711074 -1337204 -24227 -144692 -260744 -1959043 -1001812 -937019
1937 -937019 -507248 5112 -1752674 -1554964 -1703032 -1089474 348123 -299742 -1584553
1928 -1584553 -1569197 -2247557 -1384083 -391768 -380832 -1227572 -415343 832952 78894 -567616
1918 -567616 -756721 -136652 -1205307 48877 881763 821872 -44485 -116775 -986614 -2930281
1908 -2930281 -922082 -1513871 -2477758 -1264493 -199465 -748898 627914 1392261 416305
1899 416305 -282130 -1440802 -2414086 -1964249 -402581 -1114478 -445916 808565 251465
1890 251465 -567256 -1948547 -848954 -1688148 -1850613 -1251190 -1258023 1077824 403232 -227787
1880 -227787 459396 228325 -1744485 -2014462 -533914 1176841 494550 -587020 -114403
$$ packed form
1946a883017O17620j445677J373870J312977j20465j16052j698299R57231O4793
1937i37019M29771N12360j757786J97710j48068O13558J437597o47865j284811
1928a584553J5356o78360Q63474R92315J0936q46740Q12229J248295p54058o46510
1918e67616j89105O20069j068655J254184Q32886n9891q66357p2290q69839j943667
1908b930281K008199n91789r63887J213265J065028n49433J376812P64347r75956
1899D16305o98435j158672r73284M49837J561668p11897O68562J254481n57100
1890B51465q18721j381291J099593q39194j62465N99423o833K335847o74592o31019
1880b27787O87183k31071j972810k69977J480548J710755o82291j081570M72617
$$ plain form
1871 -114403 -389546 94105 696486 361278 -896671 -1319355 -2056215 -452272 -41393
1862 -41393 -1105415 -1777108 -1163009 -1518746 -1686860 -493233 -1335650 -924854 -464272 -1333541
1852 -1333541 -1979299 -1770628 -1613789 -1240508 -1596527 -1089917 -176159 121925 -1502629
1843 -1502629 -1989478 -2042043 -952665 -1949759 -544974 -232862 -2302312 -2898884 -2179684
1834 -2179684 -1292129 -1159234 -310768 -1407795 -2559148 -1484419 -83782 -918039 -1481711
1825 -1481711 -1588091 98693 -846484 -1980908 -1748127 -561907 -2708252 -1061569 -1593939
1816 -1593939 -1288481 -3565927 -3269568 -661961 -1609931 -1374684 -2512305 -2762395 -2839425
1807 -2839425 -2779174 -2820075 -401013 -973630 -2607037 -1606370 -1772842 -2367322 -3047324
$$ packed form
1871a14403k75143M83651O02381l35208j257949m22684p36860J603943M10879
1862d1393j064022o71693O14099l55737j68114J193627q42417M10796M60582q69269
1852a333541o45758K08671J56839L73281l56019N06610R13758K98084j624554
1843a502629m86849n2565J089378r97094J404785L12112k069450n96572P19200
1834b179684Q87555J32895Q48466j097027j151353J074729J400637q34257n63672
1825a481711j06380J686784r45177j134424K32781J186220k146345J646683n32370
1816a593939L05458k277446K96359K607607r47970K35247j137621k50090p7030
1807b839425O0251m0901K419062n72617j633407J000667j66472n94480o80002
$$ plain form
1798 -3047324 -1190107 -3370250 -2957380 -1841723 -2614506 -2558060 -2551549 -2162595 -1724629 -1262285
1788 -1262285 -1436103 -771489 298962 -844429 -1659177 -1855671 -1420230 -2774278 -3245759
1779 -3245759 -2133800 -1574501 -1269649 -1947242 -1359344 -249994 -1027530 -720058 -521199
1770 -521199 -1409674 -1955356 -1127401 -212676 -1281229 -1081479 -2174626 -1029134 -2029277
1761 -2029277 -959287 -1837565 -1416349 -1192166 -2144114 -1470968 -1002862 -45413 560216
1752 560216 -69518 -1110340 -2088323 -1755604 -1121317 251767 334453 1211838 1221162 -1386981
1742 -1386981 -1877616 -1591379 -786739 86623 569973 -344647 -648113 -1164713 -2664129
1733 -2664129 -1945361 -1493369 -869881 -1229962 -615484 -1287305 -1548676 -2179618 -862693
$$ packed form
1798c047324J857217k180143M12870J115657p72783N6446O511L88954M37966M62344
1788a262285j73818O64614J070451j143391q14748j96494M35441j354048m71481
1779c245759J111959N59299L04852o77593N87898J109350p77536L07472J98859
1770e21199q88475n45682Q27955R14725j068553J99750j093147J145492j000143
1761b029277J069990q78278M21216K24183r51948O73146M68106R57449O05629
1752E60216o29734j040822r77983L32719O34287J373084Q2686Q77385R324k608143
1742a386981m90635K86237Q04640Q73362M83350r14620l03466n16600j499416
1733b664129P18768M51992O23488l60081O14478o71821k61371o30942J316925
$$ plain form
1724 -862693 -1266983 -1925925 -3232261 -2721826 -1175175 -803306 -735824 -2055568 -760490
1715 -760490 -34232 -1618723 -1647529 -1547700 -2090893 -1281775 -2132071 -2534090 -1297046 -909658
1705 -909658 -99687 -751144 -566981 -392383 -1850874 -1607099 -1602679 -1289763 -2229608 -1934904
1695 -1934904 -980950 -175236 198297 -545401 -1282839 -1077725 -2031471 -2865848 -1469316
1686 -1469316 -2062173 -3706294 -3747238 -1976857 -1952259 -1376346 -1916285 -924386 -374298 401447
1676 401447 -7070 -2482706 -2109188 -1039449 -693477 -960793 -1139286 -1751022 -418802
1667 -418802 -2072460 -2704995 -347133 -907527 -871074 -1052995 -684139 -1899147 -781783
1658 -781783 -1445517 -3668155 -2792211 -2523445 -237140 -865810 -46363 -918405 13887
$$ packed form
1724h62693m04290o58942j306336N10435J546651L71869O7482j319744J295078
1715g60490P26258j584491k8806R9829n43193Q09118q50296m02019J237044L87388
1705i09658Q09971o51457J84163J74598j458491K43775M420L12916r39845K94704
1695a934904R53954Q05714L73533p43698p37438K05114r53746q34377J396532
1686a469316n92857j644121m0944J770381K4598N75913n39939R91899N50088P75745
1676D01447m08517k475636L73518J069739L45972k67316j78493o11736J332220
1667d18802j653658o32535K357862n60394L6453j81921L68856j215008J117364
1658g81783o63734k222638Q75944K68766K286305o28670Q19447q72042R32292
$$ plain form
1649 13887 -1809487 -1748252 -1720649 -1332377 -574802 -1169764 -2508427 -2132134 -1186897 -374631
1639 -374631 788735 -49489 -1284196 -847312 -1768427 -1214856 -1225961 -1821630 -577013
1630 -577013 -652409 -1099618 372470 -136466 -222245 -861151 -708723 -1347884 -1226418 -542635
1620 -542635 -1286053 -994369 -535394 -1626811 -2146994 -3247719 -2594988 -2694804 -927565
1611 -927565 -186753 -1405430 -1944134 -3047115 -2460958 -1609137 -1429412 -2141800 -1704793
1602 -1704793 -947718 -633155 -1400341 -1014744 -1152686 -794864 -1259690 350293 -1269995
1593 -1269995 -1252491 -2678587 -2463889 -1687197 -1583298 -2534143 -3268954 -1754377 -1602046
1584 -1602046 -893152 -1487309 -2067365 75178 -740296 -1879978 -1490823 -1173363 -2092560
$$ packed form
1649A3887j823374O1235K7603L88272P57575n94962j338663L76293R45237Q12266
1639c74631J163366q38224j234707M36884r21115N53571j1105n95669J244617
1630e77013p5396m47209J472088n08936q5779o38906J52428o39161J21466O83783
1620e42635p43418K91684M58975j091417n20183j100725O52731r9816J767239
1611i27565P40812j218677n38704j102981N86157Q51821J79725p12388M37007
1602a704793P57075L14563p67186L85597j37942L57822m64826J609983j620288
1593a269995J7504j426096K14698P76692J03899r50845p34811J514577J52331
1584a602046P08894n94157n80056K142543q15474j139682L89155L17460r19197
$$ plain form
1575 -2092560 -2253651 -2573941 -1962604 -1434848 -1513119 -1519281 -1516191 -849474 317429 -204671
1565 -204671 118882 -950040 -2680498 -1764078 -732604 -152182 -49674 -472177 -1091783
1556 -1091783 -2357110 -2797948 -2562205 -2512869 -1814765 -1903752 -1605009 -940638 -1980583 -2411993
1546 -2411993 -3328255 -1538670 -272410 -401001 -1839729 -2510714 -1170971 -727440 -1050383
1537 -1050383 -2326189 -2321476 -1662117 -1024051 -525702 320288 292409 -536462 -1644402 -1453008
1527 -1453008 -2331826 -2053909 -1643310 173905 461414 618549 -267444 -1101476 -3026866
1518 -3026866 -3707076 -1871382 -1738512 -2142707 -1600251 -856947 -734279 -454064 -627544
1509 -627544 -2015341 -2650197 -2907361 -715090 -368323 -2114274 -2715128 -1632827 -1106263
$$ packed form
1575b092560j61091l20290O11337N27756p8271o162L090O66717J166903n22100
1565b04671L23553j068922j730458R16420J031474N80422J02508m22503o19606
1556a091783j265327m40838K35743M9336O98104q8987K98743O64371j039945m31410
1546b411993r16262J789585J266260j28591j438728o70985J339743M43531l22943
1537a050383j275806M713O59359O38066M98349Q45990k7879q28871j107940J91394
1527a453008q78818K77917M10599J817215K87509J57135q85993q34032j925390
1518c026866o80210J835694J32870m04195N42456P43304J22668K80215j73480
1509f27544j387797o34856k57164K192271L46767j745951o00854J082301N26564
$$ plain form
1500 -1106263 18402 270813 -1694710 -2289053 -1824780 -2372212 -2238013 -561176 -1678747
1491 -1678747 -434378 -960086 -686916 -777243 -896200 -1862281 -2450241 -2140768 -1411193 -197478
1481 -197478 345375 739805 653316 664528 575829 -131454 -437976 -1007520 -138786 -228260
1471 -228260 -1065305 -1363756 -2744629 -3846541 -2443503 -2432370 -2566917 -1686720 -2366932
1462 -2366932 -2035105 -2256947 32527 1244169 -1209441 -3050052 -3821886 -1693452 -151571
1453 -151571 -1537028 -903766 -853626 -1995174 -2517649 -403323 -433916 -708219 -178339 -1905308
1443 -1905308 -858650 1774858 302451 -615800 71556 -168797 -2193653 -2812607 -1761343
1434 -1761343 -1875126 -1087028 -735062 -2872849 -3152854 -1498285 -2625605 -1947253 -1651456
$$ packed form
1500a106263J124665K52411j965523n94343M64273n47432J34199J676837j117571
1491a678747J244369n25708K73170r0327j18957r66081n87960L09473P29575J213715
1481a97478N42853L94430q6489J1212q8699p07283l06522n69544Q68734q9474
1471b28260q37045k98451j380873j101912J403038J1133j34547Q80197o80212
1462b366932L31827k21842K289474J211642k453610j840611p71834K128434J541881
1453a51571j385457O33262N0140j141548n22475K114326l0593k74303N29880j726969
1443a905308J046658K633508j472407r18251O87356k40353k024856o18954J051264
1434a761343j13783P88098L51966k137787k80005J654569j127320O78352K95797
$$ plain form
1425 -1651456 -2105201 -2326383 -2061890 -1130052 -1625984 -1170666 -1685768 -1365748 -1929451 -1360460
1415 -1360460 -1718651 -2887963 -3001564 -2709295 -673071 110089 -1382447 -2621761 -4145469
1406 -4145469 -3023468 -1922456 -3028398 -1984566 -588159 -864413 -781666 -774909 -2459377
1397 -2459377 -2657401 -3358023 -2628196 -1782204 -1806386 -2834851 -1915428 -1198777 -1481145 -1792169
1387 -1792169 -2033080 -791387 -37526 -2156214 -3435585 -2884339 -2134011 -1252705 -993776
1378 -993776 -1744545 -1664095 -1135332 -388888 350141 -502191 -230071 -1352138 -2690430 -1771737
1368 -1771737 125579 -1544437 -895838 226997 -104204 -761734 -1044384 -949026 1610960
1359 1610960 493911 -673482 -805195 -335284 -236898 674010 1746167 -243174 -1290467
$$ packed form
1425a651456m53745k21182K64493R31838m95932M55318n15102L20020n63703N68991
1415a360460l58191j169312j13601K92269K036224P83160j492536j239314j523708
1406d145469J122001J101012j105942J043832J396407k76254Q2747O757j684468
1397b459377j98024p00622P29827Q45992k4182j028465R19423P16651k82368l11024
1387a792169k40911J241693P53861k118688j279371N51246P50328Q81306K58929
1378i93776p50769Q0450N28763P46444P39029q52332K72120j122067j338292R18693
1368a771737J897316j670016O48599J122835l31201o57530k82650R5358K559986
1359A610960j117049j167393j31713M69911R8386R10908J072157j989341j047293
$$ plain form
1350 -1290467 -789347 -1091792 -1144215 -378636 -589475 -2006550 -2145550 -2167062 -2214394 -3004032
1340 -3004032 -3495048 -1755476 -1184744 47676 452605 53477 -1205975 -1629127 -3085391
1331 -3085391 -3868006 -1573323 -1586973 -1188163 -608531 -1746137 -1824090 -3200103 -2743351
1322 -2743351 -1153247 -192121 -663466 -773898 -503701 170883 -1419032 -2443384 -1698510
1313 -1698510 -1450087 -2636769 -1288511 -1111007 -1052815 -1378581 -1545649 -895077 -1582944
1304 -1582944 -1600669 -891857 -1836792 -933011 -1256278 -1118013 -744208 -867756 -1582911 -1889266
1294 -1889266 -1202303 -322917 -553725 -989164 -1639284 -2151416 -1498106 -1040250 -1747440 -2749449
1284 -2749449 -3021249 -1382520 157547 -550808 -674861 -1334665 -2494048 -1826471 -1717375
$$ packed form
1350a290467N01120l02445n2423P65579k10839j417075j39000k1512m7332p89638
1340c004032m91016J739572N70732J232420M04929l99128j259452m23152j456264
1331c085391p82615K294683j3650L98810N79632j137606p7953j376013M56752
1322b743351J590104R61126m71345j10432K70197O74584j589915j024352P44874
1313a698510K48423j186682J348258J77504N8192l25766j67068O50572o87867
1304a582944j7725P08812r44935R03781l23267J38265L73805j23548p15155l06355
1294a889266O86963Q79386k30808m35439o50120n12132O53310M57856p07190j002009
1284b749449k71800J638729J540067p08355j24053o59804j159383O67577J09096
$$ plain form
1275 -1717375 -95908 -519520 -700049 -863094 -1561193 -1079621 -1329042 -1794484 -2637257
1266 -2637257 -2184078 -2258058 -1359958 -715411 -1143222 -724839 -1238395 -1976538 -1693306 -1273342
1256 -1273342 -2676329 -3309435 -2495221 -1646960 -788494 -822573 -1345163 -1737184 -1585504 -1917081
1246 -1917081 -1382556 -1838195 -1330186 -2389200 -257235 933875 728658 1025457 380666
1237 380666 -510578 -1099456 -596816 86624 -213743 248217 -764316 -114249 -754587 -89074
1227 -89074 -353818 46844 -900349 -1705933 -2436737 -2033915 -2430370 -831576 -308821 -1388080
1217 -1388080 -1885344 -1801131 -946954 -1631223 -1042278 -292275 -1294889 -2292497 -2250678 -2655387
1207 -2655387 -1966541 -1904385 -2755633 -2856301 -922863 -1719871 -3108748 -1326478 -1120047
$$ packed form
1275a717375J621467m23612j80529j63045o98099M81572k49421m65442q42773
1266b637257M53179p3980Q98100O44547m27811M18383n13556p38143K83232M19964
1256a273342j402987o33106Q14214Q48261Q58466l4079n22590l92021J51680l31577
1246a917081N34525m55639N08009j059014K131965J191110k05217K96799o44791
1237C80666q91244n88878N02640O83440l00367M61960j012533O50067o40338O65513
1227h9074k64744M00662r47193q05584p30804M02822l96455J598794N22755j079259
1217a388080m97264Q4213Q54177o84269N88945P50003j002614r97608M1819m04709
1207b655387O88846O2156q51248j00668J933438p97008j388877J782270K06431
$$ plain form
1198 -1120047 -1575504 -713610 -2047196 -1408257 -195183 -143928 -1272196 213967 -971519
1189 -971519 -2520659 -2110611 -2697420 -1502411 129796 -211414 408517 161983 -477599
1180 -477599 -970970 -1946972 -2450784 -1906160 -1495762 -1792894 -1222422 -792008 -1677009 -1586496
1170 -1586496 -1155551 -1075048 -688231 -1979272 -1463394 -981269 -1277950 86555 1149025
1161 1149025 -573511 -2370106 -1163241 -1732050 -2123326 -1050497 -1412091 -1349705 -1062523
1152 -1062523 -2552426 -2563607 -324715 20610 -35810 -913418 215376 -165219 -828320
1143 -828320 -2162775 -2839421 -785212 -1039833 -2250439 -4182691 -1719143 -808456 -611599
1134 -611599 -250275 -1814968 297860 -598273 -2173159 -1746210 -1554196 -1634899 -2224740
$$ packed form
1198a120047m55457Q61894j333586O38939J213074N1255j128268J486163j185486
1189i71519j549140M10048n86809J195009J632207l41210O19931k46534o39582
1180d77599m93371r76002n03812N44624M10398k97132N70472M30414q85001R0513
1170a586496M30945Q0503L86817j291041N15878M82125k96681J364505J062470
1161A149025j722536j796595J206865n68809l91276J072829l61594O2386K87182
1152a062523j489903j1181K238892L45325n6420q77608J128794l80595o63101
1143h28320j334455o76646K054209k54621j210606j932252K463548R10687J96857
1134f11599L61324j564693K112828q96133j574886M26949J92014q0703n89841
$$ plain form
1125 -2224740 -907378 -1635372 -1649785 -505899 -1457744 -1293779 -1418082 -1963450 -576829
1116 -576829 -1938845 -2456060 -333426 -918970 -2138625 -2379763 -970732 -1232104 -2830040
1107 -2830040 -3407945 -2591644 -1448179 -925822 -945020 -1141791 194445 -968577 1349166
1098 1349166 948087 -1012445 -644514 -610319 -851058 -1427633 551247 418210 -459099
1089 -459099 -605566 -1191158 -572734 -2336202 -2078576 -2083277 -572118 993048 697152 340844
1079 340844 -181949 -468481 -72128 -463357 -1034088 -1291086 -2526488 -1800883 -1887323 -2158812
1069 -2158812 -2547381 -3032000 -1295416 -1891555 -831141 192459 -253853 -61304 -956828
1060 -956828 -1120432 -1128550 -2482511 -1276097 1288 -1038958 -1756539 -1987887 -2083722 -1833468
$$ packed form
1125b224740J317362p27994j4413J143886r51845J63965j24303n45368J386621
1116e76829j362016n17215K122634n85544j219655k41138J409031k61372j597936
1107b830040n77905Q16301J143465N22357j9198j96771J336236j163022K317743
1098A349166m01079j960532L67931L4195k40739n76575J978880j33037q77309
1089d59099j46467n85592O18424j763468K57626m701J511159J565166k95896l56308
1079C40844n22793k86532L96353l91229n70731k56998j235402P25605q6440k71489
1069b158812l88569m84619J736584n96139J060414J023600m46312J92549q95524
1060i56828j63604q118j353961J206414J277385j040246p17581k31348r5835K50254
$$ plain form
1050 -1833468 -1266587 -1868152 -2426805 -1866100 -310935 -1075905 495669 388186 -1011928
1041 -1011928 -1728165 -564303 -1001492 -1658626 -2769943 -1858991 -702986 -1059430 -1242871
1032 -1242871 -691226 -299971 166233 -885361 -434742 -309287 -1282481 -1740113 -1478805
1023 -1478805 -265050 700791 712297 -1226299 -876921 -592016 40112 -1529771 -1657484
1014 -1657484 -1600306 -2136083 -979761 -1430055 -1052703 -595853 -1046120 -2017251 -3183767
1005 -3183767 -3652720 -1876036 -1809536 -590911 -782258 -1391897 -7329 -1074853 -1657343
996 -1657343 -2781951 -3522151 -2393674 -4282031 -2155213 -1283649 -630488 -737958 -1027521
987 -1027521 -2879495 -3240623 -1920802 -2849236 -1555032 -2579345 -1527175 -2864411 -2655553
$$ packed form
1050a833468N66881o01565n58653N60705J555165p64970J571574j07483j400114
1041a011928p16237J163862m37189o57134j111317R10952J156005l56444j83441
1032a242871N51645L91255M66204j051594M50619J25455r73194m57632K61308
1023a478805J213755R65841J1506j938596L49378K84905O32128j569883j27713
1014a657484N7178n35777J156322m50294L77352M56850m50267r71131j166516
1005c183767m68953J776684O6500J218625j91347o09639J384568j067524n82490
996a657343j124608p40200J128477j888357K126818Q71564O53161j07470k89563
987a027521j851974l61128J319821r28434J294204j024313J052170j337236K08858
$$ plain form
978 -2655553 -1135897 -1129039 -2527951 -1942020 -1868451 65168 898065 -746735 -1057791 -2665489
968 -2665489 -1748820 -1342112 -1359105 -1060567 -1717669 -2773981 -2649547 -3683199 -3008698 -1892842
958 -1892842 -1450233 -1606978 -1877793 -2314320 -1377875 -1549456 -1498128 -1335354 -2707228 -754628
948 -754628 -497085 -225072 -492984 -368266 -1689791 -1614813 -1182178 -500150 -1733852 -2434657
938 -2434657 -1561322 -1234454 -1593634 -344592 -1235527 -2301926 -3045962 -2366023 -1692414
929 -1692414 -2274032 -63845 535128 -638295 -536766 -1369101 -1945337 -999459 -944405 -2047272
919 -2047272 -2421281 -3170744 -2608537 -594602 -1463323 -1033525 -1086653 -1116474 -1976093 -1903334
909 -1903334 -2664042 -1223390 -1898993 -2118490 -1518675 -1621581 -1355855 -2690500 -2664352 -1092342
$$ packed form
978b655553J519656O858j398912N85931P3569J933619Q32897j644800l11056j607698
968b665489R16669M06708j6993K98538o57102j056312J24434j033652O74501J115856
958a892842M42609j56745k70815m36527R36445j71581N1328J62774j371874J952600
948g54628K57543K72013k67912J24718j321525P4978M32635O82028j233702p00805
938b434657Q73335L26868l59180J249042q90935j066399p44036O79939O73609
929a692414n81618K210187N98973j173423J01529q32335n76236R45878N5054j102867
919b047272l74009p49463N62207K013935q68721M29798n3128k9821q59619P2759
909a903334p60708J440652o75603k19497N99815j02906K65726j334645K6148J572010
$$ plain form
899 -1092342 -320813 -1030592 -1566864 -2608233 -2787924 -2100725 -1451238 -2031595 -1492615 -1925112
889 -1925112 -1470041 -574057 -946547 -1949878 -2516111 -2186225 -2324441 -1667819 -1007140 -4004589
879 -4004589 -2760613 -2055308 -1475193 -67452 -1715529 -3061041 -2257198 -507938 -1877883
870 -1877883 -2118646 -1437911 -1546268 -2807044 -2409621 -1608891 -927639 -732564 -1372260 -702708
860 -702708 -893157 -1274571 -1528075 -3193556 -2955742 -2884945 -2812258 -3098176 -3661714 -1831790
850 -1831790 -2683006 -668806 -708984 -1641864 -1244449 -1063106 402907 -78287 435518 265495
840 265495 -339569 -333543 -1592615 -1149197 -979325 -2467465 -3201827 -3394670 -1230345 -1403356
830 -1403356 -592274 -83127 -1763562 -1542128 -828403 -1798363 -3695622 -2018342 -431591
$$ packed form
899a092342P71529p09779n36272j041369j79691O87199O49487n80357N38980m32497
889a925112M55071Q95984l72490j003331n66233L29886j38216O56622O60679k997449
879d004589J243976P05305N80115J407741j648077j345512Q03843J749260j369945
870a877883k40763O80735j08357j260776L97423Q00730O81252J95075o39696O69552
860g02708j90449l81414k53504j665481K37814P0797P2687k85918n63538J829924
850a831790q51216K014200m0178r32880L97415J81343J466013m81194N13805j70023
840B65495o05064O026j259072M43418J69872j488140p34362j92843K164325j73011
830a403356Q11082N09147j680435K21434P13725r69960j897259J677280J586751
$$ plain form
821 -431591 -750573 -1231697 -3176823 -3153883 -2601983 -1310412 -973653 -1394153 -1087716 155180
811 155180 -794314 -1027491 -1916267 -3098148 -1077857 -1517599 -1956169 -2275109 -3077032 -2489005
801 -2489005 -2092897 -2232757 -1278583 -553695 -336715 1391147 1015936 147783 -971316
792 -971316 -719369 -694697 -1954964 -998566 -1833009 -1329258 -908807 -992808 -1237287 -1745221
782 -1745221 -1318422 -793992 1157300 307231 -2043633 -2072854 -779681 -16302 -1519593
773 -1519593 -2049606 -988495 -1688137 -1392636 -1046513 -2438521 -3841348 -2149226 -2202496
764 -2202496 -1126465 -1034445 -2069059 -1564507 -2285309 -2584429 -2159711 -3302773 -3148478
755 -3148478 -2180922 -2347128 -2340476 -2038927 -2261064 -1479492 -2120611 -132646 -930842 -2705535
$$ packed form
821d31591l18982m81124j945126K2940N51900J291571L36759m20500L06437J242896
811A55180r49494k33177q88776j181881K020291m39742m38570l18940q01923N88027
801b489005L96108j39860R54174P24888K16980J727862l75211q68153j119099
792i71316K51947K4672j260267R56398q34443N03751M20451q4001k44479n07934
782a745221M26799N24430J951292q50069k350864k9221J293173P63379j503291
773a519593n30013J061111o99642K95501L46123j392008j402827J692122n3270
764b202496J076031R2020j034614N04552p20802k99120M24718j143062J54295
755c148478R67556j66206O652L01549k22137P81572o41119J987965p98196j774693
$$ plain form
745 -2705535 182919 -947866 -210277 752804 478993 -327110 49243 -537406 -340280
736 -340280 984014 516609 -1992 80535 -179981 -167241 690798 -778691 -1933525 350726
726 350726 -1330032 -968955 -838234 -841894 -2014821 -2920440 -2376242 -1527806 -1708538 -2563278
716 -2563278 -2656629 -1732132 -361259 -888286 -2139833 -2636587 -1523513 -1111884 -113461
707 -113461 -614110 -1108161 -719506 -937507 -1084960 -2314900 -1743366 -447838 -747225 -125287
697 -125287 -551251 -1710192 -2078217 -1722583 -1570744 -2612639 -3002840 -2550580 -1296683
688 -1296683 -1715036 -3224572 -2349108 -2098333 -2384981 -1504473 -2017274 -1154370 -266138 -196063
678 -196063 112482 -946314 -812248 -1305542 -2218066 -1255124 -2490169 -3624795 -2675477
$$ packed form
745b705535K888454j130785P37589R63081k73811q06103L76353n86649J97126
736c40280J324294m67405n18601Q2527k60516J2740Q58039j469489j154834K284251
726C50726j680758L61077J30721l660j172927r05619N44198Q48436j80732q54740
716b563278r3351R24497J370873n27027j251547m96754J113074M11629R98423
707a13461n00649m94051L88655k18001j47453j229940N71534J295528k99387O21938
697a25287m25964j158941l68025L55634J51839j041895l90201M52260J253897
688a296683m18353j509536Q75464K50775k86648Q80508n12801Q62904Q88232P0075
678a96063L08545j058796J34066m93294r12524R62942j235045j134626R49318
$$ plain form
669 -2675477 -263979 -1397950 -1137446 -2557814 -3266039 -1819405 -1902159 -2342813 -1568451
660 -1568451 -486906 -852492 -453481 -2314678 -1345809 -1023415 -746827 -1916205 -1708370
651 -1708370 -1021551 -2114156 -2117001 -2554055 -2777388 -843656 -1066479 -806964 -99122 -1527618
641 -1527618 -1477188 -1654673 -2536615 -952025 -152330 -1636750 -2972952 -2723770 -2022976
632 -2022976 -1607393 -2135050 -1520144 -2399331 -2342156 -2324070 -2146867 -1410945 -769186 -1596756
622 -1596756 -2592130 -1208489 -408077 -764168 -931442 -1827549 -1545104 -552454 -1482085 -3543291
612 -3543291 -4727227 -2408346 -1206252 -1666481 -1451344 -1395382 -1864373 -1417978 -2054536
603 -2054536 -1508391 -725010 -385389 -488907 -1488107 -2942265 -2032075 -1997955 -769443 -1675115
$$ packed form
669b675477K411498j133971K60504j420368p08225J446634q2754m40654P74362
660a568451J081545l65586L99011j861197R68869L22394K76588j169378K07835
651a708370O86819j092605k845m37054k23333J933732k22823K59515P07842j428496
641a527618N0430j77485q81942J584590P99695j484420j336202K49182P00794
632b022976M15583n27657O14906q79187N7175J8086J77203P35922O41759q27570
622a596756r95374J383641Q00412l56091j67274q96107K82445R92650r29631k061206
612c543291j183936K318881J202094m60229K15137N5962m68991M46395o36558
603b054536N46145P83381L39621j03518r99200j454158R10190L4120J228512r05672
$$ plain form
593 -1675115 -1243665 -2383105 -3045338 -2549019 -2646097 -3168287 -2434947 -1310029 -2234233 -2609530
583 -2609530 -2959499 -1821318 -2262048 -3225634 -3661838 -866819 -2098482 -1169796 -1859018
574 -1859018 -2163238 -1145465 -3504593 -3449399 -4147987 -1849278 -1319285 -1478973 -1512417 -2245154
564 -2245154 -1382082 -2464090 -1922151 -2543249 -1425323 -1971808 -2361889 -891592 -928697
555 -928697 -1491404 -751958 -1761395 -799050 -1043590 -2960021 -2675564 -2390237 -3118214 -3984537
545 -3984537 -2801848 -881964 -959558 -1198537 -1340742 -558628 -804700 -1008221 -514422 -691991
535 -691991 -1872308 -2422080 -1359870 -1119563 -912013 -2016578 -446102 -544698 -1034063
526 -1034063 -2422720 -1965583 -920623 -1110771 -873509 -509026 -1344987 143554 -199316
$$ packed form
593a675115M31450j139440o62233M96319r7078n22190P33340J124918r24204l75297
583b609530l49969J138181m40730r63586m36204K795019j231663R28686o89222
574a859018l04220J017773k359128N5194o98588K298709N29993j59688l3444p32737
564b245154Q63072j082008N41939o21098J117926n46485l90081J470297l7105
555i28697n62707P39446j009437R62345k44540j916431K84457K85327p27977q66323
545c984537J182689J919884p7594k38979j42205P82114k46072k03521M93799j77569
535f91991j180317n49772J062210K40307K07550j104565J570476r8596m89365
526a034063j388657M57137J044960j90148K37262L64483q35961J488541l42870
$$ plain form
517 -199316 -388719 -1278541 -3039393 -3892841 -3297395 -1961845 -1854607 -2421052 -2760395 -2338142
507 -2338142 -1641529 -572083 -510327 -1144472 -924015 -428918 158802 -665574 -1594240 -973080
497 -973080 -636346 -115595 -709361 -1246963 -3427070 -2793641 -2692594 -2562088 -2451157 -2349521
487 -2349521 -1462688 -1682283 -2092307 -1853391 -1347920 -1189655 -1792346 -1516727 -1710421 -930944
477 -930944 -683518 -1359236 426246 258909 30623 -941444 -619742 -840442 -642361 -1540836
467 -1540836 189729 164518 -556503 -1724522 -3123930 -1380751 -904566 -806947 -864291 -1921150
457 -1921150 -2643642 -2956428 -2605651 -2101814 -2566089 -1527531 -1688595 -2905948 -1448910
448 -1448910 -1480650 -837708 -120893 -266181 -151663 -1058147 -1305683 -1914657 -2207996 -2142848
$$ packed form
517a99316j89403q89822j760852q53448N95446J335550J07238n66445l39343M22253
507b338142O96613J069446O1756o34145K20457M95097N87720q24376r28666O21160
497i73080L36734N20751n93766n37602k180107O33429J01047J30506J10931J01636
487b349521Q86833k19595m10024K38916N05471J58265o02691K75619j93694P79477
477i30944K47426o75718J785482j67337k28286r72067L21702k20700J98081q98475
467a540836J730565k5211p21021j168019j399408J743179M76185R7619n7344j056859
457a921150p22492l12786L50777N03837m64275J038558j61064j217353J457038
448a448910l1740O42942P16815j45288J14518r06484k47536o08974k93339O5148
$$ plain form
438 -2142848 -832619 1178095 343239 -1575740 -1378677 -2844624 -3611863 -3915363 -3047626
429 -3047626 -1070638 -1664237 -4587134 -3778220 -3580800 -2111623 -1892205 -2008641 -1866828
420 -1866828 -816740 -1337838 -2227354 -3669401 -2813689 -1034735 -1270822 -1257373 -651131
411 -651131 -1017118 -1626028 -1265626 -539086 857454 -1709168 -2625744 -1891519 -614653
402 -614653 184750 -2012475 -1409190 -1661242 -1946657 -867674 -1885183 -2195279 -1971362
393 -1971362 -2890706 -2679473 -2237812 -2388990 -2202902 -1985340 -312983 -2022602 -2937489
384 -2937489 -3621005 -2920006 -2667966 -777598 -100385 -1805800 -3488806 -1942999 -2221391
375 -2221391 -1986471 -1180286 -1338350 -2717060 -1882866 -392415 -2777131 -1871369 -2108178
$$ packed form
438b142848J310229K010714q34856j918979J97063j465947p67239l03500Q67737
429c047626J976988n93599k922897Q08914J97420J469177K19418j16436J41813
420a866828J050088n21098q89516j442047Q55712J778954k36087J3449O06242
411f51131l65987o08910L60402P26540J396540k566622r16576P34225J276866
402f14653P99403k197225O03285k52052k85415J078983j017509l10096K23917
393a971362r19344K11233M41661j51178J86088K17562J672357j709619r14887
384b937489o83516P00999K52040J890368O77213j705415j683006J545807k78392
375b221391K34920Q06185j58064j378710Q34194J490451k384716R05762k36809
$$ plain form
366 -2108178 -1587221 -42648 -2184375 -3305524 -2967360 -3108277 -802858 -902958 -2220685
357 -2220685 -1752997 -1671793 -2703879 -3493324 -2426847 -1991621 -3463711 -3101173 -2654609
348 -2654609 -2540164 -2443948 -2592031 -2853420 -2393718 -3282501 -1678101 -2366611 -3748256 -2686544
338 -2686544 -3532292 -2507930 -3230947 -2033821 -2248968 -2923420 -2645493 -2215529 -1398613
329 -1398613 -1410115 -1700597 -2204150 -2372891 -3482667 -2360824 -426118 207673 -1999260
320 -1999260 -2620290 -1838059 -1464554 -2359741 -2487597 -2408566 -2048385 -980743 -658161 685185
310 685185 730716 -2354245 -2643807 -1008145 -620805 -1710265 -2825772 -2484931 -3593208
301 -3593208 -3225331 -2139046 -1255093 -1769686 -1945642 -2306902 -2854594 -2877103 -2086670 -963590
$$ packed form
366b108178N20957J544573k141727j121149L38164j40917K305419j00100j317727
357b220685M67688Q1204j032086p89445J066477M35226j472090L62538M46564
348b654609J14445R6216j48083k61389M59702q88783J604400o88510j381645J061712
338b686544q45748J024362p23017J197126k15147o74452K77927M29964Q16916
329a398613j1502k90482n03553j68741j109776J121843J934706O33791k206933
320a999260o21030P82231L73505q95187j27856P9031L60181J067642L22582J343346
310F85185M5531l084961k89562J635662L87340j089460j115507L40841j108277
301c593208L67877J086285Q83953n14593j75956l61260n47692k2509P90433J123080
$$ plain form
291 -963590 -2449856 -1814727 -1909575 -2212285 -2203974 -4077799 -2678615 -2145302 -1441844 -571315
281 -571315 -1499323 -2720718 -1744976 -985488 -2622235 -3796485 -2456342 -1417414 -2226917
272 -2226917 -1121179 -692084 -254219 -1561690 -1547896 -2390479 -1754693 -1333223 -2131291 -1623940
262 -1623940 -2540821 -2611057 -885737 -1673186 -1266437 513706 -1426086 -968749 -1012847 -1904913
252 -1904913 -1861390 -2009596 -2720044 -2193486 -2068911 -1557642 -1481907 -3044464 -3012429 -1975154
242 -1975154 134913 -550593 -2266649 -1163253 41054 -1555356 -2443140 -1233874 -1788947
233 -1788947 -1840441 -2544910 -3404875 -3078651 -2399455 -1200063 -1134815 -2483827 -2609659 -3398623
223 -3398623 -1944905 331178 45489 -1310651 -1177754 -3459796 -2620779 -1824051 -3010237
$$ packed form
291i63590j486266O35129r4848l02710Q311j873825J399184N33313P03458Q70529
281e71315r28008j221395R75742P59488j636747j174250J340143J038928q09503
272b226917J105738M29095M37865j307471J3794q42583O35786M21470p98068N07351
262a623940r16881p0236J725320p87449M06749J780143j939792M57337m4098q92066
252a904913M3523j48206p10448N26558J24575N11269P5735j562557L2035J037275
242a975154K110067o85506j716056J103396J204307j596410q87784J209266n55073
233a788947n1494p04469q59965L26224O79196J199392O5248j349012j25832p88964
223c398623J453718K276083k85689j356140J32897k282042Q39017P96728j186186
$$ plain form
214 -3010237 -1810824 -3044776 -2721736 -1871426 -1622145 -444341 -428350 -590137 -2699021
205 -2699021 -4466301 -2398011 -2018028 -3045621 -2547366 -2005493 -2277508 -2657945 -2191779
196 -2191779 -2809595 -2351306 -1919474 -1919256 -1188008 -1186247 -1993165 -62477 -258652 -1136817
186 -1136817 -782382 -681310 -251370 -1997243 -1199508 -2220635 -2006405 -2082992 -1737936 -2177038
176 -2177038 -2205295 -2802306 -2804734 -4150294 -2794300 -1480763 -827559 -316186 -3208653 -2898901
166 -2898901 -2145864 -2103783 -1883916 -1821491 -2618510 -3015647 -1399218 -1449885 -907381 -322181
$$ packed form
214c010237J199413j233952L23040Q50310K49281J177804J5991j61787k108884
205b699021j767280K068290L79983j027593M98255N41873k72015l80437M66166
196b191779o17816M58289M31832K18P31248J761q06918J930688j96175q78165
186a136817L54435J01072M29940j745873P97735j021127K14230p6587L45056m39102
176b177038k8257n97011k428j345560J355994J313537O53204N11373k892467L09752
166b898901P53037M2081K19867O2425p97019l97137J616429n0667N42504N85200
$$ [...]
##END NTUPLES=NMR SPECTRUM
##END=
