##TITLE=1H_CA-8958-4
 CDCl3
 8 sc, 
 10.12.2021
##JCAMPDX= 6.0         $$ Bruker NMR JCAMP-DX V2.0
##DATA TYPE= NMR SPECTRUM
##DATA CLASS= NTUPLES
##ORIGIN= UXNMR, Bruker Analytische Messtechnik GmbH
##OWNER= root
$$ XWIN-NMR		Version 3.5
$$ Fri Dec 10 11:25:46 2021 Russian Standard Time (UT+4h)  she@DPX200
##.OBSERVE FREQUENCY= 200.131346
##.OBSERVE NUCLEUS= ^1H
##.ACQUISITION MODE= SIMULTANEOUS
##.ACQUISITION SCHEME= undefined
##.AVERAGES= 8
##.DIGITISER RES= 18
##SPECTROMETER/DATA SYSTEM= spect
##.PULSE SEQUENCE= zg30
##.SOLVENT NAME= CDCl3
##.SHIFT REFERENCE= (INTERNAL, CDCl3, 0, 15.7083)
##AUDIT TRAIL= $$ (NUMBER, WHEN, WHO, WHERE, WHAT)
$$ ##TITLE= Audit trail, XWIN-NMR		Version 3.5
$$ ##JCAMPDX= 5.01
$$ ##ORIGIN= Bruker BioSpin GmbH
$$ ##OWNER= she
$$ F:/spectra/data/she/nmr/H-F/1/pdata/1/auditp.txt
$$ ##AUDIT TRAIL=  $$ (NUMBER, WHEN, WHO, WHERE, WHAT)
(   1,<2021-12-10 11:24:24.51 +0400>,<she>,<DPX200>,
      <created by zg, POWCHK disabled, PULCHK disabled
       configuration hash MD5:
       00 E9 B6 7A A2 85 ED C7 34 08 36 98 17 FE 4E 26
       data hash MD5: 16K
       53 F1 02 C7 AB F9 03 BB C0 97 25 90 70 ED 30 8A>)
(   2,<2021-12-10 11:24:26.79 +0400>,<she>,<DPX200>,
      <Start of raw data processing
       efp BC_mod = 2 LB = 0.24 FT_mod = 6 PKNL = 1 PHC0 = -15515.97 PHC1 = 17.8008 SI = 16K 
       data hash MD5: 16K
       DC 51 43 FE AD B4 76 EC 3B 1D 4E FA 91 4A E2 7A>)
(   3,<2021-12-10 11:24:47.31 +0400>,<she>,<DPX200>,
      <pk PHC0 = -8.359323 PHC1 = 7.8 
       data hash MD5: 16K
       93 72 3C 68 A1 10 53 DC A0 9E E8 31 5B 93 9A 0B>)
(   4,<2021-12-10 11:24:50.96 +0400>,<she>,<DPX200>,
      <abs ABSG = 5 
       data hash MD5: 16K
       3E 63 4E FE 92 6F AC 59 0F AA 56 88 64 70 71 8D>)
$$ ##END=
$$ 
$$ hash MD5
$$ 0D 09 E2 2C AB DD 28 E1 80 AF 28 93 C1 CF 6F 00
##$RELAX= 
##$RELAX= 
##$RELAX= 
##$RELAX= 
##$RELAX= 
##$RELAX= 
$$ Bruker specific parameters
$$ --------------------------
##$DU= <F:/spectra>
##$EXPNO= 1
##$NAME= <H-F>
##$PROCNO= 1
##$TYPE= <nmr>
##$USER= <she>
##$AMP= (0..31)
100 100 100 100 100 100 100 100 100 100 100 100 100 100 100 100 100 100 
100 100 100 100 100 100 100 100 100 100 100 100 100 100 
##$AQSEQ= 0
##$AQ_mod= 1
##$AUNM= <au_zg>
##$AUTOPOS= <>
##$BF1= 200.13
##$BF2= 200.13
##$BF3= 200.13
##$BF4= 200.13
##$BF5= 200.13
##$BF6= 200.13
##$BF7= 200.13
##$BF8= 200.13
##$BYTORDA= 1
##$CFDGTYP= 0
##$CFRGTYP= 5
##$CHEMSTR= <none>
##$CNST= (0..31)
1 1 145 1 1 1 1 1 1 1 1 1 1 1 1 1 1 1 1 1 1 1 1 1 1 1 1 1 1 1 1 1 
##$CPDPRG= <>
##$CPDPRG1= <>
##$CPDPRG2= <>
##$CPDPRG3= <>
##$CPDPRG4= <mlev>
##$CPDPRG5= <mlev>
##$CPDPRG6= <mlev>
##$CPDPRG7= <mlev>
##$CPDPRG8= <mlev>
##$CPDPRGB= <>
##$CPDPRGT= <>
##$D= (0..31)
0 1.2 0 0 0 0 0 0 0 0.06 0 0.03 0 0 0 0 0.0002 0 0 0 0 0 0 0 0 0 0 0 0 
0 0 0 
##$DATE= 1639121063
##$DBL= (0..7)
120 120 120 120 120 120 120 120 
##$DBP= (0..7)
150 150 150 150 150 150 150 150 
##$DBP07= 0
##$DBPNAM0= <>
##$DBPNAM1= <>
##$DBPNAM2= <>
##$DBPNAM3= <>
##$DBPNAM4= <>
$$ [...]
##$SUBNAM2= <"">
##$SUBNAM3= <"">
##$SUBNAM4= <"">
##$SUBNAM5= <"">
##$SUBNAM6= <"">
##$SUBNAM7= <"">
##$SUBNAM8= <"">
##$SUBNAM9= <"">
##$SW= 18.0517287032376
##$SWIBOX= (0..15)
0 0 2 0 0 0 0 0 0 0 0 0 0 0 0 0 
##$SW_h= 3612.71676300578
##$TD= 16384
##$TD0= 1
##$TE= 0
##$TE2= 300
##$TE3= 300
##$TEG= 300
##$TL= (0..7)
0 120 120 120 120 120 120 120 
##$TP= (0..7)
150 150 150 150 150 150 150 150 
##$TP07= 0
##$TPNAME0= <>
##$TPNAME1= <>
##$TPNAME2= <>
##$TPNAME3= <>
##$TPNAME4= <>
##$TPNAME5= <>
##$TPNAME6= <>
##$TPNAME7= <>
##$TPOAL= (0..7)
0.5 0.5 0.5 0.5 0.5 0.5 0.5 0.5 
##$TPOFFS= (0..7)
0 0 0 0 0 0 0 0 
##$TUNHIN= 0
##$TUNHOUT= 0
##$TUNXOUT= 0
##$USERA1= <user>
##$USERA2= <user>
##$USERA3= <user>
##$USERA4= <user>
##$USERA5= <user>
##$V9= 5
##$VALIST= <valist>
##$VCLIST= <CCCCCCCCCCCCCCC>
##$VD= 0
##$VDLIST= <DDDDDDDDDDDDDDD>
##$VPLIST= <PPPPPPPPPPPPPPP>
##$VTLIST= <TTTTTTTTTTTTTTT>
##$WBST= 1024
##$WBSW= 4
##$XGAIN= (0..3)
0 0 0 0 
##$XL= 0
##$YL= 0
##$YMAX_a= 206861
##$YMIN_a= -252468
##$ZGOPTNS= <>
##$ZL1= 120
##$ZL2= 120
##$ZL3= 120
##$ZL4= 120
##$ABSF1= 15.72596
##$ABSF2= -2.32589
##$ABSG= 5
##$ABSL= 3
##$ALPHA= 0
##$AQORDER= 0
##$ASSFAC= 0
##$ASSFACI= 0
##$ASSFACX= 0
##$ASSWID= 0
##$AUNMP= <proc_1d>
##$AZFE= 0.1
##$AZFW= 0.1
##$BCFW= 0
##$BC_mod= 2
##$BYTORDP= 0
##$COROFFS= 0
##$CY= -3
##$DATMOD= 1
##$DC= 0
##$DFILT= <>
##$DTYPP= 0
##$F1P= 0
##$F2P= 0
##$FCOR= 1
##$FTSIZE= 16384
##$FT_mod= 6
##$GAMMA= 0
##$GB= 0
##$INTBC= 1
##$INTSCL= 0
##$ISEN= 128
##$LB= 0.24
##$LEV0= 0
##$LPBIN= 0
##$MAXI= 10000
##$MC2= 0
##$MEAN= 0
##$ME_mod= 0
##$MI= 1.114404
##$NCOEF= 0
##$NC_proc= -7
##$NLEV= 6
##$NOISF1= 3.799351
##$NOISF2= 2.8
##$NSP= 0
##$NTH_PI= 0
##$NZP= 0
##$OFFSET= 15.70833
##$PC= 1
##$PHC0= -15524.33
##$PHC1= 25.6008
##$PH_mod= 1
##$PKNL= yes
##$PPARMOD= 0
##$PSCAL= 0
##$PSIGN= 0
##$REVERSE= no
##$SF= 200.130008651667
##$SI= 16384
##$SIGF1= 3
##$SIGF2= 2
##$SINO= 5.538805
##$SIOLD= 16384
##$SREGLST= <1H.CDCl3>
##$SSB= 0
##$STSI= 16384
##$STSR= 0
##$SW_p= 3612.71676300578
##$SYMM= 0
##$S_DEV= 0
##$TDeff= 16384
##$TDoff= 0
##$TI= <>
##$TILT= no
##$TM1= 0
##$TM2= 0
##$TOPLEV= 0
##$USERP1= <user>
##$USERP2= <user>
##$USERP3= <user>
##$USERP4= <user>
##$USERP5= <user>
##$WDW= 1
##$XDIM= 16384
##$YMAX_p= 403817560
##$YMIN_p= -951328
$$ End of Bruker specific parameters
$$ ---------------------------------
##NTUPLES= NMR SPECTRUM
##VAR_NAME=  FREQUENCY,     SPECTRUM/REAL,   SPECTRUM/IMAG
##SYMBOL=    X,             R,               I
##VAR_TYPE=  INDEPENDENT,   DEPENDENT,       DEPENDENT
##VAR_FORM=  AFFN,          ASDF,            ASDF
##VAR_DIM=   16384,         16384,           16384
##UNITS=     HZ,            ARBITRARY UNITS, ARBITRARY UNITS
##FACTOR=    0.220516191357247, 1,           1
##FIRST=     3143.70824970711, 0,            0
##LAST=      -469.008513298675, 0,           0
##MIN=       -469.008513298675, -951328,     0
##MAX=       3143.70824970711, 403817560,    0
$$ Real data points
##PAGE= N=1
##DATA TABLE= (X++(R..R)), XYDATA
$$ [...]
$$ plain form
7679 1262199 871121 1009863 1018999 769518 935954 1259389 1316222 1187113 1101618 947147
7669 947147 1169908 1000259 656775 764501 910217 1122662 1089005 913182 1037855 1244150
7659 1244150 970076 906175 1008485 1154580 1326857 1380132 1148354 1169228 1240594 1270586
7649 1270586 1033916 886888 796343 857882 854260 771173 871849 802859 696884 720152 828848
7638 828848 645870 778346 723743 697752 796497 726045 577450 885781 820063 853765 742242
7627 742242 654905 603783 708528 503807 625064 611223 499931 665817 596936 597424 657209
7616 657209 770762 733024 647125 696310 455443 472195 447381 524795 501610 388207 436792
7605 436792 523903 442719 251864 123054 124371 203990 -24999 -203301 -108573 116233 138191
$$ packed form
7679A262199l91078J38742R136k49481J66436L23435N6833j29109q5495j54471
7669I47147K22761j69649l43484J07726J45716K12445l3657j75823J24673K06295
7659A244150k74074o3901J02310J46095J72277N3275k31778K0874P1366K9992
7649A270586k36670j47028r0545O1539l622q3087J00676o8990j05975K3268J08696
7638H28848j82978J32476n4603k5991R8745p0452j48595L08331o5718L3702j11523
7627G42242q7337n1122J04745k04721J21257j3841j11292J65886o8881M88N9785
7616F57209J13553l7738q5899M9185k40867J6752k4814P7414k3185j13403M8585
7605D36792Q7111q1184j90855j28810J317P9619k28989j78302R4728K24806K1958
$$ plain form
7594 138191 222564 -72703 -13750 212965 110493 -4531 68466 44118 40250 -104030 3271
7583 3271 102206 282919 71527 123099 127436 139281 140002 263511 270980 245236 165514 114993
7571 114993 116501 71617 107127 27965 -147210 -1703 -6937 54123 178192 222071 139345
7560 139345 189701 119731 211756 263698 74025 226596 -5610 148401 104352 67642 179273
7549 179273 299979 102367 -29993 -751 31490 36628 -6442 17480 11450 -217170 -64764
7538 -64764 99654 148524 249375 16058 -124517 -131707 115468 -2248 42142 64655 51243
7527 51243 114128 132557 15489 106853 110306 19750 291348 29818 65042 50339 -141931
7516 -141931 -156078 -98507 38462 -106547 -65205 57525 88888 64131 19992 -30913 163988
$$ packed form
7594A38191Q4373k95267N8953K26715j02472j15024P2997k4348l868j44280J07301
7583C271R8935J80713k11392N1572M337J1845P21J23509P469k5744p9722n0521
7571A14993J508m4884L5510p9162j75175J45507n234O1060J24069M3879q2726
7560A39345N0356o9970R2025N1942j89673J52571k32206J54011m4049l6710J11631
7549A79273J20706j97612j32360K9242L2241N138m3070K3922o030k28620J52406
7538f4764J64418M8870J00851k33317j40575p190K47175j17716M4390K2513j3412
7527E1243O2885J8429j17068R1364L453r0556K71598k61530L5224j4703j92270
7516a41931j4147N7571J36969j45009M1342J22730L1363k4757m4139n0905J94901
$$ plain form
7505 163988 192723 42367 70003 360895 367176 59145 73250 321425 187032 304633 412212
7494 412212 259608 298304 271679 259055 -5592 -44225 -38597 -25332 -123414 -121533 -78267 -114101
7482 -114101 103550 243509 125561 -13315 199680 111848 99697 177472 -129193 -235474
7472 -235474 -13080 114210 -154139 -19704 221196 267293 -25278 -137764 -248924 -57953
7462 -57953 -131651 -146070 -169207 -143608 -96926 -155977 -258613 -77993 -142942 -215723 -195919
7451 -195919 -197022 -217828 -200090 -191381 -111643 89809 -24043 -166037 -195076 -131197 28097
7440 28097 -34281 -122472 -62773 -3168 33406 63739 -36940 -78937 -73690 -212568 -148672 -294094
7428 -294094 -179066 -96433 -185955 -192730 -180846 -313809 -231881 -107376 -23167 -135313 -458354
$$ packed form
7505A63988K8735j50356K7636K90892O281l08031J4105K48175j34393J17601J07579
7494D12212j52604L8696k6625j2624k64647l8633N628J3265r8082J881M3266l5834
7482a14101K17651J39959j17948j38876K12995q7832j2151P7775l06665j06281
7472b35474K22394J27290k68349J34435K40900M6097k92571j12486j11160J90971
7462e7953p3698j4419k3137K5599M6682n9051j02636J80620o4949p2781J9804
7451a95919j103k0806J7738Q709P9738K01452j13852j41994k9039O3879J59294
7440B8097o2378q8191N9699N9605L6574L0333j00679m1997N247j38878O3896j45422
7428b94094J15028Q2633q9522o775J1884j32963Q1928J24505Q4209j12146l23041
$$ plain form
7417 -458354 -388933 -315325 -184475 -62107 152249 151679 -99336 -101446 -464145 -297983 49192
7406 49192 -23577 -342 78715 -52750 11130 -138588 -134793 -53253 45845 -14023 -56183 116961
7394 116961 633 -30755 35215 -135368 -167111 -88341 -6455 12909 -151863 -216067 -186857
7383 -186857 -280451 -62400 -16042 -5361 -4057 43736 41062 70950 -127959 -229381 -100450
7372 -100450 -113835 14209 146504 51887 -223731 -120069 -70839 2389 105393 -95698
7362 -95698 -398877 -381888 -403096 -407557 -210733 18747 210743 -29266 -215131 -288919 -294143
7351 -294143 -202304 -150931 -156286 -89501 -100873 -204715 -37478 -68955 -230521 -249914 -140426
7340 -140426 -70313 17605 81430 -88818 -265489 -392009 -102481 67163 34524 -164126
$$ packed form
7417d58354O9421P3608J30850J22368K14356n70k51015k110l62699J66162L47175
7406D9192p2769K3235P9057j31465O3880j49718L795Q1540R9098n9868m2160J73144
7394A16961j16328l1388O5970j70583l1743P8770Q1886J9364j64772o4204K9210
7383a86857r3594K18051M6358J0681J304M7793k674K9888j98909j01422J28931
7372a00450j3385J28044J32295r4617k75618J03662M9230P3228J03004k01091
7362i5698l03179J6989k1208m461J96824K29480J91996k40009j85865p3788n224
7351b94143R1839N1373n355O6785j1372j03842J67237l1477j61566j9393J09488
7340a40426P0113Q7918O3825j70248j76671j26520K89528J69644l2639j98650
$$ plain form
7330 -164126 -214512 -236819 -292038 -210421 -205988 -202790 -339994 -277403 -199508 -184684 -263548 -340675
7318 -340675 -227665 -147371 -213788 -378247 -480393 -234535 -312591 -415385 -204856 -282598
7308 -282598 -131108 -122953 -302620 60498 -198124 -302719 -70814 -122286 -408436 -225740
7298 -225740 -80600 -5198 51376 -214120 -225407 -291501 -271593 -186517 -378082 -300137 -213912
7287 -213912 -294256 -235079 -24627 -109487 -70503 -150523 -280465 -28703 297726 505293 234011
7276 234011 4330 114905 67047 88138 113701 139320 -26027 -262041 -369108 -460624 -500995
7265 -500995 -380173 -236317 -61824 -214584 -95000 -2198 26726 -22793 74661 201362
7255 201362 3026 240482 236926 63746 -25347 -146709 -120171 -150873 -180756 -158385 -188748
$$ packed form
7330a64126n0386k2307n5219Q1617M433L198j37204O2591P7895J4824p8864p7127
7318c40675J13010Q0294o6417j64459j02146K45858p8056j02794K10529p7742
7308b82598J51490Q155j79667L63118k58622j04595K31905n1472k86150J82696
7298b25740J45140P5402N6574k65496j1287o6094J9908Q5076j91565P7945Q6225
7287b13912q0344N9177K10452q4860L8984q0020j29942K51762L26429K07567k71282
7276B34011k29681J10575m7858K1091K5563K5619j65347k36014j07067r1516m0371
7265e00995J20822J43856J74493j52760J19584R2802K8924m9519R7454J26701
7255B01362j98336K37456l556j73180q9093j21362K6538l0702k9883K2371l0363
$$ plain form
7244 -188748 -193068 -267118 -359466 -401508 -141215 -141995 -377960 -377157 -238717 -233166 -39046 71932
7232 71932 239293 145504 93786 -24719 26821 -112884 -363577 -364707 -303734 -262099 -291012
7221 -291012 -320294 39558 -64350 -83041 -178580 -105124 13971 77088 188039 68441 226030
7210 226030 344724 -73802 -61081 136302 158063 152917 -78376 -20045 139316 -75403 -518186
7199 -518186 -507805 -444975 -298006 -265301 45317 -61823 -160899 -183912 -137280 -152797 43426
7188 43426 -24109 -202747 -75855 -114884 -246818 -397370 -277889 -229732 -217182 -199656 -103211
7177 -103211 -313904 -318980 -338747 -317924 -171606 -95699 -238734 -305668 -247833 -41945 -223233
7166 -223233 -318051 -322067 -219178 -128004 -98950 -240767 -305187 75864 -119879 -38860 -62881
$$ packed form
7244a88748m320p4050r2348m2042K60293p80k35965Q03J38440N551J94120J10978
7232G1932J67361r3789n1718j18505N1540j39705k50693j130O0973M1635k8913
7221b91012k9282L59852j03908j8691r5539P3456J19095O3117J10951j19598J57589
7210B26030J18694m18526J2721J97383K1761n146k31293N8331J59361k14719m42783
7199e18186J0381O2830J46969L2705L10618j07140r9076k3013M6632j5517J96223
7188D3426o7535j78638J26892l9029j31934j50552J19481M8157J2550J7526R6445
7177a03211k10693n076j9767K0823J46318P5907j43035o6934N7835K05888j81288
7166b23233r4818m016J02889R1174K9054j41817o4420L81051j95743Q1019k4021
$$ plain form
7155 -62881 -189227 -234524 -246197 -364530 -306317 -76430 -63740 -51458 -130789 -308414 -197134
7144 -197134 -195816 -223774 -66968 -123837 -176715 -126100 -46862 -14035 -215872 -223787 -217085 -71802
7132 -71802 -134266 -171044 -181432 -145858 -277695 -275419 -320843 -248498 -201487 -388842 -273807
7121 -273807 -227738 -284410 -257245 -308305 -125439 22704 -68201 -149813 112145 248755 286952
7110 286952 203657 15469 -33988 -99852 -59990 -211192 -299227 -252391 -227719 -244722 -282585
7099 -282585 -108904 -31634 -164592 -75318 33775 124796 -128202 -49117 -143686 -269396 -79833
7088 -79833 -121868 -129561 -101681 -132590 -135336 -30815 22221 98805 3087 -81134 51761 -234925
7076 -234925 -312791 -182384 -148885 -128676 -126048 -89206 142032 422536 344945 104041 -41934
$$ packed form
7155f2881j26346m5297j1673j18333N8213K29887J2690J2282p9331j77625J11280
7144a97134J318k7958J56806n6869n2878N0615P9238L2827k01837p915O702J45283
7132g1802o2464l6778j0388L5574j31837K276m5424P2345M7011j87355J15035
7121b73807M6069n6672K7165n1060J82866J48143r0905q1612K61958J36610L8197
7110B86952q3295j88188m9457o5864L9862j51202q8035M6836K4672j7003l7863
7099b82585J73681P7270j32958Q9274J09093R1021k52998P9085r4569j25710J89563
7088g9833m2035p693K7880l0909k746J04521N3036P6584r5718q4221J32895k86686
7076b34925p7866J30407L3499K0209K628L6842K31238K80504p7591k40904j45975
$$ plain form
7065 -41934 -52565 45583 -258372 -114850 116981 -8999 -283809 -271564 -229041 -48220 203755
7054 203755 -75356 8618 -73076 -140119 -73639 105572 213540 191759 144249 -105281 222057
7043 222057 382098 309294 163376 268968 189882 88885 115686 -74345 -14602 142434
7033 142434 46580 115658 108182 134962 238371 89394 102919 364989 406882 471657 769564
7022 769564 571115 417774 462124 505370 670517 781379 669992 821262 940468 946061
7012 946061 988899 814474 736441 732151 432688 166424 413655 391769 303638 311956 224233
7001 224233 231339 280241 283804 126416 413389 383555 391776 279654 -18006 -863 28202
6990 28202 -9103 111282 128391 115892 176261 102334 38902 51817 -30971 -58860 -85732 -66178
$$ packed form
7065d1934j0631R8148l03955J43522K31831j25980k74810J2245M2523J80821K51975
7054B03755k79111Q3974q1694o7043O6480J79211J07968k1781m7510k49530L27338
7043B22057J60041p2804j45918J05592p9086j00997K6801j90031N9743J57036
7033A42434r5854O9078p476K6780J03409j48977J3525K62070M1893O4775K97907
7022G69564j98449j53341M4350M3246J65147J10862j11387J51270J19206N593
7012I46061M2838j74425p8033m290k99463k66264K47231k1886q8131Q318q7723
7001B24233P106M8902L563j57388K86973k9834Q221j12122k97660J7143K9065
6990B8202l7305J20385J7109j2499O0369p3927o3432J2915q2788k7889k6872J9554
$$ plain form
6978 -66178 129939 263240 138779 227674 191730 193194 235895 239925 118737 123655 75488 26758
6966 26758 223635 56351 -198461 -22502 214491 70515 65301 37219 299770 164214
6956 164214 -143991 -45991 97578 158208 245092 359137 265017 248438 306047 217359 284226
6945 284226 255549 101770 24059 -94609 -43646 -3600 -143157 -52895 -5907 76307 86804
6934 86804 144596 298843 165642 60017 -26168 170429 373879 309142 153976 -80542
6924 -80542 52260 150382 78975 213410 273213 317653 25428 91639 21625 -65179 -18822
6913 -18822 36642 139828 308547 308974 311679 418460 161406 217138 343069 329695 382550
6902 382550 189734 35545 184736 77420 139079 267037 33306 43545 194666 292133
$$ packed form
6978f6178J96117J33301j24461Q8895l5944J464M2701M030j21188M918m8167m8730
6966B6758J96877j67284k54812J75959K36993j43976n214k8082K62551j35556
6956A64214l08205R8000J43569O0630Q6884J14045r4120j6579N7609q8688O6867
6945B84226k8677j53779p7711j18668N0963M0046j39557R0262M6988Q2214J0497
6934H6804N7792J54247j33201j05625q6185J96597K03450o4737j55166k34518
6924h0542J32802R8122p1407J34435N9803M4440k92225O6211p0014q6804M6357
6913a8822N5464J03186J68719M27K705J06781k57054N5732J25931j3374N2855
6902C82550j92816j54189J49191j07316O1659J27958k33731J0239J51121R7467
$$ plain form
6892 292133 212772 259812 163466 327694 485781 650213 641782 599949 468858 262145 324086
6881 324086 374370 384236 76117 106741 61633 -89686 -180908 -80369 -62630 176506 112123
6870 112123 109204 256306 586648 300991 323311 449608 300463 224313 55170 -14175 80934
6859 80934 -115111 -243185 -176805 -14733 29867 -32214 -91043 -215014 -229882 -141134 -32506
6848 -32506 2106 26936 111977 319053 362833 494759 496379 212900 389890 353937 207374
6837 207374 184834 120225 -39536 83676 208134 -65044 -21991 167513 398851 309323
6827 309323 244062 96181 294793 470329 324427 360277 239862 203214 265241 87790
6817 87790 30979 -75 -9026 -14927 125951 -44358 135111 195741 81224 99094 97666 199222
$$ packed form
6892B92133p9361M7040r6346J64228J58087J64432q431m1833j31091k06713O1941
6881C24086N0284R866l08119L0624m5108j51319r1222J00539J7739K39136o4383
6870A12123k919J47102L30342k85657K2320J26297j49145p6150j69143o9345R5109
6859H0934j96045j28074O6380J62072M4600o2081n8829j23971j4868Q8748J08628
6848c2506L4612K4830Q5041K07076M3780J31926J620k83479J76990l5953j46563
6837B07374k2540o4609j59761J23212J24458k73178M3053J89504K31338q9528
6827C09323o5261j47881J98612J75536j45902L5850j20415l6648O2027j77451
6817H7790n6811l1054q951n901J40878j70309J79469O0630j14517J7870j428J01556
$$ plain form
6805 199222 203170 83879 146250 201177 300751 335777 389353 258739 33723 164881 60976
6794 60976 -208369 -204626 -340481 -504912 -304474 -177951 -173483 846 78128 244326 156387
6783 156387 208744 285560 86928 -12609 232146 97026 11084 177717 141858 134987 92887
6772 92887 -172679 -115215 176140 -141642 -205816 -165877 62529 426010 386942 248112 510788
6761 510788 571489 298673 341398 464975 389604 420066 440362 282479 299000 431757 373413
6750 373413 345297 384510 622032 646853 300718 423837 773231 599818 656257 667947 757761
6739 757761 827996 623722 412911 554456 655948 509644 447366 308228 386334 191544
6729 191544 10021 -29655 208993 329206 178694 172247 273895 290146 297537 409513 518269
$$ packed form
6805A99222L948j19291O2371N4927R9574L5026N3576j30614k25016J31158j03905
6794F0976k69345L743j35855j64431K00438J26523M468J74329P7282J66198q7939
6783A56387N2357P6816j98632r9537K44755j35120q5942J66633l5859o871m2100
6772I2887k65566N7464K91355l17782o4174L9939K28406L63481l9068j38830K62676
6761E10788O0701k72816M2725J23577p5371L0462K0296j57883J6521J32757n8344
6750C73413k8116L9213K37522K4821l46135J23119L49394j73413N6439J1690Q9814
6739G57761P0235k04274k10811J41545J01492j46304o2278j39138P8106j94790
6729A91544j81523l9676K38648J20213j50512o447J01648J6251P391J11976J08756
$$ plain form
6718 518269 715186 814610 899969 701700 547032 680391 616059 343946 542463 571457
6708 571457 623468 666246 635069 772109 958749 969539 976974 1071504 941192 1122130 1238969
6697 1238969 1407162 1598577 1625894 1640767 1733687 1782628 1627042 1306308 1322054 1360752 1242024
6686 1242024 1088249 1114390 1055052 953679 935317 703922 743367 734308 649094 737603 683076
6675 683076 667438 477926 511177 537469 476406 536247 363044 355144 437491 330542 456375
6664 456375 564750 374995 364432 321397 310246 231683 250277 54177 186799 320075 237351
6653 237351 201104 56993 286322 293012 113837 73495 -21974 255750 197078 157293 50275
6642 50275 40977 359274 510935 520981 563926 232173 109015 291748 309048 363828 377774
$$ packed form
6718E18269J96917R9424Q5359j98269j54668J33359o4332k72113J98517K8994
6708E71457N2011M2778l1177J37040J86640J0790P435R4530j30312J80938J16839
6697A238969J68193J91415K7317J4873R2920M8941j55586l20734J5746L8698j18728
6686A242024j53775K6141n9338j01373j8362k31395L9445r059q5214Q8509n4527
6675F83076j5638j89512L3251K6292o1063N9841j73203p900Q2347j06949J25833
6664D56375J08375j89755j0563m3035j1151p8563J8594j96100J32622J33276q2724
6653B37351l6247j44111K29329O690j79175m0342r5469K77724n8672l9785j07018
6642E0275r298L18297J51661J0046M2945l31753j23158J82733J7300N4780J3946
$$ plain form
6631 377774 158872 287144 393045 378391 352679 305196 256633 365114 361446 302526 409829
6620 409829 404990 535474 356079 472734 534271 777974 923391 485218 527027 681146
6610 681146 668712 661269 663245 879257 773473 753263 854054 724272 523479 396378 536883
6599 536883 821127 694485 453422 461935 504058 272411 224558 194972 311436 397633 424749
6588 424749 102587 353836 657094 753183 622191 620324 569356 647106 618834 586449 572055
6577 572055 631947 747366 660244 626746 510394 688985 907652 786921 777317 1026224 905094
6566 905094 806672 744219 611386 619301 705042 658088 757759 663880 360483 701459 805945
6555 805945 750676 649403 437729 706147 757547 672914 528216 564827 718101 788638 858631
$$ packed form
6631C77774k18902J28272J05901j4654k5712m7483m8563J08481l668n8920J07303
6620D09829m839J30484j79395J16655O1537K43703J45417m38173M1809J54119
6610F81146j2434p443J976K16012j05784k0210J00791j29782k00793j27101J40505
6599E36883K84244j26642k41063Q513M2123k31647m7853k9586J16464Q6197K7116
6588D24749l22162K51249L03258R6089j30992j867n0968P7750k8272l2385j4394
6577E72055N9892J15419q7122l3498j16352J78591K18667j20731r604K48907j21130
6566I05094r8422o2453j32833P915Q5741m6954R9671r3879l03397L40976J04486
6555H05945n5269j01273k11674K68418N1400q4633j44698L6611J53274P0537O9993
$$ plain form
6544 858631 916489 802967 1017760 890047 921641 808493 674793 603142 666144 777143
6534 777143 815261 770387 620618 722187 755821 945111 958872 835730 849357 750137 746071
6523 746071 800274 878891 755103 642590 695185 766062 645688 641742 730053 653825 583405
6512 583405 518947 555919 490478 418990 596658 769199 827241 865872 837348 862761 969945
6501 969945 910996 860964 827224 969482 1028825 849529 668355 853880 861896 737732 963116
6490 963116 919668 785416 987853 1030234 1088366 1222109 1348400 1395742 1238054 1127283
6480 1127283 1142035 1274116 1334202 1378887 1230760 1311474 1258717 1290286 1414024 1511460 1610963
6469 1610963 1729885 1751348 1768139 1921495 1918273 1847976 1771310 1702335 1788495 1684128 1405542
$$ packed form
6544H58631N7858j13522K14793j27713L1594j13148j33700p1651O3002J10999
6534G77143L8118m4874j49769J01569L3634J89290J3761j23142J3627r9220m066
6523G46071N4203P8617j23788j12513N2595P0877j20374l946Q8311p6228p0420
6512E83405o4458L6972o5441p1488J77668J72541N8042L8631k8524K5413J07184
6501I69945n8949n0032l3740J42258N9343j79296j81174J85525Q016j24164K25384
6490I63116m3448j34252K02437M2381N8132J33743J26291M7342j57688j10771
6480A127283J4752J32081O0086M4685j48127Q0714n2757L1569J23738R7436R9503
6469A610963J18922K1463J6791J53356l222p0297p6666o8975Q6160j04367k78586
$$ plain form
6458 1405542 1447728 1719762 1684517 1363471 1324064 1458891 1386936 1476622 1364645 1404983 1675794
6447 1675794 1406350 1591811 1499892 1464949 1615212 1557641 1673758 1720105 1844092 1861737
6437 1861737 1864772 1595737 1480837 1797752 1695583 1467914 1518662 1374205 1502302 1536150
6427 1536150 1330434 1289449 1562224 1602734 1781200 1710496 1564281 1681335 1866791 1707384
6417 1707384 1585416 1620749 1579973 1727008 1577156 1333059 1547655 1530293 1405312 1558965
6407 1558965 1609015 1636724 1719452 1673780 1647522 1917551 2119606 2112029 2156556 2196518 2332611
6396 2332611 2135043 2292630 2518632 2550797 2511771 2216207 2173784 2204040 2341928 2241536
6386 2241536 2234625 2359621 2527314 2552147 2486969 2582566 2682021 2906190 3068511 3043834 3445410
$$ packed form
6458A405542M2186K72034l5245l21046l9407J34827p1955Q9686j11977M0338K70811
6447A675794k69444J85461r1919l4943J50263n7571J16117M6347J23987J7645
6437A861737L035k69035j14900L16915j02169k27669N0748j44457J28097L3848
6427A536150k05716m0985K72775M0510J78466p0704j46215J17054J85456j59407
6417A707384j21968L5333m0776J47035j49852k44097K14596j7362j24981J53653
6407A558965N0050K7709Q2728m5672k6258K70029K02055p577M4527L9962J36093
6396B332611j97568J57587K26002L2165l9026k95564m2423L0256J37888j00392
6386B241536o911J24996J67693K4833o5178R5597R9455K24169J62321k4677M01576
$$ plain form
6375 3445410 3569036 3880984 4105947 4227919 4346780 4302799 3880823 3677110 3424958 3164697
6365 3164697 3088009 2924675 2531467 2262788 2035013 2096284 2182409 2029951 1860580 1953454
6355 1953454 1995892 2110667 2003856 1821368 1996930 1770052 1893466 1967519 1720347 1799702
6345 1799702 1769837 1656111 1756378 1963169 1899129 1775323 1708519 1815025 1888674 1951990
6335 1951990 1847745 1708737 1841884 1714461 1646499 1706362 1865492 1892521 1769654 1885036
6325 1885036 2112623 2045121 1899973 1965105 2128908 2028827 2160873 2004547 2053039 2274476
6315 2274476 2280766 2140232 2331801 2401648 2428032 2447695 2531272 2546400 2509624 2529379 2445640
6304 2445640 2500427 2514030 2544638 2544801 2300882 2211177 2145174 2172556 2298472 2126666 2071932
$$ packed form
6375C445410J23626L11948K24963J21972J18861m3981m21976k03713k52152k60261
6365C164697p6688j63334l93208k68679k27775O1271Q6125j52458j69371R2874
6355A953454M2438J14775j06811j82488J75562k26878J23414P4053k47172P9355
6345A799702k9865j13726J00267K06791o4040j23806o6804J06506P3649O3316
6335A951990j04245j39008J33147j27423o7962N9863J59130K7029j22867J15382
6325A885036K27587o7502j45148O5132J63803j00081J32046j56326M8492K21437
6315B274476O290j40534J91569O9847K6384J9663Q3577J5128l6776J9755q3739
6304B445640N4787J3603L0608J63k43919q9705o6003K7382J25916j71806n4734
$$ plain form
6293 2071932 1925470 1702518 1639995 1884528 1856021 1877547 2061990 1957847 2008189 2045366
6283 2045366 2064211 1968428 1856280 1663768 1774138 1822916 1793430 1988225 2078686 1986114 1957295
6272 1957295 1911367 1702359 1825726 1728811 1783733 1789560 1722737 1957877 2064770 1781452 1809500
6261 1809500 1899175 1767692 1814343 1896091 1959640 2162978 2121677 2035790 2080153 2091286 2032136
6250 2032136 1876176 2283246 2261500 2425051 2368948 2308703 2451312 2505947 2584620 2714591
6240 2714591 2749214 2820083 2740498 2881895 2998163 3255809 3269665 3211115 3281078 3410643 3478429
6229 3478429 3063170 2923827 3204703 3234171 2863592 3104648 2983781 2686365 2688747 2625646
6219 2625646 2518827 2849098 2751135 2620447 2411766 2050051 2091603 2181438 2218247 2442434
$$ packed form
6293B071932j46462k22952o2523K44533k8507K1526J84443j04143N0342L7177
6283B045366J8845r5783j12148j92512J10370M8778k9486J94795R0461r2572k8819
6272A957295m5928k09008J23367r6915N4922N827o6823K35140J06893k83318K8048
6261A809500Q9675j31483M6651Q1748O3549K03338m1301q5887M4363J1133n9150
6250B032136j55960M07070k1746J63551n6103o0245J42609N4635P8673J29971
6240B714591L4623P0869p9585J41397J16268K57646J3856n8550O9963J29565O7786
6229C478429m15259j39343K80876K9468l70579K41056j20867k97416K382o3101
6219B625646j06819L30271r7963j30688k08681l61715M1552Q9835L6809K24187
$$ plain form
6209 2442434 2358778 2226708 2097248 2369967 2301730 2286912 2275870 2164360 2368626 2515974
6199 2515974 2184745 1936533 1879102 1969369 2169017 2127423 2025889 2093055 2282245 2322392
6189 2322392 2196269 2007229 2014575 1965323 1897136 1868871 1683798 1979981 2058363 2105397 2144863
6178 2144863 2023840 2060480 2149382 2312834 2330439 2220568 2128742 2098691 2149718 2166560 2004798
6167 2004798 2080335 2211311 2075702 2117204 2277619 2240963 2142604 2214916 2273221 2102636 2136053
6156 2136053 2192286 2414141 2348244 2350440 2320467 2359256 2193803 2179880 2205891 2203664 2104377
6145 2104377 1882273 1781459 2102447 1986524 1961737 2118748 2129640 2526993 2684266 2491714
6135 2491714 2111296 1859964 1831780 2006033 1885382 1916652 2139564 2211048 2167525 2093257
$$ packed form
6209B442434q3656j32070j29460K72719o8237j4818j1042j11510K04266J47348
6199B515974l31229k48212n7431R0267J99648m1594j01534O7166J89190M0147
6189B322392j26123j89040P346m9252o8187k8265j85073K96183P8382M7034L9466
6178B144863j21023L6640Q8902J63452J7605j09871r1826l0051N1027J6842j61762
6167B004798P5537J30976j35609M1502J60415l6656r8359P2312N8305j70585L3417
6156B136053N6233K21855o5897K196k9973L8789j65453j3923K6011k227r9287
6145B104377k22104j00814L20988j15923k4787J57011J0892L97353J57273j92552
6135B491714l80418k51332k8184J74253j20651L1270K22912P1484m3523p4268
$$ plain form
6125 2093257 1970368 1764639 1699870 1687333 1657038 1696837 1866773 1742305 1802623 1713338 1742752
6114 1742752 1757502 1691859 2019740 2187746 1966687 1819351 2011544 2039883 2046598 1971372 1910662
6103 1910662 2023674 2069538 1857344 1811123 2108298 2268331 2174343 2143661 1977623 2151481
6093 2151481 2288571 2488447 2548146 2562114 2646874 2656086 2562819 2471668 2632205 2607166 2555221
6082 2555221 2372423 2389909 2343525 2241797 2222513 2294030 2403536 2569094 2581033 2620113 2573809
6071 2573809 2484280 2361479 2251527 2566156 2556349 2673293 2602940 2349200 2523796 2449094
6061 2449094 2308341 2603283 2597153 2255957 2430823 2657721 2582167 2489091 2371653 2532531
6051 2532531 2610281 2529422 2652991 2733254 2785680 2816756 2873371 2838498 2853018 2694857 2443414
$$ packed form
6125B093257j22889k05729o4769j2537l0295L9799J69936j24468O0318q9285K9414
6114A742752J4750o5643L27881J68006k21059j47336J92193K8339O715p5226o0710
6103A910662J13012M5864k12194m6221K97175J60033r3988l0682j66038J73858
6093B151481J37090J99876N9699J3968Q4760R212r3267r1151J60537k5039n1945
6082B555221j82798J7486m6384j01728j9284P1517J09506J65558J1939L9080m6304
6071B573809q9529j22801j09952L14629r807J16944p0353k53740J74596p4702
6061B449094j40753K94942o130l41196J74866K26898p5554r3076j17438J60878
6051B532531P7750q0859J23569Q0263N2426L1076N6615l4873J4520j58161k51443
$$ plain form
6040 2443414 2607296 2659064 2705159 2584833 2579462 2606281 2692922 2879002 2721512 2791898 3059244
6029 3059244 3248424 3108251 3068206 3103761 3253197 3252982 3181353 3231203 3325055 3238807 3244664
6018 3244664 3160394 3174507 3236629 3067753 3134968 3222218 3295794 3435068 3494562 3396182 3761374
6007 3761374 3671260 3413249 3680663 3685126 3616152 3465231 3429470 3697670 3629686 3496317 3503032
5996 3503032 3310486 3552657 3624580 3590171 3653873 3900258 3805501 3656493 4012324 4146794
5986 4146794 4189217 4117070 4139900 4009260 4122260 4235986 4561739 4512445 4282581 4193954
5976 4193954 4264446 4276315 4268133 4139216 4041886 4257764 4355854 4439082 4400423 4495846 4443341
5965 4443341 4623359 4800917 4630778 4697463 4781841 4751196 4741629 4712478 4607563 4895837 4887523
$$ packed form
6040B443414J63882N1768M6095j20326n371K6819Q6641J86080j57490P0386K67346
6029C059244J89180j40173m0045L5555J49436k15p1629M9850R3852q6248N857
6018C244664q4270J4113O2122j68876O7215Q7250P3576J39274N9494r8380L65192
6007C761374r0114k58011K67414M463o8974j50921l5761K68200o7984j33369O715
5996C503032j92546K42171P1923l4409O3702K46385r4757j49008L55831J34470
5986D146794M2423p2147K2830j30640J13000J13726L25753m9294k29864q8627
5976D193954P0492J1869q182j28917r7330K15878R8090Q3228l8659R5423n2505
5965D443341J80018J77558j70139O6685Q4378l0645r567k9151j04915K88274q314
$$ plain form
5954 4887523 4768686 4895224 4848208 5002857 5051817 4914243 5094779 5203181 5266362 5349477
5944 5349477 5330212 5204989 5520837 5572093 5475763 5350462 5617908 5785175 5779896 6058988
5934 6058988 5860542 5559538 5604480 5895606 5665826 5684696 5627553 5714945 5715458 5620579 5825293
5923 5825293 5950427 5836740 5876915 5975339 5996554 5801356 5669328 5551632 5857547 5923947
5913 5923947 5747027 5862630 5879231 6107049 6123342 6037434 6086929 6129793 6157140 6237478 6033852
5902 6033852 6039325 5948223 5938756 6074728 6414942 6482774 6246124 6163345 6196293 6228965 6375794
5891 6375794 6311011 6095534 5884165 6117277 6421737 6608901 6703461 6673574 6783057 6652941
5881 6652941 6845529 6892441 6978811 6916941 7257681 7377514 7576813 7766997 7830965 8002878
$$ packed form
5954D887523j18837J26538m7016J54649M8960j37574J80536J08402O3181Q3115
5944E349477j9265j25223L15848N1256r6330j25301K67446J67267n279K79092
5934F058988j98446l01004M4942K91126k29780J8870n7143Q7392N13r4879K04714
5923E825293J25134j13687M0175R8424K1215j95198j32028j17696L05915O6400
5913E923947j76920J15603J6601K27818J6293q5908M9495M2864K7347Q0338k03626
5902F033852N473r1102r467J35972L40214O7832k36650q2779L2948L2672J46829
5891F375794o4783k15477k11369K33112L04460J87164R4560k9887J09483j30116
5881F652941J92588M6912Q6370o1870L40740J19833J99299J90184O3968J71913
$$ plain form
5871 8002878 8192837 8281254 8431920 8492385 8576806 8590081 8598275 8573300 8619889 8809981 8938267
5860 8938267 8899240 9110481 9532205 9621625 9540847 9613141 9698843 9603673 9488839 9378929 9362158
5849 9362158 9444663 9514890 9719416 9963389 10138264 10216337 10527832 11061304 11066068 11189943
5839 11189943 11364335 11391262 11345721 11289415 11193795 11168606 11216603 11142160 11316158 11450093 11616054
5828 11616054 11883468 12137152 12497685 12629734 12679581 12732090 12348990 11713288 11423140 10997962
5818 10997962 10691471 10305766 9999432 9862396 9693475 9591494 9662207 9870959 9713459 9860236
5808 9860236 10132794 9828243 9723712 9836917 9969020 9982261 9938417 10065427 9911437 9904949
5798 9904949 9957735 9797743 9771162 10001044 10092312 9845450 9778838 9891262 10227968 10153720
$$ packed form
5871H002878J89959Q8417J50666O0465Q4421J3275Q194k4975M6589J90092J28286
5860H938267l9027K11241M21724Q9420q0778P2294Q5702r5170j14834j09910j6771
5849I362158Q2505P0227K04526K43973J74875P8073L11495N33472M764J23875
5839A1189943J74392K6927m5541n6306r5620k5189M7997p4443J73998J33935J65961
5828A1616054K67414K53684L60533J32049M9847N2509l83100o35702k90148m25178
5818A0997962l06491l85705l06334j37036j68921j01981P0713K08752j57500J46777
5808I860236K72558l04551j04531J13205J32103J3241m3844J27010j53990o488
5798I904949N2786j59992k6581K29882R1268k46862o6612J12424L36706p4248
$$ plain form
5788 10153720 10058069 10154509 10453505 10347035 10373806 10723341 10611718 10648233 10895573 10903151
5778 10903151 11078671 11195368 11502760 11697276 11994781 12601158 12927556 13078255 13161202 13358425
5768 13358425 13132332 12960163 12937793 12766938 12602692 12489751 12421919 12522759 12683692 12717859
5758 12717859 12669146 12696023 13026106 13033681 12797074 12561866 12400030 11917685 11330535 11085477
5748 11085477 10696410 10175311 9907631 9659673 9458007 9068825 8720165 8598010 8541911 8450313
5738 8450313 8524035 8410843 8225132 8389468 8299588 8175181 8194355 8217028 8041179 7874491
5728 7874491 8180242 8176479 8031230 7904184 7809951 8003494 8002267 7956792 7863585 7986460 7861279
5717 7861279 7775732 7753677 7572353 7516363 7564417 7603391 7567201 7528632 7573677 7633408 7468533
$$ packed form
5788A0153720r5651R6440K98996j06470K6771L49535j11623L6515K47340P578
5778A0903151J75520J16697L07392J94516K97505O06377L26398J50699Q2947J97223
5768A3358425k26093j72169k2370j70855j64246j12941o7832J00840J60933L4167
5758A2717859m8713K6877L30083P575k36607k35208j61836m82345n87150k45058
5748A1085477l89067n21099k67680k47958k01666l89182l48660j22155n6099r1598
5738H450313P3722j13192j85711J64336q9880j24407J9174K2673j75849j66688
5728G874491L05751l763j45249j27046r4233J93543j227m5475r3207J22875j25181
5717G861279q5547k2055j81324n5990M8054L8974l6190l8569M5045N9731j64875
$$ plain form
5706 7468533 7337176 7414017 7452114 7363899 7434847 7546385 7409262 7443030 7560501 7797854
5696 7797854 7752584 7914422 7865782 8050708 8016357 7865358 7908479 8097589 8154011 8300396
5686 8300396 8439335 8488659 8346621 8418516 8409619 8572952 8778712 8715410 8784407 8609284 8465507
5675 8465507 8382314 8481197 8653106 8804780 8935908 8854203 8635376 8709020 8818725 8926614
5665 8926614 8953671 9244523 9535387 9642825 9576748 9518673 9725114 9980281 9924665 10166795
5655 10166795 10290131 10514109 10627410 10415723 10478511 10686571 10838224 10694581 10771649 11032515
5645 11032515 11337620 11598107 11702267 11822707 12119879 12315803 12455525 12482632 12672459 12921204
5635 12921204 13214639 13523137 13828356 14163888 14474993 14902964 15221955 15526579 16025260
$$ packed form
5706G468533j31357P6841L8097q8215P0948J11538j37123L3768J17471K37353
5696G797854m5270J61838m8640J84926l4351j50999M3121J89110N6422J46385
5686H300396J38939M9324j42038P1895q897J63333K05760o3302O8997j75123j43777
5675H465507q3193R8883J71909J51674J31128q1705k18827P3644J09705J07889
5665H926614K7057K90852K90864J07438o6077n8075K06441K55167n5616K42130
5655A0166795J23336K23978J13301k11687O2788K08060J51653j43643P7068K60866
5645A1032515L05105K60487J04160J20440K97172J95924J39722K7107J89827K48745
5635A2921204K93435L08498L05219L35532L11105M27971L18991L04624M98681
$$ plain form
5626 16025260 16391952 16559948 16816870 16767402 16457910 16101881 16087873 15942431 16003311 15964407
5616 15964407 15669898 15736127 15974048 16182124 16349074 16487193 16920522 16895600 16758020 16732931
5606 16732931 16821512 17100725 16881480 16339865 16086584 15724473 15183587 14805031 14568998 14413367
5596 14413367 14363089 14085766 13843641 13933680 13748554 13444568 13496425 13353453 13005368 12980540
5586 12980540 12770981 12711602 12658669 12513343 12521428 12987367 13257222 13396527 13775996 14005968
5576 14005968 14712849 15011234 15077512 14818497 14079323 13268013 12784164 12239767 11970756 12052279
5566 12052279 11866073 11904585 11927835 11942292 11985636 12081389 12333663 12626871 12799976 12860981
5556 12860981 13111887 13380689 13045328 12970885 12825943 12610466 12526694 12417056 12210417 12310871
$$ packed form
5626A6025260L66692J67996K56922m9468l09492l56029j4008j45442O0880l8904
5616A5964407k94509O6229K37921K08076J66950J38119M33329k4922j37580k5089
5606A6732931Q8581K79213k19245n41615k53281l62111n40886l78556k36033j55631
5596A4413367n0278k77323k42125R0039j85126l03986N1857j42972l48085k4828
5586A2980540k09559n9379n2933j45326Q085M65939K69855J39305L79469K29972
5576A4005968P06881K98385O6278k59015p39174q11310m83849n44397k69011Q1523
5566A2052279j86206L8512K3250J4457M3344R5753K52274K93208J73105O1005
5556A2860981K50906K68802l35361p4443j44942k15477q3772j09638k06639J00454
$$ plain form
5546 12310871 12303519 11835452 11776654 11971881 12070349 12335822 11977289 12058079 12429141 12413855
5536 12413855 12297043 12181039 12223342 11978463 11579330 11218536 10979731 10913138 10865627 10325215
5526 10325215 10254964 10082037 9777755 9623379 9597065 9559126 9391301 9203120 9119150 9250594
5516 9250594 9386571 9057406 8935470 9134142 9016697 9111328 9005079 9027817 9150817 9096705
5506 9096705 9268481 9394376 9721563 9988199 9869651 9589553 9422506 9541132 9496632 9215980
5496 9215980 9220560 9450061 9363033 9302543 9517618 9454324 9197250 8907418 8779712 8911379
5486 8911379 8924431 8831455 8827801 8879293 8769134 8724527 8652173 8919169 8990873 8955382 9021002
5475 9021002 8948248 9146351 9542381 9769779 10213961 10119995 9944796 9551232 9199417 9333903
$$ packed form
5546A2310871p352m68067n8798J95227R8468K65473l58533Q0790L71062j5286
5536A2413855j16812j16004M2303k44879l99133l60794k38805o6593m7511n40412
5526A0325215p0251j72927l04282j54376k6314l7939j67825j88181q3970J31444
5516I250594J35977l29165j21936J98672j17445R4631j06249K2738J23000n4112
5506I096705J71776J25895L27187K66636j18548k80098j67047J18626m4500k80652
5496I215980M580K29501q7028o0490K15075o3294k57074k89832j27706J31667
5486H911379J3052r2976l654N1492j10159m4607p2354K66996P1704l5491O5620
5475I021002p2754J98103L96030K27398M44182r3966j75199l93564l51815J34486
$$ plain form
5465 9333903 9302246 9051385 8552295 8360346 8115722 8009545 7876674 7783436 7734707 7561320
5455 7561320 7473187 7511945 7392989 7329151 7372308 7282705 7443607 7555719 7495813 7379306 7421934
5444 7421934 7610030 7746184 7953418 8105636 8212303 7833489 7655093 7592672 7630257 7655067
5434 7655067 7584535 7487575 7386667 7350032 7127592 6908669 6866920 6955264 6993300 6894459 6625681
5423 6625681 6758357 6801550 6671710 6568073 6935666 6872705 6761321 6786852 6583695 6591019
5413 6591019 6707571 6527757 6430374 6698630 6714080 6417426 6222738 6364192 6523329 6474740
5403 6474740 6509804 6617629 6766119 6756868 6563794 6485214 6629734 6658015 6425697 6279793
5393 6279793 6080734 6123795 6204923 5962583 5879495 6012066 6055984 6170152 6109943 6264476
$$ packed form
5465I333903l1657k50861m99090j91949k44624j06177j32871r3238m8729j73387
5455G561320q8133L8758j18956o3838M3157q9603J60902J12112n9906j16507M2628
5444G421934J88096J36154K07234J52218J06667l78814j78396o2421L7585K4810
5434G655067p0532r6960j00908l6635k22440k18923m1749Q8344L8036r8841k68778
5423F625681J32676M3193j29840j03637L67593o2961j11384K5531k03157P324
5413F591019J16552j79814r7383K68256J5450k96654j94688J41454J59137m8589
5403F474740L5064J07825J48490r251j93074p8580J44520K8281k32318j45904
5393F279793j99059M3061Q1128k42340q3088J32571M3918J14168o0209J54533
$$ plain form
5383 6264476 6172230 6175162 6141231 6245006 6362857 6257347 6147585 6229184 6195489 6048949 6122040
5372 6122040 5997007 6007121 5956039 5748221 5752385 5819370 5860575 5921325 5933278 5733129 5768285
5361 5768285 5875756 5804669 5931328 6218775 6077693 6005879 5866998 6015630 6133015 6114634
5351 6114634 5968982 5881608 5989746 5936604 6068480 5975706 5973151 5866239 6048217 6182345
5341 6182345 6157458 6247153 6219106 6124737 6149726 6309960 6389129 6300063 6166561 6206630 6323144
5330 6323144 6183999 6181105 6121674 5768078 5720428 5839547 5807168 5852645 5933708 5717997 5921139
5319 5921139 6096202 6096225 6280849 6280691 6164022 5924728 6124437 6442414 6431864 6274949 6170279
5308 6170279 6286689 6468108 6382473 6167584 6053112 5990252 5983942 6332605 6095755 6215359
$$ packed form
5383F264476r2246K932l3931J03775J17851j05510j09762Q1599l3695j46540P3091
5372F122040j25033J0114n1082k07818M164O6985M1205O0750J1953k00149L5156
5361E768285J07471p1087J26659K87447j41082p1814j38881J48632J17385j8381
5351F114634j45652q7374J08138n3142J31876r2774k555j06912J81978J34128
5341F182345k4887Q9695k8047r4369K4989J60234P9169q9066j33502M0069J16514
5330F323144j39145k894n9431l53596m7650J19119l2379M5477Q1063k15711K03142
5319E921139J75063K3J84624j58j16669k39294J99709L17977j0550j56915j04670
5308F170279J16410J81419q5635k14889j14472o2860o310L48663k36850J19604
$$ plain form
5298 6215359 6297778 6112308 6054756 6228027 6394858 6398800 6336340 6388052 6590623 6663416 6851430
5287 6851430 6785432 6853577 6767698 6785749 6773418 6790765 6858469 6964734 6989902 7039117 6928871
5276 6928871 6995040 7019319 7223073 7418697 7620770 7568994 7528823 7616657 7668069 7835276 7742242
5265 7742242 7772874 7909615 7912458 7583507 7744431 7902373 7922272 7990630 7804837 7750487 7874185
5254 7874185 7848918 7779526 7833864 7869759 7806843 8095375 7990694 7867217 7758734 7689687 7742183
5243 7742183 7990151 7917559 8030487 8061336 8207840 8364504 8005953 8217051 8505567 8523791
5233 8523791 8693244 8627496 8808142 8962418 8958534 9048998 8951440 9081412 9345450 9503676
5223 9503676 9642016 9816194 10088931 10049341 10131570 10326326 10341495 10727530 10870359 11183235
$$ packed form
5298F215359Q2419j85470n7552J73271J66831L942o2460N1712K02571P2793J88014
5287F851430o5998O8145q5879J8051j2331J7347O7704J06265K5168M9215j10246
5276F928871O6169K4279K03754J95624K02073n1776m0171Q7834N1412J67207r3034
5265G742242L0632J36741K843l28951J60924J57942J9899O8358j85793n4350J23698
5254G874185k5267o9392N4338L5895o2916K88532j04681j23477j08483o9047N2496
5243G742183K47968p2592J12928L0849J46504J56664l58551K11098K88516J8224
5233H523791J69453o5748J80646J54276l884R0464r7558J29972K64038J58226
5223I503676J38340J74178K72737l9590Q2229J94756J5169L86035J42829L12876
$$ plain form
5213 11183235 11511493 11858578 12208080 12609128 12987707 13159602 13000201 13124626 12808444
5204 12808444 12584874 12367046 12374972 12493951 12538994 12430674 12361684 12199385 11867024 12126514
5194 12126514 12114066 12088347 12028159 11803344 11696284 11742210 11874261 11892700 12169013 12111260
5184 12111260 12145307 12303586 12109301 11848540 11648578 11633758 11580755 11387877 11387803 11260249 11124031
5173 11124031 10836635 10585638 10811107 10841494 10777906 10658971 10641056 10512294 10532555 10365765
5163 10365765 10129758 10177967 10279414 10366405 10268156 10279178 10316991 10244830 10388528 10355747 10413993
5152 10413993 10467738 10676977 10852061 10975354 11058939 11072510 11150568 10960454 10933915 11009338
5142 11009338 11044766 11241188 11469019 11584646 11662321 12030591 12051016 12287427 12174028 12222345
$$ packed form
5213A1183235L28258L47085L49502M01048L78579J71895j59401J24425l16182
5204A2808444k23570k17828P926J18979M5043j08320o8990j62299l32361K59490
5194A2126514j2448k5719o0188k24815j07060M5926J32051J8439K76313n7753
5184A2111260L4047J58279j94285k60761j99962j4820n3003j92878p4j27554j36218
5173A1124031k87396k50997K25469L0387o3588j18935j7915j28762K0261j66790
5163A0365765k36007M8209J01447Q6991r8249J1022L7813p2161J43698l2781N8246
5152A0413993N3745K09239J75084J23293Q3585J3571P8058j90114k6539P5423
5142A1009338L5428J96422K27831J15627P7675L68270K0425K36411j13399M8317
$$ plain form
5132 12222345 12640238 12822555 13127786 13425070 13659347 13936869 14298868 14495810 14860832
5123 14860832 15213745 15451215 15890037 15929574 15954024 16479978 16924328 17220711 17700463 18176250
5113 18176250 18445442 18998689 19430202 19809145 20140383 20498378 20938152 21389797 21445420 21916043
5103 21916043 22136506 22135006 22159803 22368045 22753005 22894661 23003294 23209670 23555050 24009754
5093 24009754 24341885 24344430 24293110 24049938 23883105 23694738 23329458 23222561 23108650 22981026
5083 22981026 22685173 22487613 22524998 22334572 22414865 22417257 22351761 22329929 22219106 21922709
5073 21922709 21834995 22041821 21747266 21533549 21600966 21823537 22077049 22384267 22963565 23732632
5063 23732632 24398275 24580722 24425614 23995902 22964427 21599925 20343421 19189437 18428716
$$ packed form
5132A2222345M17893J82317L05231K97284K34277K77522L61999J96942L65022
5123A4860832L52913K37470M38822L9537K4450N25954M44350K96383M79752M75787
5113A8176250K69192N53247M31513L78943L31238L57995M39774M51645N5623M70623
5103B1916043K20463j500K4797K08242L84960J41656J08633K06376L45380M54704
5093B4009754L32131K545n1320k43172j66833j88367l65280j06897j13911j27624
5083B2981026k95853j97560L7385j90426Q0293K392o5496k1832j10823k96397
5073B1922709q7714K06826k94555k13717O7417K22571K53512L07218N79298P69067
5063B3732632O65643J82447j55108m29712j031475j364502j256504j153984p60721
$$ plain form
5054 18428716 17813273 17361151 16796195 16391670 16151154 16045157 15815353 15550903 15430178
5045 15430178 15269458 15161606 15294654 15272926 15331382 15324954 15104782 15123335 15329937 15321343 15337297
5034 15337297 15365431 15324955 15194868 15286407 15418964 15411795 15476768 15600766 15845640 15893177 15876951
5023 15876951 15857879 15899771 15866803 16149896 16230292 16455770 16506372 16461075 16367522 16171541 16175769
5012 16175769 16128311 16264844 16327260 16362227 16560713 16416711 16443406 16655902 16769416 16813995
5002 16813995 16947299 17131596 17025745 17242871 17213482 16994461 17004132 16969409 16820467 16959588
4992 16959588 16951199 17185349 17225166 17352279 17344478 17318827 17169572 17144820 17180166 17247010 17435237
4981 17435237 17498559 17558627 17728627 17901593 18018765 18227939 18239227 18395242 18552558 18813867
$$ packed form
5054A8428716o15443m52122n64956m04525k40516j05997k29804k64450j20725
5045A5430178j60720j07852J33048k1728N8456o428k20172J8553K06602q594J5954
5034A5337297K8134m0476j30087R1539J32557p169O4973J23998K44874M7537j6226
5023A5876951j9072M1892l2968K83093Q0396K25478N0602m5297r3553j95981M228
5012A6175769m7458J36533O2416L4967J98486j44002K6695K12496J13514M4579
5002A6813995J33304J84297j05851K17126k9389k19021R671l4723j48942J39121
4992A6959588q389K34150L9817J27113p801k5651j49255k4752L5346O6844J88227
4981A7435237O3322O0068J70000J72966J17172K09174J1288J56015J57316K61309
$$ plain form
4971 18813867 19088611 19647202 20200889 20899905 21497094 22451757 23507627 23933000 24503339
4962 24503339 25428234 25688961 25466654 24779927 24028127 22925139 22037890 21705541 21301642
4953 21301642 20929203 20572219 20513699 20712191 20597967 20749273 20894220 20679750 20373957 20422489
4943 20422489 20442554 20702993 20753983 20822236 21134732 20930065 21098229 21497233 21599989 21749077
4933 21749077 21877382 22007060 22193940 22497769 22595650 22937709 23485273 23807092 24294384 24745804
4923 24745804 25080374 25296230 25504448 25323273 25243591 25014434 24713706 24530104 24503105 24664469
4913 24664469 24560889 24538336 24609644 24759081 24958488 25179729 25196595 25507731 26322671 26804478
4903 26804478 27366532 27937634 28554534 28972317 29084617 28950391 28640096 28372434 28093207
$$ packed form
4971A8813867K74744N58591N53687O99016N97189R54663J055870M25373N70339
4962B4503339R24895K60727k22307o86727p51800j102988q87249l32349m03899
4953B1301642l72439l56984n8520J98492j14224J51306J44947k14470l05793M8532
4943B0422489K0065K60439N0990O8253L12496k04667J68164L99004J02756J49088
4933B1749077J28305J29678J86880L03829R7881L42059N47564L21819M87292M51420
4923B4745804L34570K15856K08218j81175p9682k29157l00728j83602k6999J61364
4913B4664469j03580k2553P1308J49437J99407K21241J6866L11136Q14940M81807
4903B6804478N62054N71102O16900M17783J12300j34226l10295k67662k79227
$$ plain form
4894 28093207 27784362 27731366 27643570 27780127 27680993 27596784 27848716 28115589 28202130 28518382
4884 28518382 28587051 28653468 28976668 29298237 29550672 29890078 30525590 30990098 31204556 31560024
4874 31560024 32030902 32640424 33240689 33706076 34153295 34775463 35638702 36331564 37112586
4865 37112586 37846621 38635016 39841260 40906152 41674182 42272410 42727173 42635933 42461928
4856 42461928 42550068 42610477 42789688 43174073 43520434 43688886 43600226 43667407 43995988 44151260
4846 44151260 44453680 44972596 45666074 46233316 47047795 47745507 48631721 49643992 50870433
4837 50870433 51778672 53012365 54509745 56160209 57649315 59131865 60642889 62307473
4829 62307473 63986964 65669192 67838438 69917772 72556053 75268461 78148313 81438785
$$ packed form
4894B8093207l08845n2996q7796J36557r9134q4209K51932K66873Q6541L16252
4884B8518382O8669O6417L23200L21569K52435L39406O35512M64508K14458L55468
4874C1560024M70878O09522O00265M65387M47219O22168Q63239O92862P81022
4865C7112586P34035P88395J206244J064892P68030N98228M54763r1240j74005
4856D2461928Q8140O0409J79211L84385L46361J68452q8660O7181L28581J55272
4846D4151260L02420N18916O93478N67242Q14479O97712Q86214J012271J226441
4837E0870433R08239J233693J497380J650464J489106J482550J511024J664584
4829F2307473J679491J682228K169246K079334K638281K712408K879852L290472
$$ plain form
4821 81438785 84955867 88379264 91909323 95567265 99206239 103419090 108307086 113576294
4813 113576294 118801065 121475148 119943244 115488712 110483769 106817083 104260446 102873546
4805 102873546 102507618 103091519 104085352 105329226 107114869 109030417 111307661 113796832
4797 113796832 116114692 118307664 120498894 122394850 124770188 127148351 130284584 133878056
4789 133878056 137428187 141613109 146239613 151050884 156624889 162708011 168723144 174998222
4781 174998222 181062889 186647741 191821318 196268230 199735453 201783469 200899192 196843680
4773 196843680 190626081 184547854 179028025 174695082 171518740 168738917 166486981 164316476
4765 164316476 162817193 161718048 160729896 160637344 160832575 161389200 162004916 163102241 164692166
$$ packed form
4821H1438785L517082L423397L530059L657942L638974M212851M887996N269208
4813A13576294N224771K674083j531904m454532n004943l666686k556637j386900
4805A02873546l65928N83901R93833J243874J785643J915548K277244K489171
4797A13796832K317860K192972K191230J895956K375338K378163L136233L593472
4789A33878056L550131M184922M626504M811271N574005O083122O015133O275078
4781A74998222O064667N584852N173577M446912L467223K048016q84277m055512
4773A96843680o217599o078227n519829m332943l176342k779823k251936k170505
4765A64316476j499283j099145r88152r2552J95231N56625O15716J097325J589925
$$ plain form
4756 164692166 166554787 169086254 172147709 174317663 173083409 168695642 163877132 160124886
4748 160124886 157692515 156932832 157519577 158891369 161481618 164833569 168990142 174173138
4740 174173138 180071314 186597024 193178611 199866209 205985876 211498941 216500097 220983535
4732 220983535 224640074 227778403 230658069 234025749 237762787 242343784 247900527 255018961
4724 255018961 263535632 273490257 285333830 299283936 314712963 330557203 345669972
4717 345669972 359762279 372464211 384022139 395319618 403817560 402150990 384111105
4710 384111105 353509807 319668616 289005478 263465292 243130332 226768017 213427987
4703 213427987 202488739 193142087 184823075 177560343 170907551 165100017 159652467 154681284
$$ packed form
4756A64692166J862621K531467L061455K169954j234254m387767m818510l752246
4748A60124886k432371p59683N86745J371792K590249L351951M156573N182996
4740A74173138N898176O525710O581587O687598O119667N513065N001156M483438
4732B20983535L656539L138329K879666L367680L737038M580997N556743P118434
4724B55018961Q516671R954625J1843573J3950106J5429027J5844240J5112769
4717C45669972J4092307J2701932J1557928J1297479Q497942j666570j8039885
4710C84111105l0601298l3841191l0663138k5540186k0334960j6362315j3340030
4703B13427987j0939248r346652q319012p262732o652792n807534n447550m971183
$$ plain form
4695 154681284 150263933 146092984 141811866 137816966 133935210 130292828 127038638 123921068
4687 123921068 120852290 117937553 115089873 112346535 109670031 107112126 104519097 102014418
4679 102014418 99744938 97596223 95511355 93475188 91566166 89693750 88000636 86454110
4671 86454110 84769228 83203515 81850561 80476830 79236768 78013277 76516836 75200225
4663 75200225 73876782 72414356 71220565 69971885 68797061 67404437 66275918 65112977
4655 65112977 64262815 63347481 62535392 61891010 61111781 60366256 59456111 58736999 58234533
4646 58234533 57641393 57002421 56506591 55942705 55346897 54805687 54112423 53610325 53135975
4637 53135975 52610827 52060311 51645767 51397866 51032833 50469911 50047787 49548851 49415348
$$ packed form
4695A54681284m417351m170949m281118l994900l881756l642382l254190l117570
4687A23921068l068778k914737k847680k743338k676504k557905k593029k504679
4679A02014418k269480k148715k084868k036167j909022j872416j693114j546526
4671H6454110j684882j565713j352954j373731j240062j223491j496441j316611
4663G5200225j323443j462426j193791j248680j174824j392624j128519j162941
4655F5112977q50162r15334q12089o44382p79229p45525r10145p19112n02466
4646E8234533n93140o38972m95830n63886n95808n41210o93264n02098m74350
4637E3135975n25148n50516m14544k47901l65033n62922m22124m98936j33503
$$ plain form
4628 49415348 49508295 49497890 49782180 49841207 49678922 48999513 48375960 48045155 47529900 46987814
4618 46987814 46804317 46822147 46971500 47290715 47896996 48543283 49257689 49813273 50259249 50626898
4608 50626898 51332368 51765743 50949989 48970214 46790880 44814200 43086134 41222132 39558076
4599 39558076 38176121 36829230 35451440 33987403 33138390 32198491 31448427 30977525 30580861
4590 30580861 30284349 29849944 28809969 27638872 26861833 25936759 24863016 24329238 23768323
4581 23768323 23318333 22934523 22617753 22211133 21661665 21256190 20617131 20257888 20059480
4572 20059480 19863587 19934824 19775619 19237816 19103230 18767699 18578465 18475130 18278586 18228306
4562 18228306 18021073 17888750 17709545 17817684 17912159 17805087 17682763 17808131 18101111 18651806
$$ packed form
4628D9415348R2947j0405K84290N9027j62285o79409o23553l30805n15255n42086
4618D6987814j83497J7830J49353L19215O06281O46287P14406N55584M45976L67649
4608E0626898P05470M33375q15754j979775k179334j976680j728066j864002j664056
4599C9558076j381955j346891j377790j464037q49013r39899p50064m70902l96664
4590C0580861k96512m34405j039975j171097p77039r25074j073743n33778n60915
4581B3768323m49990l83810l16770m06620n49468m05475o39059l59243j98408
4572B0059480j95893P1237j59205n37803j34586l35531j89234j03335j96544n0280
4562A8228306k07233j32323j79205J08139R4475j07072j22324J25368K92980N50695
$$ plain form
4552 18651806 19055431 18923399 18271264 17736744 17400019 16878459 16435470 16098486 15583356
4543 15583356 15320657 14959015 14527331 14416496 14227877 13908762 13695483 13607704 13442586 13367826
4533 13367826 13178066 12836737 12746370 12650232 12557666 12304690 12257687 12255651 12118725 12015586
4523 12015586 11935546 12022124 12027548 11933584 11977400 12189858 11928572 11898607 11883149 12059651 11988708
4512 11988708 11948819 11879687 11809480 11891255 11821532 11763373 11720950 11849767 11860489 11943693 11984389
4501 11984389 11877123 11618763 11337094 11240487 11286246 11028647 10717286 10860554 10892793 10997633
4491 10997633 10992789 10897130 10801675 10895120 10857794 10836863 10871504 10604352 10416870 10126582 9758018
4480 9758018 9715405 9704721 9432104 9265267 9506419 9676398 9416169 9291086 9462137 9187886
$$ packed form
4552A8651806M03625j32032o52135n34520l36725n21560m42989l36984n15130
4543A5583356k62699l61642m31684j10835j88619l19115k13279q7779j65118p4760
4533A3367826j89760l41329r0367r6138r2566k52976m7003k036j36926j03139
4523A2015586q0040Q6578N424r3964M3816K12458k61286k9965j5458J76502p0943
4512A1988708l9889o9132p0207Q1775o9723n8159m2423J28817J0722Q3204M0696
4501A1984389j07266k58360k81669r6607M5759k57599l11361J43268L2239J04840
4491A0997633m844r5659r5455R3445l7326k0931L4641k67152j87482k90288l68564
4480I758018m2613j0684k72617j66837K41152J69979k60229j25083J71051k74251
$$ plain form
4470 9187886 9100177 9204007 9103686 9112134 8989001 8943875 8996286 9052122 8944907 8743812 8649474
4459 8649474 8631596 8473127 8564494 8636479 8723446 8855677 8859011 8792183 8810443 8902361 8842362
4448 8842362 8666291 8728555 8682704 8520182 8421403 8247223 8314684 8149050 8088571 8345656
4438 8345656 8292304 8158888 8029534 7886184 7966634 7865073 7734261 7667947 7685593 7631957
4428 7631957 7720565 7732607 7617619 7591297 7621884 7455288 7149005 7124171 7114735 7102455 6876279
4417 6876279 6808909 6820411 6872387 6862036 6854828 7072518 7152572 7116905 7028887 7118611 6995234
4406 6995234 6819131 6655970 6710282 6878549 6418472 6177011 5662552 5653630 5429407 5211879
4396 5211879 5028428 5046489 5250973 5000309 4976541 4763030 4687698 4571987 4480449 4696770
$$ packed form
4470I187886q7709J03830j00321Q448j23133m5126N2411N5836j07215k01095r4338
4459H649474j7878j58469R1367P1985Q6967J32231L334o6828J8260R1918n9999
4448H842362j76071O2264m5851j62522r8779j74180O7461j65634o0479K57085
4438H345656n3352j33416j29354j43350Q0450j01561j30812o6314J7646n3636
4428G631957Q8608J2042j14988k6322L0587j66596l06283k4834r436j2280k26176
4417F876279o7370J1502N1976j0351p208K17690Q0054l5667q8018Q9724j23377
4406F995234j76103j63161N4312J68267m60077k41461n14459q922k24223k17528
4396E211879j83451J8061K04484k50664k3768k13511p5332j15711r1538K16321
$$ plain form
4386 4696770 4692977 4825515 4722738 4600889 4586567 4626814 4629646 4677710 4750774 4613707 4521956
4375 4521956 4553116 4767605 4833450 4785792 4553397 4481246 4505932 4483956 4265079 4102192 4052439
4364 4052439 3982587 3914054 3901622 4010099 3954452 3978763 3986944 3700118 3614490 3582151 3687030
4353 3687030 3785630 3493985 3490377 3349980 3111189 3193803 3139905 3100316 3099827 3064800 3230282
4342 3230282 3031736 3032741 3158885 2901247 3046666 2953566 2970429 3015211 3042723 3032544 3034752
4331 3034752 3046351 3148372 2976088 2900315 2883634 2997338 3090226 3077889 3179159 3105606 2883063
4320 2883063 3022636 3273964 3235554 3320075 3275068 3410819 3429087 3366427 3384238 3199228 3169734
4309 3169734 3272749 3364363 3296883 3318158 3550795 3532602 3430220 3598502 3421675 3187392
$$ packed form
4386D696770l793J32538j02777j21849j4322M0247K832M8064P3064j37067r1751
4375D521956L1160K14489O5845m7658k32395p2151K4686k1976k18877j62887m9753
4364D052439o9852o8533j2432J08477n5647K4311Q181k86826q5628l2339J04879
4353C687030R8600k91645l608j40397k38791Q2614n3898l9589m89l5027J65482
4342C230282j98546J005J26144k57638J45419r3100J6863M4782K7512j0179K208
4331C034752J1599J02021j72284p5773j6681J13704R2888j2337J01270p3553k22543
4320B883063J39573K51328l8410Q4521m5007J35751J8268o2660J7811j85010k9494
4309C169734J03015R1614o7480K1275K32637j8193j02382J68282j76827k34283
$$ plain form
4299 3187392 3153361 2994325 2932024 3141860 2936940 2713720 2840390 2867223 2780751 2611180
4289 2611180 2544688 2283886 2379505 2426713 2514232 2336337 2292956 2332727 2171953 2190047 2274005
4278 2274005 2318175 2142047 2292047 2480302 2351518 2222838 2128424 2023443 2161278 2058411
4268 2058411 2123422 2107561 2147601 2102631 1990134 2106221 2240615 2194360 2217116 2252448 2194212
4257 2194212 2352514 2332706 2163169 2175372 2295739 2247825 2348636 2295906 2282100 2299501 2190567
4246 2190567 2173509 2055920 1888359 1747335 1883818 2028670 2079003 2033835 1936888 2089537
4236 2089537 2278372 2396614 2200263 2083709 2065753 2082956 2089989 1902119 2024703 2126213
4226 2126213 2014682 1948682 1953671 1979743 1747639 1796877 1780715 1762306 1762148 1774497 1808694 2020008
$$ packed form
4299C187392l4031j59036o2301K09836k04920k23220J26670K6833q6472j69571
4289B611180o6492k60802R5619M7208Q7519j77895m3381L9771j60774J8094Q3958
4278B274005M4170j76128J50000J88255j28784j28680r4414j04981J37835j02867
4268B058411O5011j5861M0040m4970j12497J16087J34394m6255K2756L5332n8236
4257B194212J58302j9808j69537J2203J20367m7914J00811n2730j3806J7401j08934
4246B190567j7058j17589j67561j41024J36483J44852N0333m5168r6947J52649
4236B089537J88835J18242j96351j16554j7956J7203P033j87870J22584J01510
4226B126213j11531o6000M989K6072k32104M9238j6162j8409j58J2349L4197K11314
$$ plain form
4214 2020008 2119711 2150898 2122028 2093900 2073548 1762829 1637250 1828726 1807209 1692001 1654508
4203 1654508 1531767 1611371 1704740 1477064 1495731 1715856 2002456 2077244 2108637 2279769
4193 2279769 2326888 2215916 2195872 2322318 2091932 2091308 1979785 1938135 1953514 1915377 2192902
4182 2192902 2043228 2101450 2357932 2225960 2058347 2195455 2298434 2262174 2444042 2684448
4172 2684448 2712236 2512955 2464273 2448612 2329111 2240105 2294927 2243496 2006560 1709262 1824016
4161 1824016 1765697 1617966 1645145 1653169 1665211 1636209 1750252 1915047 1627150 1795779 1844504
4150 1844504 1867102 1857321 1638938 1683402 1849208 1759386 1674434 1793419 1552943 1484745 1310679
4139 1310679 1370741 1379168 1605939 1700907 1817821 1764928 1381485 1479756 1652759 1502371 1749815
$$ packed form
4214B020008R9703L1187k8870k8128k0352l10719j25579J91476k1517j15208l7493
4203A654508j22741P9604R3369k27676J8667K20125K86600P4788L1393J71132
4193B279769M7119j10972k0044J26446k30386o24j11523m1650J5379l8137K77525
4182B192902j49674N8222K56482j31972j67613J37108J02979l6260J81868K40406
4172B684448K7788j99281m8682j5661j19501q9006N4822n1431k36936k97298J14754
4161A824016n8319j47731K7179Q024J2042k9002J14043J64795k87897J68629M8725
4150A844504K2598r781k18383M4464J65806q9822q4952J18985k40476o8198j74066
4139A310679O0062Q427K26771R4968J16914n2893l83443R8271J73003j50388K47444
$$ plain form
4128 1749815 1702237 1584714 1567180 1658040 1775401 1741907 1716603 1752726 1848327 1756941 1811588
4117 1811588 1775148 1663974 1603674 1509774 1333030 1444905 1534756 1642095 1695014 1692712 1706486
4106 1706486 1759650 1530396 1700186 1941375 1833372 1741780 1772244 1741497 1799133 2043012
4096 2043012 1914946 1940672 1897147 1737876 1900726 1843970 1569553 1686720 1875710 1899171
4086 1899171 2017589 1961372 1896452 1882409 1753363 1632366 1562174 1440561 1321332 1382570
4076 1382570 1232042 1115606 1314210 1148815 1309056 1369738 1435630 1218940 1117714 1085336
4066 1085336 1168230 1383498 1114654 1066463 1113420 1236095 1360671 1393061 1475380 1516775 1295115
4055 1295115 1099789 1396347 1404405 1390861 1184136 1227805 1560073 1350256 1402140 1444927 1304956
$$ packed form
4128A749815m7578j17523j7534R0860J17361l3494k5304L6123R5601r1386N4647
4117A811588l6440j11174o0300r3900j76744J11875Q9851J07339N2919k302J3774
4106A706486N3164k29254J69790K41189j08003r1592L0464l0747N7636K43879
4096B043012j28066K5726m3525j59271J62850n6756k74417J17167J88990K3461
4086A899171J18418n6217o4920j4043j29046j20997p0192j21613j19229O1238
4076A382570j50528j16436J98604j65395J60241O0682O5892k16690j01226l2378
4066A085336Q2894K15268k68844m8191M6957J22675J24576L2390Q2319M1395k21660
4055A295115j95326K96558Q058j3544k06725M3669L32268k09817N1884M2787j39971
$$ plain form
4044 1304956 1299958 1342568 1222821 1126959 1076661 1245848 1185389 1237347 1346302 1153744 1237080
4033 1237080 1309211 1113261 1077000 1048238 1047348 1140416 1178190 1155313 1183112 1165493 1248234 1407200
4021 1407200 1466292 1335880 1270234 1164119 1087628 1144213 1036984 1078982 1162964 1486164 1524087
4010 1524087 1338360 1240770 1075527 1208823 1194220 1423514 1413874 1540588 1623954 1558296 1576064
3999 1576064 1447639 1306529 1374923 1284382 1131530 1103831 1214799 1285787 1218361 1032739
3989 1032739 1323626 1534257 1406082 1354162 1283851 1541324 1388860 1415491 1383042 1463723
3979 1463723 1801283 1793003 1747276 1746859 1571731 1494753 1472056 1497095 1378766 1015660 1103384
3968 1103384 1211622 1048029 905338 1073401 1015448 973983 942407 1035454 1083194 1176325 1260191
$$ packed form
4044A304956m998M2610j19747r5862n0298J69187o0459N1958J08955j92558Q3336
4033A237080P2131j95950l6261k8762q90R3068L7774k2877K7799j7619Q2741J58966
4021A407200N9092j30412o5646j06115p6491N6585j07229M1998Q3982L23200L7923
4010A524087j85727r7590j65243J33296j4603K29294r640J26714Q3366o5658J7768
3999A576064j28425j41110O8394r0541j52852k7699J10968P0988o7426j85622
3989A032739K90887K10631j28175n1920p0311K57473j52464K6631l2449Q0681
3979A463723L37560q280m5727m17j75128p6978k2697K5039j18329l63106Q7724
3968A103384J08238j63593j42691J68063n7953m1465l1576R3047M7740R3131Q3866
$$ plain form
3957 1260191 1072867 1033444 1023218 1079492 1007474 1062277 953982 930950 1037642 903876 836649
3946 836649 893159 1096303 1217527 1167598 1157592 1238876 1196003 1245010 1208196 1026263 1124295
3935 1124295 1334167 1390690 1625941 1510686 1167038 1210497 1157279 1231023 1176740 1091153 1032957
3924 1032957 1130294 1058108 1057410 1251764 1161025 1213813 1225095 1056430 1098781 1085597 1125707
3913 1125707 1143201 1361692 1270471 1289516 1351913 1351575 1320187 1157999 1187790 953872 978042
3902 978042 1368819 1436520 1315754 1333211 1245502 1315620 1322557 1220810 1445165 1242971 1141472
3891 1141472 997089 1186258 1296125 1205725 1346938 1318707 1189762 1091333 1149901 1176550
3881 1176550 1033142 1113574 1516879 1513658 1362615 1343847 1428005 1467444 1516363 1276717 1374230
$$ packed form
3957A260191j87324l9423j0226N6274p2018N4803j08295k3032J06692j33766o7227
3946H36649N6510K03144J21224m9929j0006Q1284m2873M9007l6814j81933R8032
3935A124295K09872N6523K35251j15255l43648M3459n3218P3744n4283q5587n8196
3924A032957R7337p2186o98J94354r0739N2788J1282j68665M2351j3184M0110
3913A125707J7494K18491r1221J9045O2397l38l1388j62188K9791k33918K4170
3902I78042L90777O7701j20766J7457q7709P0118O937j01747K24355k02194j01499
3891A141472j44383J89169J09867r0400J41213k8231j28945r8429N8568K6649
3881A176550j43408Q0432M03305l221j51043j8768Q4158L9439M8919k39646R7513
$$ plain form
3870 1374230 1234786 1231140 1337646 1274271 1158392 1276286 1435298 1449963 1365243 1566510
3860 1566510 1664496 1680298 1600828 1547890 1676564 1930251 1876391 1889969 2066322 1992452 1853797
3849 1853797 1660769 1644620 1482825 1437893 1198133 1278470 1523246 1468958 1349510 1441129
3839 1441129 1266797 1176763 1124637 1180386 1198227 1374336 1258385 1196286 1197607 1212651 1304348
3828 1304348 1401129 1284053 1164330 1173779 1410191 1438175 1667638 1581958 1258972 1445494
3818 1445494 1654134 1399461 1190063 1443232 1434843 1389356 1243855 1199752 1369270 1529935
3808 1529935 1462607 1420464 1413581 1332580 1262875 1216248 1141546 1214377 1048304 820062 861099
3797 861099 944429 1088483 1069354 1103259 1238563 1021010 1116043 945976 942345 1075380 1062423
$$ packed form
3870A374230j39444l646J06506o3375j15879J17894J59012J4665q4720K01267
3860A566510R7986J5802p9470n2938J28674K53687n3860J3578J76353p3870j38655
3849A853797j93028j6149j61795m4932k39760Q0337K44776n4288j19448R1619
3839A441129j74332r0034n2126N5749J7841J76109j15951o2099J321J5044R1697
3828A304348R6781j17076j19723R449K36412K7984K29463q5680l22986J86522
3818A445494K08640k54673k09398K53169q389m5487j45501m4103J69518J60665
3808A529935o7328m2143o883q1001o9705m6627p4702P2831j66073k28242M1037
3797H61099Q3330J44054j9129L3905J35304k17553R5033j70067l631J33035j2957
$$ plain form
3786 1062423 956835 847322 1062699 1059104 989335 1043607 1020715 1063618 818599 1022389 1054331
3775 1054331 958480 953678 1073375 928567 687571 589279 260210 250682 442537 722084 775537
3764 775537 778029 875842 867119 881081 849567 847542 1012293 988569 844223 832018 669887 652196
3752 652196 698640 729874 757240 755767 607737 774245 774145 735931 769183 1026229 1194076
3741 1194076 1151386 1183422 1007993 1104632 995436 1009637 1057661 1212709 1179743 1057643 1166591
3730 1166591 1186495 1227757 1031707 1069763 972373 863615 857293 740504 750304 957043 1101572
3719 1101572 1140524 999777 954689 1010661 961738 938240 844862 731144 701226 839778 999111
3708 999111 945652 767522 846040 860593 827543 526165 582386 581711 582229 242239 267601 500680
$$ packed form
3786A062423j05588j09513K15377l595o9769N4272k2892M2903k45019K03790L1942
3775A054331r5851m802J19697j44808k40996r8292l29069r528J91855K79547N3453
3764G75537K492R7813q723J3962l1514k025J64751k3724j44346j2205j62131j7691
3752F52196M6444L1234K7366j473j48030J66508j00l8214L3252K57046J67847
3741A194076m2690L2036j75429R6639j09196J4201M8024J55048l2966j22100J08948
3730A166591J9904M1262j96050L8056r7390j08758o322j16789R800K06739J44529
3719A101572L8952j40747m5088N5972m8923k3498r3378j13718k9918J38552J59333
3708I99111n3459j78130P8518J4553l3050l01378N6221o75N18l39990K5362K33079
$$ plain form
3696 500680 624941 872198 680943 643594 776694 631189 411316 319843 360974 322607
3686 322607 353145 386069 377779 390494 255012 325660 585930 516805 538944 594992 512757
3675 512757 474726 520325 378895 499046 453706 537760 470314 242516 346401 449400 568390
3664 568390 556546 505334 254465 208032 435789 495817 375981 219290 297309 294376 252903
3653 252903 546843 573068 604629 378508 407638 499648 144612 82033 38521 116755 219042
3642 219042 161123 110538 400759 108403 94591 143257 -4920 175167 190411 338275 350500
3631 350500 455073 374583 353062 501959 504485 619096 441282 243996 245167 260682 247827
3620 247827 28088 186829 248234 336976 309232 223185 362259 510848 428919 231049 155136
$$ packed form
3696E00680J24261K47257j91255l7349J33100j45505k19873r1473M1131l8367
3686C22607L0538L2924q290J2715j35482P0648K60270o9125K2139N6048q2235
3675E12757l8031M5599j41430J20151m5340Q4054o7446k27798J03885J02999J18990
3664E68390j1844n1212k50869m6433K27757O0028j19836j56691P8019k933m1473
3653B52903K93940K6225L1561k26121K9130R2010l55036o2579m3512P8234J02287
3642B19042n7919n0585K90221k92356j3812M8666j48177J80087J5244J47864J2225
3631C50500J04573q0490k1521J48897K526J14611j77814j97286J171J5515j2855
3620B47827k19739J58741O1405Q8742k7744q6047J39074J48589q1929j97870p5913
$$ plain form
3609 155136 439242 451346 230800 217578 107199 117709 257350 262544 291812 448181 302943
3598 302943 -380 307221 471467 285742 166015 218829 311434 225885 103452 25015
3588 25015 16900 83062 236416 361206 387344 469927 212866 34483 103633 305244 350679
3577 350679 154343 232876 186508 256624 206633 -16066 162351 16996 63878 246069 14323
3566 14323 -26770 -60317 64070 166495 63816 183342 215051 319684 326306 267988 70601
3555 70601 116335 157367 122833 97475 83925 98136 201713 222778 304891 506602 541276
3544 541276 260025 -34202 119413 155720 256534 320734 168335 181317 304922 317025
3534 317025 493171 659297 589065 385933 396727 402430 461521 484163 223612 360019 568465
$$ packed form
3609A55136K84106J2104k20546j3222j10379J0510J39641N194K9268J56369j45238
3598C02943l03323L07601J64246j85725j19727N2814R2605q5549j22433p8437
3588B5015q115O6162J53354J24790K6138Q2583k57061j78383O9150K01611M5435
3577C50679j96336P8533m6368P0116m9991k22699J78417j45355M6882J82191k31746
3566A4323m1093l3547J24387J02425j02679J19526L1709J04633O622n8318j97387
3555G0601M5734M1032l4534k5358j3550J4211J03577K1065Q2113K01711L4674
3544E41276k81251k94227J53615L6307J00814O4200j52399J2982J23605J2103
3534C17025J76146J66126p0232k03132J0794N703N9091K2642k60551J36407K08446
$$ plain form
3523 568465 372311 362914 456115 562317 558527 452269 256269 557189 512213 367936 484718
3512 484718 270721 370067 446019 175909 257540 329231 288564 176145 263861 184775 30026
3501 30026 67644 244356 430345 487642 479448 453360 499429 419987 360598 309613 297283 407363
3489 407363 424703 310775 289513 208365 123370 16254 47020 -23728 219188 282938 279914
3478 279914 208498 281883 398650 178566 131019 54436 125322 271218 368765 266692 221002
3467 221002 73244 -48313 176256 252628 80352 233679 163929 250636 296282 341050 445208
3456 445208 427834 465508 381559 206568 272006 156980 135691 226281 181153 179744 219761
3445 219761 413858 367807 298084 289732 430856 265910 188024 136277 282527 387521 397591
$$ packed form
3523E68465j96154r397R3201J06202l790j06258j96000L00920m4976j44277J16782
3512D84718k13997R9346P5952k70110Q1631P1691m0667j12419Q7716p9086j54749
3501C0026L7618J76712J85989N7297q194k6088M6069p9442n9389n0985j2330J10080
3489D07363J7340j13928k1262q1148q4995j07116L0766p0748K42916O3750l024
3478B79914p1416P3385J16767k20084m7547p6583P0886J45896R7547j02073m5690
3467B21002j47758j21557K24569P6372j72276J53327o9750Q6707M5646M4768J04158
3456D45208j7374L7674q3949j74991O5438j15026k1289R0590m5128j409M0017
3445B19761J94097m6051o9723q352J41124j64946p7886n1747J46250J04994J0070
$$ plain form
3434 397591 403237 330398 193901 236547 421568 390353 198201 308014 456316 262218 452992
3423 452992 446904 475465 470061 409530 262213 325791 225721 270487 207108 30104 240573
3412 240573 428045 414900 472985 462338 243222 366037 414934 134573 198279 547803 603010
3401 603010 532850 323914 211221 235127 359209 393091 470011 258689 373687 507208
3391 507208 436623 408304 641692 546005 576175 722622 689080 614586 648392 692579 523600
3380 523600 325420 465254 709700 688131 672272 718827 820810 810021 750928 718528 623366
3369 623366 468062 535615 703555 881514 928482 938095 867523 887760 1027967 904802 758209
3358 758209 800407 1039332 982187 981421 1103357 1183924 1138999 977622 961756 721867 993503
$$ packed form
3434C97591N646p2839j36497M2646J85021l1215j92152J09813J48302j94098J90774
3423D52992o088K8561n404o0531j47317O3578j00070M4766o3379j77004K10469
3412B40573J87472j3145N8085j0647k19116J22815M8897k80361O3706L49524N5207
3401F03010p0160k08936j12693K3906J24082L3882P6920k11322J14998J33521
3391E07208p0585k8319K33388r5687L0170J46447l3542p4494L3806M4187j68979
3380E23600j98180J39834K44446k1569j5859M6555J01983j0789n9093l2400r5162
3369F23366j55304O7553J67940J77959M6968R613p0572K0237J40207j23165j46593
3358G58209M2198K38925n7145p66J21936Q0567m4925j61377j5866k39889K71636
$$ plain form
3347 993503 1173810 1272466 1151402 934415 1023740 1010886 943138 1012713 1064232 1070861 1066189
3336 1066189 959544 1156289 1339025 1456897 1512608 1362638 1443543 1545534 1369339 1359915
3326 1359915 1476371 1432949 1592101 1631635 1630696 1679833 1454232 1556756 1790709 1952113 1871224
3315 1871224 1957916 1790376 1630564 1762627 1724983 1764954 2025139 2199393 2085755 2004147
3305 2004147 1905151 1836001 1865628 2080010 2123679 2287367 2119917 2004329 2114513 2160998
3295 2160998 2180241 2376978 2684720 2881467 3075809 3109399 3176095 3354689 3418941 3461233
3285 3461233 3563081 3843696 3959465 3921116 3893237 4079869 4335264 4701703 5088571 5467099
3275 5467099 5949795 6452242 6815898 7012688 7275789 6996456 7094452 7043738 6960061 6836824
$$ packed form
3347I93503J80307R8656j21064k16987Q9325j2854o7748O9575N1519O629m672
3336A066189j06645J96745J82736J17872N5711j49970Q0905J01991j76195r424
3326A359915J16456m3422J59152L9534r39M9137k25601J02524K33953J61404q0889
3315A871224Q6692j67540j59812J32063l7644L9971K60185J74254j13638q1608
3305B004147r8996o9150K9627K14382M3669J63688j67450j15588J10184M6485
3295B160998J9243J96737L07742J96747J94342L3590O6696J78594O4252M2292
3285C461233J01848K80615J15769l8349k7879J86632K55395L66439L86868L78528
3275E467099M82696N02447L63656J96790K63101k79333R7996n0714q3677j23237
$$ plain form
3265 6836824 6633957 6727193 6518511 6141296 5747124 5369141 5133516 4949167 4797880 4693066
3255 4693066 4866797 5025147 4867725 4883713 4914531 4888945 5193972 5297787 5428920 5690342
3245 5690342 6028673 6296610 6629863 7243294 7648959 7714877 7368703 6904475 6334144 5691971
3235 5691971 5129420 4585242 4303796 3950036 3715163 3755573 3814153 3746456 3686169 3662385
3225 3662385 3459327 3410515 3473616 3576965 3563908 3519732 3233397 3152420 3246963 3410056 3783445
3214 3783445 3974218 3953017 4238716 4425475 4699454 4933644 4975984 4784200 4609229 4301618
3204 4301618 3952892 3719177 3420736 2980952 2745599 2479609 2434781 2389887 2120812 2014124
3194 2014124 2047960 2090756 1997613 1910135 1667824 1748488 1946080 1763862 1742399 1912190 1903400
$$ packed form
3265F836824k02867R3236k08682l77215l94172l77983k35625j84349j51287j04814
3255D693066J73731J58350j57422J5988L0818k5586L05027J03815J31133K61422
3245E690342L38331K67937L33253O13431M05665O5918l46174m64228n70331o42173
3235E691971n62551n44178k81446l53760k34873M0410N8580o7697o0287k3784
3225C662385k03058m8812O3101J03349j3057m4176k86335q0977R4543J63093L73389
3214C783445J90773k1201K85699J86759K73979K34190M2340j91784j74971l07611
3204D301618l48726k33715k98441m39784k35353k65990m4828m4894k69075j06688
3194B014124L3836M2796r3143q7478k42311Q0664J97592j82218k1463J69791q790
$$ plain form
3183 1903400 1981264 1922776 1681141 1703722 1757336 1707996 1675735 1468734 1544424 1669907 1654421
3172 1654421 1579318 1413432 1266030 1372124 1416811 1303385 1576290 1414892 1227265 1366235
3162 1366235 1382235 1324114 1200121 1363271 1322438 1458794 1572889 1284405 1182746 1104627
3152 1104627 830255 1005912 878073 969383 1224802 1119902 1120890 1222681 1324347 1167482
3142 1167482 1118272 1090977 1048850 920738 983017 1090404 1067298 988893 1032884 1202962 1052933
3131 1052933 1133149 1149199 1305496 1421812 1325281 1384704 1594903 1604573 1789960 2001939 1719386
3120 1719386 1264061 1275674 1054697 953378 1021600 820528 733383 591424 605315 670602
3110 670602 498710 533332 684793 659814 545578 732228 712052 535307 690835 700338 727227
$$ packed form
3183A903400P7864n8488k41635K2581N3614m9340l2261k07001P5690J25483j5486
3172A654421p5103j65886j47402J06094M4687j13426K72905j61398j87627J38970
3162A366235J6000n8121j23993J63150m0833J36356J14095k88484j01659p8119
3152A104627k74372J75657j27839R1310K55419j04900R88J01791J01666j56865
3142A167482m9210k7295m2127j28112O2279J07387k3106p8405M3991J70078j50029
3131A052933Q0216J6050J56297J16316r6531N9423K10199R670J85387K11979k82553
3120A719386m55325J1613k20977j01319O8222k01072q7145j41959J3891O5287
3110F70602j71892L4622J51461k4979j14236J86650k0176j76745J55528R503K6889
$$ plain form
3099 727227 596780 560330 415801 498477 411367 399082 572917 565718 596463 734966 668500
3088 668500 700032 659866 475652 544023 551013 499478 422282 521937 583075 431340 471153
3077 471153 501632 591673 423139 344049 303725 164230 224201 248942 98070 12486 4172
3066 4172 98114 141582 280557 166013 187795 331568 198505 130413 14784 -4996 -29539
3055 -29539 68479 201301 226925 144945 182510 140060 110177 64656 189665 -24532 12431
3044 12431 -11448 -275394 -236100 -224418 -355416 -271209 -79453 -123102 -136557 -97644 -270384
3033 -270384 -263568 -126368 -175377 -220287 -156232 53272 22867 -83560 -190752 -113712 -93147
3022 -93147 -99785 -117698 -71768 -436959 -253233 -119084 -101322 203904 179951 111005 88998
$$ packed form
3099G27227j30447l6450j44529Q2676q7110j2285J73835p199L0745J38503o6466
3088F68500L1532m0166j84214O8371O990n1535p7196R9655O1138j51735L9813
3077D71153L0479R0041j68534p9090m0324j39495N9971K4741j50872q5584q314
3066D172R3942M3468J38975j14544K1782J43773j33063o8092j15629j9780k4543
3055b9539R8018J32822K5624q1980L7565m2450k9883m5521J25009k14197L6963
3044A2431k3879k63946L9294J1682j30998Q4207J91756m3649j3455L8913j72740
3033b70384O816J37200m9009m4910O4055K09504l0405j06427j07192P7040K0565
3022i3147o638j7913M5930l65191J83726J34149J7762L05226k3953o8946k2007
$$ plain form
3011 88998 -85997 -62405 -30059 -87734 -59658 140892 256907 176423 82069 34168 135499
3000 135499 189452 193358 189330 255737 362518 277931 -92436 -42901 118355 167515 20273
2989 20273 -141113 -188834 -42285 211932 164184 9859 252884 293676 259538 176805 26023
2978 26023 -154290 -171099 -165638 48920 245382 314040 252106 118420 279156 411706 494261
2967 494261 550519 506823 401667 212056 368775 269417 343644 108936 137462 271760 173739
2956 173739 234764 258907 522235 664375 592111 397969 246165 -39880 57064 251028
2946 251028 270464 318877 400326 380811 331691 362652 406049 428662 698913 640343 711739
2935 711739 612754 679340 703411 771448 660573 597093 546051 719342 703702 599304 488636
$$ packed form
3011H8998j74995K3592L2346n7675K8076K00550J16015q0484r4354m7901J01331
3000A35499N3953L906m028O6407J06781q4587l70367M9535J61256M9160j47242
2989B0273j61386m7721J46549K54217m7748j54325K43025M0792l4138q2733j50782
2978B6023j80313j6809N461K14558J96462O8658o1934j33686J60736J32550Q2555
2967D94261N6258m3696j05156j89611J56719r9358P4227k34708K8526J34298r8021
2956A73739O1025K4143K63328J42140p2264j94142j51804k86045R6944J93964
2946B51028J9436M8413Q1449j9515m9120L0961M3397K2613K70251n8570P1396
2935G11739r8985O6586K4071O8037j10875o3480n1042J73291j5640j04398j10668
$$ plain form
2924 488636 362704 344155 285368 378985 394650 480491 573693 486437 488586 687423 421840
2913 421840 465236 477026 455576 448906 512472 433910 416429 474774 541221 508602 476289 679939
2901 679939 736091 508585 324807 335461 173086 183456 281558 332408 498729 580319 338965
2890 338965 196869 364427 470223 357814 185988 309229 517885 434169 313366 245075
2880 245075 80818 115339 242264 103468 154475 160065 110992 260980 157747 -70009 110381
2869 110381 64511 -34325 150498 275457 292309 19647 82692 105264 24347 16865 130882
2858 130882 133779 124481 150217 18084 -16166 -63354 -135381 55796 115263 -48312 -98060
2847 -98060 23024 -106106 -174371 -165908 -333748 -421178 -386255 -408091 -691857 -629444 -389009
$$ packed form
2924D88636j25932j8549n8787R3617J5665Q5841R3202q7256K149J98837k65583
2913D21840M3396J1790k1450o670O3566p8562j7481N8345O6447l2619l2313K03650
2901F79939N6152k27506j83778J0654j62375J0370R8102N0850J66321Q1590k41354
2890C38965j42096J67558J05796j12409j71826J23241K08656q3716j20803o8291
2880B45075j64257L4521J26925j38796N1007N590m9073J49988j03233k27756J80390
2869A10381m5870r8836J84823J24959J6852k72662O3045K2572q0917p482J14017
2858A30882K897r298K5736j32133l4250m7188p2027J91177N9467j63575m9748
2847i8060J21084j29130o8265Q463j67840q7430L4923k1836k83766O2413K40435
$$ plain form
2836 -389009 -364448 -115860 -237026 -388371 -427452 -383546 -358136 -473395 -386481 -397611 -347637
2825 -347637 -336455 -431191 -220015 -147132 -262675 -192830 -307129 -384636 -306748 -304115 -497596
2814 -497596 -403685 -424744 -366604 -343347 -380521 -578365 -512016 -341585 -407855 -644569 -529272
2803 -529272 -481764 -612492 -564417 -605052 -452915 -317721 -303385 -173122 -325349 -141031
2793 -141031 -81574 -259115 -294888 -532894 -339374 -388952 -430121 -325682 -297728 -489779 -263087
2782 -263087 -275754 -257806 -232281 -343783 -237148 -136671 -149874 -184411 -67626 -47536 -107750
2771 -107750 -74290 -323637 -180350 -112745 -229879 -369616 -366419 -157926 -259511 -397007
2761 -397007 -322227 -477719 -226102 -88479 -87852 -51468 -242964 -56958 79738 71547 68989
$$ packed form
2836c89009K4561K48588j21166j51345l9081M3906K5410j15259Q6914j1130M9974
2825c47637J1182r4736K11176P2883j15543O9845j14299p7507P7888K633j93481
2814d97596R3911k1059N8140K3257l7174j97844O6349J70431o6270k36714J15297
2803e29272M7508j30728M8075m0635J52137J35194J4336J30263j52227J84318
2793a41031N9457j77541l5773k38006J93520m9578m1169J04439K7954j92051K26692
2782b63087j2667J7948K5525j11502J06635J00477j3203l4537J16785K0090o0214
2771a07750L3460k49347J43287O7605j17134j39737L197K08493j01585j37496
2761c97007P4780j55492K51617J37623O27L6384j91496J86006J36696q191k558
$$ plain form
2750 68989 129888 70415 58004 -169681 -112081 -305627 -378241 -383974 -260677 -333378 -386298
2739 -386298 -392715 -234869 -269340 -214287 -211436 -121206 -153186 -278753 -242273 -321007 -324038 -478667
2727 -478667 -440205 -295527 -358104 -486724 -510092 -544907 -490582 -478376 -522474 -361046 -206382
2716 -206382 -186539 -357835 -500957 -243502 -258177 -327449 -419988 -555884 -562039 -554627 -536028
2705 -536028 -655693 -725129 -682962 -741124 -759484 -811844 -677263 -697763 -622518 -664554 -726658
2694 -726658 -490609 -426007 -560003 -489532 -262362 -389153 -421220 -387906 -382250 -230902 -215560
2683 -215560 -399298 -552235 -951328 -827430 -782111 -943076 -739789 -546784 -479005 -323788
2673 -323788 -322131 -292271 -350779 -260268 -170513 -476891 -569291 -597879 -714321 -665754 -458630
$$ packed form
2750F8989O0899n9473j2411k27685N7600j93546p2614n733J23297p2701n2920
2739c86298o417J57846l4471N5053K851R0230l1980j25567L6480p8734l031j54629
2727d78667L8462J44678o2577j28620k3368l4815N4325J2206m4098J61428J54664
2716b06382J9843j71296j43122K57455j4675o9272r2539j35896o155P412J8599
2705e36028j19665o9436M2167n8162j8360n2360J34581k0500P5245m2036o2104
2694g26658K36049O4602j33996P0471K27170j26791l2067L3314N656J51348J5342
2683b15560j83738j52937l99093J23898M5319j60965K03287J93005O7779J55217
2673c23788J657K9860n8508R0511Q9755l06378r2400k8588j16442M8567K07124
$$ plain form
2662 -458630 -569380 -690129 -715882 -475149 -623136 -794389 -577647 -585492 -557958 -576263 -780136
2651 -780136 -578615 -548057 -322796 -298881 -271484 -206157 -179973 -511896 -527658 -300269 -401645
2640 -401645 -326380 -472560 -495486 -366938 -371421 -145065 -155003 -242611 -359990 -340567 -406144
2629 -406144 -463498 -524392 -466615 -289941 -237063 -246285 -240306 -293300 -407707 -348702 -274363 -202365
2617 -202365 -201397 -125635 -215344 -172583 -120945 -171756 -275793 -78831 -233132 -159541 -187358
2606 -187358 -281203 -49104 -84386 -322277 -267929 -181406 -289927 -121946 -8195 -306274
2596 -306274 -162272 -181534 -303654 -227344 -252405 -481300 -393503 -517497 -665034 -466519
2586 -466519 -523113 -512341 -706360 -670479 -529916 -495372 -633514 -580861 -406057 -347560 -217805
$$ packed form
2662d58630j10750j20749k5753K40733j47987j71253K16742p845K7534j8305k03873
2651g80136K01521L0558K25261K3915K7397O5327K6184l31923j5762K27389j01376
2640d01645P5265j46180k2926J28548m483K26356r938q7608j17379J9423o5577
2629d06144n7354o0894N7777J76674N2878r222N979n2994j14407N9005P4339P1998
2617b02365R68P5762q9709M2761N1638n0811j04037J96962j54301P3591k7817
2606a87358r3845K32099l5282k37891N4348Q6523j08521J67981J13751k98079
2596c06274J44002j9262j22120P6310k5061k28895Q7797j23994j47537J98515
2586d66519n6594J0772j94019L5881J40563L4544j38142N2653J74804N8497J29755
$$ plain form
2575 -217805 -420664 -356573 -329584 -207532 -101887 5003 -179346 -385268 -320211 -369918
2565 -369918 -429614 -578160 -677830 -539748 -412158 -298297 -335480 -390519 -271879 -288449 -103950
2554 -103950 -276151 -161677 -177352 -261296 -299942 -171689 -248234 -201667 -314648 -403010 -347203
2543 -347203 -389661 -496947 -517944 -524489 -345359 -60593 -25134 -78151 -181483 -261154 -220011
2532 -220011 -214266 -347285 -299549 -145373 -138380 -137086 -171415 23700 -43224 -234797 -368122
2521 -368122 -517958 -413642 -414629 -388753 -439283 -348069 -398465 -378504 -494427 -363731 -303019
2510 -303019 -381232 -413228 -349712 -459524 -674376 -666576 -426199 -317227 -290636 -293433 -362126
2499 -362126 -501385 -449217 -346888 -502059 -830945 -621067 -549336 -587823 -612460 -590333 -515808
$$ packed form
2575b17805k02859O4091K6989J22052J05645J06890j84349k05922O5057m9707
2565c69918n9696j48546r9670J38082J27590J13861l7183n5039J18640j6570J84499
2554a03950j72201J14474j5675q3944l8646J28253p6545M6567j12981q8362N5807
2543c47203m2458j07286k0997o545J79130K84766L5459n3017j03332p9671M1143
2532b20011N745j33019M7736J54176O993J294l4329J95115o6924j91573j33325
2521c68122j49836J04316r87K5876n0530R1214n0396J9961j15923J30696O0712
2510c03019p8213l1996O3516j09812k14852P800K40377J08972K6591k797o8693
2499c62126j39259N2168J02329j55171l28886K09878P1731l8487k4637K2127P4525
$$ plain form
2488 -515808 -227821 -222658 -192639 -218270 -379857 -321937 -502219 -573995 -618479 -518463 -589966
2477 -589966 -568117 -550977 -633978 -728430 -597552 -565164 -532450 -458354 -729071 -623784 -510671
2466 -510671 -646634 -552449 -609701 -508000 -560603 -374818 -302273 -362569 -469732 -420063 -437907
2455 -437907 -507902 -616246 -617441 -500708 -348948 -374903 -387511 -185966 -334093 -186287 -60377
2444 -60377 -8531 -206031 -245504 -92937 -351243 -371571 -321997 -327555 -387673 -293727 -90857
2433 -90857 -208693 -129940 -359263 -251209 -327712 -370199 -307246 -419785 -494880 -387089 -151874
2422 -151874 -304800 -108304 52088 -236753 -304403 -114536 -142927 -291992 -216125 -132654
2412 -132654 -209369 -436297 -349362 12030 32112 116 -68486 -61658 -72926 -2474 -133660
$$ packed form
2488e15808K87987N163L0019k5631j61587N7920j80282p1776m4484J00016p1503
2477e89966K1849J7140q3001r4452J30878L2388L2714P4096k70717J05287J13113
2466e10671j35963R4185n7252J01701n2603J85785P2545o0296j07163M9669j7844
2455d37907o9995j08344j195J16733J51760k5955j2608K01545j48127J47806J25910
2444f0377N1846j97500l9473J52567k58306k0328M9574n558o0118R3946K02870
2433i0857j17836P8753k29323J08054p6503m2487O2953j12539p5095J07791K35215
2422a51874j52926J96496J60392k88841o7650J89867k8391j49065P5867Q3471
2412a32654p6715k26928Q6935L61392K0082l1996o8602O828j1268P0452j31186
$$ plain form
2401 -133660 -42888 12506 100343 217305 407784 416586 354536 359514 446062 438257 67546 21317
2389 21317 -17482 -49136 -44155 -207090 -212833 -115108 -80989 5069 115438 65504 177642 193982
2377 193982 239976 -138034 -85463 -68197 -12860 -180896 -276646 -149334 -36413 -264045 -299668
2366 -299668 -69389 -110130 -86894 -354720 -316835 -279344 -228822 -185487 -90414 -33080 27827
2355 27827 200734 137241 -85343 -153281 -311525 -357313 -286673 -327718 -457185 -420525 -510402
2344 -510402 -144376 -187492 -236992 -339120 -377448 -8236 -1464 -32461 -121597 -119208 -23154
2333 -23154 -235715 -388813 -436871 -405903 -409795 -300800 -126262 -2113 -90672 -167775 -212752
2322 -212752 -139161 -152056 -152346 -25294 9905 46701 163757 4221 16033 -291411 -297270
$$ packed form
2401a33660R0772N5394Q7837J16962J90479Q802o2050M978Q6548p805l70711m6229
2389B1317l8799l1654M981j62935n743R7725L4119Q6058J10369m9934J12138J6340
2377A93982M5994l78010N2571J7266N5337j68036r5750J27312J12921k27632l5623
2366b99668K30279m0741K3236k67826L7885L7491N0522M3335R5073N7334O0907
2355B7827J72907o3493k22584o7938j58244m5788P0640m1045j29467L6660q9877
2344e10402L66026m3116m9500j02128l8328L69212O772l0997q9136K389R6054
2333b3154k12561j53098m8058L0968l892J08995J74538J24149q8559p7103m4977
2322b12752P3591j2895k90J27052L5199L6796J17056j59536J1812l07444n859
$$ plain form
2311 -297270 -159817 -181429 -342415 -322198 -178279 -342968 -282665 -183309 -195967 -200093 -165972
2300 -165972 -72027 21613 135334 89600 -52606 -78891 -95695 -137450 10341 -92849 -316091
2289 -316091 -426405 -205399 -244944 -79752 -72845 -298322 -270782 -269627 -123532 -82826 46670
2278 46670 -71308 26461 -130355 -103462 -93987 82956 13853 -164112 -167959 -83418 -96307
2267 -96307 -55978 -42943 -3678 134461 55491 -123888 -33817 139785 307781 452148 481840
2256 481840 365849 251915 355698 216349 125059 61515 -152593 100113 -4865 -77332
2246 -77332 354323 398398 385129 528325 467181 462758 669230 698876 535660 597239 569589
2235 569589 731803 886135 826026 870124 1146119 1129701 870573 754580 867651 778955
$$ packed form
2311b97270J37453k1612j60986K0217J43919j64689O0303R9356j2658m126L4121
2300a65972R3945R3640J13721m5734j42206k6285j6804m1755J47791j03190k23242
2289c16091j10314K21006l9545J65192O907k25477K7540J155J46095M0706J29496
2278D6670j17978R7769j56816K6893R475J76943o9103j77965l847Q4541j2889
2267i6307M0329J3035L9265J38139p8970j79379R0071J73602J67996J44367K9692
2256D81840j15991j13934J03783j39349r1290o3544k14108K52706j04978p2467
2246g7332M31655M4075j3269J43196o1144m423K06472K9646j63216O1579k7650
2235E69589J62214J54332o0109M4098K75995j6418k59128j15993J13071q8696
$$ plain form
2225 778955 817025 941582 992408 916179 1012556 991951 1171267 1404167 1615611 1537841 1489233
2214 1489233 1278993 1189521 1424621 1492456 1400575 1342668 1429571 1369904 1543538 1591889 1614955
2203 1614955 1596173 1630535 1777742 1859574 1693406 1821998 1603227 1675645 1926244 2090734
2193 2090734 2245613 2382672 2483721 2510037 2503434 2684976 2913014 2932735 3229687 3408935
2183 3408935 3322041 3469553 3726806 3549857 3522190 3635711 3515305 3593433 3773521 3953942
2173 3953942 4058023 4226706 4139306 4280412 4567766 4851152 5224859 5483086 5591734 5718237
2163 5718237 6028068 6262220 6816777 6998194 7143288 7768071 8254461 8808613 9069679 9466443
2153 9466443 10094704 10852835 11598202 12162578 12946201 13975558 15006042 16379584 17616174
$$ packed form
2225G78955L8070J24557N0826p6229R6377k0605J79316K32900K11444p7770m8608
2214A489233k10240q9472K35100O7835r1881n7907Q6903n9667J73634M8351K3066
2203A614955j8782L4362J47207Q1832j66168J28592k18771P2418K50599J64490
2193B090734J54879J37059J01049K6316o603J81542K28038J9721K96952J79248
2183C408935q6894J47512K57253j76949k7667J13521j20406P8128J80088J80421
2173C953942J04081J68683q7400J41106K87354K83386L73707K58227J08648J26503
2163E718237L09831K34152N54557J81417J45094O24783M86390N54152K61066L96764
2153I466443O28261P58131P45367N64376P83623J029357J030484J373542J236590
$$ plain form
2144 17616174 19186009 21036135 22808708 24036598 25392572 27123363 29659702 33205755
2136 33205755 37641238 42883437 49312270 56664341 65382663 74497531 85118179 100179711
2128 100179711 117623512 122252585 105699601 83414590 65721020 52898053 43699580
2121 43699580 36822884 31967966 28382043 25578459 23079966 20960034 19493778 17972266
2113 17972266 17083940 16273092 14907888 13503973 12440870 11342786 10883030 10306114 9774762
2104 9774762 9330026 8777732 8378011 8004143 7761888 7639201 7497676 7119625 6796478 6633861
2094 6633861 6310822 5943402 5841054 5522874 4926244 4514948 4602774 4568155 4345786 4184907
2084 4184907 4156936 4055917 3826016 3704466 3537270 3316441 3173771 3095768 2994863 3037251
$$ packed form
2144A7616174J569835J850126J772573J227890J355974J730791K536339L546053
2136C3205755M435483N242199O428833P352071Q718322R114868J0620648J5061532
2128A00179711J7443801M629073j6552984k2285011j7693570j2822967r198473
2121D3699580o876696m854918l585923k803584k498493k119932j466256j521512
2113A7972266q88326q10848j365204j403915j063103j098084m59756n76916n31352
2104I774762m44736n52294l99721l73868k42255j22687j41525l78051l23147j62617
2094F633861l23039l67420j02348l18180n96630m11296Q7826l4619k22369j60879
2084D184907k7971j01019k29901j21550j67196k20829j42670p8003j00905M2388
$$ plain form
2074 3037251 3137351 2906341 2797446 2741396 2704310 2493664 2536668 2472724 2216912 2128824
2064 2128824 1829289 1940583 2004901 2227084 2183756 2185718 2139665 2201958 2222096 2160340 2260854
2053 2260854 2042209 1681358 1726626 1498046 1584054 1579636 1555897 1476549 1408361 1298645 1256532
2042 1256532 1126608 1183645 1438514 1358302 1245877 1251779 1285468 1334382 1308087 1163277 1112734
2031 1112734 1124484 1164024 925519 825588 658357 634949 709365 759611 905750 735687 514110
2020 514110 579083 576506 414124 488153 516299 290196 481691 309125 349743 333731 325282
2009 325282 249557 268012 75546 143936 288956 310643 398941 357902 226643 235750 288361
1998 288361 220654 246424 141648 162114 142911 272792 346251 387892 275393 239824 555244
$$ packed form
2074C037251J00100k31010j08895n6050l7086k10646M3004o3944k55812q8088
2064B128824k99535J11294O4318K22183m3328J962m6053O2293K0138o1756J00514
2053B260854k18645l60851M5268k28580Q6008m418k3739p9348o8188j09716m2113
2042A256532j29924N7037K54869q0212j12425N902L3689M8914k6295j44810n0543
2031A112734J1750L9540k38505r9931j67231k3408P4416N0246J46139j70063k21577
2020E14110O4973k577j62382P4029K8146k26103J91495j72566M0618j6012q449
2009C25282p5725J8455j92466O8390J45020K1687Q8298m1039j31259R107N2611
1998B88361o7707K5770j04776K0466j9203J29881P3459M1641j12499l5569L15420
$$ plain form
1987 555244 258321 97088 -84609 -91007 64734 100681 215986 216900 215608 409585 421025
1976 421025 361254 234381 451465 397946 375371 472595 464686 330533 141789 30885 30657
1965 30657 35379 246078 316445 179454 121513 325369 384113 87040 120561 35309 118301
1954 118301 -90690 42467 2040 43728 112027 180225 -30026 -100942 -85371 -120950 52746
1943 52746 83902 178086 46276 -144546 -115076 44393 -70436 140854 287104 227779 276787
1932 276787 42985 122746 138439 195166 168313 57103 45626 -41525 -10794 -162061 -100916
1921 -100916 -32437 -130231 -121790 -83759 74804 -122115 -75723 197014 -20649 -68721 -17165
1910 -17165 11028 47521 -57282 -139547 -38057 -80869 -273149 -268355 -222329 -261981 -419657
$$ packed form
1987E55244k96923j61233j81697o398J55741L5947J15305R14j292J93977J1440
1976D21025n9771j26873K17084n3519k2575R7224p909j34153j88744j10904k28
1965C0657M722K10699P0367j36991n7941K03856N8744k97073L3521q5252Q2992
1954A18301k08991J33157m0427M1688O8299O8198k10251p0916J5571l5579J73696
1943E2746L1156R4184j31810j90822K9470J59469j14829K11290J46250n9325M9008
1932B76787k33802P9761J5693N6727k6853j11210j1477q7151L0731j51267O1145
1921a00916O8479r7794Q441L8031J58563j96919M6392K72737k17663m8072N1556
1910a7165K8193L6493j04803q2265J01490m2812j92280M794M6026l9652j57676
$$ plain form
1899 -419657 -244357 -107499 -253940 -198653 118181 64100 184226 102916 -3467 26150
1889 26150 -24428 -153332 -283032 -179852 -100428 45123 20662 -45530 -165190 -300073 -151854
1878 -151854 -76032 -196848 -110892 -31646 119179 328021 97384 49656 -54960 92507
1868 92507 180954 168120 163747 182431 158119 265001 265413 222555 245908 448904 479771 467091
1856 467091 427522 298096 239946 195971 97637 -9183 93228 24527 55253 -2614 -231676
1845 -231676 -332032 -5666 100015 34073 -65291 -53730 28922 123622 -96614 -211935 -435859
1834 -435859 -404779 -281616 59274 102150 -40812 24060 990 20379 88378 -122249 -157160
1823 -157160 -334233 -193886 84447 -24728 50169 65559 -98057 -176467 -76033 -157893
$$ packed form
1899d19657J75300J36858j46441N5287L16834n4081J20126q1310j06383K9617
1889B6150n0578j28904j29700J03180P9424J45551k4461o6192j19660j34883J48219
1878a51854P5822j20816Q5956P9246J50825K08842k30637m7728j04616J47467
1868I2507Q8447j2834m373J8684k4312J06882M12m2858K3353K02996L0867j2680
1856D67091l9569j29426n8150m3975r8334j06820J02411o8701L0726n7867k29062
1845b31676j00356L26366J05681o5942r9364J1561Q2652R4700k20236j15321k23924
1834d35859L1080J23163L40890M2876j42962O4872k3070J9389O7999k10627l4911
1823a57160j77073J40347K78333j09175P4897J5390j63616p8410J00434q1860
$$ plain form
1813 -157893 -84059 -8123 88818 28893 -19804 -58790 -73504 31304 10064 69768 -161152
1802 -161152 7579 -187458 -241599 -79454 -154678 -89389 -114775 -158040 -189613 -204885 -228046
1791 -228046 -222790 -153920 21875 -95590 -131712 -233770 -259277 -219624 -273451 -154871 -103973
1780 -103973 -216969 -274398 -328225 -274899 -281203 -122273 -46951 -36125 -162922 -336150 -321390
1769 -321390 -315800 -477142 -541942 -359470 -337211 -141522 -223021 -152729 -154870 -177941 -293558
1758 -293558 -200163 -178338 -113355 -104392 -154644 -100407 8032 29318 -32012 -7167 -40554 29632
1746 29632 -148651 -150254 -106388 -264524 -204616 55981 45420 -78701 -153197 -246791 -304418
1735 -304418 -159572 -189506 -95240 -84932 -31943 -310359 -302869 -199581 -324158 -264281 -161298
$$ packed form
1813a57893P3834P5936R6941n9925m8697l8986j4714J04808k1240N9704k30920
1802a61152J68731j95037n4141J62145p5224O5289k5386m3265l1573j5272k3161
1791b28046N256O8870J75795j17465l6122j02058k5507L9653n3827J18580N0898
1780a03973j12996n7429n3827N3326o304J58930P5322J0826j26797j73228J4760
1769c21390N590j61342o4800J82472K2259J95689q1499P0292k141k3071j15617
1758b93558R3395K1825O4983Q963n0252N4237J08439K1286o1330K4845l3387P0186
1746B9632j78283j603M3866j58136N9908K60597j0561j24121p4496r3594n7627
1735c04418J44846k9934R4266J0308N2989k78416P490J03288j24577N9877J02983
$$ plain form
1724 -161298 -185849 -121664 -167602 -155400 -155933 -454594 -374006 -245253 -406390 -415013 -509059 -416642
1712 -416642 -234571 -383863 -528823 -471495 -408779 -258238 -340508 -315519 -329601 -372477 -198213
1701 -198213 -160949 -179280 -36389 -178627 -166160 -28018 -104241 -21382 2651 -115354 -51521
1690 -51521 -150428 -101316 -283789 -264295 -227374 -188897 -77616 13578 229074 247190 152095
1679 152095 50312 29151 71762 211241 96819 119282 230612 35271 -89785 58883
$$ packed form
1724a61298k4551O4185m5938J2202n33k98661Q0588J28753j61137q623r4046R2417
1712d16642J82071j49292j44960N7328O2716J50541q2270K4989j4082m2876J74264
1701a98213L7264j8331J42891j42238J2467J38142p6223Q2859K4033j18005O3833
1690e1521r8907M9112j82473J9494L6921L8477J11281R1194K15496J8116r5095
1679A52095j01783k1161M2611J39479j14422K2463J11330j95341j25056J48668
$$ [...]
##END NTUPLES=NMR SPECTRUM
##END=
