##TITLE=1H_CA-8958-3
 CDCl3
 8 sc, 
 10.12.2021
##JCAMPDX= 6.0         $$ Bruker NMR JCAMP-DX V2.0
##DATA TYPE= NMR SPECTRUM
##DATA CLASS= NTUPLES
##ORIGIN= UXNMR, Bruker Analytische Messtechnik GmbH
##OWNER= root
$$ XWIN-NMR		Version 3.5
$$ Fri Dec 10 11:34:13 2021 Russian Standard Time (UT+4h)  she@DPX200
##.OBSERVE FREQUENCY= 200.131346
##.OBSERVE NUCLEUS= ^1H
##.ACQUISITION MODE= SIMULTANEOUS
##.ACQUISITION SCHEME= undefined
##.AVERAGES= 8
##.DIGITISER RES= 18
##SPECTROMETER/DATA SYSTEM= spect
##.PULSE SEQUENCE= zg30
##.SOLVENT NAME= CDCl3
##.SHIFT REFERENCE= (INTERNAL, CDCl3, 0, 15.6576)
##AUDIT TRAIL= $$ (NUMBER, WHEN, WHO, WHERE, WHAT)
$$ ##TITLE= Audit trail, XWIN-NMR		Version 3.5
$$ ##JCAMPDX= 5.01
$$ ##ORIGIN= Bruker BioSpin GmbH
$$ ##OWNER= she
$$ F:/spectra/data/she/nmr/H-F/1/pdata/1/auditp.txt
$$ ##AUDIT TRAIL=  $$ (NUMBER, WHEN, WHO, WHERE, WHAT)
(   1,<2021-12-10 11:32:40.03 +0400>,<she>,<DPX200>,
      <created by zg, POWCHK disabled, PULCHK disabled
       configuration hash MD5:
       00 E9 B6 7A A2 85 ED C7 34 08 36 98 17 FE 4E 26
       data hash MD5: 16K
       FE E6 46 38 07 88 84 50 17 04 FA A5 B8 EC 82 AB>)
(   2,<2021-12-10 11:32:42.37 +0400>,<she>,<DPX200>,
      <Start of raw data processing
       efp BC_mod = 2 LB = 0.24 FT_mod = 6 PKNL = 1 PHC0 = -15509.18 PHC1 = 7.000801 SI = 16K 
       data hash MD5: 16K
       F9 F0 AA 76 D1 E4 3A C1 23 08 9E 87 6F 8C 5B 01>)
(   3,<2021-12-10 11:33:03.78 +0400>,<she>,<DPX200>,
      <pk PHC0 = -159.4852 PHC1 = 3 
       data hash MD5: 16K
       15 0A 49 39 FB D7 27 D6 DA 5C 49 3D EF 82 48 00>)
(   4,<2021-12-10 11:33:07.06 +0400>,<she>,<DPX200>,
      <abs ABSG = 5 
       data hash MD5: 16K
       47 F1 23 35 BD 8C 54 6E 38 F6 59 BE 61 60 96 9F>)
$$ ##END=
$$ 
$$ hash MD5
$$ AC 2A 34 BA 8C 01 E8 7A 3D 1F 4D 34 4C B8 A9 38
##$RELAX= 
##$RELAX= 
##$RELAX= 
##$RELAX= 
##$RELAX= 
##$RELAX= 
$$ Bruker specific parameters
$$ --------------------------
##$DU= <F:/spectra>
##$EXPNO= 1
##$NAME= <H-F>
##$PROCNO= 1
##$TYPE= <nmr>
##$USER= <she>
##$AMP= (0..31)
100 100 100 100 100 100 100 100 100 100 100 100 100 100 100 100 100 100 
100 100 100 100 100 100 100 100 100 100 100 100 100 100 
##$AQSEQ= 0
##$AQ_mod= 1
##$AUNM= <au_zg>
##$AUTOPOS= <>
##$BF1= 200.13
##$BF2= 200.13
##$BF3= 200.13
##$BF4= 200.13
##$BF5= 200.13
##$BF6= 200.13
##$BF7= 200.13
##$BF8= 200.13
##$BYTORDA= 1
##$CFDGTYP= 0
##$CFRGTYP= 5
##$CHEMSTR= <none>
##$CNST= (0..31)
1 1 145 1 1 1 1 1 1 1 1 1 1 1 1 1 1 1 1 1 1 1 1 1 1 1 1 1 1 1 1 1 
##$CPDPRG= <>
##$CPDPRG1= <>
##$CPDPRG2= <>
##$CPDPRG3= <>
##$CPDPRG4= <mlev>
##$CPDPRG5= <mlev>
##$CPDPRG6= <mlev>
##$CPDPRG7= <mlev>
##$CPDPRG8= <mlev>
##$CPDPRGB= <>
##$CPDPRGT= <>
##$D= (0..31)
0 1.2 0 0 0 0 0 0 0 0.06 0 0.03 0 0 0 0 0.0002 0 0 0 0 0 0 0 0 0 0 0 0 
0 0 0 
##$DATE= 1639121559
##$DBL= (0..7)
120 120 120 120 120 120 120 120 
##$DBP= (0..7)
150 150 150 150 150 150 150 150 
##$DBP07= 0
##$DBPNAM0= <>
##$DBPNAM1= <>
##$DBPNAM2= <>
##$DBPNAM3= <>
##$DBPNAM4= <>
$$ [...]
##$SUBNAM2= <"">
##$SUBNAM3= <"">
##$SUBNAM4= <"">
##$SUBNAM5= <"">
##$SUBNAM6= <"">
##$SUBNAM7= <"">
##$SUBNAM8= <"">
##$SUBNAM9= <"">
##$SW= 18.0517287032376
##$SWIBOX= (0..15)
0 0 2 0 0 0 0 0 0 0 0 0 0 0 0 0 
##$SW_h= 3612.71676300578
##$TD= 16384
##$TD0= 1
##$TE= 0
##$TE2= 300
##$TE3= 300
##$TEG= 300
##$TL= (0..7)
0 120 120 120 120 120 120 120 
##$TP= (0..7)
150 150 150 150 150 150 150 150 
##$TP07= 0
##$TPNAME0= <>
##$TPNAME1= <>
##$TPNAME2= <>
##$TPNAME3= <>
##$TPNAME4= <>
##$TPNAME5= <>
##$TPNAME6= <>
##$TPNAME7= <>
##$TPOAL= (0..7)
0.5 0.5 0.5 0.5 0.5 0.5 0.5 0.5 
##$TPOFFS= (0..7)
0 0 0 0 0 0 0 0 
##$TUNHIN= 0
##$TUNHOUT= 0
##$TUNXOUT= 0
##$USERA1= <user>
##$USERA2= <user>
##$USERA3= <user>
##$USERA4= <user>
##$USERA5= <user>
##$V9= 5
##$VALIST= <valist>
##$VCLIST= <CCCCCCCCCCCCCCC>
##$VD= 0
##$VDLIST= <DDDDDDDDDDDDDDD>
##$VPLIST= <PPPPPPPPPPPPPPP>
##$VTLIST= <TTTTTTTTTTTTTTT>
##$WBST= 1024
##$WBSW= 4
##$XGAIN= (0..3)
0 0 0 0 
##$XL= 0
##$YL= 0
##$YMAX_a= 354749
##$YMIN_a= -292990
##$ZGOPTNS= <>
##$ZL1= 120
##$ZL2= 120
##$ZL3= 120
##$ZL4= 120
##$ABSF1= 15.70832
##$ABSF2= -2.34353
##$ABSG= 5
##$ABSL= 3
##$ALPHA= 0
##$AQORDER= 0
##$ASSFAC= 0
##$ASSFACI= 0
##$ASSFACX= 0
##$ASSWID= 0
##$AUNMP= <proc_1d>
##$AZFE= 0.1
##$AZFW= 0.1
##$BCFW= 0
##$BC_mod= 2
##$BYTORDP= 0
##$COROFFS= 0
##$CY= -3
##$DATMOD= 1
##$DC= 0
##$DFILT= <>
##$DTYPP= 0
##$F1P= 0
##$F2P= 0
##$FCOR= 1
##$FTSIZE= 16384
##$FT_mod= 6
##$GAMMA= 0
##$GB= 0
##$INTBC= 1
##$INTSCL= 0
##$ISEN= 128
##$LB= 0.24
##$LEV0= 0
##$LPBIN= 0
##$MAXI= 10000
##$MC2= 0
##$MEAN= 0
##$ME_mod= 0
##$MI= 1.114404
##$NCOEF= 0
##$NC_proc= -5
##$NLEV= 6
##$NOISF1= 3.799351
##$NOISF2= 2.8
##$NSP= 0
##$NTH_PI= 0
##$NZP= 0
##$OFFSET= 15.65764
##$PC= 1
##$PHC0= -15668.67
##$PHC1= 10.0008
##$PH_mod= 1
##$PKNL= yes
##$PPARMOD= 0
##$PSCAL= 0
##$PSIGN= 0
##$REVERSE= no
##$SF= 200.130018793491
##$SI= 16384
##$SIGF1= 3
##$SIGF2= 2
##$SINO= 5.538805
##$SIOLD= 16384
##$SREGLST= <1H.CDCl3>
##$SSB= 0
##$STSI= 16384
##$STSR= 0
##$SW_p= 3612.71676300578
##$SYMM= 0
##$S_DEV= 0
##$TDeff= 16384
##$TDoff= 0
##$TI= <>
##$TILT= no
##$TM1= 0
##$TM2= 0
##$TOPLEV= 0
##$USERP1= <user>
##$USERP2= <user>
##$USERP3= <user>
##$USERP4= <user>
##$USERP5= <user>
##$WDW= 1
##$XDIM= 16384
##$YMAX_p= 460450621
##$YMIN_p= -47453
$$ End of Bruker specific parameters
$$ ---------------------------------
##NTUPLES= NMR SPECTRUM
##VAR_NAME=  FREQUENCY,     SPECTRUM/REAL,   SPECTRUM/IMAG
##SYMBOL=    X,             R,               I
##VAR_TYPE=  INDEPENDENT,   DEPENDENT,       DEPENDENT
##VAR_FORM=  AFFN,          ASDF,            ASDF
##VAR_DIM=   16384,         16384,           16384
##UNITS=     HZ,            ARBITRARY UNITS, ARBITRARY UNITS
##FACTOR=    0.220516191357247, 1,           1
##FIRST=     3133.56387895182, 0,            0
##LAST=      -479.152884053961, 0,           0
##MIN=       -479.152884053961, -47453,      0
##MAX=       3133.56387895182, 460450621,    0
$$ Real data points
##PAGE= N=1
##DATA TABLE= (X++(R..R)), XYDATA
$$ [...]
8139E4806875n437370m521145l113071j754490o40077K52209R74333J579923K029383
8130D4176570K175570J643046K29599j827921l528255l968016l387131k521732
8122C2991730j695198j043192n87439k98045o1881J7250r3724n67491j298853
8113B7363157j887383k025391j766252j385306j038684p97695o19453m82490l39241
8104A7021262k49183j55082p4417O644J48349K93700M41662O57217R10365J138172
8094B0138689J358727J587410J779704J834838J572034Q30835m68193j697207
8086B6936837k210611j946756j336342p54581k60735Q8315L53701N41033N79803
8077B1990664L71814j37631r37201j741022k088884j911637j518537j133748q62354
$$ plain form
8139 54806875 49369505 44848360 41735289 39980799 39340722 39592931 40567264 42147187 44176570
8130 44176570 46352140 47995186 48224785 46396864 42868609 38900593 35513462 32991730
8122 32991730 31296532 30253340 29665901 29367856 29305975 29323225 29229501 28662010 27363157
8113 27363157 25475774 23450383 21684131 20298825 19260141 18462446 17842993 17360503 17021262
8104 17021262 16772079 16616997 16542580 16549224 16697573 16991273 17432935 18090152 19000517 20138689
8094 20138689 21497416 23084826 24864530 26699368 28271402 29102237 28634044 26936837
8086 26936837 24726226 22779470 21443128 20688547 20427812 20516127 20869828 21410861 21990664
8077 21990664 22362478 22224847 21287646 19546624 17457740 15546103 14027566 12893818 12031464
8068A2031464o86455n63706n22407m77540m42015m08007l91466l81683l88680
8059G769505l91241l92843l64404l18892k93827k85091k69572k33454k05161j89567
8049D825453j64072j69671j37894j26547j03997p9286j08897j02575p5281r0554
8039C666679q2732p7636o9363p1186n6158m7507m2010n5234o5913m3328m5277
8028C010335l7057o1876o3877p8362p1371q0891o8396n8639n2768l0221m3936
8017B362941m0214l6389l9347k1688r136j0141k3829k0347r888n490n671m583
8005B136218l839j0507j3819q805r457k2693j7856j4747J0380P606J6217N665
7993B074363L2286L6775K4675P56k4732m6748q9309o4736n3013l6038j5198J8668
$$ plain form
8068 12031464 11345009 10781303 10258896 9781356 9339341 8931334 8539868 8158185 7769505
8059 7769505 7378264 6985421 6621017 6302125 6008298 5723207 5453635 5220181 5015020 4825453
8049 4825453 4661381 4491710 4353816 4227269 4123272 4043986 3935089 3832514 3757233 3666679
8039 3666679 3583947 3506311 3436948 3365762 3309604 3262097 3220087 3164853 3098940 3055612 3010335
8028 3010335 2973278 2911402 2847525 2769163 2697792 2616901 2548505 2489866 2437098 2406877 2362941
8017 2362941 2322727 2286338 2246991 2225303 2216167 2206026 2182197 2161850 2151962 2146472 2140801 2136218
8005 2136218 2132379 2121872 2108053 2099248 2089791 2067098 2049242 2034495 2044875 2052481 2068698 2074363
7993 2074363 2106649 2143424 2168099 2168855 2144123 2097375 2008066 1943330 1890317 1854279 1839081 1857749
7981A857749q846N1931M0253K9944Q634j5389l5305l4717k5962j2894k1580J0641
7969A844459J7273K0372J2814o818l6955l3319k1888m0510l0949n3274o5108n1293
7957A554804m6962l5550k3885l2225k9135l0127k6657k4762n7376m5658l6509
7946A165958k8441o48q25j1043J5461J1366P682l079n373l6706m3987k7137p3189
7933I70039k8783n924j2915m2724j5590j8334k7842r284J9182j4237p132j1930
7921G94526M30J5507K0016J8281l795J0564P480m832K8845J4875J9600K8815M0736
7908I91048O0124Q1698Q3480P0352Q2294R7127O9435L6963j4700n8326p5181q3276
7896A341038o0566l6466l1179j8661l379j8801j4177j6532m1133p0982p6867o2275
$$ plain form
7981 1857749 1848903 1900834 1941087 1971031 1979665 1964276 1928971 1894254 1868292 1855398 1833818 1844459
7969 1844459 1861732 1882104 1894918 1888100 1851145 1817826 1795938 1755428 1724479 1671205 1606097 1554804
7957 1554804 1507842 1472292 1448407 1416182 1387047 1356920 1330263 1305501 1248125 1202467 1165958
7946 1165958 1137517 1136869 1136044 1125001 1140462 1151828 1159510 1156431 1151058 1114352 1070365 1043228 970039
7933 970039 941256 935332 922417 879693 864103 845769 817927 808643 827825 813588 806456 794526
7921 794526 794956 810463 830479 848760 844965 855529 863009 858177 887022 901897 921497 950312 991048
7908 991048 1051172 1132870 1216350 1286702 1368996 1466123 1535558 1572521 1557821 1499495 1424314 1341038
7896 1341038 1280472 1244006 1212827 1194166 1190787 1171986 1157809 1141277 1100144 1029162 952295 890020
7884H90020q1469n5933m1561k8655k7491k7727k6007k8068j7676k5145k9812n21
7872D99955q615j6903l5941k3593j3274j7019o260L551j635j7472j4020R29j1511
7859C38192j4267j2059l633m98q364n607o692o038j8034J073k84P8Q149k1906
7845B50110o384K284M34J1194o805j9209J6274n927j1938n45q157n757r94J9069
7831B33649j6061k979j2398J4633l060O091J983m12j7559M781k542K0385k632
7818B23879N975P571q294m3n060q259j0913j2347J8852J631J4827M476J7492Q186
7804B57973P2333l5985o4724Q831Q994N4405K1135J4996J2802K1719j4284J747
7792C59942j0980j0276j3453l001p95O069J1827J3459N235R143K827J3303q785
$$ plain form
7884 890020 808551 752618 711057 682402 654911 627184 601177 573109 555433 530288 500476 499955
7872 499955 491340 474437 438496 414903 401629 384610 378350 381901 380266 362794 348774 349703 338192
7859 338192 323925 311866 308233 307735 299371 293764 287072 281034 263000 264073 263789 263867 272016 250110
7845 250110 243726 246010 246444 257638 250833 231624 247898 241971 230033 229488 221331 215574 214580 233649
7831 233649 217588 214609 202211 216844 213784 219875 221858 221446 203887 208668 206126 226511 223879
7818 223879 229854 237425 229131 229088 224028 215769 204856 192509 211361 212992 227819 232295 249787 257973
7804 257973 330306 294321 229597 238428 247422 301827 322962 337958 350760 372479 358195 359942
7792 359942 348962 338686 325233 322232 321437 327506 339333 352792 358027 367170 369997 383300 374515
7779C74515k1520j4613j2163R052o321k3900J189L345J43k5335o89o948k1138
7766B55617r236n367j6384P487L486Q918R971J2042j595L984k0956l290m832j1579
7752B28266j8726j7166K404j7316j6246Q277L142L910k02l083n611n457J030k280
7738A60942J0629j6429P878J690p066J2390L083k538J1852j2820J5687P69j2904
7725A73163j7664L328j3918k944J8048n854J3270j4586o700k083k2369j0724j7430
7712I3537p131J2799Q283k3694m457O846o712o405k345Q177n264j0113P73l822
7698F0472r573O010m199r145l588K233K94k3345O547L832j309k178J4166j4130
7684B6087j2704N839N180P193q985j218l26r10M600L653j602N776l981k48L112
$$ plain form
7779 374515 352995 338382 326219 335271 328950 305050 306239 309584 309727 284392 283703 276755 255617
7766 255617 246381 241014 224630 232117 235603 244521 254492 266534 264939 268923 247967 244677 239845 228266
7752 228266 209540 192374 194778 177462 161216 169493 172635 176545 176343 173260 167649 162192 163222 160942
7738 160942 171571 155142 163020 164710 157644 170034 173117 170579 182431 169611 185298 186067 173163
7725 173163 155499 158827 144909 141965 160013 154159 167429 152843 146143 144060 121691 110967 93537
7712 93537 86406 99205 107488 83794 79337 86183 79471 73066 70721 78898 73634 63521 64294 60472
7698 60472 50899 56909 52710 43565 39977 42210 42504 19159 25706 29538 28229 26051 40217 26087
7684 26087 13383 19222 24402 31595 22610 21392 21066 20156 24756 28409 26807 32583 28602 28354 31466
7669C1466K5504j1260k0611j6640P47n869K5502N424q593j9641O546J8160j73
7656C0562m660j8664j5237J2023L050O470j644o048M324N990P89q202L51M159
7642A3263o967k1j225m702J9819k555j6138N962J1318J58K071m501j5477j0944
7628i939K1005l044k821J5864M802j3049J0380J992j5695k4722J0108p044O492
7615e671K290R613R725k3971N292J6124m507Q704l040j5421l497R393J0212k347
7601A2899j3471l411N802p378P797P074r503n288O524P209R757j6363r209m37
7587g998N147J7093q893m11o296J670K751j099J857n142o487J560K286J221k45
7572b986k367r478K897j878l241O337J885j0307n951N288J1421o49j3741J3418
$$ plain form
7669 31466 56970 45710 25099 8459 9206 3337 28839 34263 25670 6029 12575 30735 30562
7656 30562 25902 7238 -7999 4024 7074 13544 11900 5852 10176 16166 16955 8753 9104 13263
7642 13263 6296 6275 5050 348 20167 17612 1474 7436 18754 18912 20983 16482 1005 -9939
7628 -9939 11066 8022 5201 21065 25867 12818 23198 25190 9495 -15227 -5119 -12163 -5671
7615 -5671 -3381 6232 15957 -8014 -2722 13402 8895 17599 14559 -862 -4359 5034 15246 12899
7601 12899 -572 -3983 1819 -5559 2238 9312 -191 -5479 1045 8254 18011 1648 -7561 -7998
7587 -7998 -2851 14242 5349 4938 -1358 312 3063 1964 3821 -1321 -7808 -6248 -3962 -2741 -2986
7572 -2986 -5353 -14831 -11934 -13812 -17053 -10716 -8831 -19138 -25089 -19801 -8380 -9029 -22770 -9352
7558i352J698j4593J3526J8588r412n624j7865q167J1062K533N921L794r745J5910
7544a726j924p021l87j4605q588J6814J800j205J3187j1669L439J1885J3448p517
7530E931p451o492l757K274j1958k248Q590m86j1582J975n485O493K979k218j817
7515b5252p012J3503J6002J5018n180J031p026J0003Q280j1421J0786N398L98
7502B4528k7598n704n558p111N750K3221j3582K093n86R002k1570P17Q667R538
7488A807R875j8672r824Q78R89p93j3898q007J5093Q461o32j0278K0588K913N590
7473D090m092O814k533j9077J32Q433J0743n109R505P335j0201P939K09m880j3410
7458d102J5245k2458j3146J1407M4062O473j2118m473k764L802n804j3252l477
$$ plain form
7558 -9352 -7654 -22247 -8721 9867 455 -5169 -23034 -31201 -20139 -17606 -11685 -7891 -17636 -1726
7544 -1726 -3650 -10671 -11058 -25663 -34251 -17437 -15637 -16842 -3655 -15324 -11885 0 13448 5931
7530 5931 -1520 -8012 -11769 -9495 -21453 -23701 -15111 -15597 -27179 -25204 -30689 -24196 -21217 -23435 -25252
7515 -25252 -32264 -18761 -2759 12259 7079 8110 1084 11087 19367 7946 18732 24130 24528
7502 24528 -3070 -8774 -14332 -21443 -15693 7528 -6054 -3961 -4547 4455 -17115 -16398 -7731 1807
7488 1807 11682 -6990 -16814 -15936 -14947 -15740 -29638 -37645 -22552 -14091 -14723 -25001 -4413 -1500 4090
7473 4090 -2 6812 4279 -14798 -14666 -6233 4510 -599 8906 16241 6040 13979 14188 9308 -4102
7458 -4102 11143 -11315 -24461 -13054 31008 37481 25363 20890 18126 21928 16124 2872 -605
7445f05M742o361p625P922q1r577N929m417l993j0223J3107M552m017Q778J165
7430g04K600Q757j0477Q717K382k539L16L80N194p75j3534O658O14L822M970N408
7414B1789J5000L419J3139R168J651j498n452O244r781J1135R793L726L316J765
7400H3414J7073j3486M837p643r069M767j0695j2206K705j5463k32K944J853r075
7386C9724J658k0152n297J5696P054m593j5005L845j07j1071j1978j0939R947
7373a218N601m573l612p345Q430m443J2225q963l015M43J72M860p892K04l798
7358a2924r597P039j1385Q363K0931j6065m08K564k2902o3J6223L555j832O492
7344a0009j1517l486O151n474J7237m350m862M798q685j1119P946K723j404p146
$$ plain form
7445 -605 4137 -2224 -9849 -1927 -2008 -11585 -5656 -10073 -14066 -24289 -11182 -6630 -10647 -1869 -704
7430 -704 1896 10653 176 8893 11275 8736 9052 9432 14626 13851 317 6975 7589 11411 16381 21789
7414 21789 36789 40208 53347 62515 64166 62668 57216 63460 53679 64814 74607 78333 81649 83414
7400 83414 100487 87001 91838 84195 75126 79893 69198 56992 59697 44234 44002 46946 48799 39724
7386 39724 41382 21230 15933 31629 38683 34090 19085 22930 22823 11752 -226 -11165 -1218
7373 -1218 4383 -190 -3802 -11147 -2717 -7160 5065 -3898 -6913 -6470 -6298 -1438 -9330 -9126 -12924
7358 -12924 -22521 -15482 -26867 -18504 2427 -13638 -14046 -11482 -34384 -34447 -18224 -14669 -16501 -10009
7344 -10009 -21526 -25012 -18861 -24335 -7098 -11448 -16310 -11512 -20197 -31316 -23370 -20647 -22051 -29197
7330b9197q339J3255Q353M503j1297L896J2511J1296O910K0786J1816r571j8528
7317A6394m576j2350j0063Q464o192r754j2257j585m97J6016o550m996j2656j328
7303d1930J0691n653J0176n128j72q22J6364J687j3979N47P09L635O158p374L721
7288b1370o174K515P69P21L459n23r358j625P374j5168o009J1341L625j4654K2682
7273b2395O791r216J1223m744j8914r823N734M133q340J3395l581k596J008l802
7259d1127Q174N135P831n825L221P382k535j7358m042R46p505P794N805J2860
7245a9244J0244j5707M235M644k2794M263J623L389M065M531j9082J4110K693
7232b3030M254M99j6013J2464m310r648K6356k564j5350k0111L360K0432m28J3712
$$ plain form
7330 -29197 -37536 -24281 -15928 -11425 -22722 -18826 -6315 4981 11891 32677 44493 34922 16394
7317 16394 11818 -532 -10595 -2131 -8323 -18077 -30334 -31919 -32416 -16400 -22950 -27946 -40602 -41930
7303 -41930 -31239 -36892 -26716 -31844 -32016 -32838 -16474 -14787 -28766 -28219 -27510 -23875 -17717 -25091 -21370
7288 -21370 -27544 -25029 -24260 -23539 -20080 -20603 -29961 -31586 -24212 -39380 -45389 -34048 -30423 -45077 -22395
7273 -22395 -15604 -24820 -13597 -18341 -37255 -47078 -41344 -37211 -45551 -32156 -35737 -38333 -37325 -41127
7259 -41127 -32953 -27818 -19987 -25812 -22591 -15209 -17744 -35102 -39144 -38198 -45703 -37909 -32104 -19244
7245 -19244 -9000 -24707 -20472 -15828 -38622 -34359 -32736 -29347 -25282 -20751 -39833 -25723 -23030
7232 -23030 -18776 -18277 -34290 -21826 -26136 -35784 -9428 -11992 -27342 -47453 -44093 -23661 -24089 -10377
7218a0377k326j1789N88r158N443M095K549J0087j0961Q810r512P104K188J682
7204a1577l920m597k810J0655k242n869J2673j8855p278J7936R769L758j6857
7191a9214J803J2675k0503m373J5417K093j2587n552J7526o775o515J6777j0001
7178a9229M990N253m28J6144j4225m351J0536k982K77L72N44K5603j8710n137
7164a343L50Q007R63r297J2978j6634J1771M627J9850m463N05K0613Q70j1360
7150C7437J0238R800q454R110o307M380q447R637k111q491J82J2955l859j5901
7136D0169j1855j0758m877R816k922q053p258N221R911J1655n564J0887J9039
7123E5411n680J4185J0027N369j2169J1116O267K541K535R300J4689n864r781
$$ plain form
7218 -10377 -12703 -24492 -23904 -33062 -27619 -23524 -20975 -10888 -21849 -13039 -22551 -15447 -13259 -11577
7204 -11577 -15497 -20094 -22904 -12249 -14491 -20360 -7687 -26542 -33820 -15884 -6115 -2357 -19214
7191 -19214 -17411 -4736 -25239 -29612 -14195 -12102 -24689 -30241 -12715 -19490 -26005 -9228 -19229
7178 -19229 -14239 -8986 -9414 6730 -7495 -11846 -1310 -4292 -4015 -3643 -3099 22504 3794 -1343
7164 -1343 -993 7014 7977 -1320 11658 -4976 6795 11422 31272 26809 27314 47927 48797 37437
7150 37437 47675 57475 49021 58131 51824 56204 47757 57394 55283 46792 46974 59929 56070 40169
7136 40169 28314 17556 12679 22495 19573 11520 4262 9483 19394 31049 25485 36372 55411
7123 55411 49731 63916 73943 79312 67143 78259 84526 87067 89602 98902 113591 107727 97946
7110I7946k3170r053j8340n307j654q943l27n766K11n952M0l056K4885L816n068
7095D0262j0418m127q930M138p881j4097J3983J8166J780k082J0428p906M64L114
7081C6894j1102R882n240p730o259J1603K62N955J535R931j1890R862N669O544
7067E5916p77k548J2975j2552Q50m324Q314P162N390M525R069J1263M298J9097
7053A18658K1947N62J601j6633o713m798j0176o029L513j9674j0080J9451j0421
7040H1208p95N167j8378J4572j247O789L881p225O252J2557K593j0353p606j410
7026H6005k173J270M777M141P191L306J4466j1720J7176O732j0325J3231r498
7013A24579j0488J0247O760j8868O905J0625O234q287K0549k959j4391K8407J9104
$$ plain form
7110 97946 74776 65723 47383 42076 40422 31479 31152 25386 25597 19645 19685 16629 41514 45330 40262
7095 40262 29844 25717 16787 20925 13044 -1053 12930 31096 32876 30794 41222 33316 33780 36894
7081 36894 25792 35674 30434 22704 16445 28048 28310 34265 35800 45731 33841 43703 49372 55916
7067 55916 55139 52591 65566 53014 53864 49540 57854 65016 70406 74931 84000 95263 99561 118658
7053 118658 140605 141167 142768 126135 119422 114624 104448 98419 101932 82258 72178 91629 81208
7040 81208 80413 85580 67202 81774 80527 87316 91197 83972 90224 102781 105374 95021 87415 86005
7026 86005 83832 85102 89879 94020 101211 104517 118983 107263 124439 131171 120846 134077 124579
7013 124579 114091 124338 131098 112230 119135 129760 135994 127707 148256 145297 130906 159313 178417
7000A78417J2548J1702O5j0979R650K242M168J3171n228O919q395K764r44k268
6986B13832L0300N351n007K7277K3513M977j3473K1081R214l736R07P782Q837
6973C30855J7446J3538N541O49K3547J2745j0153K1705L9013J3173N15k207K3690
6960D90057Q970n74J9175K9501L0949R999K8130O401K5126L1563K1811J9362L2709
6947G53179L9622N4243J9734K3737L4319M6704N5829M8652O1405M4229Q1197J08793
6935A371643J11825J27052J61270J70813K00592K06783K68237L29646M04339N53760
6925C905960O80512P82892R07635J024701J292486J518889J358513Q59311q58531
6916A1472368k282865k246232j556291j029601o94940m80105l81218k83548k32778
$$ plain form
7000 178417 190965 202667 202732 191753 201403 203645 207813 220984 215756 222675 214280 217044 216100 213832
6986 213832 244132 249483 244476 271753 295266 300243 286770 307851 317065 313329 314236 322018 330855
6973 330855 348301 361839 367380 368029 391576 404321 394168 415873 454886 468059 468574 466367 490057
6960 490057 499027 498453 517628 547129 578078 588077 616207 622608 647734 679297 701108 720470 753179
6947 753179 792801 847044 866778 890515 924834 971538 1027367 1076019 1137424 1181653 1262850 1371643
6935 1371643 1483468 1610520 1771790 1942603 2143195 2349978 2618215 2947861 3352200 3905960
6925 3905960 4586472 5369364 6276999 7301700 8594186 10113075 11471588 12330899 11472368
6916 11472368 9189503 6943271 5386980 4357379 3662439 3182334 2801116 2517568 2284790
6907B284790k01299j99842j66494j33047j02407q5359q2428p6588n4540p9414
6897A103372m6641o2803o2400n0593l5158k3566l2558m1022m8201k4751k4494
6886F51185m0991l0820p178l4504l9503k3328l7587m381p164k8716k2475j317
6874C73221k5461l236r072l449l907k0777r169j0542j1320N447j6051r222j1879
6861B44583j0461p602k376J986j2466j6430o257m740q927K784J4100m666j6844
6848A72684k353q908p647j1798n693O832j3435j3891j0989r536o249n171J6824
6835A00670J7093r059J79j3579k2799K44J378k3505Q64N514l674O8K80J3041o413
6820F0302n889n149J100P846o44j1391p688P15O580o623j7355r500Q719J7038
$$ plain form
6907 2284790 2083491 1883649 1717155 1584108 1481701 1396342 1313914 1237326 1182786 1103372
6897 1103372 1056731 993928 931528 880935 845777 822211 789653 748631 700430 675679 651185
6886 651185 610194 579374 572196 537692 498189 474861 437274 432893 425729 397013 374538 373221
6874 373221 347760 344524 335452 332003 328096 307319 298150 287608 276288 281735 265684 256462 244583
6861 244583 234122 226520 224144 226130 213664 197234 190977 186237 177310 180094 194194 189528 172684
6848 172684 170331 161423 153776 141978 136285 143117 129682 115791 104802 95266 89017 83846 100670
6835 100670 117763 108704 108883 95304 72505 72749 74127 50622 51486 57000 53326 53394 53674 66715 60302
6820 60302 54413 49264 50364 58210 57566 46175 38487 39202 45782 39159 21804 12304 21023 38061
6806C8061J3758n148j5168m28J0686N971k3339N72O455j3383J3378J0520l244
6793C8691p794r785n099j0788J1919O317j2067n160J017J8145r417P034j7330
6780E683p305R169k583O109l254r004O503j551j5759j2474J0402k897Q739P792
6766d30l185J3551m154m380P287q682l467R992n764j0921N329p414m739L666m559
6751a7870N400Q247O55N27j1922K635j4119Q467J7190J2847M994l090K488q896
6737G553k172M32J1836r557j647o800P695L282L968m275l432j5534J528J981r686
6722a4828o212J2388Q407j1922Q916Q133k2160K137J2318k260K402K304q090J0299
6708A832n225R83N494q069m168j7327K4785J2857m580J9758j5000j051J564j3882
$$ plain form
6806 38061 51819 46671 31503 31075 41761 47732 24393 24965 31420 18037 31415 41935 38691
6793 38691 30897 21112 16013 5225 17144 23461 11394 6234 7251 25396 15979 23013 5683
6780 5683 -1622 7547 4964 11073 7819 -1185 5318 3767 -11992 -24466 -14064 -16961 -8222 -430
6766 -430 -3615 9936 5782 1402 8689 7 -3460 6532 768 -10153 -4824 -12238 -16977 -13311 -17870
6751 -17870 -12470 -4223 -3568 -3041 -14963 -12328 -26447 -17980 -790 12057 17051 13961 16449 7553
6737 7553 5381 5813 17649 8092 6445 -355 7340 10622 14590 10315 6883 -8651 -7123 -5142 -14828
6722 -14828 -21040 -8652 -245 -12167 -3251 4882 -17278 -15141 -2823 -5083 -2681 -377 -8467 1832
6708 1832 -3393 -2410 3084 -4985 -9153 -26480 -1695 11162 6582 26340 11340 10289 11853 -2029
6694b029j7153K965J7713J319r72j4915o741O089n483k1508J3338Q919K073P664
6680h721j1000J0528J3795j7031l287j136J3361M646r603J4398m961l900l202
6667f113r844J877J0384N811P562L919k810j6170l53J3336o425p220j3480J3898
6653e628J3090j5422k878q95m73p69J5836n219j7427N963p431N54k358J1447Q295
6638c315k352k087j0772j0977O776o073N700r27rO250L354q30k524r570J8529
6623h827j3689j877J2299q847o741N305K0629O946l594k3795J2254K709j7767
6610b4995K2222m596l609J5833p574j4607o542N662L372r129p751P356K600K082
6596a9676M613O40j404Q40n686Q545K079j4827j39M626j5392O761Q907P093r34
$$ plain form
6694 -2029 -19182 -16217 1496 2815 1843 -13072 -19813 -13724 -19207 -40715 -27377 -18458 -16385 -8721
6680 -8721 -19721 -9193 4602 -12429 -15716 -16852 -3491 1155 -8448 5950 989 -2911 -6113
6667 -6113 -15957 -14080 -3696 2115 9677 13596 10786 -5384 -5737 7599 1174 -6046 -19526 -5628
6653 -5628 7462 -7960 -10838 -11733 -12206 -12975 2861 -2358 -19785 -13822 -21253 -20699 -23057 -11610 -3315
6638 -3315 -5667 -7754 -18526 -29503 -22727 -28800 -23100 -24027 -24036 -17786 -14432 -15262 -17786 -27356 -8827
6623 -8827 -22516 -24393 -12094 -20941 -27682 -22377 -1748 5198 1604 -22191 -9937 -7228 -24995
6610 -24995 -2773 -7369 -10978 4855 -2719 -17326 -23868 -18206 -14834 -23963 -31714 -24358 -21758 -19676
6596 -19676 -15063 -14423 -15827 -14987 -20673 -12128 -10049 -24876 -25015 -20389 -35781 -29020 -20113 -13020 -13954
6581a3954P650o702J7888j3158j0627L992M553l964j8435J251Q032n620P368K77
6567b1449q63O057n637R198p157J502k932j352R852J564J983n469J738J0063k522
6552e424o703j2501p95l869N889j646J209J1877l432J6474J5076j3333j3804p377
6538a8359J224Q597J6908r450J412j1114j3132O933J4814r524J869J7877j9665
6525a1610p764K1898M58K609k782J387J9845J411n330j4577J9894J4210Q973J3970
6511F2592k2404q268j3078r233j1297j6791n53n918J0904Q485J388M887j1357
6498a0643M694r055R109R274j7493M368o315l567o669Q416O321q487j4735J3935
6484b0847P166R343L788q514l578o551k1361n024J2837J9482j964r661o726n470
$$ plain form
6581 -13954 -6304 -13006 4882 -8276 -18903 -14911 -10358 -14322 -32757 -31506 -23474 -29094 -21726 -21449
6567 -21449 -22312 -16255 -21892 -12694 -19851 -18349 -21281 -22633 -12781 -11217 -9234 -14703 -12965 -2902 -5424
6552 -5424 -12127 -24628 -25423 -29292 -23403 -25049 -23840 -11963 -15395 1079 16155 2822 -10982 -18359
6538 -18359 -17135 -8538 8370 -1080 332 -10782 -23914 -16981 -2167 -11691 -9822 8055 -11610
6525 -11610 -19374 2524 2982 5591 2809 4196 24041 25452 20122 5545 25439 39649 48622 62592
6511 62592 40188 31920 18842 9609 -1688 -18479 -19032 -24950 -14046 -5561 -4173 714 -10643
6498 -10643 -5949 -15004 -5895 3379 -14114 -9746 -16061 -19628 -26297 -17881 -11560 -20047 -34782 -20847
6484 -20847 -13681 -4338 -550 -9064 -12642 -19193 -40554 -45578 -32741 -13259 -15223 -24884 -31610 -37080
6470c7080J3487L339j9007n656K0906j25n720M667N163j1039K719J4855j004N868
6456h627k5N645N627k1087M465M133m697N319P063N530J861m508n978o809p698
6441a9786Q131O15J349n593m107Q042O985Q37n221p051N604P879l036M317n110
6426f145O005L988J019L988K836M015l2j2419j1813m10o291j521Q534j0130k3595
6411d1971K0893J9656K801p299m001M080J0080P263j1057n972P812r30j1189K1546
6397A1712m040j520r736q20n73J9183n389J3878J0570j546k5050P89P990k746
6383A2702k834k786N574K557J1783k1187K3315M35j5500P698p52R56J7887q956
6369C0892J4117L238J5263n389l157J0108j0923J1184q146O111K3740k910N066
$$ plain form
6470 -37080 -23593 -20254 -39261 -44917 -24011 -24136 -29856 -25189 -20026 -31065 -28346 -13491 -14495 -8627
6456 -8627 -8652 -3007 2620 -18467 -14002 -9869 -14566 -9247 -2184 3346 5207 699 -5279 -12088 -19786
6441 -19786 -11655 -11040 -9691 -15284 -19391 -11349 -4364 -3527 -8748 -15799 -10195 -2316 -5352 -1035 -6145
6426 -6145 -140 3848 4867 8855 11691 15706 15674 3255 -8558 -8968 -15259 -16780 -8246 -18376 -41971
6411 -41971 -21078 -1422 1379 -5920 -9921 -5841 4239 11502 445 -5527 2285 1355 -9834 11712
6397 11712 7672 6152 -3584 -4404 -4977 14206 8817 22695 33265 31719 6669 7458 15448 12702
6383 12702 9868 7082 12656 15213 26996 5809 29124 29559 14059 21757 21005 21961 39848 30892
6369 30892 45009 48247 63510 58121 54964 65072 54149 65333 57187 63298 87038 84128 89194
6356H9194P973J7222J263L338K7391L6759K0790K0741R762K984k845j7828j5311
6343B01433k3054l7076k7795m613j6527j5341P18k426k3390R545N177k1554o436
6330C8661n284r355o395J1252n90j4698j133q765O909K4440n608j4222r372J3580
6316A9420J1137j4765J1352Q768j4257j8325O59J4002n081k0271m556p73L4388
6303B1698k038m939j6899k644K1071K967L074p581O40l277o353J2147R94p245
6289A1615j780J1706M786j0072k045j4329L937N190J1494l575j898j0720O769
6276A1078J1594j073J7894k0380k3339j935k613J2197M394J4315j679j9405n758
6263d710N415O909R464j4691o83L522k103M702Q933k1844J2089n624m641o467
$$ plain form
6356 89194 97167 114389 115652 118990 146381 183140 203930 224671 234433 237417 234572 216744 201433
6343 201433 178379 141303 113508 108895 92368 77027 77745 75319 51929 61474 66651 45097 38661
6330 38661 33377 24022 17627 28879 28289 13591 12458 3693 10602 35042 29434 15212 5840 19420
6316 19420 30557 15792 27144 35912 21655 3330 3989 17991 12910 -7361 -11917 -12690 21698
6303 21698 19660 14721 -2178 -4822 16249 19216 22290 14709 15349 12072 5719 17866 18860 11615
6289 11615 9835 21541 26327 16255 14210 -119 3818 9008 20502 16927 15029 4309 11078
6276 11078 22672 21599 39493 19113 -4226 -6161 -8774 3423 7817 22132 20453 1048 -4710
6263 -4710 705 7614 17078 2387 1704 5226 3123 7825 16758 -5086 7003 1379 -3262 -9729
6249i729j410J8554J4020j724j7636J0252K1735Q775r462j756q771J482O228o547
6235B4011K330J988o068p347K893R243O271K056j7824l286l271K985l434J1134
6221B1681q16o24L656N811o150r550j572J9907Q764J7785k173l0215o354J7613
6207C7763j972j4223Q529L431J85R60P947L67R262J630j6964q796N669p147k880
6192B3761K0460r42j4074J3559r282m910J9481j0354J1815j3568J225m178j68
6179C2825l846o89q712P71J2059J3863j2219j6225K2104m501j093K959o366J1366
6165D2296l795J0929Q009R109J5273k855k2591r024L727j4306K0278J3314J2543
6152H2907J2059j3330j2762J0676L698j690j999N792N782J7290K396P452o758
$$ plain form
6249 -9729 -11139 7415 21435 19711 2075 12327 34062 42837 33375 31619 22848 24330 30558 24011
6235 24011 26341 28329 22261 14914 17807 27050 33321 35377 17553 14267 10996 13981 10547 21681
6221 21681 20865 20241 23897 29708 23558 14008 12436 32343 41107 58892 56719 26504 20150 37763
6207 37763 35791 21568 30097 33528 33713 34673 42620 42987 52249 53879 36915 28119 33788 26641 23761
6192 23761 44221 43279 29205 42764 33482 28572 48053 37699 49514 35946 37171 32993 32825
6179 32825 28979 28290 19578 20349 32408 46271 34052 17827 39931 35430 34337 37296 30930 42296
6165 42296 38501 49430 57439 66548 81821 78966 56375 47351 51078 36772 57050 70364 82907
6152 82907 94966 81636 68874 79550 83248 81558 79559 85351 91133 108423 110819 118271 111513
6139A11513N405j4131j3475N807q335j0971Q901M306L187j8830r250J1870n951
6126G0046L372K583R453L871q038P349Q325m942J061J836Q470o208j8884k052
6112G6242j971J2665P891M601m292q763P273Q439K3338j0884k3853J1601K3451
6099A25738k944q252K854J0340P940J0158R867k766N852r569p240j042k749r750
6085A28437J949J3046O861N159J122l0369M887K0830Q148O604j4189p133O908
6072A52260o302J2619j5649j0046K2934O161K292j5716j7997j515J002J7519N447
6059A53009k1127q286J4358K1061q867k1372P703m618k274J9268M048K003J5626
6046A70532O486j9413j663M51J6468k413j9871N044J0250J6617j551R252P636
$$ plain form
6139 111513 116918 102787 89312 95119 86784 75813 84714 89020 92207 73377 64127 75997 70046
6126 70046 73418 76001 85454 89325 81287 88636 96961 92019 93080 94916 103386 97178 78294 76242
6112 76242 74271 86936 94827 99428 95136 86373 93646 102085 125423 114539 90686 102287 125738
6099 125738 122794 114542 117396 127736 135676 145834 155701 152935 158787 149218 141978 140936 138187 128437
6085 128437 130386 143432 150293 155452 156574 126205 131092 151922 160070 166674 152485 145352 152260
6072 152260 145958 158577 142928 132882 155816 161977 164269 148553 130556 129041 130043 147562 153009
6059 153009 131882 123596 137954 159015 150148 128776 136479 131861 129587 148855 152903 154906 170532
6046 170532 177018 157605 155942 156393 172861 170448 150577 155621 165871 182488 180937 190189 197825
6033A97825j1141K883L588l802j4864j0066j0931m022J3327J4581k3560J7669
6021A71487K0328l604k245J7822j6165L60Q236M293K196O627l2304J8719J6446
6008B12196j5552o974P629J3237o53J1620m096j40Q30J5330O117j0474J94M984
5994B34248Q803K3552J3701J773m858L637J0896o871K4200K5971J476L87k2599
5981C14316p747j2657O077k146J1506j1451n186J7771R905P821r339K381L991
5968C25242j9522J6804J0203M837K6976R458j7366M600J7858J1790R379J5264
5956D15523K5302J5407J8948R506J6721J8672m856J026j7279L771m700r575J5950
5943E04416J1046K931J4332M835L755J9231J982M010K1182J8662J3323R296J8055
$$ plain form
6033 197825 186684 189567 193155 189353 174489 164423 153492 149470 162797 177378 153818 171487
6021 171487 191815 188211 185966 203788 187623 187983 196219 200512 202708 209335 177031 195750 212196
6008 212196 196644 189670 197299 210536 209883 221503 217407 217267 218097 233427 239544 229070 229264 234248
5994 234248 243051 266603 280304 282077 277219 280856 291752 284881 309081 335052 336528 336915 314316
5981 314316 306569 293912 299989 297843 309349 297898 292712 310483 320388 328209 318870 321251 325242
5968 325242 305720 322524 332727 337564 364540 373998 356632 361232 379090 390880 400259 415523
5956 415523 440825 456232 475180 484686 501407 520079 515223 516249 498970 502741 498041 488466 504416
5943 504416 515462 518393 532725 537560 541315 560546 562528 566538 587720 606382 619705 629001 647056
5930F47056K0337P922K2748L4918K4828J7032J7068R958K0717M1638M1928K6171
5918I32321J9135P104r306J1832K3476K2099J4595K3977J6999j1736N006R16q41
5905A055577P9O845K1410K3569J8245L4894M3568J9849J9660K3872k260L906R178
5892A278392J9711J6432L5803J4570J1220K5160K6616L5605K6953J7938L5330
5881A543730M9003N1160M7347M6823O2685N6418P3793P6102Q2378O9415J06550
5870B265404J13549J23713J40611J49364J70519K09196K59252K55296K91480L63471
5860D341855M14993M51972N10425N57075N73584N17469L98171K23424j8779k28461
5850G741728l63000l65925k64139j31843J0727J29728K36137L02716L58753L73353
$$ plain form
5930 647056 667393 675315 698063 732981 757809 774841 791909 801867 822584 864222 906150 932321
5918 932321 951456 958560 949254 961086 984562 1006661 1021256 1045233 1062232 1050496 1055502 1056418 1055577
5905 1055577 1055656 1062501 1083911 1107480 1125725 1160619 1204187 1224036 1243696 1267568 1265308 1269214 1278392
5892 1278392 1298103 1314535 1350338 1364908 1376128 1401288 1427904 1463509 1490462 1508400 1543730
5881 1543730 1592733 1643893 1691240 1738063 1800748 1857166 1930959 2007061 2089439 2158854 2265404
5870 2265404 2378953 2502666 2643277 2792641 2963160 3172356 3431608 3686904 3978384 4341855
5860 4341855 4756848 5208820 5719245 6276320 6849904 7367373 7765544 7988968 7970189 7741728
5850 7741728 7378728 7012803 6748664 6616821 6627548 6757276 6993413 7296129 7654882 8028235
5840H028235L15233J85426k0927k91162n30904o50354o66131n99194n04646l84620
5830D880956k77116k52983k22633j82391j65657j45911j17429r8478r7998o0814
5820C259546n0061m4896m684k6776j5528j7203K695R38J8984J8863K1051N8045
5808C220974N6825N1801O4146R4211J11996J15943J35029J54937J80833K24870
5798D411565K53369K80451L11560L63899M25167N11929N92899O80602P86102Q78740
5788I496283R35833R72196Q92752P12682L92197k0704m02481o22930o72238n64520
5778A1119070l58394j08692Q8630K70816M00186N11937N58006N00059K82505l8275
5768A3225848m75013q47443j081975j173405j094816r40602p71227o43858n40378
$$ plain form
5840 8028235 8343468 8528894 8507967 8216805 7685901 7035547 6369416 5770222 5265576 4880956
5830 4880956 4603840 4350857 4128224 3945833 3780176 3634265 3516836 3418358 3320360 3259546
5820 3259546 3209485 3164589 3159905 3133129 3117601 3100398 3103093 3104031 3123015 3141878 3162929 3220974
5808 3220974 3277799 3329600 3393746 3487957 3599953 3715896 3850925 4005862 4186695 4411565
5798 4411565 4664934 4945385 5256945 5620844 6046011 6557940 7150839 7831441 8617543 9496283
5788 9496283 10432116 11404312 12297064 13009746 13401943 13381239 12978758 12355828 11683590 11119070
5778 11119070 10760676 10651984 10740614 11011430 11411616 11923553 12481559 12981618 13264123 13225848
5768 13225848 12750835 11903392 10821417 9648012 8553196 7612594 6841367 6197509 5657131
5759E657131m62186l87237l37453k80379k63453k48157k01282j64191j41549j26616
5749C044628j27378j12595j16468j07391j15850r1931r4051o0142n7531n3739
5739B107552m2084m1217m1233l1941m2381o297j1480N790M678N120R636O196j5134
5726A907205k3626k260J4574O231J9985K2766j0598l9784n4794n5531k9618j4687
5714A739863l2999n3022m7751m0904m7361k9266n892Q903M504N4379M6144K7952
5702A624550K644p67j3914K5393K5527M3411J4608N758l4897n9185n2273k1319
5690A559536k4980Q21o708k8937l7237m6664k8763p294l224P278K6552j2314j7089
5677A380977Q548K4870n356J9097J3063P183J5099L1052K173K6830J7630K1501
$$ plain form
5759 5657131 5194945 4807708 4470255 4189876 3926423 3678266 3476984 3312793 3171244 3044628
5749 3044628 2917250 2804655 2688187 2580796 2464946 2373015 2278964 2218822 2161291 2107552
5739 2107552 2065468 2024251 1983018 1951077 1908696 1902399 1890919 1896709 1901387 1906507 1916143 1922339 1907205
5726 1907205 1883579 1881319 1895893 1902124 1922109 1944875 1934277 1894493 1839699 1784168 1754550 1739863
5714 1739863 1706864 1653842 1606091 1565187 1517826 1488560 1482668 1491571 1496075 1550454 1596598 1624550
5702 1624550 1627194 1626427 1612513 1637906 1663433 1706844 1721452 1727210 1692313 1633128 1580855 1559536
5690 1559536 1534556 1535377 1528669 1499732 1462495 1415831 1387068 1379774 1376550 1383828 1410380 1398066 1380977
5677 1380977 1389525 1414395 1409039 1428136 1441199 1448382 1463481 1494533 1496706 1523536 1541166 1562667
5665A562667K8192K5402L7419M9719L7203K8320K7359L3475N6450M0412L9113
5654A965731L2065L4040K9285L8121O6156O5503O0857Q2029Q3855P7126J05377
5643B640145J05127J10166J12683J40554J64453J55034J73672K00325J85011K00410
5633D187580K52495K84775L41548L88975M44759N04714O01296O92475P65162Q36412
5623I300191Q96172Q83987P79657N42837J99846k01580n75625p93294q29119p17802
5613I485270n46005l64048j99912p2809N7495J72038K92922M20240N16829O21866
5603A0383886P16165P44764O94384N07040J62559k96919p41876j057873j181577
5594I930553j105343r34485p79992o35303n04956m21860l61373l15955k75724
$$ plain form
5665 1562667 1590859 1616261 1653680 1703399 1740602 1768922 1796281 1829756 1886206 1926618 1965731
5654 1965731 1997796 2031836 2061121 2099242 2165398 2230901 2291758 2373787 2457642 2534768 2640145
5643 2640145 2745272 2855438 2968121 3108675 3273128 3428162 3601834 3802159 3987170 4187580
5633 4187580 4440075 4724850 5066398 5455373 5900132 6404846 7006142 7698617 8463779 9300191
5623 9300191 10196363 11080350 11860007 12402844 12602690 12401110 11825485 11032191 10203072 9485270
5613 9485270 8939265 8575217 8375305 8302496 8359991 8532029 8824951 9245191 9762020 10383886
5603 10383886 11100051 11844815 12539199 13046239 13208798 12911879 12170003 11112130 9930553
5594 9930553 8825210 7890725 7110733 6475430 5970474 5548614 5187241 4871286 4595562
5585D595562k19587j94181j60405j51945j23489j20995q8689o3960m6661l9061
5575C386589m0077k4279k0054J8039N030J070J3729L6878P317M1548O9295Q9776
5563C584861J08211J13246J65364K14244K43306K89655L48315M12149M75860N02005
5553F457216N20984N00760L67590J52023j16629l40913n22097n41324m73087l74170
5543E630353k63643j38469n7002P261Q2893J73084K36285K85098L58174L78637
5533F692671M11030L96177L02966J13230j82541m63094o45445p22658o79466n76909
5523D645961m69287l75765l07452k55666k22229j95554j79392j48726j28167j25188
5513B238535r6213q1249o6861o8641p1391o2584n9819n3132n3313l5944k3782
$$ plain form
5585 4595562 4375975 4181794 4021389 3869444 3745955 3624960 3536271 3472311 3425650 3386589
5575 3386589 3346512 3322233 3302179 3320218 3325248 3326318 3340047 3376925 3384242 3425790 3495085 3584861
5563 3584861 3693072 3806318 3971682 4185926 4429232 4718887 5067202 5479351 5955211 6457216
5553 6457216 6978200 7478960 7846550 7998573 7881944 7541031 7018934 6477610 6004523 5630353
5543 5630353 5366710 5228241 5171239 5178500 5261393 5434477 5670762 5955860 6314034 6692671
5533 6692671 7103701 7499878 7802844 7916074 7733533 7270439 6624994 5902336 5222870 4645961
5523 4645961 4176674 3800909 3493457 3237791 3015562 2820008 2640616 2491890 2363723 2238535
5513 2238535 2142322 2061073 1994212 1925571 1854180 1791596 1731777 1678645 1625332 1589388 1565606
5502A565606k3972j5151N84J397j2180m524j9972l5318n7042o0877m1099l7616
5490A259836j7142r060j0937K0232L558R808r120o2011o7931o0295n2632k2886
5478I81420l2968l6917j8149j4379m3416k5746k0287l1453j4576j6322j1422j8273
5466F97512n833j0357q625j1334l599j1560k1199K748j8293j7456j9354j2029
5454E60621k0592k4627j8654o541M794l719j4764k593q362N964j0073j0296P017
5441D58175P107j0435j4173q348j491j6511m254q003j4240R308j6065j579L45
5428C79836o059j6166J3880k992k349J9302o923r944M42j329o805J5953q04j2573
5414C63469o51M542N671L231l961p66l432j1646J804k1650J5327p96J612L606
$$ plain form
5502 1565606 1541634 1526483 1527067 1528464 1516284 1511760 1491788 1456470 1399428 1338551 1297452 1259836
5490 1259836 1242694 1233634 1222697 1242929 1246487 1256295 1247175 1185164 1117233 1056938 1004306 981420
5478 981420 948452 911535 893386 879007 835591 809845 789558 758105 743529 727207 715785 697512
5466 697512 691679 681322 672697 661363 657764 646204 625005 627753 609460 592004 572650 560621
5454 560621 540029 515402 496748 490207 495001 491282 476518 473925 465563 471527 461454 451158 458175
5441 458175 465282 454847 440674 432326 430835 414324 410070 402067 387827 397135 381070 379491 379836
5428 379836 373777 357611 371491 368499 366150 385452 378529 368585 369027 367698 360893 376846 376042 363469
5414 363469 362818 367360 373031 376262 372301 371535 368103 356457 358261 336611 351938 351142 352754 356360
5400C56360p339k0726j0362O455O457N875J1333M177J359j1120O681Q849j1910
5387C46089j1793O169j3046j3572J3391m739J800n421q289j788N718n821J3759
5374C22457J1258j4425j0430j3398l203J776O068l366n350L787M109M542J433
5361C05258J1940L875j510j1086k957J2274l611k757o610j829J2116L38j4938
5348C00503M034j5703n887O351J650P125o608m672N9P7R171k889K746k0920M300
5333B79337K7137k401o493k652J6922l601J1069O390J4569J0885j672P914N765
5320C63169p107m839O179J302n387R105K012J4681j5496Q595P653k9772k409J0830
5306C58516N149j460J4608j2783N269J560M939J9610k632K2539j9741k341J5415
$$ plain form
5400 356360 349021 328295 317933 324388 330845 336720 348053 352230 353589 342469 349150 357999 346089
5387 346089 334296 340465 327419 313847 327238 322499 324299 318878 310589 308801 314519 308698 322457
5374 322457 333715 319290 308860 295462 292259 294035 300103 296737 291387 295174 299283 303825 305258
5361 305258 317198 321073 319563 308477 305520 317794 314183 311426 304816 302987 315103 315441 300503
5348 300503 304537 288834 282947 289298 290948 298073 291465 286793 286852 286929 296100 293211 295957 275037 279337
5333 279337 306474 304073 297580 294928 311850 308249 319318 325708 340277 351162 349490 357404 363169
5320 363169 356062 351223 357402 358704 353317 362422 364434 379115 363619 372214 379867 350095 347686 358516
5306 358516 363665 362205 376813 364030 369299 370859 375798 395408 392776 415315 395574 393233 408648
5293D08648k052n577R906J7836J918K414O315N872q957j3861Q844J3821q570L638
5279D40195n891k3979J282M884r069j0767N893l812K5151j844k742n197M640q360
5265D10384j391O256n100j934Q356J6889Q533K3223k068m232q662K2295J9987
5252D92536R967j9600N461n062j58M875L136K4251J7328n327l193Q493J5068K2858
5238E70633J5333L541N022J6072j1834j0820M198J5617J4453K649k61l02L7133
5225F61434J2511Q584J7303J5245N920n92J9755r749o29K7030L0094J1849K1574
5212H20329L3258K4645J3170R79J9467P541K84m627J3009L3865K7397K8342K4743
5199A042402N3235N4432N0171N6167N5425P3003P9209O8516K1432K864R957K3525
$$ plain form
5293 408648 406596 401019 410925 428761 430679 433093 439408 445280 436323 422462 431306 445127 436557 440195
5279 440195 434304 410325 411607 416491 407422 396655 402548 398736 423887 422043 419301 414104 418744 410384
5265 410384 408993 415249 410149 408215 416571 433460 441993 465216 463148 458916 450254 472549 492536
5252 492536 502503 482903 488364 483302 483144 488019 491155 515406 532734 527407 524214 532707 547775 570633
5238 570633 585966 589507 594529 610601 598767 587947 592145 607762 622215 624864 624603 624301 661434
5225 661434 673945 682529 699832 715077 720997 720405 740160 730411 729782 756812 786906 798755 820329
5212 820329 853587 878232 891402 892381 911848 919389 919673 915046 928055 961920 989317 1017659 1042402
5199 1042402 1095637 1150069 1200240 1256407 1311832 1384835 1464044 1532560 1553992 1556856 1566813 1590338
5187A590338L2208J0803J6465J2783k2932k747j1725j5644j2895m929L773R275
5175A604773P086J2449J6799K9105L0768L0088L5565N6514O0642M1951L4940J1300
5163A971980j7929q806q701J0456M3093L1778K4471L1318M2352L4503M1933M5655
5151B242103P2309N8876N3941Q1094Q9890R0414R2969J11345J22762J30419J65998
5140C312120J59752J59359J80254K18863K25885K64658L10722L23470L28499L04573
5130E788155K52999J55158Q5001P4589R8327J88022K88999L51908M42499N44124
5120H269781O31473O56545O38648N96887M83088L91129L10722K34974K02648J28630
5110A2544525K5810l9133o5619o836J64326L30992M57923N27008N10050M56065
$$ plain form
5187 1590338 1622546 1633349 1649814 1662597 1639665 1636918 1625193 1609549 1596654 1591725 1595498 1604773
5175 1604773 1611859 1624308 1641107 1670212 1700980 1731068 1766633 1823147 1883789 1925740 1960680 1971980
5163 1971980 1954051 1945245 1936544 1947000 1990093 2021871 2046342 2077660 2120012 2154515 2196448 2242103
5151 2242103 2314412 2373288 2427229 2508323 2598213 2688627 2781596 2892941 3015703 3146122 3312120
5140 3312120 3471872 3631231 3811485 4030348 4256233 4520891 4831613 5155083 5483582 5788155
5130 5788155 6041154 6196312 6281313 6355902 6454229 6642251 6931250 7283158 7725657 8269781
5120 8269781 8901254 9557799 10196447 10793334 11276422 11667551 11978273 12213247 12415895 12544525
5110 12544525 12570335 12531202 12465583 12458747 12623073 12954065 13411988 13938996 14449046 14905111
5100A4905111L93223L37445K05935j545k68456n18383n72526n16953m44743l91907
5090A3127201l90425l59637k23865q8758L1481R1334N1342o5779j84944k61102
5080A1726848l21615l58446m78432n65295o67293p01373o52142n75665m61493
5071F945094l33955k62905j91867j14702r1504o1282p6472j58329k52792l38365
5061E062921l49688l37382l04293k50551j92945j79288j33883r4148r1728r1701
5051C037314p9223n5221n6815l6952l8033k2020j5378J7766L5843L9203M7928
5040B874412O6462R1497J18404J51542J66403J98083K13140K02619J26256l0345
5030D178473j91146l13821l32004k86869k24797j61943j28065j00037r2915o8107
$$ plain form
5100 14905111 15298334 15635779 15841714 15840169 15571713 15053330 14480804 13963851 13519108 13127201
5090 13127201 12736776 12377139 12153274 12064516 12095997 12187331 12238673 12172894 11987950 11726848
5080 11726848 11405233 11046787 10568355 10003060 9335767 8634394 7982252 7406587 6945094
5071 6945094 6611139 6348234 6156367 6041665 5950161 5888879 5812407 5654078 5401286 5062921
5061 5062921 4713233 4375851 4071558 3821007 3628062 3448774 3314891 3220743 3129015 3037314
5051 3037314 2958091 2902870 2846055 2809103 2771070 2749050 2733672 2751438 2787281 2826484 2874412
5040 2874412 2940874 3032371 3150775 3302317 3468720 3666803 3879943 4082562 4208818 4178473
5030 4178473 3987327 3673506 3341502 3054633 2829836 2667893 2539828 2439791 2346876 2278769
5020B278769n9765n1570p634k3239m36l4720k5164m2668j7398j5835l3863n515
5008A960962o2l075m7920m8709l7167j970P612j1040l916j0679j5498J6821l910
4995A801449P986J8409k8415l2661k1191O229N485j1653r060j796Q394j1592P816
4982A739400Q951o632j205M765J57j1123J6786j8487l5291l0967j8908k1393J8237
4969A644290L0496j2240o365J292M024J360K68r446k7269k2304k6052m3240j2038
4956A522776J6719J8142K1338J2303J1644L3773J1313l944j4461k4360m0561k0570
4944A544112k8846k2456j348n509K885K504K0549Q611N3704O6963O6081N3310
4932A760560M6763L2392K5409L8335K2844M0100J9758J6640O067J3593N403J726
$$ plain form
5020 2278769 2219004 2167434 2159800 2136561 2136125 2101405 2076241 2033573 2016175 2000340 1966477 1960962
5008 1960962 1960900 1957825 1909905 1861196 1824029 1822059 1829671 1818631 1814715 1804036 1788538 1805359 1801449
4995 1801449 1809435 1827844 1799429 1766768 1745577 1751806 1757291 1745638 1736578 1734782 1743176 1731584 1739400
4982 1739400 1748351 1741719 1740514 1745279 1745436 1734313 1751099 1732612 1697321 1666354 1647446 1626053 1644290
4969 1644290 1674786 1662546 1656181 1657473 1661497 1662857 1663125 1653679 1626410 1604106 1578054 1534814 1522776
4956 1522776 1539495 1557637 1578975 1591278 1602922 1636695 1648008 1644064 1629603 1605243 1564682 1544112
4944 1544112 1515266 1492810 1491462 1485953 1488838 1491342 1511891 1520502 1574206 1641169 1707250 1760560
4932 1760560 1807323 1839715 1865124 1903459 1926303 1966403 1986161 2002801 2008868 2022461 2027864 2029590
4920B029590J7892L3387M9917M0538K1533J8884N3864M1310L8474M5851M3090
4909B434330K4364K6887J8659K0729J7375L1081J8235L2751L3708K5789J7783
4898B701691K2830K0687O274M9893K7027L4003L2234L0110M0965L2098L0392N7037
4886C085241P0751R9808R0060Q2404J06910J00348R7483R7658O3381P8531N4295
4875D026870L4215K8344J5449m280J5984L0467K5196K6400L5953L8829K9084P9603
4863D382114O1966P4165R1867J12627J16108J35939J29241J19263J08566P9154
4853E411010P9318M7666O1140O7181Q6191R5656Q2463N6252N3807K2141R7949
4842F160774J17658J36687J67098J65155J63698K16447K17184K28450K34001K15070
$$ plain form
4920 2029590 2047482 2080869 2130786 2171324 2192857 2211741 2265605 2306915 2345389 2391240 2434330
4909 2434330 2458694 2485581 2504240 2524969 2542344 2573425 2591660 2624411 2658119 2683908 2701691
4898 2701691 2724521 2745208 2751482 2801375 2828402 2862405 2894639 2924749 2965714 2997812 3028204 3085241
4886 3085241 3155992 3255800 3345860 3428264 3535174 3635522 3733005 3830663 3894044 3972575 4026870
4875 4026870 4061085 4089429 4104878 4100598 4116582 4147049 4172245 4198645 4234598 4273427 4302511 4382114
4863 4382114 4444080 4518245 4610112 4722739 4838847 4974786 5104027 5223290 5331856 5411010
4853 5411010 5490328 5537994 5599134 5666315 5752506 5848162 5930625 5986877 6040684 6062825 6160774
4842 6160774 6278432 6415119 6582217 6747372 6911070 7127517 7344701 7573151 7807152 8022222
4832H022222J97177K29023K70625K90122K89476K85043K78982K70596K67633K49146
4822A0650045K39401K48204K61411K37637K43478K80170K84138L63501M20801
4813A3228786M55278N31586N67826O05866O17202N96517O09991O66973O77804
4804A8557829P23375P72902Q17672Q92644J028934J177975J385422J638385J871720
4795B8866858K113138K351692K525785K645156K657102K321128J405180q0889
4787D4805150j365360j629059j184626n68007j45671O9398J17096J82874K84327
4778D0566122M10731N51795O90572O46682K93309l36684o91758n68554j66534
4769D1395681J97829N07580P54807R45793J114679J303207J442725J606242J765778
$$ plain form
4832 8022222 8219399 8448422 8719047 9009169 9298645 9583688 9862670 10133266 10400899 10650045
4822 10650045 10889446 11137650 11399061 11636698 11880176 12160346 12444484 12807985 13228786
4813 13228786 13684064 14215650 14783476 15389342 16006544 16603061 17213052 17880025 18557829
4804 18557829 19281204 20054106 20871778 21764422 22793356 23971331 25356753 26995138 28866858
4795 28866858 30979996 33331688 35857473 38502629 41159731 43480859 44886039 44805150
4787 44805150 43439790 41810731 40626105 40058098 39912427 39981825 40098921 40281795 40566122
4778 40566122 40976853 41528648 42219220 42865902 43159211 42822527 42130769 41562215 41395681
4769 41395681 41593510 42101090 42855897 43801690 44916369 46219576 47662301 49268543 51034321
4760E1034321K055924K421148K757026K912797K813758K371325J942031J673482
4752F9981812J479157J102659Q28228J015083J724212K685540L743270M763284
4744H7323245N784361O868233P939324R160771J0696006J2490836J4702082J7431163
4736A72396021K0845510K4525105K7628077L0014753L2556072L6189524M0492357
4729C84647419M0149938L0029351N623913l0630502n7203681o1403969n0944694
4722B60267775l8346925k8526936k1635945j7123522j4012415j1758456j0205529
4715A18658047q926471p612810o286393n103049m136272l243346k518695k022490
4707G8808521j695774j679127k275459l268362m247157m628137m344669l757183
$$ plain form
4760 51034321 53090245 55511393 58268419 61181216 63994974 66366299 68308330 69981812
4752 69981812 71460969 72563628 73391856 74406939 76131151 78816691 82559961 87323245
4744 87323245 93107606 99975839 107915163 117075934 127771940 140262776 154964858 172396021
4736 172396021 193241531 217766636 245394713 275409466 307965538 344155062 384647419
4729 384647419 424797357 454826708 460450621 429820119 372616438 311212469 260267775
4722 260267775 221920850 193393914 171757969 154634447 140622032 128863576 118658047
4715 118658047 109731576 102118766 95832373 90729324 86593052 83349706 80831011 78808521
4707 78808521 77112747 75433620 73158161 69889799 65642642 61014505 56669836 52912653
4699E2912653l204782k690763k280700k013790j836464j780212j761695j721357
4691C5622890j637602j485000j330180j263577j149857j022025r40807q65000
4683B5928842p86647p40131p38577p04566o71791o35711o15373n89126n44526
4674A9902394m89568m83953n20276n83706n99906n60565m88647m34914l83010
4665A5357849l56846l02020k32563j59571j76136j90589j85134k11626k59656
4656A3283708l07404l09631l03862k60219k36418j89120j91729j75116j23309
4647A1186900r1495l5849R366M8210P0101O1297N1640O4103Q8191R9431P8822
4636A1630717L1189L8106O5550J41332K97808M43833O10255P92857R40144J071431
$$ plain form
4699 52912653 49707871 47017108 44736408 42722618 40886154 39105942 37344247 35622890
4691 35622890 33985288 32500288 31170108 29906531 28756674 27734649 26793842 25928842
4683 25928842 25142195 24402064 23663487 22958921 22287130 21651419 21036046 20446920 19902394
4674 19902394 19412826 18928873 18408597 17824891 17224985 16664420 16175773 15740859 15357849
4665 15357849 15001003 14698983 14466420 14306849 14130713 13940124 13754990 13543364 13283708
4656 13283708 12976304 12666673 12362811 12102592 11866174 11677054 11485325 11310209 11186900
4647 11186900 11095405 11059556 11068922 11117132 11187233 11248530 11300170 11364273 11452464 11551895 11630717
4636 11630717 11661906 11700012 11765562 11906894 12204702 12648535 13258790 14051647 14991791 16063222
4626A6063222J214107J304709J314630J076646N43778l02368r84256j132340q17339
4617A8280789m05759j2792K93196N21887P23761Q36595P67976L99072k59243r05182
4607B0240300j175250r75006n65481j76917J30869L62779L73642J55939l65975
4598A8004900r42952j159575r95913o53628l71443j36482P1641K24341L27474
4589A4368363L33305J17214l34734r35073j357605j377202j168941r30226p30223
4580G984878n81638m77196l97074l33375k79636k41713j95849j63617j42367j49063
4570E023350j43570j21767j52335j34391j51837j62426j57438j52145j24681j07549
4560C615211j17075q4058q1832o7445p1188q9970n5384m9552o7792o1943n1750
$$ plain form
4626 16063222 17277329 18582038 19896668 20973314 21517092 21214724 20230468 19098128 18280789
4617 18280789 17875030 17862238 18155434 18677321 19401082 20237677 21005653 21404725 21145482 20240300
4607 20240300 19065050 18090044 17524563 17347646 17478515 17841294 18214936 18370875 18004900
4598 18004900 17061948 15902373 14906460 14252832 13881389 13744907 13816548 14040889 14368363
4589 14368363 14701668 14818882 14484148 13549075 12191470 10814268 9645327 8715101 7984878
4580 7984878 7403240 6926044 6528970 6195595 5915959 5674246 5478397 5314780 5172413 5023350
4570 5023350 4879780 4758013 4605678 4471287 4319450 4157024 3999586 3847441 3722760 3615211
4560 3615211 3498136 3414078 3332246 3264801 3193613 3103643 3048259 2998707 2930915 2868972 2817222
4549B817222p0137m9242p4917o9759n6972l2361n4840k1982k6479n8358l4771
4538B267404m0439k9118j8237l3823l9712m1460m1904m5860l8746o363j0949j7034
4526A903759o926O464l489j107J2605K3111J7948L7261n15n295j1402n1234m3371
4513A877809k6440n5715k7022k9777l3650j3064j1822q856J3542K0074K1353Q552
4501A734984J1783k2860n4333l2716m4896k3235j2182k5897k4171M010Q155r437
4489A509205K8k4206l3798l0784k9081J562J3037N699Q986O520j1465k9253o0769
4476A325681n7211m4034m7537k8400k3331k0564l352J1223o772l314l3202l8993
4464A030194k9696l2397j8099k0036l5511k5200j8046n729j5479K649Q857R418
$$ plain form
4549 2817222 2747085 2697843 2622926 2553167 2496195 2463834 2408994 2387012 2360533 2302175 2267404
4538 2267404 2226965 2197847 2179610 2145787 2106075 2064615 2022711 1976851 1938105 1931742 1920793 1903759
4526 1903759 1896833 1903297 1899808 1898701 1911306 1934417 1952365 1989626 1989111 1983816 1972414 1921180 1877809
4513 1877809 1851369 1795654 1768632 1738855 1705205 1692141 1680319 1671463 1685005 1705079 1726432 1734984
4501 1734984 1746767 1723907 1669574 1636858 1591962 1568727 1556545 1530648 1506477 1510487 1518642 1509205
4489 1509205 1509233 1485027 1451229 1420445 1391364 1392926 1405963 1411662 1420648 1427168 1415703 1386450 1325681
4476 1325681 1268470 1224436 1176899 1148499 1125168 1104604 1101252 1112475 1105703 1102389 1069187 1030194
4464 1030194 1000498 968101 950002 929966 894455 869255 851209 845480 830001 832650 841507 850925
4452H50925n776M762M360k2301j4818q236N877N644p20K578R750l645n630J8243
4438H41013K9577M8970N9985L9875N0462N0597N1393N4649Q7399Q3959J25332
4427A523211J40936J52264J56653J93190K18292K24240K13859J47503J1669j60560
4417B821257k63305l16848k96848k25079j54731j14756j04380q5087m6503n7059
4407A156661m7666m7719l2466k8602k1698J0072r184o046J4624j842k6545l1148
4395I28441j6844m0048m2721j1934J067j0670j4716j3948k420q969j6645j4514
4383G36079j7450j5155l2424k2189r842J3698r619k039j2712j0261j040j876n022
4370F10148j328j5820O90O407J8708M337J4089K3455J320j1000L865l721O594
$$ plain form
4452 850925 845149 849911 854271 831970 817152 808916 814793 820437 819717 822295 832045 828400 822770 841013
4438 841013 870590 919560 979545 1019420 1069882 1120479 1171872 1226521 1313920 1397879 1523211
4427 1523211 1664147 1816411 1973064 2166254 2384546 2608786 2822645 2970148 2981817 2821257
4417 2821257 2557952 2241104 1944256 1719177 1564446 1449690 1345310 1260223 1213720 1156661
4407 1156661 1108995 1061276 1028810 1000208 978510 988582 979398 973352 987976 986134 959589 928441
4395 928441 911597 871549 828828 816894 817961 807291 792575 778627 776207 767238 750593 736079
4383 736079 718629 703474 671050 648861 639019 652717 643098 641059 628347 618086 617046 615170 610148
4370 610148 608820 593000 593690 600097 618805 623142 637231 660686 662006 651006 654871 651150 657744
4357F57744O960j5336L52j7796j4304k4809k2196J2443K237j5797K123J1792n814
4344E77599k164j1648J8355J8832P445q662J1853L675j4207n792j4355l852l1263
4331E45816j6008M86j9704k9563k5398j523J816n924k2280j6117K6711J1120m440
4318D44992l955J1096o107o918M744P058l0808J298L048j8888r211j2306K058
4305C86101J4759p948J1842Q081J67R951p656J8520K1517l633K780L3141K7020
4292E14642K1459K1543K8457O5803K9792K5538J5696j9216p909q623m5584k9925
4280F11673k8014l8323j7580L60l721k838J0157J2506l690J2598k5938l7332l4191
4267D55667l0183r201r138o71j5449R079k531L381J3657j1021L108p037K501J2225
$$ plain form
4357 657744 664704 649368 649720 631924 617620 592811 570615 583058 585295 569498 571621 583413 577599
4344 577599 575435 563787 582142 600974 608419 599757 611610 615285 601078 595286 580931 577079 545816
4331 545816 529808 530294 510590 481027 455629 454106 455922 449998 427718 411601 438312 449432 444992
4318 444992 441037 452133 446026 439108 443852 450910 420102 421400 424448 405560 396349 384043 386101
4305 386101 400860 392912 404754 412835 413002 422953 415297 433817 455334 451701 454481 487622 514642
4292 514642 536101 557644 586101 651904 681696 707234 722930 703714 695805 687182 641598 611673
4280 611673 583659 545336 527756 528116 524395 521557 531714 544220 540530 553128 527190 489858 455667
4267 455667 425484 416283 407145 406474 391025 400104 397573 400954 414611 403590 406698 399661 402162 414387
4253D14387m456j9555j0666J7379M394j6621m32J161k365j8328p681J8112n554
4240C69775L087k6546M403J753J955M757p842N519J2573J2447M78K3583J2689
4227D18631J9897K7220p539k2r954j6793p881O785J9313M788K5975K7586J1898
4214E19904L0061L3006J8379K9914N4465N6073N7635O7248P5943J12348J41852
4203A196828J18644P5757J3575j03466j96036j67051j11204p5390p2482m2591
4193F36584l0898l9843k9687j2434r764j3324j5150m3279j2337R22j9504j3873
4181C97413J0385j0393P473q491R933j3383k3853O843j4001m311j084o107k807
4168C47617p253j2180j4161P062j1852k214R245k7322k308P168J8038l891k2368
$$ plain form
4253 414387 409931 390376 379710 397089 401483 384862 384430 385591 383226 364898 357217 375329 369775
4240 369775 372862 346316 350719 352472 354427 359184 351342 356861 369434 381881 382359 405942 418631
4227 418631 438528 465748 458209 458187 448233 431440 423559 430344 449657 454445 480420 508006 519904
4214 519904 549965 582971 601350 631264 685729 741802 799437 866685 942628 1054976 1196828
4203 1196828 1315472 1391229 1404804 1301338 1105302 938251 827047 751657 679175 636584
4193 636584 605686 565843 536156 523722 513958 500634 485484 442205 429868 430790 411286 397413
4181 397413 407798 397405 404878 396387 406320 392937 369084 375927 361926 357615 356531 350424 347617
4168 347617 340364 328184 314023 321085 309233 307019 316264 288942 286634 293802 311840 307949 285581
4155B85581j063j065j71L070J1126m985j6641P997p894m185p950N225j1644N306
4141B62707j561K4343j481j5117l849k54j861R052L952M001P393N042K1120K5654
4127C39141o087p565l471r343P185k923k102r899k2879j738L206L075J1295j6658
4113B81237J325P91N436q80K1708k727n448m612m141K0145J071J8864N879O438
4099C45086L837P583K9906M549N917l209n021J3049J823j943J6270K1148J9994
4086D58989J7793J1641K4787J6198K7758M7193O2392O8366O0694N1698P7300N7752
4074I82561K5749L462l9334n9550p0785o4219p6849p1767m0227l8811j5072k5952
4062E09206k5302J821j6433j2783N288J1393p294K1722P571K0903l403q038J055
$$ plain form
4155 285581 284518 283453 283282 286352 297478 292493 275852 283849 275955 271770 263820 269045 257401 262707
4141 262707 261146 285489 284008 268891 265042 264788 262927 271979 275931 279932 287325 292367 313487 339141
4127 339141 333054 325489 322018 312675 319860 316937 314835 304936 282057 280319 283525 286600 297895 281237
4113 281237 282562 283353 288789 287909 309617 306890 301442 296830 292689 312834 313905 332769 338648 345086
4099 345086 348923 356506 386412 390961 396878 393669 388648 401697 403520 401577 417847 438995 458989
4086 458989 476782 488423 513210 529408 557166 604359 666751 735117 795811 847509 924809 982561
4074 982561 1008310 1011772 972438 912888 842103 777884 701035 629268 589041 550230 535158 509206
4062 509206 483904 485725 469292 456509 461797 473190 465896 487618 495189 516092 512689 504651 505706
4049E05706J4850K4025M4835L0503K9904N4693L4518K7387L175k7559o4064n0437
4037F27536l5290n0843k4348J1098p114m722o090j1660K976q144j4642L018J542
4024D83317j7064N884M708L217J532Q627k312j1516J921O871O204J1637L961L975
4010E10962N362J1112O398K537J8576J0114J5704r270k0513q422O834p610n764
3997E36020J2372q433k574j4126K766j291K014J8668J518p33m602J0172Q279Q267
3983E68317l013o988J3800J1125J7446j123J0227k073M154l879M541J7441j0136
3970F19839J1808o963M008Q321j081J3773J2635l758M765M073j2024m037R388
3957F60747J9698J7739j1839L534J1868Q621r47J566N455q933L987l363J3612
$$ plain form
4049 505706 520556 544581 589416 619919 649823 704516 739034 766421 769596 742037 677973 627536
4037 627536 592246 541403 517055 528153 521039 516317 510227 498567 501543 493399 478757 481775 483317
4024 483317 466253 472137 476845 480062 481594 490221 487909 476393 478314 485185 491389 503026 506987 510962
4010 510962 516324 527436 533834 536371 554947 565061 580765 571495 550982 542560 549394 541784 536020
3997 536020 548392 539959 537385 523259 526025 524734 526748 545416 546934 546201 541599 551771 560050 568317
3983 568317 565304 558316 572116 583241 600687 599564 609791 607718 611872 607993 612534 629975 619839
3970 619839 631647 624684 628692 637013 635932 649705 662340 658582 663347 667420 655396 651359 660747
3957 660747 680445 698184 686345 689879 701747 710368 709421 710987 716442 707509 711496 708133 721745
3944G21745J9941J6027P903K345M177N015J3532K612J2063L847J6093J525M713
3931H31538K7007J9257l140J1775p36o636j1451j3758J1971J349l67J5115J781
3918H83705P201l228P02L481m53L936J1202j785l70j279n639J0958q845J2402
3904I11988J8445j4218J7187Q768N395J748J2378J4714O515L57k3598k1726J2070
3891I50023R865J122j6561o671R37j7524K283N754O484J804R03n366M501J0320
3877I47874n829M610j6375j26J5700j457m892N442J7180n313K522m177j6226P113
3863I46046o719J2409J0580o104n772J7045M050M863K6124j8366j2250K4862J6475
3850A013243l914J8155q486K4884J8424O724J2557J9656L3701M0085M794J8399
$$ plain form
3944 721745 741686 757713 765616 767961 772138 777153 790685 793297 805360 809207 825300 826825 831538
3931 831538 858545 877802 874662 886437 885701 879065 867614 853856 865827 867176 866809 881924 883705
3918 883705 890906 887678 888380 891861 891408 895344 906546 904761 904391 903112 897473 908431 899586 911988
3904 911988 930433 916215 933402 942170 947565 949313 961691 976405 982920 983277 959679 937953 950023
3891 950023 959888 961010 944449 937778 938715 921191 923474 929228 935712 937516 938419 933053 937554 947874
3877 947874 942045 946655 930280 930154 945854 944397 939505 944947 962127 956814 959336 955159 938933 946046
3863 946046 939327 951736 962316 956212 950440 967485 971535 976398 1002522 984156 971906 996768 1013243
3850 1013243 1009329 1027484 1018998 1043882 1062306 1069030 1081587 1101243 1134944 1175029 1179823 1198222
3838A198222j511q223j6478j8404r510l1915j9077o161l4289j288O978j6362j5353
3825A026629Q007J0245L482k630Q237J1181m539r673k229n376J3368K060m246
3812A054516j5291L5979K190m989M655o561J4763K5718O058n198J6367J4393K1076
3799A163676k7658M516J1666N219R63O533N089J5349J4661L770R09J4007M705
3786A223405O778P868J8098J3511Q546N457J5241l114J1503J2462m973J0561O707
3773A332050O273L888J5160L172k075J0777J9789J4005K1113J7011L1668J1043
3761A483874R42J1679K1383J0412J6963M825J2534K5743P630K1962P559p233r372
3748A608901K2825J9355J7120O916q444J6228J6921k35J3851M953M536P331K3155
$$ plain form
3838 1198222 1196711 1188488 1172010 1153606 1144096 1112181 1093104 1086943 1052654 1051366 1058344 1041982 1026629
3825 1026629 1034636 1044881 1048363 1045733 1053970 1065151 1060612 1050939 1048710 1043334 1056702 1058762 1054516
3812 1054516 1039225 1075204 1077394 1072405 1077060 1070499 1085262 1110980 1117038 1111840 1128207 1142600 1163676
3799 1163676 1136018 1140534 1152200 1157419 1158382 1164915 1170004 1185353 1200014 1203784 1204693 1218700 1223405
3786 1223405 1230183 1238051 1256149 1269660 1278206 1283663 1298904 1295790 1307293 1319755 1314782 1325343 1332050
3773 1332050 1338323 1342211 1357371 1360543 1358468 1369245 1389034 1403039 1424152 1441163 1472831 1483874
3761 1483874 1484816 1496495 1517878 1528290 1545253 1550078 1562612 1588355 1595985 1617947 1625506 1618273 1608901
3748 1608901 1631726 1651081 1668201 1675117 1666673 1682901 1699822 1699587 1713438 1718391 1722927 1730258 1753413
3735A753413m318J0345K0259J3358J3721K805J0844J4319J3480R252L301J8715
3723A879494O239J4029J733J188Q214J1670j726K349j760O923J6350N145o893
3710A942955j1827J16J1627J1470K615R47J908N348Q436j0800M839o424K843L0819
3696A994872p42J0501P311J3714K040J2860L338J287M769l942L197J1329J6226
3683B076760l553J0586N189J1563l776j805L780R164J6953J0353j6407j338M505
3670B121974j056j112K007k10k7047q380L858J1767j1361p088j0541J0011q061
3657B074761J771j1917O784L978R126k3759m704m860J6976j935m39P423K132q459
3643B066878k967J9585k1979q102J285J42n00J3579P938J1918L370n18j400J9462
$$ plain form
3735 1753413 1749095 1759440 1779699 1793057 1806778 1809583 1820427 1834746 1848226 1857478 1860779 1879494
3723 1879494 1885733 1899762 1901495 1902683 1910897 1922567 1920841 1923190 1921430 1928353 1944703 1949848 1942955
3710 1942955 1931128 1931244 1942871 1954341 1956956 1957903 1959811 1965159 1973595 1962795 1967634 1961210 1964053 1994872
3696 1994872 1994130 2004631 2011942 2025656 2027696 2040556 2043894 2045181 2049950 2046008 2049205 2060534 2076760
3683 2076760 2073207 2083793 2088982 2100545 2096769 2094964 2098744 2107908 2124861 2135214 2118807 2117469 2121974
3670 2121974 2120918 2119806 2121813 2121603 2094556 2086176 2090034 2101801 2090440 2083352 2072811 2082822 2074761
3657 2074761 2076532 2064615 2071399 2075377 2084503 2060744 2056040 2051180 2068156 2066221 2065782 2073205 2075337 2066878
3643 2066878 2063911 2083496 2061517 2053415 2054700 2054842 2054342 2067921 2075859 2087777 2091147 2090629 2089229 2108691
3629B108691j098J1806M34o219N979J3746J6981J0173J2203J8240k683J3428O436
3616B208117J8660J4200P86n287J4437K8135J6058Q165K4387J0808j254N277k298
3603B340191K3008M586k087R26j0254J1712J4483K009J955J2831L0378R613J3321
3590B452672Q307Q154J6891K0687j695R173L2896J9381q562K657K1163O135Q755
3577B596614J6568K171K2027q583j0303J5694J4704p021O688j2822N438K121J6087
3564B659383K5285M832r549J2005J9488L733J8634N048M915J7146J0456N231J6873
3551B793480J2256K0113o391K546K0068l725j3064p870K50J2460O073k278k617
3538B831301p941K713O818k1267k567J8361K0751K829n032J2566J5087J941J4836
$$ plain form
3629 2108691 2107593 2119399 2119833 2113614 2119593 2133339 2150320 2160493 2172696 2190936 2188253 2201681 2208117
3616 2208117 2226777 2240977 2241763 2236476 2250913 2279048 2295106 2303271 2327658 2338466 2337212 2342489 2340191
3603 2340191 2363199 2367785 2365698 2366624 2356370 2368082 2382565 2384574 2386529 2399360 2429738 2439351 2452672
3590 2452672 2460979 2469133 2486024 2506711 2505016 2514189 2547085 2566466 2557904 2560561 2581724 2587859 2596614
3577 2596614 2613182 2615353 2637380 2628797 2618494 2634188 2648892 2641871 2648559 2635737 2641175 2643296 2659383
3564 2659383 2684668 2689500 2679951 2691956 2711444 2715177 2733811 2738859 2743774 2760920 2771376 2776607 2793480
3551 2793480 2805736 2825849 2819458 2822004 2842072 2838347 2825283 2817413 2817663 2830123 2836196 2833918 2831301
3538 2831301 2823360 2826073 2832891 2811624 2809057 2827418 2848169 2850998 2845966 2858532 2873619 2875560 2890396
3525B890396J0394J9856O571Q302J6239j922J3241L036Q276J6222k975N841m798
3512B988679N344O810m579Q493L293k987J4741K7946J6905q485R639J6446K4552
3499C106797J076J8025K4902L945J2804J5965M984J7275K0892K7186J3393j678
3487C265566R925K3415R406O817R039J2830O612J735K2985K9672J2660L165J0975
3474C424802J9273J1376K2594K5892J7060J9855J9165K9075K4882L6148K0902
3463C671024K3270L2151J2841L1698L7592K3902J0020K1123L0071K1240L9275
3452C954207J0935R598M0191M3899L2175L5642J3686L8797M2533L5859L6304L3712
3440D327538L6084L5060M8279K8477M1598K7585M1834L7116M6366M5312L8045
$$ plain form
3525 2890396 2900790 2920646 2927217 2935519 2951758 2949836 2963077 2966113 2974389 2990611 2987636 2993477 2988679
3512 2988679 2994023 3000833 2996254 3004747 3008040 3005053 3019794 3047740 3064645 3056160 3065799 3082245 3106797
3499 3106797 3107873 3125898 3150800 3154745 3167549 3183514 3188498 3205773 3226665 3253851 3267244 3265566
3487 3265566 3275491 3298906 3308312 3315129 3324168 3336998 3343610 3345345 3368330 3398002 3410662 3413827 3424802
3474 3424802 3444075 3455451 3478045 3503937 3520997 3540852 3560017 3589092 3613974 3650122 3671024
3463 3671024 3694294 3726445 3739286 3770984 3808576 3832478 3842498 3863621 3893692 3914932 3954207
3452 3954207 3965142 3974740 4014931 4058830 4091005 4126647 4140333 4179130 4221663 4257522 4293826 4327538
3440 4327538 4363622 4398682 4446961 4475438 4517036 4544621 4586455 4623571 4669937 4715249 4753294
3429D753294M7775L2523N4664N1666M1202L7163N8095L4499N3636N5790M6992
3418E267299M4692N0188P2801O7124P2619P4635N4557N2191M5417P0016P5501
3407E947040Q6190O1038O1458P4553P8766Q5003P1133Q7337J10402R2599Q9289
3396F844808J08583R8313J14403J02220J11912J25681Q5356R0465R3145Q4280
3386G859166Q7280J08053J19731J15494J20314J23639J35507J39703J36214J35304
3376I080405J44931J58437J46680J42596J55652J58347J64307J95031J88511J76084
3366A0710981J84283J96392J98393K04195K12254K03725J95135K04655K14380
3357A2524393K09080K16439K30253K33889K40924K63134K53980K68336L01186
$$ plain form
3429 4753294 4801069 4833592 4888256 4939922 4981124 5018287 5076382 5110881 5164517 5220307 5267299
3418 5267299 5311991 5362179 5434980 5502104 5574723 5649358 5703915 5756106 5801523 5871539 5947040
3407 5947040 6033230 6094268 6155726 6230279 6309045 6394048 6465181 6552518 6662920 6755519 6844808
3396 6844808 6953391 7051704 7166107 7268327 7380239 7505920 7591276 7681741 7774886 7859166
3386 7859166 7946446 8054499 8174230 8289724 8410038 8533677 8669184 8808887 8945101 9080405
3376 9080405 9225336 9383773 9530453 9673049 9828701 9987048 10151355 10346386 10534897 10710981
3366 10710981 10895264 11091656 11290049 11494244 11706498 11910223 12105358 12310013 12524393
3357 12524393 12733473 12949912 13180165 13414054 13654978 13918112 14172092 14440428 14741614
3348A4741614L29998L13644L24365L35082L58499M00347M24129M44236M74794
3339A8146708M99208N42493N84480O27287O86533P25660P94915Q26126Q92827
3330B4326237R96404J056568J186092J288545J412777J528848J640688J760613
3322C5196772J865817J921050J996639J983989J881082J697996J393080R67692
3314D8904117M05223k59540r77614j592841k091206k307495k261958k085762j865094
3305C5867830j635352j429310j270411j092965j005250r18685q49516q10031p38235
3296B6118075p08007o58149n80746n72987n21881n00267n05734m57300m69224
3287B1143780m31307m21753m23371m14942m26413m14654l86997m00107m02372
$$ plain form
3348 14741614 15071612 15385256 15709621 16044703 16403202 16803549 17227678 17671914 18146708
3339 18146708 18645916 19188409 19772889 20400176 21086709 21812369 22607284 23433410 24326237
3330 24326237 25322641 26379209 27565301 28853846 30266623 31795471 33436159 35196772
3322 35196772 37062589 38983639 40980278 42964267 44845349 46543345 47936425 48904117
3314 48904117 49309340 49049800 48072186 46479345 44388139 42080644 39818686 37732924 35867830
3305 35867830 34232478 32803168 31532757 30439792 29434542 28515857 27666341 26856310 26118075
3296 26118075 25410068 24751919 24171173 23598186 23076305 22576038 22070304 21613004 21143780
3287 21143780 20712473 20290720 19867349 19452407 19025994 18611340 18224343 17824236 17421864
3278A7421864l97052l88318l66464l46007l53464l52872l27136l04825k98884
3269A4286842k90132k75103k70614k69628k71415k57823k43089k28173k03654
3260A1977211k05021j88353j85904j97614j88000j81441j60254j37414j52610
3251A0380600j54213j46061j26168j40193j26232j22620j14921r6651j13231j12807
3241I127503j04046j04661j08366j04168r1071j04195j02351o7955q4962p4061
3231H181667p3746p5124o9917o6196p8034q7083n9473n1068r0495p7273o0969
3220G392289n8296p3288n4281o0288n1659n0861o4512m3584o4154n4088n2432
3209F764846m9573m2676n4280o0603m6735n0136l1084n6822o2128m9120l9628
$$ plain form
3278 17421864 17024812 16636494 16270030 15924023 15570559 15217687 14890551 14585726 14286842
3269 14286842 13996710 13721607 13450993 13181365 12909950 12652127 12409038 12180865 11977211
3260 11977211 11772190 11583837 11397933 11200319 11012319 10830878 10670624 10533210 10380600
3251 10380600 10226387 10080326 9954158 9813965 9687733 9565113 9450192 9353541 9240310 9127503
3241 9127503 9023457 8918796 8810430 8706262 8615191 8510996 8408645 8340690 8255728 8181667
3231 8181667 8107921 8032797 7962880 7896684 7818650 7731567 7672094 7621026 7530531 7453258 7392289
3220 7392289 7333993 7260705 7206424 7146136 7094477 7043616 6979104 6935520 6871366 6817278 6764846
3209 6764846 6715273 6672597 6618317 6557714 6510979 6460843 6429759 6372937 6310809 6261689 6222061
3198F222061l1281o0725n9218m7825m1482l8206k9723m6909n4385m8035k7417
3187E736855n3038l4807k2609l8285l5433l2073l0335k8055k0890j7637k9873
3176E393820m2522k5402k7474k9942l3887l7267l4388j5817l0171k8879J303k9158
3164E060216k9336l3502k7696L40k6877k5941j6312J137j7005j3915k3967k3424
3152D823718r076m0718k2454q315k4407l7733k8818l9960j9910k4863k9640k4406
3140D513418j8075k0516k3276m1319k4403k1930m8301o149k8167m1978q173j1148
3128D219983k3879j1082j471j5789l8153j5091j1919j1731o217k2616j9544k6888
3116D015603j8850k3392j1661j3549k0876l0836l3299j6798k4486r709j6837j0199
$$ plain form
3198 6222061 6190780 6130055 6070837 6023012 5981530 5943324 5913601 5866692 5812307 5764272 5736855
3187 5736855 5683817 5649010 5626401 5588116 5552683 5520610 5490275 5462220 5441330 5423693 5393820
3176 5393820 5351298 5325896 5298422 5268480 5234593 5197326 5162938 5147121 5116950 5088071 5089374 5060216
3164 5060216 5030880 4997378 4969682 4970022 4943145 4917204 4900892 4902029 4885024 4871109 4847142 4823718
3152 4823718 4814642 4773924 4751470 4743155 4718748 4681015 4652197 4612237 4592327 4567464 4537824 4513418
3140 4513418 4495343 4474827 4451551 4410232 4385829 4363899 4315598 4309449 4281282 4239304 4231131 4219983
3128 4219983 4196104 4185022 4183551 4167762 4129609 4114518 4102599 4090868 4084651 4062035 4042491 4015603
3116 4015603 3996753 3973361 3961700 3948151 3927275 3896439 3863140 3846342 3821856 3812147 3795310 3785111
3104C785111k1306r536m0336j5025j0249k8890m991j018j0328j0662l33J0082
3092C642519j4185j0279L1633o594o392J6072M553N072k1595Q278K3302K1394
3080C693778L616q729o66J3150K1866J0588M594K1424J6889K6108L0052J0958
3068C843628K3926J8249L2724N1242L2481L0435K1492K3621M0133L0801M2478
3057D191210K8270M5591K4404L5048M9274N6224M9919N5340N4188M0185M6942
3046D676595N2321N1556M3097M2288L8868N2205M1527L9033N4657L0699M1438
3035E164284O5735N7394O6461N2866N5387P4503O9680P3972N8883Q1794P1434
3024E892393Q7052J09309J28771J28079J11519J27932J28857J47896J65181J44724
$$ plain form
3104 3785111 3763805 3754269 3713933 3698908 3688659 3659769 3654778 3653760 3643432 3632770 3632437 3642519
3092 3642519 3628334 3618055 3649688 3643094 3636702 3652774 3657327 3662399 3640804 3649082 3672384 3693778
3080 3693778 3697394 3688665 3687999 3701149 3723015 3733603 3738197 3759621 3776510 3802618 3832670 3843628
3068 3843628 3867554 3885803 3918527 3969769 4002250 4032685 4054177 4077798 4117931 4148732 4191210
3057 4191210 4219480 4265071 4289475 4324523 4373797 4430021 4479940 4535280 4589468 4629653 4676595
3046 4676595 4728916 4780472 4823569 4865857 4904725 4956930 4998457 5037490 5092147 5122846 5164284
3035 5164284 5230019 5287413 5353874 5406740 5462127 5536630 5606310 5680282 5739165 5820959 5892393
3024 5892393 5979445 6088754 6217525 6345604 6457123 6585055 6713912 6861808 7026989 7171713
3014G171713J50704J54426J58762K06440K09434J84201J93330K20759J98901K25187
3004I073857K22866K16038K07549J96618J93876J48615J41194J33633J28566J15906
2994A0778718J10091J40999J57465J55478J91330K13985K43738K56756K77237
2985A2525797L08897L24283L48498M05249M30256M44627M71193N01731M96034
2976A6256565N09427M88560M26909L74881K50291J28649j6059j73754l24658m26965
2966A7493846l98540l27479k48447j43233n8194J0581P9348J38633J52802J98248
2956A6897565K23999K26772K33382K35090K20235K34392K26984J98028J47729
2947A8844176P7514J0689q4805j54662k34088l13082l43762l60509l82495m33978
$$ plain form
3014 7171713 7322417 7476843 7635605 7842045 8051479 8235680 8429010 8649769 8848670 9073857
3004 9073857 9296723 9512761 9720310 9916928 10110804 10259419 10400613 10534246 10662812 10778718
2994 10778718 10888809 11029808 11187273 11342751 11534081 11748066 11991804 12248560 12525797
2985 12525797 12834694 13158977 13507475 13912724 14342980 14787607 15258800 15760531 16256565
2976 16256565 16765992 17254552 17681461 18056342 18306633 18435282 18419223 18245469 17920811 17493846
2966 17493846 17095306 16767827 16519380 16376147 16317953 16328534 16407882 16546515 16699317 16897565
2956 16897565 17121564 17348336 17581718 17816808 18037043 18271435 18498419 18696447 18844176
2947 18844176 18921690 18932379 18847574 18692912 18458824 18145742 17801980 17441471 17058976 16624998
2937A6624998m50551m40484m01462l18004k84865k17206j55661j20571j04155
2928A4132039j04512q5174r3579j17581j25160j60881k02913k23692k75106l02192
2918A2441249l36273l87300m05475m31191m42713m07429l84299l67474l23133
2909H955962l10735k74020k45322k29389j93518j89496j97099j83575j49724j65851
2899F817233j37281j30763j43217j43305j59829j27995j59405j35162j24604j18901
2889E436771j26122j51028j20126j21542j14306j09297r3294j04490j08638j20983
2879D266945r8321p7035p7376r3323q3044q5605p0147o7718o5791o5422o2099
2868C421064o0980n7426m5857n2736m6229l8212l4856m0366o3503l5263m0373
$$ plain form
2937 16624998 16174447 15733963 15332501 15014497 14729632 14512426 14356765 14236194 14132039
2928 14132039 14027527 13942353 13848774 13731193 13606033 13445152 13242239 13018547 12743441 12441249
2918 12441249 12104976 11717676 11312201 10881010 10438297 10030868 9646569 9279095 8955962
2909 8955962 8645227 8371207 8125885 7896496 7702978 7513482 7316383 7132808 6983084 6817233
2899 6817233 6679952 6549189 6405972 6262667 6102838 5974843 5815438 5680276 5555672 5436771
2889 5436771 5310649 5159621 5039495 4917953 4803647 4694350 4601056 4496566 4387928 4266945
2879 4266945 4168624 4091589 4014213 3920890 3837846 3752241 3682094 3614376 3548585 3483163 3421064
2868 3421064 3360084 3302658 3256801 3204065 3157836 3119624 3084768 3044402 2980899 2945636 2905263
2857B905263n1011n9984m3468o4048n1209k3209m6225m6165n0276m6245m0124
2846B383299l9816n4505m3814l9104l5989k9378l9651j6207l3882m2607k1665
2835A986681k3137k8783k8006k3345j4039j2740l7880l2285l0746j3332l4485
2824A707903l5155k4762k0621l3789l6023k3463j6704k8391k2669o213k0107k3826
2812A416180k0610m3586k6351k7777o404j5670M415k4550k8921k771k6561k4825
2800A172569k4132j4273k0666j2057m875N65j1114l2817j7100k3831J5817l817
2788A024269j4951k0346r721l347j2425o984o552j3452k760k2418J7478m147j7328
2775I07316r266j1973n216r990l685J595l530J247l746k2864L56k1854M404j100
$$ plain form
2857 2905263 2854252 2794268 2750800 2686752 2635543 2612334 2566109 2519944 2469668 2423423 2383299
2846 2383299 2343483 2288978 2245164 2206060 2170071 2140693 2101042 2084835 2050953 2008346 1986681
2835 1986681 1963544 1934761 1906755 1883410 1869371 1856631 1818751 1786466 1755720 1742388 1707903
2824 1707903 1672748 1647986 1627365 1593576 1557553 1534090 1517386 1488995 1466326 1460113 1440006 1416180
2812 1416180 1395570 1351984 1325633 1297856 1291452 1275782 1280197 1255647 1226726 1223955 1197394 1172569
2800 1172569 1148437 1134164 1113498 1101441 1096566 1097131 1086017 1053200 1036100 1012269 1028086 1024269
2788 1024269 1009318 988972 979251 975904 963479 956495 949943 936491 933731 911313 928791 924644 907316
2775 907316 898050 886077 880861 870871 867186 868781 865251 866498 862752 839888 840244 818390 822794 821694
2761H21694j1910Q745p328j8566m591p160q967o420m498j2076O395o357N7l705
2747G45313j4643j1522q24J916L000j7751k071j4983r482K5988L682k1080k259
2734F85284j0204K994L575j8250n512j1178j9448J8177L233j9018n518J854J3957
2721F39946q154j1260J3879o09j7279p714j1946o771J4294L840K174O713l985
2708F13128k0520n942j5028q439J0805K553j5489m138l144O824O91l78m753K291
2694E58461k962R111O10j5983l256o087m55O141J9633q224k0025j5850q654P361
2680E19821K866o758M519p097j5893J94M30r977L194J3621k8477j6566L0375J4138
2666E04390k5723j5144m43N095k029j0146Q325O452n947N9N343j2544J164p803
$$ plain form
2761 821694 809784 818529 811201 792635 788044 780884 771917 765497 760999 748923 755318 748961 749018 745313
2747 745313 730670 719148 718324 720240 723240 705489 703418 688435 678953 704941 708623 687543 685284
2734 685284 675080 678074 681649 663399 657887 646709 627261 645438 648671 629653 624135 625989 639946
2721 639946 631792 620532 634411 633802 616523 608809 596863 590092 604386 608226 610400 617113 613128
2708 613128 592608 586666 571638 563199 574004 576557 561068 556930 553786 560610 561301 560923 556170 558461
2694 558461 555499 564610 565220 549237 545981 539894 539439 545580 565213 556989 536964 521114 512460 519821
2680 519821 522687 515929 520448 513351 497458 497652 498082 488105 491299 504920 476443 459877 490252 504390
2666 504390 478667 463523 463080 468175 466146 456000 464325 470777 464830 464889 470232 457688 458852 451049
2652D51049j3842p691J293M675M688j3072q791j4455Q322J3483o674j2917q336
2639C97732l07L370k592M244j1445k9069J3543q72j8593j453j0772j6754K2151
2626C49183l846j3645L306j5946k216N757J979m156M832j0238R326k1067j0368
2613B92901J0759l802p067r230j0535k070P198p013O675j3757l322K357L334m285
2599B62143Q168J552p826J0155n820K602k3957L295K296q137j1868J430j290o461
2585B26282Q294m678N117J1315j783r676k25j5588q33J6319n527o937q093K755
2571B16742j7173j9156P308Q178j0767N994M743P64l040k8376K2748M047j9846
2558A72166o69L640O06q90j504j6799L2365j0388k202J5443L373o658l247m582
$$ plain form
2652 451049 437207 429516 430809 435484 440172 427100 418309 403854 412176 425659 418985 406068 397732
2639 397732 397425 400795 398203 402447 391002 361933 375476 374604 356011 354558 343786 327032 349183
2626 349183 345337 331692 334998 319052 316836 322593 324572 320416 325248 315010 324336 303269 292901
2613 292901 303660 299858 292791 283561 273026 270956 278154 271141 277816 264059 260737 263094 266428 262143
2599 262143 270311 271863 264037 274192 268372 270974 247017 250312 252608 244471 232603 234033 232743 226282
2585 226282 234576 229898 235015 246330 244547 234871 234646 219058 218225 234544 229017 222080 213987 216742
2571 216742 199569 180413 187721 195899 185132 191126 195869 196633 193593 165217 187965 192012 172166
2558 172166 171497 175137 175743 174853 173349 156550 188915 178527 176325 191768 195141 188483 185236 180654
2544A80654j1830k009p329K2397Q04r280q666j335m592Q165m527j0669j4091K176
2530A39868J4907Q310j2642j6162J628N644k899j764l3L518j2208o842J2750J1467
2516A45542j3665o257R278k104j5669N162k464J0742j3569m789M155m185N746
2503A17923n908q433j4497k40J7443q400j4784l254J437O144P726Q096q787j6913
2489G7553P633N796n445L459K27n901m897l155J0986q395l791M170l224J9305
2475I4321J0742r752q217N802n397j0366j3613p191M19k621J90J3135R109o110
2461G0451n243q92q069Q425J9205l209j2820p107P585R293nL654n4j0141l215
2446F7858J861n713J5083l919J0050P055k568N80r224j6897Q81q915j5635Q339
$$ plain form
2544 180654 168824 166815 159486 181883 182687 173407 164741 163406 158814 166979 162452 151783 137692 139868
2530 139868 154775 163085 150443 134281 135909 141553 138654 136890 136857 140375 128167 121325 134075 145542
2516 145542 131877 125620 134898 132794 117125 122287 119823 130565 116996 112207 116362 112177 117923
2503 117923 112015 103582 89085 88845 106288 97888 83104 79850 81287 87431 95157 103253 94466 77553
2489 77553 85186 90982 85537 88996 89223 83322 78425 75270 86256 77861 74070 78240 75016 94321
2475 94321 105063 95311 87094 92896 87499 77133 63520 56329 56748 54127 54317 67452 76561 70451
2461 70451 65208 64316 56247 64672 83877 80668 67848 60741 68326 77619 77614 81268 81214 71073 67858
2446 67858 69719 64006 79089 75170 85220 92275 89707 90287 81063 64166 65047 56132 40497 48836
2432D8836J396p806P811J8581j072k2472Q985m10j1776k2j0053R451J8819j6418
2418D3850k076o399R409j5809n712K369k543O177j152J1355j4763j1285P646K177
2404B3244n161Q54k007j1596L802J9741r322J5763j2776j6219O348m1J8757O034
2390C7421p9j4106l502N232l248J528j2238j5674N869J2142L060k88J719k273
2376A5563p173O773J2076K13m594K572j2091R677k996N362n645P137j731j975
2362B3168J766n14l733M052M476l492L64j7764J2071O693J774K7n987K425j686
2347B3640j6736J168o893J7296l790j5377K0295K327n819n505k395J5p878M759
2333E107O961K971k129r412Q530J2105o759o876L757j916j117R576J3669j3050
$$ plain form
2432 48836 50232 42426 50237 68818 67746 45274 54259 53849 42073 42051 31998 41449 60268 43850
2418 43850 41774 35375 44784 28975 23263 25632 23089 29266 28114 39469 24706 13421 21067 23244
2404 23244 18083 18937 16930 5334 9136 28877 19555 35318 22542 6323 12671 12630 31387 37421
2390 37421 37342 23236 19734 24966 21718 23246 11008 -4666 1203 13345 16405 16117 17836 15563
2376 15563 8390 15163 27239 27452 22858 25430 13339 23016 20020 25382 19737 26874 25143 23168
2362 23168 24934 24420 20687 24739 29215 25723 26087 8323 20394 27087 28861 28888 22901 25326 23640
2347 23640 6904 8072 1179 18475 14685 -692 19603 21930 16111 10606 8211 8226 348 5107
2333 5107 12068 15039 12910 3498 12028 24133 17374 10498 14255 12339 11222 20798 34467 21417
2319B1417N730L674j0884J2162k15j2785j153k096j1943J6684l935l159M700P402
2305B5599N671r530L556m04O981p366n678K825O881r029p94k829J7713L582j1582
2290B5596P86l571J0585K100N395j74j2068m22r04M180J1681j899o260j3271j357
2275B0397J6928j355K324L486p712j033J2046J0690J991j281k047j2590o958M907
2261C9793N46J562n331J8296J1132q041p36R439K4561j1575j0005L285J1402J0176
2247I4504n84O758j1026j330M125k709j2554K5778L1397R790k0912l599J5645
2234A35283K768O745j0722K2305P601j4182Q434r986M969Q172k482J4078Q048
2221A81031J629L0590J0650n894q563J3570r870J839n21J8031K4105J1114R413
$$ plain form
2319 21417 27147 30821 19937 32099 31884 19099 17946 15850 3907 20591 16656 13497 18197 25599
2305 25599 31270 21740 25296 24892 31873 24507 18829 21654 28535 19506 18712 15883 33596 37178 25596
2290 25596 26382 22811 33396 35496 40891 40717 28649 28227 27323 31503 43184 41285 35025 21754 20397
2275 20397 37325 35970 38294 41780 34068 33035 45081 55771 57762 56481 54434 41844 34886 39793
2261 39793 40339 41901 36570 54866 65998 57957 57221 66660 91221 79646 69641 72926 84328 94504
2247 94504 93920 100678 89652 88322 92447 89738 77184 102962 134359 144149 123237 119638 135283
2234 135283 138051 144796 134074 156379 163980 149798 158232 148246 153215 161387 158905 172983 181031
2221 181031 182660 213250 223900 218006 209443 223013 213143 214982 214461 232492 256597 267711 277124
2208B77124m057K4950J5202J113R948J2952K3587K6949K6699L0788K1306N46L9428
2195E06535M0550K8058M1182M9564N9377Q1635J00792P0662N7432Q3928P8074
2184A197789J03555J76817J93012K53787L13221L88882M46494M73220O04360O65214
2174D816351N93633L24328n32465j086864r71420o43728m33890l05044k17181
2165A543720j64184j46283j02476q6943p0768m7529n2409l8427n5579p4399o6220
2154F38503l4066m6114k9668l5841l4909k5607m683k2966j4043l3264l1612j3884
2142C11846q998r801k7273m262M212k5728p819p799k7523j3338j1130J0985j2808
2129A70564j4659L236p90J5384m980k9421j2923P029j3260j8734K422l998k977
$$ plain form
2208 277124 273067 298017 313219 314332 324280 337232 360819 387768 414467 445255 466561 467107 506535
2195 506535 547085 575143 616325 665889 725266 806901 907693 978355 1035787 1119715 1197789
2184 1197789 1301344 1478161 1671173 1924960 2238181 2627063 3073557 3546777 4151137 4816351
2174 4816351 5409984 5734312 5201847 4114983 3143563 2499835 2065945 1760901 1543720
2165 1543720 1379536 1233253 1130777 1043834 973066 925537 873128 834701 779122 704723 638503
2154 638503 604437 558323 528655 492814 457905 432298 427615 404649 390606 357342 325730 311846
2142 311846 302848 293047 265774 261512 265724 239996 232177 224378 196855 183517 172387 183372 170564
2129 170564 155905 159141 158351 173735 168755 139334 126411 133440 120180 101446 103868 99870 96893
2116I6893p22r431l516J0603k6768n540L809J0462N860L620j8383Q723j687k718
2102G1205R196j6049j320j5874j1188K040J9176l463k150o993J1124R886k1030
2089D4560j5689J5715n995k5578k511R670m38n556r43Q745q886P969J0579n139
2075B6503L342O525k4597m240l323L695R668L660l955p183K801K898j1462O100
2061A0432J0682O150j9618N767n909O579K611q456J1532j5523K404k291R088j48
2047A3300J1783q073j3973r648n026K4876m772p427j209R066n829j6099J2216
2034h15m213N89j3935J4428M349j2356P890P57k651K606O707j3559J5651J1177
2020A6625r944n494R262O686j6356j7221p766K077L833M760r202L607P821l22
$$ plain form
2116 96893 96171 86740 83224 93827 67059 61519 65328 75790 81650 85270 66887 75610 73923 71205
2102 71205 80401 64352 63032 47158 35970 38010 57186 53723 51573 44580 55704 65590 44560
2089 44560 28871 44586 38591 13013 10502 20172 19734 14178 13235 21980 13094 21063 31642 26503
2075 26503 29845 36370 11773 7533 4210 7905 17573 21233 17278 10095 12896 15794 4332 10432
2061 10432 21114 27264 7646 13413 7504 14083 16694 8238 19770 4247 6651 4360 13448 13300
2047 13300 25083 17010 3037 -6611 -11637 13239 8467 1040 -169 8897 3068 -13031 -815
2034 -815 -5028 -4439 -18374 -3946 403 -11953 -4063 -3306 -5957 -3351 3356 -10203 5448 16625
2020 16625 6681 1187 10449 17135 779 -16442 -24208 -22131 -18298 -13538 -22740 -19133 -11312 -11634
2006a1634J0816j5682j92L891m564j2536O137J239R796O157k606L866O575j6992
1992a5729j771R002o968Q38q192J1436j3607J0455n361j8348m387K0692P0L526
1978a8344p77j1398p059J9997m73j509p216P154J5833L610q366m737k643O064
1964i864p440p381M094M013J56P886K515l937r774J0193Q60j5210M773J8507m10
1949a019j0549m720O424R872j2939k255q735P04J1938L266j1093K423P313j6241
1935b5611J3491J0165j2537N709p560P503j1273j7084K0223j961Q291n58m044
1922a5246m784j3861N249p245Q109R789Q685p859O070J0706m202j0002j166o63
1908a6420o880R456J1574R08M017l537K462j228O556j0156p159o620L285o249
$$ plain form
2006 -11634 -818 -16500 -16692 -12801 -17365 -29901 -23764 -22525 -12729 -6572 -9178 -5312 1263 -15729
1992 -15729 -17500 -8498 -15466 -14628 -22820 -11384 -24991 -14536 -19897 -38245 -42632 -21940 -21870 -18344
1978 -18344 -19121 -30519 -37578 -17581 -18054 -19563 -26779 -19625 -3792 -182 -8548 -13285 -15928 -9864
1964 -9864 -17304 -24685 -20591 -16578 -16422 -8536 -6021 -9958 -19732 -9539 -8679 -23889 -19116 -609 -1019
1949 -1019 -11568 -16288 -9864 8 -12931 -15186 -23921 -23217 -11279 -8013 -19106 -16683 -9370 -25611
1935 -25611 -12120 -1955 -14492 -8783 -16343 -8840 -20113 -37197 -16974 -18935 -10644 -11202 -15246
1922 -15246 -20030 -33891 -28642 -35887 -27778 -17989 -9304 -17163 -11093 -387 -4589 -14591 -15757 -16420
1908 -16420 -23300 -13844 -2270 -1362 2655 -882 1580 352 6908 -3248 -10407 -17027 -13742 -19991
1894a9991J0323j842m03m064J493Q417r347O27j878j1130J6658M057m422K587
1880h915n078j9074k802J7057P88j4743J026L789Q012P007M191k893j480r944
1866b3059K2440M51l0011P864J1221j0016k0818O699R514J0280j5784k554O467
1853b7306n460J649Q583Q879M826k420j430m779R646R243j5859L350M568k1192
1839b7702N798p572J979J3842l134r32p238L863p12m010l27n303K960o44J2799
1824a6333P120j3616J394M739n496Q142p437j1872N362J8508J0689q128q008m860
1810a9796j6741M357J6227O368n838J2426l775j9283N330P030n388N192R588q352
1796a2655l749j2239Q842J6653j2048l909q926J2846J404l970R511n846j672P536
$$ plain form
1894 -19991 -9668 -11510 -11913 -15977 -14484 -6067 -15414 -14787 -16665 -27795 -11137 -7080 -11502 -8915
1880 -8915 -13993 -33067 -35869 -18812 -18024 -32767 -31741 -27952 -19940 -12933 -8742 -11635 -13115 -23059
1866 -23059 -619 -168 -30179 -22315 -11094 -21110 -41928 -35229 -25715 -15435 -31219 -33773 -27306
1853 -27306 -32766 -31117 -22534 -13655 -8829 -11249 -12679 -17458 -7812 1431 -14428 -11078 -6510 -27702
1839 -27702 -21904 -29476 -27497 -13655 -16789 -17721 -24959 -21096 -21808 -25818 -26145 -31448 -28488 -29132 -16333
1824 -16333 -9213 -22829 -21435 -16696 -22192 -14050 -21487 -33359 -27997 -9489 1200 -6928 -14936 -19796
1810 -19796 -36537 -32180 -15953 -9585 -15423 -2997 -6772 -26055 -20725 -13695 -19083 -13891 -4303 -12655
1796 -12655 -16404 -28643 -19801 -3148 -15196 -19105 -28031 -15185 -13781 -17751 -8240 -14086 -15758 -8222
1782h222j870K930j67J0475j4661p684K198j6776J5360K094q142j6889L746l420
1768d1028J5953J5653j0642r277j665J6391j5653N976L260Q0j685m853N364Q439
1754a3687R53M248j78j0323j313r22J3443l15n819K201q311K175l530r158L812
1739b6724J142P44o199J0224J9855q130j6298N59r05J806O698l363N46M159O236
1724i650r611j3095J3678P306L53M90k759j1775q270J0245R513m485j112m340
1710b3512j296K114R691p114J2411L058n14j2767R216J1785q530j964j5731R819
1696a3334n444L786j1203J460M582m031M677N822q146l783n356P075J327j5943
1682c8511J8968J2921K433k234j0032m319O637P558J359j1778J0510L423j5899
$$ plain form
1782 -8222 -10092 -7162 -7329 3146 -11515 -19199 -17001 -33777 -18417 -16323 -24465 -41354 -37608 -41028
1768 -41028 -25075 -9422 -20064 -29341 -31006 -14615 -30268 -24292 -21032 -20952 -22637 -27490 -22126 -13687
1754 -13687 -12734 -8486 -8664 -18987 -20300 -21222 -7779 -8094 -13913 -11712 -20023 -17848 -21378 -30536 -26724
1739 -26724 -25582 -24838 -31037 -20813 -958 -9088 -25386 -24827 -25732 -23926 -17228 -20591 -20045 -15886 -9650
1724 -9650 -19261 -32356 -18678 -11372 -11019 -10529 -13288 -25063 -33333 -23088 -13575 -18060 -19172 -23512
1710 -23512 -24808 -22694 -13003 -20117 -7706 -4648 -5162 -17929 -8713 3072 -5458 -7422 -23153 -13334
1696 -13334 -18778 -14992 -26195 -24735 -20153 -24184 -19507 -13685 -21831 -25614 -30970 -23895 -22568 -38511
1682 -38511 -19543 -6622 -4189 -6423 -16455 -20774 -14137 -6579 -5220 -16998 -6488 -3065 -18964
1669a8964j199P651j1454K134m365l900L734M174m255l30J2872N775n877J207
1655a2797q711O717J2426j9929O515m265p048R570m655L559K1523J82o652P84
1641b781K619j8362j5429M243j0462R393j507m1J0823K1683m888j1814j3067N864
1627b3726J2215o256j0914J5061J1618k8973O76q22J4470O306m590M139j7430
1614b8226j375j18K043J5169j1679J0433l089j2450J4632n218k49J6350q789k565
1600a5131J4441k5234j280Q983K385R946m359j824q859m106j4190R017J6865q160
1586b1506j4093N943O463j2946K9429M123k1681R706J4995p343q814r19L875j484
1572a4252R31q633m798M938P14O060p540J985P762j2050j0258R810L722P296o24
$$ plain form
1669 -18964 -20163 -12512 -23966 -21832 -26197 -30097 -26363 -22189 -26444 -26774 -13902 -8127 -14004 -12797
1655 -12797 -21508 -14791 -2365 -22294 -15779 -20044 -27092 -17522 -22177 -18618 2905 3087 -3565 -2781
1641 -2781 -162 -18524 -33953 -29710 -40172 -30779 -32286 -32327 -21504 179 -4709 -16523 -29590 -23726
1627 -23726 -11511 -17767 -28681 -13620 -2002 -30975 -30299 -31121 -16651 -10345 -14935 -10796 -28226
1614 -28226 -29601 -29719 -27676 -12507 -24186 -13753 -16842 -29292 -14660 -19878 -20127 -3777 -12566 -15131
1600 -15131 -690 -25924 -27204 -18221 -15836 -5890 -10249 -12073 -20932 -25038 -39228 -30211 -13346 -21506
1586 -21506 -35599 -29656 -23193 -36139 -6710 -2587 -24268 -14562 433 -6910 -15724 -16643 -12768 -14252
1572 -14252 -13321 -21954 -26752 -21814 -21100 -15040 -22580 -20595 -12833 -24883 -35141 -25331 -21609 -14313 -14937
1557a4937k461K794N576o104j3241J738J0515K703J2525j5949l533k3164J0434
1544c3104j477J8141R723J6115n355k1087q253Q508J7971j6041L481l16j4784
1531b6478M70k552J3973J6325P53p317r926o688k419J9578K189L291j7123j4770
1517c0694j044K4669q714j3790J0367N101K293k246j1096N287j0218L827n935
1504c2193Q833Q89R891r61m386m90q790M132k69J5488J918N237L070q482q141
1489a4254M130k926M337r490q629J5469k262j55K1715j1805r55J9482n043q440
1475A174m418o380k032n451k424Q109J0048k0345o424K165J5197P223J1803p141
1461A104j3239J4087K168M005Q064O123l3793J471k771o044J1504n714m811N485
$$ plain form
1557 -14937 -17398 -14604 -9028 -15132 -28373 -26635 -16120 -13417 -892 -16841 -20374 -43538 -33104
1544 -33104 -34581 -16440 -6717 9398 4043 -17044 -25297 -16789 1182 -14859 -11378 -11694 -26478
1531 -26478 -26008 -28560 -14587 1738 2491 -4826 -14752 -21440 -23859 -4281 -2092 1199 -15924 -30694
1517 -30694 -31738 -7069 -15783 -29573 -19206 -14105 -11812 -14058 -25154 -19867 -30085 -26258 -32193
1504 -32193 -23360 -22471 -12580 -13541 -17927 -18417 -27207 -23075 -23344 -7856 -5938 -701 2369 -6113 -14254
1489 -14254 -10124 -13050 -8713 -18203 -26832 -11363 -13625 -13780 7935 -3870 -4825 14657 9614 1174
1475 1174 -3244 -9624 -11656 -17107 -19531 -11422 -1374 -21719 -28143 -25978 -10781 -3558 8245 1104
1461 1104 -12135 1952 4120 8125 16189 22312 -11481 -10010 -12781 -18825 -7321 -13035 -17846 -12361
1447a2361J0737p729N973J3325k3270j83K041L405j0323j272M525J2071j0665
1434a3726J3494k459J05l838R81M069N210j8184q567J2056P022L922q553l242
1420a1710o661j2588J2551J4792q72j0082q209o793n244J3725j1600J8076J3780
1407h35R756p801L597j936r551L950p604l440J1161m161O832k172m985p370n566
1392b0125R527J9248j4760o548m372Q0J2105R32R856r468m766j6516J7958J4995
1378H146n026j858j6450l575K505R17O028K07n414K721R167j354N89j1384j1237
1363b6018J2013p131P783j14l249j0936J3286M775J1062J6554j6020j1697m56
1350a0148O898J2517L4l095j9150j13J19J0912k376q58m133k043j4324J1558O756
$$ plain form
1447 -12361 -1624 -9353 -3380 9945 -13325 -13508 -11467 -8062 -18385 -19657 -15132 -3061 -13726
1434 -13726 -232 -2691 -2586 -6424 -5443 -1374 3836 -14348 -22915 -10859 -3837 85 -8468 -11710
1420 -11710 -18371 -30959 -18408 -3616 -4488 -14570 -22779 -29572 -34816 -21091 -32691 -14615 -835
1407 -835 8921 1120 4717 2781 -6770 -2820 -10424 -13864 -2703 -6864 -32 -2204 -7189 -14559 -20125
1392 -20125 -10598 8650 -6110 -12658 -17030 -16950 -4845 -3913 5943 -3525 -8291 -24807 -6849 8146
1378 8146 3120 1262 -15188 -18763 -16258 -15341 -9313 -9106 -14520 -11799 -2632 -3986 -3397 -14781 -26018
1363 -26018 -14005 -21136 -13353 -13467 -16716 -27652 -14366 -9591 1471 18025 2005 -9692 -10148
1350 -10148 -3250 9267 9301 6206 -12944 -13057 -12938 -2026 -4402 -5260 -9393 -11436 -25760 -14202 -7446
1335g446m465j0120l697J7749R726j12j5148J7923r321j870M013R744o122p322
$$ plain form
1335 -7446 -11911 -22031 -25728 -7979 1747 1635 -13513 4410 -4911 -6781 -2768 6976 854 -6468
$$ [...]
##END NTUPLES=NMR SPECTRUM
##END=
