##TITLE=1H_CA-8958-2
 CDCl3
 8 sc, 
 9.12.2021
##JCAMPDX= 6.0         $$ Bruker NMR JCAMP-DX V2.0
##DATA TYPE= NMR SPECTRUM
##DATA CLASS= NTUPLES
##ORIGIN= UXNMR, Bruker Analytische Messtechnik GmbH
##OWNER= root
$$ XWIN-NMR		Version 3.5
$$ Thu Dec  9 11:46:28 2021 Russian Standard Time (UT+4h)  she@DPX200
##.OBSERVE FREQUENCY= 200.131346
##.OBSERVE NUCLEUS= ^1H
##.ACQUISITION MODE= SIMULTANEOUS
##.ACQUISITION SCHEME= undefined
##.AVERAGES= 8
##.DIGITISER RES= 18
##SPECTROMETER/DATA SYSTEM= spect
##.PULSE SEQUENCE= zg30
##.SOLVENT NAME= CDCl3
##.SHIFT REFERENCE= (INTERNAL, CDCl3, 0, 15.7028)
##AUDIT TRAIL= $$ (NUMBER, WHEN, WHO, WHERE, WHAT)
$$ ##TITLE= Audit trail, XWIN-NMR		Version 3.5
$$ ##JCAMPDX= 5.01
$$ ##ORIGIN= Bruker BioSpin GmbH
$$ ##OWNER= she
$$ F:/spectra/data/she/nmr/H-F/1/pdata/1/auditp.txt
$$ ##AUDIT TRAIL=  $$ (NUMBER, WHEN, WHO, WHERE, WHAT)
(   1,<2021-12-09 11:44:57.31 +0400>,<she>,<DPX200>,
      <created by zg, POWCHK disabled, PULCHK disabled
       configuration hash MD5:
       00 E9 B6 7A A2 85 ED C7 34 08 36 98 17 FE 4E 26
       data hash MD5: 16K
       60 04 1F 26 29 F6 D9 6D C7 A6 35 C0 0F 8F E6 F1>)
(   2,<2021-12-09 11:44:59.67 +0400>,<she>,<DPX200>,
      <Start of raw data processing
       efp BC_mod = 2 LB = 0.24 FT_mod = 6 PKNL = 1 PHC0 = -15513.17 PHC1 = 14.0008 SI = 16K 
       data hash MD5: 16K
       E1 88 BC 13 D3 D8 0E 16 FA 5E 7B 9A AB A1 10 77>)
(   3,<2021-12-09 11:45:19.90 +0400>,<she>,<DPX200>,
      <pk PHC0 = -4.748783 PHC1 = 7.999999 
       data hash MD5: 16K
       55 54 AF 7D 3F 0D 76 3A 60 5F F6 BD 5C 37 9C 22>)
(   4,<2021-12-09 11:45:22.79 +0400>,<she>,<DPX200>,
      <abs ABSG = 5 
       data hash MD5: 16K
       56 45 A6 A6 63 5E 49 00 48 E8 7B 54 DE B7 44 91>)
$$ ##END=
$$ 
$$ hash MD5
$$ 9C 63 27 5F 08 B2 6E C5 93 31 F2 F2 60 39 8F E9
##$RELAX= 
##$RELAX= 
##$RELAX= 
##$RELAX= 
##$RELAX= 
##$RELAX= 
$$ Bruker specific parameters
$$ --------------------------
##$DU= <F:/spectra>
##$EXPNO= 1
##$NAME= <H-F>
##$PROCNO= 1
##$TYPE= <nmr>
##$USER= <she>
##$AMP= (0..31)
100 100 100 100 100 100 100 100 100 100 100 100 100 100 100 100 100 100 
100 100 100 100 100 100 100 100 100 100 100 100 100 100 
##$AQSEQ= 0
##$AQ_mod= 1
##$AUNM= <au_zg>
##$AUTOPOS= <>
##$BF1= 200.13
##$BF2= 200.13
##$BF3= 200.13
##$BF4= 200.13
##$BF5= 200.13
##$BF6= 200.13
##$BF7= 200.13
##$BF8= 200.13
##$BYTORDA= 1
##$CFDGTYP= 0
##$CFRGTYP= 5
##$CHEMSTR= <none>
##$CNST= (0..31)
1 1 145 1 1 1 1 1 1 1 1 1 1 1 1 1 1 1 1 1 1 1 1 1 1 1 1 1 1 1 1 1 
##$CPDPRG= <>
##$CPDPRG1= <>
##$CPDPRG2= <>
##$CPDPRG3= <>
##$CPDPRG4= <mlev>
##$CPDPRG5= <mlev>
##$CPDPRG6= <mlev>
##$CPDPRG7= <mlev>
##$CPDPRG8= <mlev>
##$CPDPRGB= <>
##$CPDPRGT= <>
##$D= (0..31)
0 1.2 0 0 0 0 0 0 0 0.06 0 0.03 0 0 0 0 0.0002 0 0 0 0 0 0 0 0 0 0 0 0 
0 0 0 
##$DATE= 1639035896
##$DBL= (0..7)
120 120 120 120 120 120 120 120 
##$DBP= (0..7)
150 150 150 150 150 150 150 150 
##$DBP07= 0
##$DBPNAM0= <>
##$DBPNAM1= <>
##$DBPNAM2= <>
##$DBPNAM3= <>
##$DBPNAM4= <>
$$ [...]
##$SUBNAM2= <"">
##$SUBNAM3= <"">
##$SUBNAM4= <"">
##$SUBNAM5= <"">
##$SUBNAM6= <"">
##$SUBNAM7= <"">
##$SUBNAM8= <"">
##$SUBNAM9= <"">
##$SW= 18.0517287032376
##$SWIBOX= (0..15)
0 0 2 0 0 0 0 0 0 0 0 0 0 0 0 0 
##$SW_h= 3612.71676300578
##$TD= 16384
##$TD0= 1
##$TE= 0
##$TE2= 300
##$TE3= 300
##$TEG= 300
##$TL= (0..7)
0 120 120 120 120 120 120 120 
##$TP= (0..7)
150 150 150 150 150 150 150 150 
##$TP07= 0
##$TPNAME0= <>
##$TPNAME1= <>
##$TPNAME2= <>
##$TPNAME3= <>
##$TPNAME4= <>
##$TPNAME5= <>
##$TPNAME6= <>
##$TPNAME7= <>
##$TPOAL= (0..7)
0.5 0.5 0.5 0.5 0.5 0.5 0.5 0.5 
##$TPOFFS= (0..7)
0 0 0 0 0 0 0 0 
##$TUNHIN= 0
##$TUNHOUT= 0
##$TUNXOUT= 0
##$USERA1= <user>
##$USERA2= <user>
##$USERA3= <user>
##$USERA4= <user>
##$USERA5= <user>
##$V9= 5
##$VALIST= <valist>
##$VCLIST= <CCCCCCCCCCCCCCC>
##$VD= 0
##$VDLIST= <DDDDDDDDDDDDDDD>
##$VPLIST= <PPPPPPPPPPPPPPP>
##$VTLIST= <TTTTTTTTTTTTTTT>
##$WBST= 1024
##$WBSW= 4
##$XGAIN= (0..3)
0 0 0 0 
##$XL= 0
##$YL= 0
##$YMAX_a= 592871
##$YMIN_a= -864851
##$ZGOPTNS= <>
##$ZL1= 120
##$ZL2= 120
##$ZL3= 120
##$ZL4= 120
##$ABSF1= 16.09176
##$ABSF2= -1.960096
##$ABSG= 5
##$ABSL= 3
##$ALPHA= 0
##$AQORDER= 0
##$ASSFAC= 0
##$ASSFACI= 0
##$ASSFACX= 0
##$ASSWID= 0
##$AUNMP= <proc_1d>
##$AZFE= 0.1
##$AZFW= 0.1
##$BCFW= 0
##$BC_mod= 2
##$BYTORDP= 0
##$COROFFS= 0
##$CY= -3
##$DATMOD= 1
##$DC= 0
##$DFILT= <>
##$DTYPP= 0
##$F1P= 0
##$F2P= 0
##$FCOR= 1
##$FTSIZE= 16384
##$FT_mod= 6
##$GAMMA= 0
##$GB= 0
##$INTBC= 1
##$INTSCL= 0
##$ISEN= 128
##$LB= 0.24
##$LEV0= 0
##$LPBIN= 0
##$MAXI= 10000
##$MC2= 0
##$MEAN= 0
##$ME_mod= 0
##$MI= 1.114404
##$NCOEF= 0
##$NC_proc= -4
##$NLEV= 6
##$NOISF1= 3.799351
##$NOISF2= 2.8
##$NSP= 0
##$NTH_PI= 0
##$NZP= 0
##$OFFSET= 15.70282
##$PC= 1
##$PHC0= -15517.92
##$PHC1= 22.0008
##$PH_mod= 1
##$PKNL= yes
##$PPARMOD= 0
##$PSCAL= 0
##$PSIGN= 0
##$REVERSE= no
##$SF= 200.130009754313
##$SI= 16384
##$SIGF1= 3
##$SIGF2= 2
##$SINO= 5.538805
##$SIOLD= 16384
##$SREGLST= <1H.CDCl3>
##$SSB= 0
##$STSI= 16384
##$STSR= 0
##$SW_p= 3612.71676300578
##$SYMM= 0
##$S_DEV= 0
##$TDeff= 16384
##$TDoff= 0
##$TI= <>
##$TILT= no
##$TM1= 0
##$TM2= 0
##$TOPLEV= 0
##$USERP1= <user>
##$USERP2= <user>
##$USERP3= <user>
##$USERP4= <user>
##$USERP5= <user>
##$WDW= 1
##$XDIM= 16384
##$YMAX_p= 305969432
##$YMIN_p= -68067
$$ End of Bruker specific parameters
$$ ---------------------------------
##NTUPLES= NMR SPECTRUM
##VAR_NAME=  FREQUENCY,     SPECTRUM/REAL,   SPECTRUM/IMAG
##SYMBOL=    X,             R,               I
##VAR_TYPE=  INDEPENDENT,   DEPENDENT,       DEPENDENT
##VAR_FORM=  AFFN,          ASDF,            ASDF
##VAR_DIM=   16384,         16384,           16384
##UNITS=     HZ,            ARBITRARY UNITS, ARBITRARY UNITS
##FACTOR=    0.220516191357247, 1,           1
##FIRST=     3142.60548459112, 0,            0
##LAST=      -470.111278414662, 0,           0
##MIN=       -470.111278414662, -68067,      0
##MAX=       3142.60548459112, 305969432,    0
$$ Real data points
##PAGE= N=1
##DATA TABLE= (X++(R..R)), XYDATA
$$ [...]
10304 -22697 -27343 -3574 -5783 -36938 -34838 -15457 -21092 -34992 -15131 -11427 -17031 -29139 -19671
10291 -19671 -2590 -1980 -33617 -26238 -11651 -24444 -14332 -27642 -24116 -14396 4644 6322 -6677
10278 -6677 -19986 -23216 -29115 -5130 -7892 -21556 -27309 -38934 -31031 -11634 2944 -21859 -2056
10265 -2056 404 15067 20933 -2683 -20795 -21195 5920 14507 10271 4386 16670 10216 5622 -11084
10251 -11084 -20144 -4570 -12669 -25570 -34104 -45398 -21824 -17678 -24248 -21645 -89 6603 -17918
10238 -17918 -8973 -11200 1041 -9231 3718 18160 2378 3996 -16378 -12277 16351 -4196
10226 -4196 -24323 -17426 -15336 -6278 -886 -15075 -17350 5169 2113 9429 12314 -13080 -11460 -3781
10212 -3781 40 -17990 -29722 -24113 6250 1181 6749 4418 -5138 -5607 -29747 -20006 -4588 -30535
10198 -30535 -11047 -6475 -1985 -10537 -15505 2182 16971 14208 3842 -3942 5261 21459 611
10185 611 4842 14830 23532 9678 6359 3100 -9532 -11040 -10787 -23929 20130 5856 -2364 -5072
10171 -5072 -7405 -11244 15492 22207 -9687 5817 8694 888 -2304 -30473 -12841 20757 8796
10158 8796 10985 -19069 -3590 4879 7326 1337 21050 20819 16595 24422 557 397 -5631 863
10144 863 -13066 1674 24272 27812 12387 15238 53976 32775 34142 45897 24696 22442 29085
10131 29085 44541 38532 22581 19133 15395 -442 -8076 10482 15545 15563 25545 13393 -6821
10118 -6821 -22794 -5389 33444 25692 14727 9013 -2186 15000 24857 35227 29481 10799 17391
10105 17391 10531 -1540 3633 22121 31917 64024 46965 34399 16785 13593 5591 -14425 -9016
10092 -9016 -1637 36054 44147 17749 -9598 -8490 10706 28102 30220 36068 38610 42000 36192
10079 36192 12098 18625 43932 36319 33351 40371 34848 31684 42383 39702 31152 22327 11852
10066 11852 26896 37879 36552 31997 58647 67415 54481 42623 39655 16196 19454 29745 37279
10053 37279 39577 35876 48887 57650 44964 24544 16849 11595 49904 60230 66423 62321 54229
10040 54229 62573 36634 52724 44358 32579 43657 42907 57379 53178 49806 30000 47255 72024
10027 72024 79988 59774 37071 37440 56114 62154 52786 85177 105101 82704 63705 46064 40721
10014 40721 72839 75935 82826 90176 114993 110936 89892 83956 89543 91002 79215 87501 93852
10001 93852 92029 95829 96300 65456 72195 107646 108258 74092 98427 74133 91068 102174 97318
9988 97318 82658 59089 68032 64053 70425 101191 99888 85525 102308 102687 92393 103383 88459
9975 88459 105364 136064 139142 128244 168803 150601 147687 166292 160892 140514 122349 148521
9963 148521 139717 126714 127727 113562 115833 120238 100640 124183 126540 141671 139636 148352 121095
9950 121095 114906 121327 132719 156267 185804 169513 158940 184986 181666 196600 206156 199795 197372
9937 197372 199881 181844 180093 222132 193143 169882 147591 163719 157813 145021 133434 131680
9925 131680 136442 141982 153601 122725 142671 141144 100089 93118 116437 126504 130150 113652 118437
9912 118437 106246 124146 176706 158998 144744 138322 158943 185498 189351 170623 185329 182984
9900 182984 157313 179928 174136 173366 188612 194663 185365 187443 199369 243854 260757 272402 294542
9887 294542 310847 325606 323372 373769 413971 457400 504127 548050 556163 567282 550407 491469
9875 491469 431499 381710 340286 295183 255928 236037 233614 211140 208311 197651 191412 178251
9863 178251 166266 154535 141824 172112 174539 166913 190907 161720 127132 161947 154689 171368
9851 171368 187652 171459 174480 156248 147479 137618 146617 131793 131720 137617 153066 158782 162635 167082
9837 167082 168398 163439 182117 191813 186872 155129 169787 184430 178068 183750 157109 166785 164791
9824 164791 179910 178597 174503 190695 190667 167136 168376 170236 179323 200979 215867 215543 215632 198540
9810 198540 183344 205073 210753 203857 198789 211974 212408 214205 214715 208474 207468 224576 251247 259299
9796 259299 254009 275823 287346 292402 312876 327644 336292 372513 398688 361100 340555 365843
9784 365843 386964 364300 323948 305396 330178 310346 306136 308507 310046 333780 359862 370581
9772 370581 366716 367646 357653 377327 390763 403557 336102 312887 319186 301229 275168 262930 279661
9759 279661 270041 225103 215164 228048 218666 208459 215115 210902 213004 218635 198656 201809 206042
9746 206042 227501 243636 234743 228319 214644 229962 213659 225766 237866 208825 206480 206754 207188
9733 207188 219943 222845 222351 229534 207901 188214 213728 226663 197576 193709 209480 231886 227849
9720 227849 228565 198036 191290 224622 232168 234720 262363 265351 244103 223398 230941 241520 250042
9707 250042 232861 259332 255574 269760 314791 280848 264446 298846 285754 288294 298631 326443
9695 326443 348262 336342 355413 409116 426571 425805 452103 481235 520679 574471 623759 648618
9683 648618 690375 737959 794170 796064 795937 804662 779544 740878 694703 654771 598693 550278
9671 550278 485489 444451 428680 402922 418360 398885 364222 334897 314484 317109 324122 322763
9659 322763 327028 302862 307457 310211 310357 315428 296148 282817 285908 284625 281558 277423 292592 298788
9645 298788 318057 323677 320270 330033 366577 365030 369810 363657 369461 379447 365763 332742 327852
9632 327852 320657 325708 332714 316203 295368 287876 303446 294557 316188 300015 319197 313277 312328
9619 312328 307938 277535 262048 265284 245499 260740 264579 259081 249695 255256 261634 273069 262432
9606 262432 258472 226885 235080 265033 228055 225143 227199 226613 236736 229790 243336 233725 234995
9593 234995 229540 202233 204629 217665 209389 219062 215880 180719 204179 224448 229157 241852 218919
9580 218919 204810 229483 238065 222793 223235 220812 252044 261154 218506 234175 234955 227345 203761
9567 203761 207620 225787 219072 220552 223813 224364 232667 222243 234132 248350 232541 230878 256679
9554 256679 250417 270674 255670 242916 246961 277070 269373 276133 313681 297967 312615 318701 317129
9541 317129 303751 292257 325701 327857 323780 324834 332496 340497 336380 342674 345250 365912 383654
9528 383654 401028 383721 382592 392489 392903 378876 365313 380526 329071 303335 324379 316626 300954
9515 300954 294541 294998 301538 294660 308282 321656 285618 269878 315328 342659 315010 291344 290789
9502 290789 306821 314957 337949 326144 337062 355199 334948 329372 298015 317939 326642 324220
9490 324220 316536 324336 335805 332407 333747 338911 338268 354703 346544 317530 329342 308774 327588
9477 327588 341973 344818 354307 342459 360083 381327 393196 395074 375473 364230 362401 388355
9465 388355 397493 383553 397559 404782 440669 459948 426080 418501 445375 470761 468823 457321
9453 457321 464929 479681 469028 478154 488623 506623 536287 528168 522196 555772 572784 613527
9441 613527 634604 658218 678969 696406 722688 753870 792584 859451 907869 968930 1036563 1119630
9429 1119630 1200663 1292927 1404744 1527744 1629882 1664997 1628255 1498817 1392420 1271114
9419 1271114 1134870 1040647 974361 920030 868035 842736 813680 788930 796500 782903 745403
9408 745403 723457 673946 678175 683324 656417 635890 658208 678008 700832 689694 653358 664104
9396 664104 686909 706865 698760 706217 692178 674384 671461 658060 651827 650619 664403 689032 694776
9383 694776 697770 716525 730884 722082 737300 780949 838133 866209 879075 921646 940867 977536
9371 977536 983193 984577 996058 978178 970370 952908 938444 870814 827518 785578 709947 660576
9359 660576 627646 611003 598442 544293 542779 529471 528711 528302 508629 518199 500445 467716 474195
9346 474195 462727 455401 476485 471194 446623 463516 452522 435192 447797 434974 435771 435893 453514
9333 453514 445486 430619 450102 459354 450814 439480 438900 433550 448379 438923 455279 478423 509714
9320 509714 530470 533768 545693 566675 582545 586085 579440 597447 572101 568228 532347 501481
9308 501481 479317 475975 477815 452145 465281 477976 454670 464147 464456 444675 470293 476271 457793
9295 457793 461100 478495 445251 453709 457237 457947 447087 430838 426282 444225 436642 420546 384984
9282 384984 390848 394292 410373 413600 399659 421308 413599 417428 425504 451327 452927 444327 465103
9269 465103 463354 452872 436252 430141 438622 469425 455146 442819 426404 413154 435547 467509
9257 467509 476973 503208 513016 507534 544861 571183 557439 565878 569769 537078 509905 492796 463636
9244 463636 454587 448145 445192 459878 453012 440984 420336 431699 435713 442304 424230 415189 414426
9231 414426 413864 424936 427425 409963 394758 393950 389560 401911 395935 419814 415436 391978 390483
9218 390483 406301 392921 395413 411078 409043 419301 437833 411504 403993 403274 393246 387127 414132
9205 414132 419581 432170 406876 403567 432251 430564 421938 404030 430468 461386 488258 475572
9193 475572 480290 481909 494550 548714 569342 590369 572568 553070 506629 455377 434289 434707
9181 434707 452954 448927 435055 404534 417752 423325 422726 433815 463857 447058 446231 441221 445175
9168 445175 442403 442997 450640 423801 408119 406867 403149 396667 421407 445621 433933 428657 403279
9155 403279 420285 427593 428411 444844 460640 443982 438587 441261 451164 433380 429219 451135 445759
9142 445759 446448 467594 464456 446675 442981 457848 466514 448009 444744 444072 449256 474447 493123
9129 493123 511814 525497 531650 520807 511351 514212 518549 533281 509464 513916 492068 499154 520011
9116 520011 497112 483231 497615 509207 506398 519539 524838 515241 517005 515759 521348 531986 540829
9103 540829 541045 539799 533015 523162 540785 556205 572936 563261 570570 567798 554829 580060 601872
9090 601872 600213 608637 604511 602893 591666 611298 589381 571987 576561 593196 615004 616502 608914
9077 608914 615893 612448 632171 654178 656490 647722 644756 652105 634251 623255 615850 604050 593886
9064 593886 609717 595524 610922 608841 622279 614892 620271 621971 621811 654915 661653 649021 636518
9051 636518 625239 624141 630374 645748 653596 669000 667637 661833 696403 723961 726272 727726 714637
9038 714637 715605 738666 744680 754001 793159 798956 796495 798706 814399 815477 807095 787379 772905
9025 772905 769203 784015 816919 814390 812711 817405 827107 842896 860098 865567 877904 900117 879393
9012 879393 917560 942134 975743 1003227 1039009 1051468 1076585 1105981 1100587 1084775 1105091 1113324
9000 1113324 1125838 1165631 1182830 1215986 1265984 1328690 1390654 1480528 1566429 1635919 1670173
8989 1670173 1653119 1614723 1544417 1447627 1406727 1347994 1341674 1327607 1318346 1313675 1335332 1345090
8977 1345090 1333216 1332625 1325631 1326646 1356739 1378272 1364282 1374436 1380953 1423248 1456893 1465773 1495154
8964 1495154 1544337 1576185 1575094 1586232 1652471 1695465 1726883 1783116 1839774 1911327 2006296 2105517
8952 2105517 2193710 2294871 2356954 2383462 2331538 2254249 2197240 2142948 2120705 2094529 2069319
8941 2069319 2041500 2006277 2022059 2002571 1981517 1982334 1953351 1930437 1901210 1842387 1831691 1798121
8929 1798121 1791454 1788674 1772776 1768962 1771571 1772037 1791684 1804680 1811726 1840588 1862403 1882604 1889859
8916 1889859 1889997 1910848 1957356 2015051 2028638 2046372 2088489 2125779 2166416 2165483 2209838 2244262
8904 2244262 2263636 2291626 2302574 2327327 2349364 2341712 2331121 2315710 2288878 2250596 2193977 2156595
8892 2156595 2117269 2080765 2055690 2007454 1951398 1930264 1900789 1880586 1866407 1819233 1770314
8881 1770314 1764368 1751112 1744559 1734117 1721517 1718206 1724733 1734585 1749472 1767667 1750890 1735737
8869 1735737 1750327 1757636 1753613 1783317 1782292 1792472 1821719 1849337 1859070 1906485 1939265 1961062
8857 1961062 1974153 1952899 1941627 1958954 1926645 1867177 1846145 1832152 1815015 1785324 1780042 1734455
8845 1734455 1691947 1655520 1622463 1611975 1610514 1595570 1572992 1538488 1526154 1548176 1537705 1541722
8833 1541722 1547961 1546496 1539970 1530862 1494026 1498408 1502720 1521765 1544830 1528949 1505669 1502504 1502599
8820 1502599 1494652 1509475 1551044 1529569 1548547 1549394 1523690 1538616 1536464 1543844 1530990 1550933
8808 1550933 1571440 1579733 1573134 1581528 1583157 1625509 1666862 1671680 1687553 1706445 1752243 1784111
8796 1784111 1808540 1802906 1822900 1848772 1895663 1922669 1947342 1981645 2017615 2015797 2026937 2044917
8784 2044917 2066876 2059986 2073975 2086105 2086666 2110269 2147272 2179981 2187028 2220750 2268176 2296031
8772 2296031 2303545 2354018 2388179 2434533 2492415 2517408 2538768 2581155 2639688 2712231 2788173 2830122
8760 2830122 2857878 2909605 2962748 2987000 3050733 3112456 3191883 3237616 3308853 3395336 3499562
8749 3499562 3610242 3682604 3794441 3903053 4030358 4162217 4286438 4445761 4609380 4759438
8739 4759438 4931202 5129580 5367166 5617358 5852340 6115657 6459904 6839614 7288481 7844144
8729 7844144 8477067 9157324 9972648 10911507 12050028 13420890 15045788 17060706 19502944
8720 19502944 22413365 26002824 30159408 34817774 38929295 40684391 37282689 31406719
8712 31406719 25992827 21305535 17933623 15416889 13524841 11946648 10674865 9632545
8704 9632545 8799175 8107810 7564745 7094210 6737009 6417356 6132652 5856743 5643900 5371750
8694 5371750 5157234 5005524 4879362 4737287 4645327 4551552 4453164 4343290 4279386 4205912
8684 4205912 4137866 4069785 4005945 3939769 3875774 3800029 3747887 3656283 3597398 3529120 3479098
8673 3479098 3428306 3394373 3388518 3385040 3418579 3449744 3463201 3488760 3490282 3475547 3451967 3413593
8661 3413593 3373332 3326075 3306178 3278015 3274103 3262577 3271740 3304071 3289266 3248496 3217586 3186464
8649 3186464 3109930 3032590 2944234 2894629 2839245 2779788 2731658 2703060 2651861 2646966 2585188 2545759
8637 2545759 2518198 2483226 2445086 2405872 2379948 2344683 2327042 2338943 2319214 2306032 2330043
8626 2330043 2311023 2328882 2313347 2288931 2251332 2254388 2233109 2242383 2226971 2239099 2213245 2190403
8614 2190403 2182573 2166810 2182250 2149179 2140888 2147483 2131352 2115253 2090098 2114516 2092848 2097158
8602 2097158 2118745 2128207 2134706 2152602 2140161 2124183 2115955 2118323 2126308 2137120 2163826 2160340 2174308
8589 2174308 2208993 2205435 2202194 2237462 2295931 2291191 2257689 2288402 2306029 2299989 2301392 2337819
8577 2337819 2359518 2376061 2383121 2413665 2404963 2390711 2392682 2421149 2442102 2447301 2423205 2437960
8565 2437960 2440340 2432984 2426497 2426680 2462612 2482142 2465810 2464374 2486003 2488105 2533912 2545072 2554351
8552 2554351 2571526 2556890 2546463 2542876 2487413 2487340 2499042 2494924 2474272 2497481 2522169 2544680
8540 2544680 2568651 2615446 2633446 2650210 2661707 2650931 2629441 2604522 2610471 2618042 2607215 2576899
8528 2576899 2571627 2574007 2594429 2594264 2601731 2596317 2593674 2586864 2619669 2632433 2635398 2640755 2638370 2640835
8514 2640835 2618353 2658670 2692895 2687622 2705009 2712710 2716963 2741159 2756082 2770046 2788911 2809439
8502 2809439 2826488 2841448 2838945 2871126 2891837 2922378 2938791 2914953 2892139 2880945 2861977 2854513
8490 2854513 2874865 2869323 2842177 2787915 2793284 2817053 2811049 2815724 2824107 2817846 2830448 2818226 2826951
8477 2826951 2851531 2887369 2887501 2885578 2901839 2916865 2906629 2905277 2910470 2916474 2925583 2941858 2957002
8464 2957002 2949169 2952037 2992564 3005543 2997122 2974052 2954504 2970336 2959337 2966311 2968822 3010797
8452 3010797 3033782 3028938 3048149 3079465 3121933 3146836 3148573 3123899 3125385 3146326 3160569 3166376
8440 3166376 3188114 3234497 3269216 3317747 3316072 3311494 3382817 3427059 3480252 3529525 3562232 3592495
8428 3592495 3623102 3680051 3738901 3765239 3799961 3835605 3883659 3938377 3986066 4031010 4104338
8417 4104338 4187412 4259578 4348121 4410838 4462284 4548581 4655262 4748271 4870173 4965190 5078385
8406 5078385 5177044 5272457 5384130 5501411 5590186 5713965 5828349 5931649 6071659 6154177
8396 6154177 6205321 6268394 6320645 6382171 6465176 6519167 6648970 6748676 6848332 6992910 7139175
8385 7139175 7332255 7535278 7711723 7931887 8181534 8414528 8690099 8942688 9191908 9483139
8375 9483139 9797523 10157797 10527704 10908716 11385413 11875424 12439300 13096235 13856563 14801516
8365 14801516 15929783 17208068 18654598 20191151 21577037 22610046 23069916 22813883
8357 22813883 21947862 20592790 19039003 17519842 16171409 15079712 14199654 13494661 12972640
8348 12972640 12600919 12319960 12140399 12068191 12070445 12106036 12206935 12361574 12568566 12815950
8338 12815950 13077298 13356322 13657049 13995874 14425869 14847919 15314572 15864195 16463744
8329 16463744 17152565 17977145 18969964 20169201 21574784 23172884 24844603 26364524 27414661
8320 27414661 27721045 27200475 25847105 23797511 21491308 19304831 17315299 15692245
8312 15692245 14358482 13281379 12376845 11585578 10948315 10445456 10012847 9633452 9360346
8303 9360346 9090437 8877780 8649262 8442024 8246247 8026047 7782973 7567271 7362310 7186495
8293 7186495 7004380 6810000 6655530 6518642 6387857 6254060 6163237 6025976 5890040 5768779
8283 5768779 5647390 5560353 5504094 5419536 5321355 5247891 5184324 5131066 5097278 5060863 5021424
8272 5021424 4980347 4952285 4929490 4883036 4850687 4829608 4809564 4778745 4723390 4714684 4677585 4648808
8260 4648808 4616568 4589045 4553894 4560565 4551322 4515297 4509976 4485582 4473109 4446877 4449418 4428529
8248 4428529 4405459 4415140 4429165 4423501 4425927 4424767 4446702 4452192 4461990 4475641 4523068 4529165 4520117
8235 4520117 4493441 4478481 4456993 4461688 4469573 4489947 4524146 4549693 4604795 4617106 4652300 4654579
8223 4654579 4660368 4713214 4748465 4749948 4773527 4811878 4848604 4859159 4933156 4951598 4999010 5042054
8211 5042054 5042057 5068993 5095425 5120875 5146775 5191930 5201149 5216896 5261252 5285025 5340001 5361893
8199 5361893 5427200 5466905 5458043 5485660 5548774 5593513 5606980 5702470 5763249 5800159 5834162 5908579
8187 5908579 5992649 6069201 6177934 6281794 6393305 6511714 6622837 6756699 6882248 7042633
8177 7042633 7175652 7351150 7525782 7742199 7922522 8101631 8282486 8416398 8565113 8727535
8167 8727535 8917777 9097392 9340571 9588097 9842536 10151031 10489818 10773161 11021136 11236292
8157 11236292 11442904 11635510 11806160 12014944 12268847 12528810 12840822 13142336 13448328
8148 13448328 13749475 14005526 14186537 14286479 14343389 14376728 14408448 14457382 14545739 14667283
8138 14667283 14850020 15076103 15322537 15663508 16053746 16435823 16829248 17305073 17827764
8129 17827764 18365460 18990502 19729473 20549514 21453821 22529280 23765984 25191686 26812173
8120 26812173 28594242 30320449 31821899 32973014 33650512 33909273 34076958 34468073 35333176
8111 35333176 36732801 38661849 41069467 43786905 46538341 48843527 50124090 50181313
8103 50181313 49253565 47643111 45954755 44638646 43822565 43414461 43042713 42230454 40712981
8094 40712981 38644830 36449613 34425859 32712599 31408951 30451810 29760273 29292123 28962070
8085 28962070 28689442 28322213 27749085 26878034 25824784 24669662 23579521 22594807 21749683
8076 21749683 21089785 20538898 20113045 19806767 19576111 19414190 19308566 19235056 19242899 19322715
8066 19322715 19510977 19826033 20282572 20885187 21648369 22509012 23500115 24428033 25160543
8057 25160543 25440464 25085625 24256644 23295619 22375901 21605454 21024999 20657440 20464732
8048 20464732 20383599 20402976 20421396 20325874 20006327 19290961 18318176 17252017 16235554 15359093
8038 15359093 14580466 13923543 13323047 12786435 12351643 11956638 11552865 11241305 10945287
8029 10945287 10685753 10416688 10204187 10007593 9849974 9664009 9501606 9342470 9176066
8020 9176066 9022341 8902459 8810807 8700465 8595593 8482998 8361835 8259602 8157049 8054015
8010 8054015 7928672 7810832 7698280 7590621 7505327 7434634 7336675 7222151 7162112 7080613
8000 7080613 6997035 6926891 6878092 6820905 6761897 6670106 6588455 6521680 6448211 6391695 6306811
7989 6306811 6263597 6216801 6147946 6076241 6027921 5966264 5898302 5844500 5807183 5750256 5701500
7978 5701500 5657323 5598272 5565837 5499685 5468074 5451312 5393824 5341604 5283853 5219077 5204265
7967 5204265 5178280 5149036 5128869 5107091 5098108 5068381 5025669 5025328 4994754 4963418 4925871 4929306
7955 4929306 4932594 4912226 4882565 4871268 4861413 4817233 4775824 4750221 4760582 4737109 4722948 4745718
7943 4745718 4694677 4669662 4649207 4608270 4550843 4485745 4404781 4362707 4323744 4266402 4243162
7932 4243162 4224621 4180100 4141040 4094632 4057048 4009187 3949085 3910342 3868486 3859423 3835671 3800909
7920 3800909 3768460 3725494 3735142 3718168 3707707 3665626 3626378 3607056 3595509 3579675 3549566 3527659
7908 3527659 3522412 3490592 3455958 3436025 3407793 3390493 3370514 3336786 3301713 3282934 3262531 3218697
7896 3218697 3195638 3173791 3125818 3121379 3077136 3057871 3063287 3047611 3024276 3004187 2958961 2966413
7884 2966413 2928477 2906290 2889155 2903659 2896039 2877745 2843560 2819634 2797666 2771561 2719670 2694708
7872 2694708 2688723 2672100 2661926 2653857 2644690 2631889 2626826 2651313 2667822 2676366 2652081 2636740
7860 2636740 2650084 2667264 2681415 2668550 2650941 2612775 2599236 2595289 2548090 2519860 2516504 2502154
7848 2502154 2466983 2442815 2435469 2420719 2382443 2361277 2323565 2293638 2268096 2243085 2220801 2192786
7836 2192786 2173868 2138115 2098909 2068327 2064262 2037685 2022821 2024124 2019319 2017464 2004221 1988161
7824 1988161 1989293 1973181 1959784 1963565 1950446 1945401 1945592 1925670 1927625 1911546 1904340 1878619 1909295
7811 1909295 1890552 1857066 1864387 1900421 1874545 1877140 1858517 1847462 1829769 1820834 1784076 1781862
7799 1781862 1825514 1843364 1847430 1832220 1825603 1829827 1805139 1744134 1731166 1717696 1713377 1707186
7787 1707186 1677284 1659476 1663189 1665177 1672817 1669870 1650192 1629893 1601133 1577666 1584999 1583382 1573715
7774 1573715 1563068 1563782 1562874 1571996 1555580 1523142 1528672 1540796 1527799 1518267 1523160 1539202 1538381
7761 1538381 1552861 1583274 1575864 1552866 1579670 1584448 1592700 1585345 1588573 1589558 1590581 1589791 1553043
7748 1553043 1550512 1541066 1558747 1552677 1537391 1520833 1518529 1526134 1539709 1526341 1500767 1485907
7736 1485907 1439683 1444488 1423779 1426833 1439347 1430028 1443148 1445916 1438478 1418632 1420011 1430889 1420284
7723 1420284 1392764 1378791 1401514 1404136 1400314 1374727 1344411 1348268 1335167 1316609 1315541 1321727
7711 1321727 1316086 1273281 1260460 1266901 1252608 1237594 1240036 1217781 1205522 1206501 1194152 1181200
7699 1181200 1172730 1156706 1149394 1131649 1099330 1074673 1072494 1102942 1133438 1128079 1122070 1111614
7687 1111614 1104563 1104238 1078702 1034183 1016499 1004709 979768 988443 967015 946318 907641 904069
7675 904069 908539 889836 880645 857922 859569 851012 823063 814549 804314 759169 730523 755682 746661
7662 746661 729886 717691 719791 706423 721233 727474 696748 685279 667378 665274 642178 634983
7650 634983 657035 652685 641670 667901 681406 677075 648513 631189 628381 666292 675993 673225 697752
7637 697752 708352 710883 704556 688832 662172 642747 635600 626336 634690 639111 629583 613010 596270
7624 596270 615836 625649 592689 587204 573709 567261 591347 551546 561034 562625 531127 559356 564747
7611 564747 547450 557391 547970 552308 559290 567988 579069 576636 560077 549600 541270 520620 502380
7598 502380 488523 487204 499797 517434 518425 497131 463174 444456 465776 471476 448255 448556 438435
7585 438435 423748 440163 396114 379756 407898 428459 416366 410300 417026 401460 379833 409208
7573 409208 383408 380794 362737 339263 352504 343618 344876 347713 347014 328734 329750 310237 310077
7560 310077 301719 280301 294640 296084 286900 311982 309770 315073 296002 273655 280057 289579 278405
7547 278405 260588 244728 255681 248576 250256 252353 242558 243392 278331 279649 283070 263890 247793
7534 247793 245506 233496 244192 232298 221066 221561 222304 223864 211262 201496 234845 249168 215867
7521 215867 212260 206270 204284 221697 223824 227089 211964 209516 212555 204324 205563 202774 195116 189671
7507 189671 205326 197028 181716 181293 189170 206896 180583 200875 197654 187739 191333 197023 198007 186220
7493 186220 183326 204235 194508 197036 197962 199942 188809 193319 212602 214437 207132 195606 196637 195600
7479 195600 199908 181206 193851 185782 185815 174001 183400 187326 162060 152034 167259 168626 153286
7466 153286 147989 159269 166982 152644 160260 143596 152881 173600 146751 153348 164728 169455 174298
7453 174298 165968 159512 156824 154615 151262 170587 190858 164814 162350 158511 140327 137489 142820
7440 142820 132038 120394 153358 172199 167193 137687 126263 129388 137408 141547 167244 165451 144690
7427 144690 163749 176131 163089 136750 115081 108295 117048 119619 134597 127606 133468 129644 116410
7414 116410 135807 132849 139730 123945 106707 91307 114541 110196 77875 92754 115448 127666
7402 127666 108413 111585 83887 83144 90094 84099 105883 65265 65457 87537 99664 97740 101492
7389 101492 87005 78533 101572 103025 110096 82726 74792 81834 79518 86959 96505 88653 87243 90589
7375 90589 69025 73309 72375 97202 99718 112434 95137 54031 71474 79336 78437 61554 60219
7362 60219 73435 98912 106360 94090 95059 96645 80916 77979 84731 84485 53405 65771 73037 69314
7348 69314 66373 68394 80060 68814 85834 78765 52481 47887 60819 78670 65495 73473 75167
7335 75167 78806 87677 109621 97109 61427 60761 74146 59409 43593 40207 48663 60945 74371
7322 74371 76797 77564 85529 72177 98120 84161 92268 103606 49842 50131 97393 111545 72152
7309 72152 70929 95644 71581 79007 82144 81162 76813 59919 71533 67196 71834 107990 93756
7296 93756 73110 67921 73874 61685 44056 70324 79096 55411 69079 68428 47802 93967 95348
7283 95348 80087 88501 79475 75152 79834 67764 62612 55120 62656 87190 64793 71405 50934
7270 50934 48030 44642 42480 59961 60933 66261 45200 61012 71416 68602 66344 87619 82909 83276
7256 83276 61637 47015 43403 45830 66805 50595 41624 36451 60070 49250 43960 43596 38644
7243 38644 34292 70476 60829 61394 71433 81177 64182 50190 52162 50243 55383 39901 67891
7230 67891 65474 59083 58152 41667 39378 55969 63735 51502 46089 53211 57052 59604 32938 38547
7216 38547 49088 61223 53375 67423 68080 37287 24807 32389 51753 44378 51860 47106 48653
7203 48653 56488 57513 64317 44779 20577 34896 27840 23039 32873 49292 57400 36885 45797
7190 45797 26872 31413 44384 68906 46233 50313 44309 19574 41152 41833 25805 29586 48436
7177 48436 35030 18036 5641 21397 21084 9032 32328 30184 13658 7020 -2052 114 -10750
7164 -10750 10210 11283 19452 -6392 -8546 -4987 2500 16905 30049 55331 34509 -3629 16335
7151 16335 3068 -1211 13086 -4358 21696 11361 -7173 -2982 597 373 3549 -13413 -26596
7138 -26596 -25701 6530 9301 -2059 1998 15855 5514 5527 2850 -3870 4610 -3387 -9757 -18242
7124 -18242 18966 32582 16530 10360 16715 25865 15751 22686 23383 -3145 12528 21686 9914
7111 9914 12338 12154 18822 14650 33418 17783 3889 683 18682 13797 49907 56561 32347 30356
7097 30356 -5615 -13023 2686 12335 2001 9168 5859 4735 990 2828 8925 -5249 -18051
7084 -18051 -19396 -26522 -23309 -17630 8722 2094 2382 -2143 352 19934 11175 23389 16948 -8818
7070 -8818 14042 9093 443 4646 -10741 11867 18619 8500 17036 -2524 -10507 10902 -6175
7057 -6175 -30733 -36753 -32084 -4313 1395 -20530 -41145 -43479 -15571 -11570 -16837 -12568 9608
7044 9608 16829 10592 -7782 -12546 -14415 -968 -13291 -15007 13150 5574 25476 35546 34915 37579
7030 37579 32031 17032 22901 45315 38700 33466 54516 45968 16691 8701 15576 17444 19448 25958
7016 25958 56819 77162 81830 79113 79534 73044 97222 86793 84719 107752 119971 106079 105855
7003 105855 107734 128416 149322 154865 167938 168090 180201 182579 201741 228629 219842 217047 200805
6990 200805 194016 197142 171537 137644 100489 119455 125910 79015 66958 76389 41874 72466
6978 72466 115689 116626 99569 85379 93934 104055 100272 73976 113369 120844 93634 100019 108482
6965 108482 95673 79057 73101 101969 110731 89726 132408 130812 124264 103263 101438 92098 73588
6952 73588 97145 140434 126977 129313 110532 106583 103612 104606 94004 74303 92078 99862 96115
6939 96115 110447 88113 88987 97486 102536 77461 50777 48881 71168 85742 95314 113690 86119
6926 86119 95195 96340 89620 81926 85273 88978 110214 106373 109682 118248 138482 153319 160558 160553 146440
6911 146440 190528 193119 208081 243050 290169 345910 340612 329327 279172 211226 159351 158348
6899 158348 156169 137191 115965 132834 129083 105746 96744 109351 102832 73183 75026 87259 93804
6886 93804 95235 70287 66549 86645 92221 72683 84931 60524 56241 67208 82108 77228 49661
6873 49661 62456 95539 70190 89823 90439 64726 67010 84050 67704 57528 56067 47432 53602
6860 53602 52629 67695 73530 53740 15844 49223 33881 34330 51936 36674 24500 16661 10988
6847 10988 53953 44524 34858 28304 23018 21196 26709 10300 10215 2856 -8678 19154 5956 -1387
6833 -1387 -4013 -9090 2382 14547 19742 -4154 -21550 23512 46101 28484 42847 24553 38165
6820 38165 37934 29790 19811 21435 13034 47872 52290 27772 61078 68663 50568 40742 42004 32565
6806 32565 25650 38449 62867 40947 27227 35954 39364 22928 15932 25101 32541 17902 35289
6793 35289 45373 41597 35395 32307 13206 38412 46736 60183 79165 67801 58001 87452 48840
6780 48840 49705 70312 60012 78594 67911 39310 58039 59683 68233 73665 34735 40563 36517
6767 36517 53652 48259 58859 60535 29154 5792 10169 4118 -5076 7063 28306 40112 12261
6754 12261 15016 31835 19924 -3587 12844 16136 14933 36283 23659 37702 4228 -6584
6742 -6584 6934 10092 17849 24611 28045 33886 46525 23826 14995 5944 21500 20013 15068 9218
6728 9218 8276 21534 19556 26639 18452 8607 5692 -15122 -10546 2690 -699 -28172 -22655 2641
6714 2641 5528 30800 37469 38138 52403 48958 38065 -937 -8970 14221 25327 4376 23589
6701 23589 58112 23745 9647 24149 40405 45366 32786 19701 34009 49284 68267 54580
6689 54580 47056 51679 78463 79529 84562 77313 77106 77861 89587 86671 103205 119822 143898 159665
6675 159665 185068 187001 172730 174190 205644 213333 211613 201424 223309 241818 253299 269571
6663 269571 249717 240261 251617 261447 280544 275836 287597 282240 261163 254869 243910 237930 201758
6650 201758 183370 170525 173221 149953 119517 101327 138043 144657 121395 114867 121198 93795
6638 93795 111185 98022 104374 88332 94612 91783 83632 92794 80576 52449 58746 73890 77053
6625 77053 76510 92779 94191 79674 108458 116788 91862 105549 87222 77154 106771 149354 171210
6612 171210 140942 117991 146942 125052 100720 99335 89024 81709 84509 93346 86950 88963 79337
6599 79337 63529 40574 39924 43888 46972 60447 67281 87465 66990 33311 26879 29248 63793
6586 63793 73604 67077 51469 82204 68414 44293 40830 51720 47201 53775 67643 70667 32219
6573 32219 35185 51264 60228 62471 46202 39022 46212 59878 45922 34072 39023 46694 59633
6560 59633 69252 68272 43614 46895 49498 55390 74073 53518 58368 52499 46655 56866 85385 79877
6546 79877 73919 71006 85180 75117 54397 59225 59591 72219 61554 67117 79651 91225 82861
6533 82861 82829 78388 61035 59200 92744 88454 80732 92804 77558 84782 82762 76169 60178 76581
6519 76581 74930 72380 75408 88691 65616 66858 84545 66933 64184 74465 105004 103491 107258
6506 107258 104054 75377 64338 62051 73536 85710 91579 88481 95106 89532 86118 92184 86336
6493 86336 97796 115416 137444 129039 115454 84630 77311 88655 109812 111978 110913 102396 106740
6480 106740 116623 108693 102701 131541 127134 106681 117252 122477 98608 89317 90448 91017 86046 76100
6466 76100 102357 124609 108043 111345 102554 93408 110889 106148 111722 120867 124461 137763 155172
6453 155172 165298 146652 149735 153843 147466 146993 145947 152013 157834 147263 150965 166939 136662
6440 136662 147781 152997 161966 164272 181542 183266 168786 189886 188412 202333 247697 225249 191205
6427 191205 209084 218451 230065 219535 210208 205896 204189 217528 228208 234487 230177 239243 252813
6414 252813 243633 243563 261923 260508 256590 258710 258280 252665 257967 268176 267067 259393 268563 266211 276178
6399 276178 282153 280980 292571 283482 282746 301838 287336 290747 326292 326098 343619 392925 397497
6386 397497 393978 397085 416494 443182 469539 443452 455868 494744 484749 450413 437525 437619 448142
6373 448142 430613 399143 377085 391491 393200 371421 387921 371519 352908 381240 377914 371101
6361 371101 348237 341254 357971 353462 371796 353595 336487 347543 364548 368264 380712 395842
6349 395842 399579 392952 403843 395185 395517 415770 448931 463406 477205 489083 489288 498944 494546
6336 494546 489630 510186 499422 496639 456735 428819 382756 358282 366260 347819 343976 336299 329195
6323 329195 331124 328743 348490 341800 313979 312818 307770 334114 319202 303960 296676 305403 296116
6310 296116 325483 314428 306182 299305 270766 289120 294847 305564 297218 295486 311094 302750 309941
6297 309941 312517 325745 332868 326679 368384 369316 365150 369634 372098 384961 379066 339207 354004
6284 354004 353991 346806 347027 336606 349208 361624 336066 320654 322623 308874 292342 290175 299341
6271 299341 310807 322739 306113 298118 283765 290654 300792 316855 303580 305172 323408 317552
6259 317552 290687 287601 300424 308984 316689 307351 315628 314896 301404 293630 296064 300049 305106 309043
6245 309043 306578 281560 315141 306359 299715 302747 317388 310258 299276 326210 315516 335458 358505
6232 358505 362599 368935 362957 401656 383100 389287 378401 383748 390047 385599 421973 420273 406748
6219 406748 425740 438173 449197 451700 437194 459439 468037 467041 465370 464420 451004 440099 448228
6206 448228 460374 462484 451979 435103 453289 448230 446788 439682 429527 397630 382426 366042
6194 366042 372524 368655 374438 395250 371011 362252 356554 349572 377548 379934 364923 361684 352082
6181 352082 358132 385516 374518 362129 361654 344355 333531 357754 340085 341357 353342 336818
6169 336818 344584 341353 331014 346648 334774 329439 321790 328170 343943 355524 351623 336528 315329
6156 315329 319115 344025 335629 332238 330401 343331 341544 317787 325499 330454 315165 303317 306556
6143 306556 306625 322630 310137 318813 339747 338718 332477 323800 325850 342917 314886 312219 341035
6130 341035 346420 340049 327982 342802 333043 332720 328941 339147 343598 371833 356030 341542 355024
6117 355024 338972 343216 359467 348140 320650 317661 323096 325965 331125 316039 301648 324844 328554
6104 328554 281168 275914 298659 308467 303295 307630 326473 318714 330434 346927 354704 344340 362616
6091 362616 357781 340498 346363 341480 364056 344379 342214 340052 345325 332841 322309 329935 358865
6078 358865 360766 364712 366568 362418 362167 336732 328351 340826 347992 344260 361767 379999 381054 378487
6064 378487 354752 367579 359716 342782 360505 385934 389402 372726 385121 404308 407546 406198
6052 406198 401655 399041 382634 388612 395336 414749 419904 401792 414993 423878 427035 437515 439195
6039 439195 409386 398330 443537 430871 412560 434610 424256 445351 466763 456084 458485 467009
6027 467009 456809 444021 472343 461206 445317 454006 483321 486628 474892 499464 496890 497661 497443
6014 497443 489848 483301 492897 492970 492603 497732 510742 543814 542351 522263 513870 537716 542139 531095
6000 531095 535773 545278 532185 551343 565401 569978 571314 544694 572261 577769 577916 562370 572249
5987 572249 598913 591671 586824 594080 583540 612455 621454 617683 624458 628312 634942 663307 662692 672557
5973 672557 655775 650324 693293 681480 648437 672611 684392 708860 730112 731880 729173 732411
5961 732411 724370 738299 728487 718645 725059 725198 754760 771671 767394 749540 768132 777662 773277
5948 773277 793630 800112 820115 789773 807022 832239 829522 851177 861824 877184 869770 892259
5936 892259 899450 900742 926531 940859 939381 942513 939220 938486 949420 968787 996863 1022794 1042533
5923 1042533 1058618 1090043 1109047 1135383 1159267 1178029 1198014 1232045 1262310 1245879 1214285
5912 1214285 1236763 1252376 1278978 1316131 1319955 1332922 1345773 1379598 1384487 1396321 1406281 1430620
5900 1430620 1448817 1457414 1444078 1450893 1464267 1478859 1495622 1486404 1503929 1526983 1506772 1516174
5888 1516174 1513583 1516925 1549838 1570465 1589929 1617292 1634125 1649066 1652158 1674730 1695005 1703161
5876 1703161 1693807 1728137 1744100 1791331 1815180 1817383 1864595 1874646 1880616 1916040 1930836 1969336
5864 1969336 2013591 2050274 2089788 2116926 2165654 2187419 2207295 2235391 2279499 2302945 2354156
5853 2354156 2431755 2475183 2524684 2584733 2620414 2675015 2734038 2804359 2896211 2962143 3029693
5842 3029693 3125815 3207161 3330166 3483621 3631123 3822463 4041891 4274866 4511725 4777300
5832 4777300 5080960 5355354 5583922 5726056 5828443 5848434 5756382 5655476 5548044 5488222
5822 5488222 5451529 5485384 5549121 5631888 5780044 5959895 6118530 6268056 6340124 6321861 6235585
5811 6235585 6106758 5930864 5719194 5515594 5274384 5003241 4711113 4479111 4306561 4177453
5801 4177453 4046264 3937396 3882905 3850843 3793305 3735821 3728671 3753911 3728509 3705713 3695005
5790 3695005 3712212 3714287 3711244 3708120 3720362 3741379 3740358 3751741 3774812 3802517 3839648 3887695
5778 3887695 3960588 4039695 4103668 4199753 4288949 4426559 4567930 4739690 4957822 5189176
5768 5189176 5454347 5749722 6120534 6509598 6920314 7375743 7797644 8182143 8461845 8596430
5758 8596430 8591221 8468912 8290116 8120626 7962464 7831904 7802643 7851850 7949816 8112157
5748 8112157 8293629 8471922 8608738 8601056 8484403 8215942 7826660 7371396 6898932 6405522
5738 6405522 5951804 5577392 5260360 4972780 4713787 4493766 4315676 4169873 4025124 3896810
5728 3896810 3770799 3658988 3572711 3475804 3384902 3307532 3251263 3180521 3122005 3066516 3031250
5717 3031250 2972317 2916975 2914053 2899917 2816550 2790532 2791572 2764398 2747156 2700177 2684034 2647217
5705 2647217 2611070 2587110 2536481 2531168 2533350 2523096 2492726 2469597 2441853 2433102 2433380 2393425
5693 2393425 2367073 2378599 2400261 2382067 2387651 2358230 2348563 2334990 2346741 2346800 2353349 2339486 2330778
5680 2330778 2328476 2312314 2285998 2288709 2313201 2336111 2320567 2307793 2298437 2290620 2264012 2244739
5668 2244739 2253227 2232360 2236563 2226134 2226484 2223483 2248338 2255787 2241318 2259297 2249464 2251427 2254161
5655 2254161 2243773 2285944 2321307 2331713 2345736 2367900 2388695 2411675 2396440 2430848 2472155
5644 2472155 2481162 2501343 2497017 2524370 2520054 2532381 2548987 2556265 2589215 2600755 2629372 2648834
5632 2648834 2677362 2710916 2716134 2738395 2774167 2815700 2852034 2866574 2891538 2921365 2977066 3032919
5620 3032919 3100687 3180317 3252354 3331162 3411770 3483534 3539756 3624909 3723714 3815118 3921436
5609 3921436 4064447 4184521 4331857 4492654 4675650 4918477 5137631 5387909 5670974 5964127
5599 5964127 6330248 6729808 7170221 7612146 8030862 8393750 8661131 8759825 8703261 8557077
5589 8557077 8291341 8015808 7755554 7538683 7392759 7304226 7236512 7263485 7370730 7512067
5579 7512067 7687609 7953111 8251606 8560606 8886259 9169819 9378612 9401832 9281022 8990144
5569 8990144 8591472 8126404 7653407 7230314 6863311 6542071 6269656 6013940 5791795 5601396
5559 5601396 5454736 5356940 5285443 5236902 5268275 5313102 5390753 5456424 5476391 5438326 5265361
5548 5265361 5063354 4907837 4786461 4702842 4648683 4591984 4564459 4516055 4493779 4521932 4554551
5537 4554551 4599278 4686039 4780364 4869860 4941903 5059458 5198908 5336707 5486887 5682141
5527 5682141 5902933 6124171 6274004 6414373 6467999 6409815 6295923 6109509 5902867 5718206
5517 5718206 5578194 5452360 5397383 5373202 5369286 5394511 5439671 5534316 5664859 5870693 6077854
5506 6077854 6251125 6412014 6523555 6523382 6404317 6218680 5963940 5652125 5330791 5022610
5496 5022610 4778890 4574334 4378555 4224448 4078602 3932193 3839481 3741531 3645855 3547476
5486 3547476 3485017 3421809 3362814 3309504 3268101 3228304 3209877 3212541 3204205 3193154 3189048 3194858
5474 3194858 3199757 3147165 3092088 3049223 2973790 2920752 2842302 2803704 2765155 2725793 2667637 2615692
5462 2615692 2601260 2598197 2593770 2573366 2561443 2575776 2583250 2586499 2561395 2553361 2542182 2518830
5450 2518830 2515558 2512147 2501223 2510751 2517822 2538583 2576170 2598367 2623045 2646698 2645694 2633487
5438 2633487 2615795 2631757 2632177 2606145 2594033 2607303 2612579 2643664 2627705 2588463 2547389 2479521
5426 2479521 2430037 2364283 2334170 2289020 2274580 2268288 2252507 2240346 2218401 2213030 2197628 2175057
5414 2175057 2174875 2170794 2170985 2203902 2214943 2227132 2189157 2156074 2168352 2156323 2122956 2096466
5402 2096466 2057293 2015391 1999362 1986223 1974407 1951432 1961628 1959137 1958718 1948422 1916355 1906975
5390 1906975 1881300 1892237 1916968 1906031 1897055 1896476 1897058 1879745 1880111 1896302 1907220 1910743 1899563
5377 1899563 1894083 1881984 1890809 1882948 1882059 1858266 1846255 1830554 1823154 1831786 1830450 1839275 1846927
5364 1846927 1860622 1851590 1847107 1859216 1854986 1845106 1850233 1847136 1854219 1863111 1883731 1846744 1844902
5351 1844902 1862042 1860685 1858987 1847835 1888864 1886316 1871263 1879181 1881407 1882333 1900267 1894931 1876924
5338 1876924 1849521 1829731 1866991 1841138 1824477 1857540 1865658 1886330 1900856 1905993 1896830 1879251
5326 1879251 1889104 1886890 1870227 1863600 1845182 1869241 1880689 1843111 1849202 1834830 1804489 1787487
5314 1787487 1789580 1810691 1790997 1773079 1754126 1731269 1748031 1753031 1723215 1708850 1708505 1733659
5302 1733659 1732960 1713408 1725427 1744153 1763098 1749706 1739768 1716715 1736894 1742406 1752637 1746587
5290 1746587 1752710 1743112 1732809 1737701 1726676 1727490 1718215 1706620 1671957 1671750 1692860 1693240 1708401
5277 1708401 1696403 1702072 1703127 1697685 1716637 1711745 1728527 1743255 1768675 1766035 1784351 1794037 1785799
5264 1785799 1814342 1834983 1866750 1876030 1896625 1902763 1932643 1969926 1971476 1994310 2001803 1997346
5252 1997346 2014726 2050989 2060986 2091903 2089950 2114602 2148862 2161188 2151457 2115819 2095271 2099171
5240 2099171 2131666 2162509 2199961 2233979 2287535 2357709 2425046 2501992 2571309 2585304 2579168 2521926
5228 2521926 2463031 2392830 2320729 2253356 2195617 2174434 2139884 2105658 2079777 2077174 2069467 2088237
5216 2088237 2116818 2110517 2121661 2125969 2152808 2194532 2223024 2254531 2295288 2336131 2404522 2475670
5204 2475670 2548800 2609054 2646863 2721044 2771139 2819713 2832300 2829696 2802639 2749338 2704556 2683395
5192 2683395 2632536 2595886 2577689 2569051 2570553 2574821 2583219 2601044 2594475 2594520 2594480 2600751 2607125 2596329
5178 2596329 2609489 2617486 2609684 2587320 2572811 2554781 2560014 2558541 2536123 2533345 2544184 2527530
5166 2527530 2521457 2553714 2571570 2574751 2570184 2555619 2568274 2574532 2589096 2596032 2611835 2607586 2621797
5153 2621797 2664384 2655905 2666149 2690017 2696317 2669630 2665235 2683713 2678244 2660259 2657805 2672351
5141 2672351 2676779 2736551 2772851 2774940 2786022 2787288 2822260 2862600 2894157 2917447 2960638 2996252
5129 2996252 3028864 3046650 3079782 3085742 3111551 3162650 3209023 3248349 3299461 3342668 3414853 3493365
5117 3493365 3582861 3698086 3803168 3894945 4023487 4147708 4302862 4476890 4645336 4865418
5107 4865418 5072283 5306788 5494718 5679095 5866968 5990516 6153165 6328699 6511502 6733371
5097 6733371 7014289 7306530 7626701 8022509 8378248 8758920 9100512 9402724 9698359 9943414
5087 9943414 10150420 10342375 10476271 10592213 10658225 10746516 10838695 10975059 11156354 11406581
5077 11406581 11677653 11922934 12183919 12417628 12579358 12657928 12659404 12551092 12374434 12168801
5067 12168801 11950763 11757406 11555780 11357846 11166410 11032512 10991775 10988474 10971921 10937984
5057 10937984 10895609 10811494 10684210 10550179 10399215 10231720 10035145 9824639 9637342 9437548
5047 9437548 9322776 9120629 8876314 8601309 8299054 7983129 7700999 7479128 7245956 6994028
5037 6994028 6737239 6458397 6211275 5995276 5783893 5595546 5420656 5281695 5145104 5032434
5027 5032434 4916709 4850541 4770052 4715393 4622793 4564797 4518995 4506509 4500317 4456454 4437826
5016 4437826 4437872 4421765 4409585 4438351 4459364 4470039 4478873 4512160 4576201 4634919 4757443 4898618
5004 4898618 5008899 5132434 5213566 5233295 5174376 5068064 4929108 4809427 4689205 4594189
4994 4594189 4480081 4368368 4320497 4284463 4274555 4247260 4222587 4210075 4199462 4176109 4152094
4983 4152094 4116712 4105360 4101057 4094890 4102074 4109237 4112904 4085627 4062394 4035229 4023990 4011003
4971 4011003 4001854 4004474 4029506 4011485 4006356 3994896 3969279 3936122 3901694 3868791 3854341 3837648
4959 3837648 3799413 3806506 3788154 3775663 3747808 3715011 3717368 3682363 3650766 3620696 3594696 3562166
4947 3562166 3573629 3569275 3540751 3518918 3497950 3492448 3494223 3461960 3505933 3524443 3509050 3507610
4935 3507610 3509348 3515107 3514253 3518921 3527171 3530547 3569920 3613647 3627436 3643798 3702478 3728672 3762848
4922 3762848 3801696 3829078 3851341 3864630 3891814 3912884 3948602 3987700 4010466 4050048 4098012
4911 4098012 4155588 4224272 4284793 4339974 4424090 4501083 4572572 4642040 4753502 4837508 4922106
4900 4922106 5037328 5129573 5236592 5351802 5481739 5608519 5749427 5839092 5949142 6005540
4890 6005540 6069959 6070196 6079809 6116482 6166083 6205703 6256739 6280691 6322994 6375648 6441125 6461186
4878 6461186 6511248 6580148 6661520 6759342 6835033 6887130 6895107 6903875 6916627 6912934 6902067 6869232
4866 6869232 6825060 6791185 6778076 6778445 6824595 6884230 6947811 7035412 7114456 7246219 7374634
4855 7374634 7523158 7614040 7731739 7850956 7946203 8085150 8261059 8396787 8551504 8745609
4845 8745609 8912896 9118051 9228285 9347269 9448497 9535203 9626218 9736992 9867490 9999043
4835 9999043 10160454 10333432 10466857 10587773 10766697 10927728 11052407 11177034 11295956 11427184
4825 11427184 11563760 11721431 11872034 11990087 12115441 12184494 12269160 12392020 12550250 12723746
4815 12723746 12874127 13043927 13263781 13496427 13783373 14044668 14295580 14562758 14881012
4806 14881012 15195294 15505479 15902816 16328384 16773806 17315666 17928656 18608052 19345756
4797 19345756 20115581 20820706 21397793 21672055 21622110 21455772 21287066 21182391 21196483 21338623
4787 21338623 21549467 21889269 22300208 22760076 23319621 23929732 24619080 25361732 26125392
4778 26125392 26970340 27875650 28883955 29982292 31145483 32375878 33724700 35124118
4770 35124118 36544392 37974346 39384147 40776832 42221542 43825172 45571678 47446504
4762 47446504 49415243 51380437 53368007 55392674 57353596 59164274 60540149 61235324
4754 61235324 61039198 60153727 58995352 57790862 56745926 55935992 55352026 55035678 54955554
4745 54955554 55090235 55456916 56125014 57187209 58613983 60367746 62401444 64516089 66334030
4736 66334030 67348590 67444396 66948664 66182431 65296038 64564215 64107051 63986471 64235483
4727 64235483 64758039 65536470 66531390 67761727 69230043 70995817 73036892 75460694 78293115
4718 78293115 81477378 85056670 88928973 92901166 96662689 100175821 103750447 107702413
4710 107702413 112368328 117931023 124746438 133091956 143201158 155330079 169757863 186737515
4702 186737515 206644333 229548476 254700805 279731854 299406552 305969432 293810504
4695 293810504 268498707 239466979 211794942 188120888 168920658 153386950 140467914
4688 140467914 129604653 120383012 112540234 105876239 100250353 95498408 91510981 88063881
4680 88063881 85060857 82354153 79794382 77367661 75021966 72680361 70341451 68011520
4672 68011520 65783087 63667935 61704450 59888875 58201078 56611008 55114667 53667587
4664 53667587 52246434 50838137 49438588 48057194 46765962 45573205 44430914 43355193
4656 43355193 42381307 41427283 40530319 39724310 39004996 38327389 37712416 37137294 36573612
4647 36573612 36055874 35539546 34979312 34434770 33924269 33415372 32960016 32535044 32160381
4638 32160381 31775278 31421491 31072153 30734781 30454852 30168763 29904034 29671673 29437367
4629 29437367 29273201 29128445 29041453 29003819 28964457 28925960 28883269 28827001 28759050 28633696 28475952
4618 28475952 28291119 28075365 27832869 27626161 27473975 27401512 27476180 27651278 27977816 28426016
4608 28426016 29046833 29787147 30633785 31484338 32066411 32062079 31316720 30169549 29046163
4599 29046163 28057021 27293306 26777519 26506222 26376117 26380982 26453003 26436939 26226687 25728640
4589 25728640 25017986 24277903 23657766 23188824 22890302 22729796 22646875 22553253 22286788 21805183
4579 21805183 21168027 20513332 19958274 19504573 19153608 18929136 18797433 18753437 18748414 18695488
4569 18695488 18500013 18044849 17367840 16635879 15914670 15240872 14670502 14168506 13731266
4560 13731266 13339842 13003441 12710799 12426583 12152731 11950356 11706546 11480485 11262779
4551 11262779 11079728 10882000 10715585 10540784 10350397 10192458 10089585 9964803 9900660 9847785
4541 9847785 9769895 9738595 9721838 9732500 9754647 9763295 9794953 9830835 9757366 9630327 9460482
4530 9460482 9250251 9012408 8762771 8514533 8316940 8179068 8060388 7898945 7788102 7689675
4520 7689675 7574683 7441301 7333291 7253609 7165867 7089071 6971163 6896519 6836479 6805237 6776863
4509 6776863 6727337 6707486 6667643 6611576 6553760 6532519 6510157 6439995 6394132 6353301 6307111
4498 6307111 6266184 6227198 6180732 6096493 6051226 6007382 5957615 5942153 5912329 5855662 5853705 5846567
4486 5846567 5825991 5779638 5780991 5716728 5647921 5601702 5570339 5501119 5427997 5392349 5364330 5308301
4474 5308301 5238797 5202306 5187834 5169917 5116297 5090561 5065298 5030549 4971027 4967121 4960990 4947384
4462 4947384 4890685 4840735 4828889 4826742 4809417 4812268 4812008 4804209 4800276 4812068 4833833 4847120 4867266
4449 4867266 4879335 4896489 4924499 4899701 4883099 4804377 4705262 4623835 4563141 4505684 4455735
4438 4455735 4404588 4355592 4328900 4286540 4254153 4245278 4227170 4205340 4190475 4174244 4143812 4102627
4426 4102627 4074785 4044255 4059773 4039108 4033532 4021292 4020476 3993089 3969688 3948996 3912765 3899519
4414 3899519 3890095 3864350 3833827 3796781 3779805 3745522 3741716 3746131 3754096 3742835 3764642 3775389
4402 3775389 3766575 3774120 3781909 3787128 3818040 3906748 3938454 4023414 4130996 4237665 4363299 4454397
4390 4454397 4554064 4571607 4469704 4360825 4198151 4014410 3865796 3751426 3615669 3526549
4380 3526549 3449350 3385391 3348597 3323548 3301650 3280838 3252356 3226801 3232425 3215533 3193995 3176232
4368 3176232 3154434 3109010 3080352 3051770 3039457 3011669 2941597 2887887 2867504 2849087 2821740
4357 2821740 2795649 2768227 2732371 2715666 2677304 2647806 2620155 2586519 2581670 2533793 2489326 2467387
4345 2467387 2464897 2447830 2417671 2418806 2417665 2426003 2399895 2397218 2390175 2365749 2357646 2318501 2285338
4332 2285338 2283367 2279123 2261861 2277897 2263385 2274378 2260277 2238386 2209428 2189982 2196710 2192887
4320 2192887 2186495 2170656 2180361 2160743 2132472 2145806 2128934 2131123 2131120 2125630 2148756 2150973 2139003
4307 2139003 2138600 2135194 2133168 2129930 2156233 2154055 2107197 2108003 2102561 2069590 2054712 2051620 2028387
4294 2028387 2011759 2019053 2010589 1993298 1968844 1925801 1909117 1892071 1880731 1837746 1830742 1837143
4282 1837143 1820214 1817585 1791351 1774927 1771231 1740200 1740003 1721675 1731588 1723630 1678331 1672516 1678278
4269 1678278 1673553 1649166 1665647 1652365 1633797 1651102 1665258 1671427 1660856 1660365 1658103 1659806 1682480
4256 1682480 1683636 1654512 1658383 1674728 1666423 1693929 1675337 1649828 1614458 1610121 1593803 1559281
4244 1559281 1546527 1556391 1561792 1548111 1556815 1539578 1546698 1539125 1527846 1535952 1531587 1533539 1542996
4231 1542996 1537760 1527526 1517782 1518288 1533689 1555291 1521440 1509077 1516111 1505823 1513423 1513799 1513433
4218 1513433 1488214 1497914 1488403 1472366 1483993 1483885 1492914 1491356 1487650 1480388 1485179 1492311 1477281
4205 1477281 1462029 1431531 1408183 1404607 1414073 1425270 1440537 1458810 1480338 1492995 1470207 1464975
4193 1464975 1468262 1464392 1453214 1456725 1450338 1446126 1439188 1437712 1428520 1432906 1454498 1456074 1455555 1447593
4179 1447593 1484960 1515233 1518853 1527095 1551118 1554406 1588739 1649546 1671325 1713045 1723907 1733500
4167 1733500 1723113 1706745 1690571 1711625 1726711 1727812 1758342 1729706 1717399 1702930 1688375 1664979
4155 1664979 1680161 1702032 1715378 1771515 1777761 1776800 1803831 1775712 1752333 1721696 1697821 1643174
4143 1643174 1585866 1564988 1508274 1477041 1444081 1431373 1412449 1389132 1393004 1376928 1345592 1334700
4131 1334700 1311376 1299425 1310367 1309275 1282923 1281882 1284875 1308340 1305818 1310727 1306097 1287923 1240426
4118 1240426 1202932 1201980 1178623 1170654 1155357 1142222 1108396 1084375 1074800 1070024 1059173 1053477 1029486
4105 1029486 1054157 1082812 1058117 1054478 1068334 1072033 1070556 1098369 1097019 1095166 1124876 1130375 1149393
4092 1149393 1166231 1169931 1172083 1179051 1170915 1161648 1183415 1171606 1152979 1155094 1161016 1176397 1185117
4079 1185117 1177989 1240609 1256626 1287853 1292641 1211035 1159835 1078326 1021845 1010605 1012097 977760
4067 977760 941956 916595 911481 923368 914405 930345 922336 891216 883737 869338 871444 895325 910091
4054 910091 911287 927081 915104 891667 857039 858521 875270 858102 840840 813643 803375 807777
4042 807777 780373 785986 762781 753657 768862 761677 758358 743426 734007 743631 741214 732966 747970
4029 747970 758414 751449 753108 753882 749477 736069 750058 738913 738647 738020 723185 725305 729051 706134
4015 706134 712310 729597 740565 751281 729457 722842 712825 721369 732485 740134 737577 707185 715178
4002 715178 718334 705179 746504 742389 729012 737333 723668 722624 726038 724862 715314 723763 730469
3989 730469 711274 702948 700846 734375 739238 742202 735238 711132 707451 699732 707444 713752 707064 686069
3975 686069 652716 651397 654541 637515 624629 646359 686008 662903 627405 634423 655843 647212
3963 647212 631314 639924 643579 676896 658275 659824 673460 675743 672133 668295 680982 659962 635934
3950 635934 629137 623720 622234 619904 628238 612518 597514 600728 617520 635559 641229 636402 639906
3937 639906 637241 632734 616201 625996 640631 638592 620413 617263 635925 640091 622184 617365 628771
3924 628771 625530 624482 636540 651575 648211 638680 668133 681397 661265 674581 668494 678841 693958
3911 693958 680085 692051 693518 706696 716217 705799 713233 723288 727772 739481 736537 727165 734168
3898 734168 761477 765349 758405 778738 775893 779988 753262 717803 689460 693913 677175 678091 644820
3885 644820 657189 694849 675410 639614 655321 644147 644225 671902 662276 645990 636069 631900 646813
3872 646813 647270 644217 645083 647138 654825 637660 622443 617490 626628 659756 653666 644547 671067 669591
3858 669591 668949 687774 705489 700358 713771 742543 789167 784758 784254 774821 762886 760868 761482 738151
3844 738151 711393 726752 752074 739985 736401 739214 724417 738763 748131 761334 751142 742171
3832 742171 757795 762425 771685 773199 756629 742523 733406 736579 724253 713279 706883 712957 714542
3819 714542 699300 693417 688081 678922 668405 666056 693385 705234 692472 719643 730635 740042 741925
3806 741925 752656 765540 805568 838865 868383 888541 858968 832790 843538 833733 808746 776108
3794 776108 770331 759599 732693 714042 702668 694621 682351 660629 642213 650746 630280 641372
3782 641372 659603 659209 630276 631544 609400 622871 637410 644842 641498 655283 673808 664642 647959
3769 647959 630787 635830 672408 653902 647076 654831 655110 658323 666642 665557 644570 638266 654701
3756 654701 660560 668777 700740 678137 665948 682683 676478 686580 705995 716096 720757 729702 727537
3743 727537 728806 738913 747845 776759 766909 773137 800257 784269 793705 828329 825345 809523 823235
3730 823235 830473 832144 849573 839764 859780 849645 859444 845514 838376 848931 859987 816437 818853
3717 818853 804207 776802 778418 806497 821375 797115 789646 808960 802986 796066 793287 819817 825848
3704 825848 822175 833716 817291 817216 799586 807169 829685 821481 815312 805162 821982 812522 804153
3691 804153 826556 818599 853336 855225 859850 853542 824097 834208 834585 849439 853528 852907 851252 847626
3677 847626 835255 825812 832990 816150 802634 810194 807526 826348 832347 840538 822297 813701 838498
3664 838498 842631 844245 823860 841403 818028 835177 850949 816354 831518 832346 820000 839489
3652 839489 811963 810241 830552 861635 847650 814075 813874 816592 815218 840801 866848 869586 848499
3639 848499 852525 872621 871672 878368 861055 845724 859765 846106 837630 846633 847280 854111 868414
3626 868414 840128 813550 832118 850729 832407 809918 788669 790687 812693 827909 836177 855745
3614 855745 840210 813449 818346 815315 824158 830619 821628 796096 777576 795963 815540 838612 815710
3601 815710 799702 790514 807311 789323 818394 813765 808592 827443 836346 806581 795669 801892 787683
3588 787683 814410 829246 845066 817594 840441 829407 815367 795338 806731 788317 804921 802590
3576 802590 765241 806070 841329 839504 834610 817881 827816 838291 836238 837572 856337 860541 860400
3563 860400 862672 872450 865130 854479 834192 832120 865820 849445 851475 849047 856238 873568 886064
3550 886064 877212 882997 896176 895853 903821 913615 915823 919715 910902 921926 938613 941662 935115 948274
3536 948274 959829 941984 953108 944973 958595 953016 950462 940834 956528 950732 949534 957231 945765
3523 945765 917888 927031 976326 983249 952603 962465 955528 959917 982087 985748 990324 1011207 1026474
3510 1026474 1035168 1015832 999826 1005898 1000403 1013060 1017158 999279 983105 1002415 990143 985481
3498 985481 1007246 999736 1010475 1001577 991660 989795 980311 999918 1017307 1019583 1017909 1013399 1006578
3485 1006578 1023562 1022043 1042567 1075741 1069070 1043608 1029212 1050551 1056609 1055499 1067083 1038201
3473 1038201 1030144 1043395 1050394 1052706 1086013 1095870 1091199 1083923 1071542 1084583 1094962 1083016 1092866
3460 1092866 1110772 1135322 1129997 1114710 1134293 1139925 1125744 1124057 1129035 1125751 1129606 1130947 1164824
3447 1164824 1191402 1183076 1171114 1175570 1170010 1163404 1173590 1180942 1176359 1165389 1177612 1191882 1209015
3434 1209015 1194530 1195263 1226012 1246540 1256677 1259949 1249312 1257125 1265991 1244514 1240343 1255423 1250580
3421 1250580 1233699 1271861 1295342 1299505 1290085 1295281 1328412 1326678 1343738 1329803 1336214 1365452
3409 1365452 1376426 1397199 1396163 1413781 1439186 1435185 1448460 1464866 1499928 1522746 1523411 1525877
3397 1525877 1541212 1543710 1560122 1560715 1571771 1613615 1656573 1676867 1681888 1684618 1699472 1722484
3385 1722484 1743086 1750619 1786843 1818238 1826964 1834668 1873784 1892117 1895761 1911111 1927652 1931837
3373 1931837 1939245 1975329 2006691 2025670 2061299 2081521 2093631 2113392 2143889 2159852 2168474 2190039
3361 2190039 2249569 2303596 2327582 2387182 2448204 2505132 2526882 2564000 2623495 2679943 2712636
3350 2712636 2768513 2810511 2860551 2880582 2919199 2963305 2982906 3026709 3061201 3089738 3128790
3339 3128790 3186095 3264215 3292336 3362763 3420222 3488767 3567648 3636982 3687767 3784716 3857342
3328 3857342 3930256 4006943 4080792 4155177 4247320 4336787 4410049 4483976 4582684 4694146 4787785
3317 4787785 4879817 4952385 5029792 5103909 5203116 5304952 5431015 5568997 5642361 5769957 5930323
3306 5930323 6048357 6231976 6389946 6560847 6752202 6926540 7127636 7360073 7623652 7870614
3296 7870614 8117812 8424708 8710863 9036674 9389597 9791187 10237973 10722557 11236192 11817786
3286 11817786 12460488 13132692 13873043 14647245 15474393 16328884 17240752 18151946 18984226
3277 18984226 19713150 20315537 20706892 20870220 20723096 20318120 19647242 18834815 17989872
3268 17989872 17138347 16351061 15633659 14983344 14430640 13942836 13490387 13095330 12703881
3259 12703881 12360102 12031788 11780866 11535957 11304685 11120274 10944970 10782002 10649262
3250 10649262 10535530 10331691 10128244 10000029 9813248 9603443 9428862 9272181 9114178
3241 9114178 8993212 8861224 8687908 8497363 8303553 8138921 7972157 7810993 7655195 7500666
3231 7500666 7365513 7229255 7101532 6952355 6831927 6717277 6618223 6534702 6465109 6418207
3221 6418207 6386327 6349104 6351439 6346941 6254369 6109109 5986708 5860124 5739862 5616796 5522437
3210 5522437 5460096 5386234 5295549 5245089 5140670 5088298 5027225 4953114 4902430 4859889 4817403
3199 4817403 4769952 4696628 4607107 4533384 4473528 4435717 4377759 4368709 4334536 4290815 4256266 4265288
3187 4265288 4255493 4229986 4191688 4136841 4070586 4013601 3968438 3926758 3846912 3778304 3738329 3705560
3175 3705560 3691837 3631155 3572479 3542054 3527181 3507301 3473962 3443680 3398028 3388059 3351254 3351745
3163 3351745 3312558 3279801 3270518 3256768 3207135 3163275 3137742 3083445 3049320 3000530 2977601 2941027
3151 2941027 2901489 2879086 2874327 2857409 2831187 2786004 2772687 2755159 2709867 2716045 2697288 2698008
3139 2698008 2660033 2639610 2649466 2628158 2629984 2636022 2616362 2625725 2633811 2669061 2662545 2666478 2678338
3126 2678338 2682841 2712792 2685019 2631093 2563242 2524104 2496160 2475158 2443707 2392562 2385614 2380438
3114 2380438 2368599 2345642 2325286 2319412 2301627 2281094 2279487 2286119 2259987 2240524 2214068 2206317
3102 2206317 2188109 2162196 2154600 2133217 2117461 2134330 2131361 2111427 2088269 2105247 2128757 2126163
3090 2126163 2115469 2092052 2053653 2012145 1995106 1969329 1973217 1950329 1927911 1898990 1867029 1866383
3078 1866383 1868402 1848355 1843300 1824089 1793647 1773961 1752131 1747617 1728286 1694009 1681538 1666906
3066 1666906 1654263 1653892 1631526 1616806 1571148 1573152 1579458 1558341 1537749 1537618 1543690 1524009 1543682
3053 1543682 1537406 1507386 1514625 1525792 1501024 1503702 1484555 1480176 1499047 1478199 1486487 1471971
3041 1471971 1482880 1483668 1460003 1456909 1452348 1430217 1460343 1449350 1465966 1496256 1497281 1484893
3029 1484893 1481520 1491096 1526315 1508246 1492614 1503756 1513588 1548631 1558662 1549912 1542795 1538778 1536714
3016 1536714 1562084 1586109 1589715 1603811 1608562 1631403 1678911 1689726 1719666 1721853 1713484 1717328
3004 1717328 1737932 1759508 1750155 1768954 1807107 1827806 1852332 1856821 1830075 1862522 1874614 1892480
2992 1892480 1918494 1942737 1978986 1983409 1994427 2016449 2087588 2118775 2129267 2144688 2176098 2224577
2980 2224577 2275758 2329451 2388693 2427048 2478829 2550383 2609533 2698803 2781428 2836405 2928958
2969 2928958 2986125 3049671 3154065 3244353 3317034 3413450 3494122 3590954 3671854 3718402 3790882
2958 3790882 3848428 3920568 3993643 4014028 4055191 4092715 4171753 4264381 4326661 4394442 4484838
2947 4484838 4584348 4705379 4822296 4931625 5081760 5265918 5447250 5626930 5824357 6017611
2937 6017611 6227739 6437202 6634507 6829970 6995601 7102090 7183946 7153627 7102936 6964803
2927 6964803 6808828 6660266 6527635 6437520 6350966 6344062 6369228 6386070 6428274 6509743 6616594
2916 6616594 6700641 6802714 6925441 7056733 7150200 7245656 7377167 7481098 7566867 7629320
2906 7629320 7619585 7615406 7578672 7471635 7341603 7206577 7064636 6901450 6745168 6582759
2896 6582759 6400239 6240024 6146785 6043466 5974125 5881194 5851319 5806660 5786342 5770228 5750982
2885 5750982 5722294 5692169 5636941 5591806 5515868 5412681 5317068 5203705 5061431 4870303 4694616
2874 4694616 4534310 4381784 4235871 4081143 3946476 3839358 3737410 3628819 3533799 3453752
2864 3453752 3354543 3290167 3241797 3177620 3094318 3036671 3029746 2982277 2932659 2915171 2880880 2796313
2852 2796313 2710956 2642783 2552061 2502166 2464192 2416356 2326424 2262136 2218037 2173868 2084875
2841 2084875 2038372 2032863 1973744 1916399 1898681 1861042 1801977 1753497 1699952 1685101 1676232 1635242
2829 1635242 1601990 1593948 1574593 1527995 1502499 1494505 1492325 1468879 1462119 1448037 1423868 1396878
2817 1396878 1375930 1366780 1343909 1321599 1316332 1263917 1252426 1237059 1220682 1200689 1186672 1172152
2805 1172152 1142847 1106020 1106726 1071666 1039608 1043168 1013944 1003129 995775 974794 975742 956320 940441
2792 940441 919866 908858 921918 903432 903833 894677 905355 875009 827463 833503 833093 816502 814513
2779 814513 784021 755466 741537 736462 733342 737054 722833 710168 700746 690847 664814 669834 672209
2766 672209 676992 668188 667686 645504 649757 654425 632921 611320 595094 605488 611168 588834 564052
2753 564052 570265 574245 555401 547280 562575 554407 539795 536301 523167 523667 523458 501373 479398
2740 479398 483064 498463 505366 509387 485644 506263 478531 476525 488285 491641 505279 486950 446206
2727 446206 467098 473296 467515 487229 456359 460660 467812 451462 424260 428082 426845 417135 403773
2714 403773 394748 379858 402356 412009 423304 435228 414918 400226 403516 403977 410147 411207 405264
2701 405264 381975 364999 352257 352705 370969 368771 358011 362058 377433 368151 375240 358193 364064
2688 364064 353528 346282 340973 324089 342197 346167 349386 356986 366201 353163 347232 353959 356123
2675 356123 350081 366017 369037 374353 363874 359201 359020 343355 331395 332849 319718 322550 342666
2662 342666 324268 304020 312000 324244 343858 341305 343972 353906 352655 328319 326639 321826 312421
2649 312421 316393 308765 328244 327659 322350 316803 322055 324974 295278 279734 290495 306881 275525
2636 275525 273462 293364 276715 288962 279074 291225 291726 300127 322278 326327 289927 287313 277392
2623 277392 292250 296319 280897 273137 264135 242235 247622 255483 280997 288662 261867 257945 240690
2610 240690 230170 258432 272895 280590 269020 284674 276341 262232 274682 246055 236499 247658
2598 247658 248808 243745 242683 230193 218609 232291 218687 239378 250904 235108 233070 226724 226631
2585 226631 204190 193137 211403 222243 230341 242001 209261 217079 233270 223079 214565 200989
2573 200989 212544 221414 210121 210343 185931 197399 183419 184978 210204 205448 187654 216806 201118
2560 201118 178917 179078 177766 175602 186223 189117 188451 180452 165030 188908 195010 186132 193535 188836
2546 188836 169006 171891 138876 168096 199088 181090 173000 162954 168150 152967 164194 158388
2534 158388 150982 167466 192483 175418 143857 132958 142667 140451 158438 157596 135117 133786 132170
2521 132170 126533 108776 120774 135735 129982 143329 163060 155573 166403 138527 118164 121944
2509 121944 118144 116525 109412 114751 138661 137536 140763 133976 123549 128482 136807 136821 128390 133825
2495 133825 132971 125707 115879 141771 159192 139696 130750 145212 116886 107510 130258 102905 93529
2482 93529 110837 108881 86167 62340 72866 101163 94704 98807 99907 93249 92410 99520 100191 95867
2468 95867 105157 117315 108714 90271 98693 113008 107280 109121 97907 103409 100254 88197 93820
2455 93820 122889 122401 92358 86800 62420 64214 83968 108376 109921 128050 113099 135051 135235
2442 135235 79533 84372 76171 86849 97026 91483 92663 92314 87589 100419 97462 87166 79133
2429 79133 87478 91142 98180 111512 95034 79538 63014 60215 89151 84768 79816 97223 96601
2416 96601 80882 53630 80498 122392 94531 77479 91313 87792 89798 97212 93652 93395 102600
2403 102600 91479 111427 94435 86178 99725 106991 102634 92938 102250 93589 63505 70332 81302
2390 81302 72294 74268 51402 81687 71743 70520 67443 50349 47557 81003 67210 38918 50053
2377 50053 38821 59729 75618 66070 64437 61959 47447 39882 43213 67363 74553 60788 66690
2364 66690 54425 63281 72498 77148 63496 80142 105393 73582 74451 60209 49966 52920 53983
2351 53983 35337 73876 68964 64028 64615 64767 81543 76430 67577 66020 61642 50239 44391 54198
2337 54198 71531 42148 48211 38748 21725 41214 46244 34494 31994 25672 22514 25209 37722
2324 37722 59932 55422 57015 53628 57056 42244 33042 40175 60811 84829 82235 70099 54858
2311 54858 45837 25995 42546 48588 36595 50825 48466 40190 32248 31303 40346 46346 39594 31034
2297 31034 28684 47165 54554 51461 68528 55790 36096 38719 51442 57173 56959 54789 56827 57043
2283 57043 63611 71008 66996 43957 34193 84442 61339 40155 56437 48264 44930 41315 52823
2270 52823 41287 42062 43270 45167 59809 57624 59428 62916 54372 49810 62462 55123 54750 42506
2256 42506 13100 27693 32041 8908 27320 53179 39340 37139 50298 62783 71377 72186 74397
2243 74397 73606 70515 55674 33543 44181 85222 78141 54013 58840 68268 62420 64153 59867 67722
2229 67722 95873 88133 91227 87196 72215 67122 87238 64667 85208 85799 86904 113841 129058
2216 129058 129989 103506 107182 114878 105995 112715 128657 122278 99743 112168 149716 174961 161685
2203 161685 163872 149009 158967 173172 170832 183251 190117 194824 175552 186275 202300 200099 201164
2190 201164 218433 227199 232915 232478 225596 233059 238137 261567 271615 282250 282542 305536 314873 311086
2176 311086 290835 300673 356514 352153 355561 377531 390645 371609 364629 387565 426431 469494
2164 469494 529036 552635 586213 615822 657419 709716 774148 797224 845711 915336 987851 1065948
2152 1065948 1156586 1244862 1368810 1496684 1655301 1754055 1893938 2063655 2288687 2541935
2142 2541935 2911111 3328239 3899433 4572250 5471036 6471885 7787781 9129883 10376434
2133 10376434 10248964 8526626 7121871 5793735 4798262 4084875 3569333 3120628 2752194
2124 2752194 2453894 2269818 2109321 1988693 1853163 1782573 1665184 1552990 1475863 1376631
2114 1376631 1280383 1204100 1149885 1072046 1030158 981899 944069 929183 904499 859557 823826
2103 823826 791946 761842 757625 749418 692538 664499 631021 624794 590805 577895 564760 542775
2091 542775 520345 491296 469029 464272 472908 454661 456009 454005 445477 432632 396564 375948 370511
2078 370511 353213 343859 352435 342770 335129 337890 319513 328809 295438 296454 288350 291381 275331
2065 275331 260199 271923 262669 257847 255654 247290 246337 264028 269880 259692 258778 267947 246084 237576
2051 237576 204263 196486 209287 201848 193372 209581 216516 192924 166685 191226 184870 157250 136107
2038 136107 155214 169757 151266 167355 160350 167995 162373 137392 141536 122844 114705 141171 139033
2025 139033 121697 122104 125434 136234 120740 138301 124779 121730 122693 117716 123885 117153 107398 106609
2011 106609 80558 112599 103851 114790 110707 96233 114947 121868 89767 94321 114301 95490
1999 95490 88707 80316 82368 94628 103331 93153 78199 63903 67039 67049 62122 69549 76195 82173
1985 82173 100545 101690 108307 96485 76409 71413 54481 46384 66669 91802 88154 62707 86893
1972 86893 69381 48215 77697 79519 90870 98641 72228 53784 59795 74277 78207 61550 49733
1959 49733 49865 55858 55390 61037 66377 59331 56638 43694 66964 73843 61835 37781 46110 43200
1945 43200 61646 67585 72183 71885 75617 50864 38959 47983 50292 58595 57941 46807 45051 20084
1931 20084 31092 51671 79254 65256 49175 33349 26188 43772 48016 26110 9587 41705
1919 41705 52430 42782 55474 77212 77923 54264 27824 26445 37449 57999 49029 50711 67742
1906 67742 48789 42881 36470 22692 26857 34917 36973 54725 67653 50417 55058 60847 65969
1893 65969 53246 55159 64301 46526 37727 55256 68238 68257 27536 12308 31629 43624 17014
1880 17014 29335 20606 25116 30806 14503 20600 47646 63102 74944 55263 62166 49138 61111
1867 61111 74912 71038 92423 89053 86949 85921 73208 65227 64205 50873 40830 27922 60558
1854 60558 59391 67987 55806 33612 28613 42561 51203 39866 31326 43159 50934 17170 28266
1841 28266 11023 33495 51264 59538 73279 41582 56074 72641 34511 -13346 10567 32860
1829 32860 25383 26122 36177 37624 29063 -1671 3629 32928 23949 16256 31578 29103 11813 29108
1815 29108 30425 20967 714 -12364 10644 20635 32921 39472 46089 60730 39240 34288 22634
1802 22634 37194 29770 25339 38462 29321 32035 13609 -3580 22420 15707 1982 5944 31897
1789 31897 31435 -3432 6032 18661 33843 20017 14029 316 -15284 -3001 -12320 443 23453
1776 23453 5775 10451 36379 38808 394 8305 25088 36814 51439 38688 26065 35376 18155
1763 18155 13760 -13536 -16648 26340 37115 14387 16424 29509 28491 12023 -7962 -6943 5604
1750 5604 32696 19927 32966 11502 -2410 18926 21511 31799 13287 23995 31763 31215 35361
1737 35361 18661 2012 -3542 4316 4252 13940 33933 36113 37930 37055 17710 23150 45363 38771
1723 38771 28149 27557 37755 43263 20822 -1516 13577 21980 10204 18672 9758 9095 -12406
1710 -12406 -19491 19111 19382 -1369 13734 14314 6120 33413 20165 -19689 -19995 -9098 12979
1697 12979 14775 4121 16345 11171 -2844 -23877 -17671 -25595 -23233 -866 11764 -17224 5603
1684 5603 20702 16031 -2487 -8750 8465 15524 20053 13985 21022 -10623 -1280 11238 16904 31872
1670 31872 13605 24913 41079 21189 15996 15107 4994 11740 13879 13939 1455 818 21595 20396
1656 20396 19801 6632 6720 7624 17749 17715 25107 14805 16252 21282 -4619 -21903 22345 -11318
1642 -11318 -6058 22364 31804 18203 -3857 -1596 -1373 25014 12997 -14318 -1177 2192 3196
1629 3196 20200 28265 15948 11383 26382 11050 20148 6804 26917 28719 5417 -9881 2891
1616 2891 6458 4532 -8974 -13494 18334 12362 -4970 -351 15559 33698 29238 21773 15039 21716
1602 21716 10564 -5908 -5641 10701 12936 3183 8450 -6558 -9762 -7325 -11532 -12787 8312 9826
1588 9826 23482 7174 -18903 -16031 -8720 6707 5573 8492 -2823 -2644 1547 8803 14001 -11330
1574 -11330 12700 3023 5496 18262 34814 38825 25078 20223 13552 -4560 -16394 16698 -2361
1561 -2361 18643 5798 3911 -3131 -5955 -2818 8647 15663 -13702 -8947 -16791 2293 10697 25622
1547 25622 19248 -8294 -9899 -13486 4304 33780 23001 2548 5535 1967 -3437 10514 -1184
1534 -1184 -27766 -34678 -18229 -29885 -35081 -22687 -5290 360 -14694 -15173 -1333 4570 -457
1521 -457 -16610 -9583 12025 6850 10188 -15680 -4305 2201 5709 -3220 3026 15499 3560 -215
1507 -215 -10368 333 1955 -16360 -8961 8600 15204 -2137 -11394 -20291 -14693 -13878 -4607 -4417
1493 -4417 2543 6316 7350 14960 15869 1720 2285 11755 -6006 -6235 -4982 4172 6314 9591 -4991
1478 -4991 -1376 -11111 -15511 -5405 -7531 -21376 -9114 14164 17105 29995 22344 12167 -4850
1465 -4850 -1287 21210 15585 13763 17640 17274 12919 13236 16210 -17805 1153 23128 22862 13984 10567
1450 10567 13003 -1927 1413 1345 466 -2586 8845 7053 1783 18845 26598 19196 8560 -11999
1436 -11999 -22346 2873 17648 -436 -8697 -9946 11964 13112 8095 -7310 -7904 -4951 27611
1423 27611 17 5228 14723 11909 7573 4956 23716 23361 -13206 -13291 22116 15339 10942 22136
1409 22136 32336 57234 27473 -2062 -821 13843 31223 19495 -5922 -24883 10206 20508
1397 20508 20175 1223 -13720 9516 6274 7677 -6058 -41416 -42825 -54048 -30149 -6060 -5420
1384 -5420 -9158 3273 -6545 3065 15285 -3173 -15357 -14502 298 -3274 -2183 -7411 -19621 -22091
1370 -22091 7594 33268 12827 -7487 -26201 9505 -395 3646 4917 6330 12861 3726 -9251
1357 -9251 5576 25645 31744 11708 -8067 1748 -1546 -12485 -3879 15832 19090 13043 17960
1344 17960 18551 9057 16467 12088 -4854 6182 425 -10095 16946 15551 -15133 -23973 -17607 -20979
1330 -20979 -13773 -25334 -8907 16045 2183 -2598 -2631 -10979 6374 13281 761 -12625 -32519
1317 -32519 -36321 -18954 -2890 1395 -12390 2651 13653 5585 -3555 -15742 -23630 -19894 -34558
1304 -34558 -14228 -4357 10218 18679 -2355 28314 14376 6013 -10537 -21033 -5615 7807
1292 7807 -1947 -3258 6821 -15070 -9715 1020 -15586 -21254 -42113 -22648 -2392 -2608 -14553
1279 -14553 -22198 -12288 -465 8296 -12370 -6057 15985 4665 -11099 -18382 -25580 -4834 21511
1266 21511 21011 39494 6653 1556 1711 483 3835 -16266 3272 -5112 -6702 -18660 7639 22824
1252 22824 8189 9593 -3677 1359 19078 18181 22141 21256 42055 13914 9643 11578 4961 -13782
1238 -13782 884 -6293 11272 34795 23458 17469 7626 -12847 18721 20018 3784 6176 3424
1225 3424 -7401 -17301 4682 -9528 -15602 -4593 -23953 5657 17850 -5436 14188 25923
1213 25923 16543 2103 -15703 -2290 1764 5391 16894 -3261 -19203 -27541 -16889 8082 15090
1200 15090 -1337 15888 20173 22713 23894 11760 -8910 -13009 -9927 -14596 -35287 -20264 -25116
1187 -25116 -23422 -19215 -12262 -4613 5856 15088 -727 -150 9055 6526 26769 9346 -10145 -15444
1173 -15444 14473 25462 8920 20198 15132 7616 399 -7011 2719 -23223 -20404 -1878 26424
1160 26424 29090 9012 2732 2588 -10672 -23191 -37555 -44868 -17217 4295 8594 -5516 -28658
1147 -28658 -34062 -21463 -12532 7199 26097 42631 29417 5957 -1695 -24176 -3280 23262
1135 23262 2727 -9700 -24286 -19641 -18967 -2573 34647 19279 -4086 3861 -4179 -41924 -47547
1122 -47547 -29107 -20947 -23456 -6460 18785 18702 21265 14947 -11320 2272 -4864 -3026 18807 21957
1108 21957 8200 -10790 -5818 -16396 -26425 -23988 -1219 804 11447 5093 17977 -10542 -37890
1095 -37890 -19141 -7714 -8389 6957 7703 24249 33081 25244 26130 8931 -35092 -32645 -3856 15553
1081 15553 30570 14592 17156 -1202 1433 -2370 -23070 -2418 -8417 -1580 21305 1720 -14358
1068 -14358 -17526 -38945 -42372 -13646 3317 -19608 -9659 17322 11909 -3235 2914 6171 13209
1055 13209 24427 23076 12897 -20450 1264 13530 9818 17072 7975 22778 14256 4220 1195
1042 1195 -19854 -2170 9807 6481 32034 -1343 -2399 4748 18956 20661 20370 9920 -6322
1029 -6322 -5845 5328 3480 6104 -601 -7407 11584 3373 4659 -10563 -4989 9889 -10625 -7540
1015 -7540 -6568 -13767 -16663 -34682 -9382 9146 9479 6376 -3720 -5909 11941 -1224 -1277 19030
1001 19030 32124 1331 -7260 10849 19928 -1979 -21314 -18546 -7087 5572 -8169 -24241
989 -24241 2900 -4388 295 -28420 -27816 4966 -4146 -17284 -11603 -5783 5738 -16492 -15923 4085
975 4085 1780 -13701 -20757 -2451 -29723 -23648 -15381 -2516 -13467 -15913 14717 16627 2682
962 2682 -27798 -38685 -24448 -32220 -4071 15860 28588 24611 -452 2429 -13520 -3700 13245
949 13245 7629 3069 6391 7279 -17564 -13266 14130 -11993 -3762 8015 2901 -9001 7518 -10741
935 -10741 -27306 -7571 -4132 27 -10270 -6349 -33918 -21205 -6722 13608 1824 -30295 -20898
922 -20898 -18633 -15411 -7729 -12692 -16069 -317 -31440 -37042 -3124 -6424 -10814 -1426 -4716 -12335
908 -12335 -394 1091 -787 -3090 -20785 -1526 -7176 650 9293 8205 2403 2004 11239 3956
894 3956 6845 -26370 -8601 1852 -2797 -21598 -2625 -9271 -18830 -9017 -18325 -21865 -8608 -3395
880 -3395 9452 -5708 -14629 -4971 -10203 -14136 -438 -12309 -20840 -19282 -20786 -33884 -33749 509
866 509 -14 9686 -11506 -21009 5403 -1961 22781 3882 -19633 -23406 -18748 -6775 -894 19177
852 19177 13747 -12191 -11825 -8642 -21405 -738 -3270 3075 -6225 -5114 -8436 21248 11315 4227
838 4227 -3886 8471 35309 -8711 3787 4276 -10007 -12952 -4363 -366 -8975 9747 12766 4342
824 4342 -20645 -1721 2541 -7231 -10558 -2731 -6129 -10747 2949 19402 12807 -15396 -4932 24108
810 24108 34104 27306 22065 2563 17745 16333 23386 26592 19289 224 -18042 -25088 -12049 16712
796 16712 33965 10428 11989 -4549 -19830 -1255 -7232 -17996 -13367 -16819 -21764 -29302 -25308
783 -25308 -11507 -9421 25620 12868 -12541 7941 11735 -13356 12487 20540 18583 -2638 -10224
770 -10224 -13036 -8900 483 17980 24193 34573 13416 8912 -9477 -8597 15222 6460 -5854 -16480
756 -16480 -17621 -24920 -29614 -15273 -11567 -11586 24001 4041 -12891 16007 -11420 -34827 -24915 -21867
742 -21867 -7253 12661 -23342 -23363 -7413 6168 19633 25120 17334 1243 20982 421 -11810
729 -11810 -2796 -890 -31394 -19517 -3340 3730 4209 8689 17168 -8599 -30917 -12302 -2573 1911
715 1911 -4247 -22612 -16517 -23378 -27094 -22529 -26090 -16553 -17422 -11970 3795 -11648 -6816 2355 -716
700 -716 31153 29195 21312 2384 24175 34281 24176 85 4738 19734 33821 18329 2683
687 2683 -26845 -6549 -5614 -29801 -14273 -5043 19424 31152 31882 -2109 15184 22241 18306 1419
673 1419 -17647 -3649 -24662 -22184 -4099 9508 17390 7660 -12424 -6385 3999 -15227 5062
660 5062 11371 6600 6666 -6596 -6234 -995 10761 4530 -6740 -2512 -13587 -17509 -5965 5642
646 5642 -11485 -11025 -8159 4434 -23682 -16056 -1879 -41726 -41878 -37211 -8877 -6635 -10344 -19524
632 -19524 -13618 -9778 -30714 -43565 -34229 -11744 -19635 -7639 -2409 5056 15047 10964 5070 15275
618 15275 -6442 -15790 14300 24478 9228 7737 9922 -1198 -11785 13566 10630 16789 -12017
605 -12017 -15792 -3851 -9854 2555 5882 -7111 -14490 -36362 -23773 -9400 -15061 -14413 -32656
592 -32656 -17235 -26115 -4325 6797 7396 6938 -400 -15988 -27185 -14166 8715 25278 10183
579 10183 4992 -1826 941 -7096 2313 11125 1434 -10821 -2740 2385 13422 40646 28198 52041
565 52041 41140 1690 2959 7314 -29526 -15918 11142 -10081 -22010 -30563 -36221 -23144 -11185
552 -11185 -6990 124 17217 -13171 -13820 -14092 1368 2444 9096 23431 12743 3962 -6783 -10209
538 -10209 -11770 -1757 -27067 10175 11503 12771 23001 12112 23353 16073 -12605 -10562 -9805
525 -9805 -1992 -13628 -5738 16155 3354 15430 -19802 -18386 2141 21934 19474 19162 30914
512 30914 6018 -7907 -6025 148 -13429 -20929 -20870 -410 8171 -9989 -8724 -16337 -18327 -6280
498 -6280 12069 -1973 -806 10946 -1736 -17140 -1972 14895 5097 -34577 -26262 8935 -8416
485 -8416 -19114 -5318 16667 28274 12910 -11221 -20989 -6940 3662 -6755 -15622 -20480 -995
472 -995 -5145 -12072 7181 -11736 -8459 -14988 -3912 -4438 -1196 6777 16193 -8222 -12640 -13433 95
457 95 -2330 1895 1526 -23657 -6484 -6718 5128 5079 2279 -24474 -8318 -6386 15178 708 -11399
442 -11399 -6970 -7943 -10416 -6264 -16025 -18097 -3044 3289 -10350 4489 223 9366 16918 23324
428 23324 14333 8711 214 -5113 -2873 13504 9261 -8244 12852 -3413 -45804 -10607 -14522
415 -14522 -10805 -6290 -20002 -26545 -16801 -7061 -21692 4549 -5047 -22027 -32891 -9691 -15526
402 -15526 17561 22499 3505 16553 16574 -8755 -7846 -1272 -3152 976 -11361 -2476 26 -8536
388 -8536 -14892 -2186 18608 -4332 -25415 -16262 -3499 -9660 2723 -13988 -2161 11075 7847
375 7847 -5759 6148 -11048 -9686 6502 -16103 3342 -14136 -31184 -14212 4790 -16520
363 -16520 -25597 -9392 -11751 -8963 -9723 -7147 -13575 1844 -8968 -9795 -17280 -26093 8666 31115
349 31115 23197 30725 6282 -13216 -9242 -16927 -26779 -57639 -36529 454 5099 -5986 -6528 -9715
335 -9715 -11035 -12606 -11493 -18207 1685 1909 -14599 -18044 37 -862 -24325 -3070 -16045 -9636
321 -9636 -1544 -6205 -3601 2947 33881 31147 -12584 -24515 1788 18979 -1398 -33308 -23520
308 -23520 -12676 10935 12310 5087 10040 6344 18141 -4415 -5834 9195 6975 11693 18021 -18789
294 -18789 -34835 -27724 -13953 -22267 -20650 -7844 -5764 -21860 -32956 9075 -2728 -3354 802
281 802 -15268 -12141 -22853 -16573 -2785 -18403 -18631 -27207 -7921 -16013 -6932 -1506 14808 11340
267 11340 -12098 -41247 -32728 -15052 -5690 -2637 7013 11368 17151 23908 27338 25142 -11552 -5188
253 -5188 2125 -5588 746 9097 -2712 -16865 -15048 -26763 -23321 -48894 -40672 -3167 4009 21376
239 21376 4665 14398 19474 -5331 -9893 -12993 4375 3414 -17892 -29454 -28239 -11434 214
226 214 -20222 -30536 -11887 -26763 -19975 -6434 5622 -3823 5578 9587 -670 1144 -1232 -15647
212 -15647 -20145 493 -4510 -9950 -642 -16357 5281 18282 -9980 -25215 -13387 275 8782
199 8782 -11 -13870 -14724 -10031 -17499 8278 23127 -5181 -18337 10486 8716 23715 19007 32661
185 32661 8419 -17446 -13674 -5922 -1674 -5568 -218 -17770 -735 -2817 -949 -12379 -23954
172 -23954 -15704 -5586 -27172 -5407 5799 -14046 -27410 -36944 -23402 -26408 -20000 -5094 -12682
159 -12682 895 -13249 -19285 -13605 -25341 -24228 -30381 -45520 -17974 -12800 -6827 -25392 -15155
146 -15155 -4952 9175 13876 7199 -1266 -16464 -9290 -8469 -15942 -22495 -26463 -35747 -21930 5705
132 5705 10852 -23641 -1200 -10775 -24933 -14257 -2737 -15319 -17075 5538 -6707 -26801 -8340
119 -8340 10429 -55 -14605 -13938 -21752 4093 11289 13497 -2284 -21711 -31154 -17811 -7342
106 -7342 3267 -5539 -11353 -267 -8185 -7949 168 -14432 -15789 -6960 -15990 -13066 -20436 -9590
92 -9590 11197 -6688 -13917 -34715 -26135 16713 -4850 7556 11224 19699 7566 -3684 718
79 718 5402 6699 -12678 -3643 1566 -14439 -7911 11472 -2209 -9608 -16701 -27873 -16312 -10130
65 -10130 -8374 -10276 -8700 -13636 -10158 -11329 -2688 -2182 7210 3936 -558 -6787 -9708 -11413 -5507
50 -5507 -17013 -14620 -383 -10725 -2789 -3659 -6283 2746 -8137 -10082 -16400 -12760 -2625 4583
36 4583 -18032 -23997 -15091 5245 -399 -4988 -1726 -18716 -20361 -25424 -30647 -43185 -36604 -18179
22 -18179 -19029 -19105 -16372 -17863 -18853 -22672 -16548 -5137 8289 14116 -1949 -4588 -21789 -766 -1481
7 -1481 -20895 -13123 -15698 -3487 -13587 4261 10681
0 10681
$$ Imaginary data points
##PAGE= N=2
##DATA TABLE= (X++(I..I)), XYDATA
16383 -444882 -438149 -434346 -406417 -393772 -383718 -376098 -369336 -373088 -356751 -348354 -324835 -318963 -323405
16370 -323405 -322909 -318958 -312058 -303072 -274689 -248916 -241043 -246088 -230384 -221867 -211026 -201259 -202019 -215580
16356 -215580 -191938 -175578 -182058 -164139 -153913 -139517 -130676 -117313 -113808 -103719 -88340 -61815
16344 -61815 -47893 -44267 -39320 -27805 -28915 -9545 2068 -3476 14115 31749 52426 60059 63229
16331 63229 63166 78283 94054 101028 106015 115199 104701 108101 134787 159876 152581 156126 165402 165191
16317 165191 165106 203996 215438 213022 205382 226961 214785 236672 257802 274025 263507 265345 296176
16304 296176 305028 311155 319402 332565 342255 340288 342813 348787 358525 358350 370860 387122 400061
16291 400061 398651 385171 396078 421736 431416 434308 435283 458332 460518 471993 481512 483033 498914
16278 498914 493881 504237 535484 532698 523388 534679 547585 548689 543230 566896 571226 591511 586366
16265 586366 576904 576158 581767 608264 617243 617534 625517 615252 622628 657189 655488 658179 680522 670502
16251 670502 661276 666361 697838 696770 705942 687890 717013 725333 725016 702447 695338 700888 728287
16238 728287 742223 748379 744079 746436 782712 786763 786751 795721 785986 790148 809775 823530 802510
16225 802510 803189 796774 802336 822549 794058 814458 837969 839943 847735 873175 879905 879652 892541
16212 892541 891610 875558 881620 894675 887907 877670 892163 901878 906610 922249 917294 916214 929534
16199 929534 928713 926768 933809 945720 950974 948599 949801 959596 951901 937654 932734 964882 956578 957727
16185 957727 949724 969697 973040 987691 990001 996050 1015300 1007119 987310 990053 1008551 1004863 996148
16172 996148 992901 969077 980473 985367 995791 1033483 1040328 1047414 1029019 1019954 1027258 1021105 1038152
16159 1038152 1016100 1016549 1021520 1023183 1041640 1039308 1031824 1030375 1032674 1048282 1058511 1059058 1092038
16146 1092038 1093896 1077147 1074114 1083569 1083203 1081504 1066536 1078370 1092550 1106397 1097704 1075238 1083056
16133 1083056 1092618 1095572 1104498 1083464 1062312 1038958 1042111 1055230 1095051 1077615 1071396 1072467
16121 1072467 1085408 1085454 1116457 1142116 1124781 1115536 1112096 1114261 1109600 1110876 1107322 1131585 1127719
16108 1127719 1118360 1130184 1123291 1109588 1105292 1108729 1116638 1120100 1124859 1142325 1114139 1109899 1104116
16095 1104116 1093201 1112956 1100543 1110870 1117765 1114757 1137359 1153731 1138731 1150285 1132874 1107997
16083 1107997 1102428 1109244 1127625 1144396 1139228 1135185 1136281 1161001 1168678 1160421 1134608 1139158 1156338
16070 1156338 1131429 1141702 1132398 1138599 1159565 1150084 1140769 1132410 1143550 1174265 1171379 1158791
16058 1158791 1146788 1145845 1141025 1138049 1151013 1153973 1135005 1118304 1119667 1121483 1129977 1144120 1137283
16045 1137283 1143267 1147218 1142344 1132296 1124887 1151332 1137160 1148269 1129836 1141740 1147987 1150804
16033 1150804 1161313 1172245 1164817 1138051 1145628 1147748 1157919 1173520 1154027 1168615 1149394 1137431
16021 1137431 1145647 1169897 1178103 1162813 1146377 1145843 1148321 1135408 1141208 1139686 1159235 1176307 1180954
16008 1180954 1146209 1147039 1152084 1144846 1133693 1138677 1148771 1161827 1126646 1149387 1159017 1160383 1166841
15995 1166841 1167116 1173360 1161853 1167056 1123939 1177318 1167080 1167714 1177931 1170411 1170267 1164261 1173526
15982 1173526 1175941 1174119 1136561 1146687 1146053 1148255 1140202 1171234 1152534 1129765 1151632 1176428
15970 1176428 1185688 1193966 1171656 1149414 1169372 1170380 1160849 1168150 1179307 1159926 1152424 1167014
15958 1167014 1154819 1156450 1145725 1169490 1164824 1159732 1168048 1193537 1204963 1179383 1175970 1175089 1168724
15945 1168724 1158732 1152906 1172359 1178255 1178781 1192883 1182686 1174223 1158637 1179897 1196844 1189917 1176316
15932 1176316 1143198 1147750 1171405 1163726 1173039 1187559 1197974 1188123 1159942 1159124 1163821 1155524 1155587
15919 1155587 1161947 1147579 1138087 1182058 1186303 1162124 1157110 1149533 1148968 1177001 1174418 1158366 1167211
15906 1167211 1170410 1158960 1171093 1173627 1163847 1157875 1160055 1135420 1157859 1151381 1161742 1160308 1170474
15893 1170474 1169146 1175012 1192951 1167331 1162320 1153082 1163307 1149592 1155311 1154167 1160521 1173286 1146854
15880 1146854 1169184 1160645 1158215 1162980 1147276 1149950 1173223 1188627 1183238 1183818 1201583 1187553 1157843
15867 1157843 1164236 1173585 1184417 1183961 1183929 1170890 1184695 1163233 1180704 1190394 1190971 1194412 1201428 1173271
15853 1173271 1163947 1155103 1178161 1175866 1182354 1182499 1188517 1190473 1155429 1178083 1198620 1172696 1163157
15840 1163157 1170522 1177343 1180058 1177486 1179186 1169542 1184994 1177094 1181417 1174922 1176991 1170338 1185705
15827 1185705 1198992 1164734 1173640 1175643 1167337 1179609 1153366 1137809 1163905 1181292 1190597 1174653
15815 1174653 1161030 1170759 1170089 1160624 1169345 1171144 1191144 1198063 1179121 1165603 1164555 1187080 1182851
15802 1182851 1193601 1208457 1197630 1188472 1177219 1181312 1176842 1185639 1188505 1177294 1184697 1188900 1183131
15789 1183131 1178018 1185459 1193361 1197464 1164895 1187370 1163331 1155830 1172348 1179890 1145539 1157922
15777 1157922 1180920 1176573 1169485 1169022 1193837 1185533 1201278 1201476 1181863 1209530 1197046 1196122 1177260
15764 1177260 1173205 1186975 1197609 1204424 1180294 1173043 1167435 1175833 1184247 1202349 1209249 1195735 1173726
15751 1173726 1178875 1205057 1196070 1197050 1219415 1200777 1210908 1223386 1186435 1148126 1175238 1180581
15739 1180581 1183213 1194324 1188298 1157984 1157345 1143276 1153571 1161755 1163050 1178836 1176760 1179628 1177573
15726 1177573 1190634 1195730 1200671 1191805 1181761 1182668 1178871 1200275 1212929 1207499 1186587 1176038 1177970
15713 1177970 1178022 1181390 1190937 1179254 1189492 1197348 1196853 1216938 1210571 1177534 1175938 1167558 1167447 1194785
15699 1194785 1188113 1182396 1185233 1172289 1166337 1166174 1181621 1198467 1190060 1194779 1191149 1178440 1188731
15686 1188731 1186900 1168254 1191153 1229911 1213876 1214005 1197915 1192341 1186952 1181988 1200911 1175679
15674 1175679 1193670 1222101 1200092 1176824 1195163 1213291 1204522 1220528 1207921 1212815 1218048 1191306
15662 1191306 1201572 1226543 1211927 1220241 1199273 1194423 1214348 1206837 1216145 1217933 1212362 1224027
15650 1224027 1224937 1224537 1212175 1190699 1218094 1220263 1226265 1216650 1234997 1206085 1183648 1165535 1165714
15637 1165714 1177305 1192092 1185173 1164328 1161422 1178785 1190283 1207534 1192475 1205602 1212097 1224756
15625 1224756 1214503 1193622 1181976 1205676 1230553 1230403 1236785 1238247 1178157 1185849 1204990 1188149
15613 1188149 1214754 1227643 1208595 1208873 1222148 1204478 1213646 1216275 1208348 1206985 1205244 1207698 1229124
15600 1229124 1212270 1214440 1219786 1230206 1209317 1197633 1179225 1231194 1238152 1206603 1212727 1214504
15588 1214504 1219315 1213742 1227493 1202001 1201819 1219672 1213716 1223608 1189239 1188661 1199488 1199174 1198643 1212056
15574 1212056 1204624 1224478 1214711 1225922 1216471 1197958 1214502 1218673 1216214 1231239 1216850 1210931
15562 1210931 1200518 1197883 1209720 1209393 1210810 1235995 1221051 1211005 1208521 1208099 1241308 1232171 1208429
15549 1208429 1181087 1191243 1211864 1194601 1192372 1222136 1230060 1205793 1203306 1207966 1188216 1174970
15537 1174970 1184151 1214296 1218204 1214722 1227378 1218654 1204308 1202989 1208535 1225385 1225475 1211207 1191267
15524 1191267 1200456 1183434 1193279 1190431 1210095 1199817 1187083 1169506 1209113 1211727 1230659 1219086
15512 1219086 1205034 1222104 1227650 1215828 1216124 1192114 1201624 1240633 1246701 1235544 1221591 1221993 1218118
15499 1218118 1196868 1217141 1233839 1244032 1242594 1237891 1244710 1247892 1240526 1243777 1248545 1222907 1207911
15486 1207911 1180315 1187231 1196888 1230209 1219664 1206963 1189062 1222156 1235586 1235479 1232522 1226892
15474 1226892 1243000 1237917 1239374 1221747 1200323 1217644 1251695 1250793 1219041 1210018 1211709 1217642 1213116
15461 1213116 1239089 1253732 1242161 1234102 1241473 1226006 1242257 1246702 1221633 1203756 1214023 1198909
15449 1198909 1216389 1227720 1201747 1183973 1224614 1231338 1244492 1243466 1242684 1233435 1210571 1209685 1217695
15436 1217695 1256136 1240853 1223156 1233511 1224473 1225426 1242585 1226353 1228761 1212815 1236322 1252608
15424 1252608 1225228 1212162 1231935 1259866 1243529 1238308 1226780 1237501 1234796 1217625 1242951 1235023
15412 1235023 1245169 1257894 1222256 1217857 1241302 1252563 1261475 1255863 1247831 1238389 1232927 1232451 1219091
15399 1219091 1234760 1259534 1225675 1209350 1204317 1219032 1215060 1231074 1221511 1234706 1232139 1259217
15387 1259217 1259469 1238077 1256141 1239698 1236747 1244014 1244426 1242774 1269239 1240962 1207255 1213336 1220558
15374 1220558 1229862 1239265 1220082 1214092 1224325 1219784 1236343 1235773 1222999 1221499 1218470 1210319 1205983
15361 1205983 1225068 1224567 1221932 1221651 1234225 1251008 1239564 1220201 1219591 1239500 1214452 1206177 1234730
15348 1234730 1245861 1226732 1248902 1257942 1265844 1255195 1245090 1246113 1256444 1246349 1237063 1239186
15336 1239186 1253074 1252876 1255703 1255668 1234448 1238965 1241930 1253939 1239119 1255726 1268080 1269988 1256686
15323 1256686 1234055 1255391 1276286 1270561 1248508 1262560 1248433 1235924 1249963 1224101 1214264 1237808
15311 1237808 1278307 1258740 1261558 1246643 1245626 1240121 1237567 1245422 1273474 1270931 1255662 1278490
15299 1278490 1276053 1241591 1226747 1240357 1281734 1271820 1232094 1255627 1261535 1231077 1257190 1280184
15287 1280184 1263664 1260210 1265461 1262550 1232863 1215872 1231519 1258846 1253614 1228519 1216700 1237031
15275 1237031 1235746 1205575 1236020 1253179 1231014 1227553 1225150 1240198 1240991 1242145 1238550 1262009 1258743
15262 1258743 1253933 1260375 1264033 1249839 1252333 1250364 1248993 1258690 1236387 1252159 1259738 1264183 1256149
15249 1256149 1252975 1263024 1275119 1277538 1253196 1243314 1247224 1255266 1276657 1266272 1244122 1237543
15237 1237543 1235737 1239545 1255324 1232131 1224198 1241098 1244960 1256434 1256928 1247032 1236367 1233321 1252546
$$ [...]
##END NTUPLES=NMR SPECTRUM
##END=
