##TITLE=1H_CA-8958-1
 CDCl3
 8 sc, 
 9.12.2021
##JCAMPDX= 6.0         $$ Bruker NMR JCAMP-DX V2.0
##DATA TYPE= NMR SPECTRUM
##DATA CLASS= NTUPLES
##ORIGIN= UXNMR, Bruker Analytische Messtechnik GmbH
##OWNER= root
$$ XWIN-NMR		Version 3.5
$$ Thu Dec  9 11:53:18 2021 Russian Standard Time (UT+4h)  she@DPX200
##.OBSERVE FREQUENCY= 200.131346
##.OBSERVE NUCLEUS= ^1H
##.ACQUISITION MODE= SIMULTANEOUS
##.ACQUISITION SCHEME= undefined
##.AVERAGES= 8
##.DIGITISER RES= 18
##SPECTROMETER/DATA SYSTEM= spect
##.PULSE SEQUENCE= zg30
##.SOLVENT NAME= CDCl3
##.SHIFT REFERENCE= (INTERNAL, CDCl3, 0, 15.6345)
##AUDIT TRAIL= $$ (NUMBER, WHEN, WHO, WHERE, WHAT)
$$ ##TITLE= Audit trail, XWIN-NMR		Version 3.5
$$ ##JCAMPDX= 5.01
$$ ##ORIGIN= Bruker BioSpin GmbH
$$ ##OWNER= she
$$ F:/spectra/data/she/nmr/H-F/1/pdata/1/auditp.txt
$$ ##AUDIT TRAIL=  $$ (NUMBER, WHEN, WHO, WHERE, WHAT)
(   1,<2021-12-09 11:52:00.00 +0400>,<she>,<DPX200>,
      <created by zg, POWCHK disabled, PULCHK disabled
       configuration hash MD5:
       00 E9 B6 7A A2 85 ED C7 34 08 36 98 17 FE 4E 26
       data hash MD5: 16K
       C3 CD A6 2C 2C 46 00 1A 2A A0 D3 CC 97 9D 3E 67>)
(   2,<2021-12-09 11:52:02.25 +0400>,<she>,<DPX200>,
      <Start of raw data processing
       efp BC_mod = 2 LB = 0.24 FT_mod = 6 PKNL = 1 PHC0 = -15517.92 PHC1 = 22.0008 SI = 16K 
       data hash MD5: 16K
       77 41 8A 95 3D C4 C3 4B D8 F2 5B 32 7A 37 D7 64>)
(   3,<2021-12-09 11:52:25.54 +0400>,<she>,<DPX200>,
      <pk PHC0 = -150.9877 PHC1 = -10.99999 
       data hash MD5: 16K
       8F 76 A9 AC BF 2C E6 5E 2E 0B 56 95 5A C0 82 5A>)
(   4,<2021-12-09 11:52:28.35 +0400>,<she>,<DPX200>,
      <abs ABSG = 5 
       data hash MD5: 16K
       4F A1 2E 07 5F 4E D4 C3 A1 18 65 4E 91 D8 FE D7>)
$$ ##END=
$$ 
$$ hash MD5
$$ 1F B1 51 E3 B2 13 31 1D BD DC 82 FC A7 11 F3 24
##$RELAX= 
##$RELAX= 
##$RELAX= 
##$RELAX= 
##$RELAX= 
##$RELAX= 
$$ Bruker specific parameters
$$ --------------------------
##$DU= <F:/spectra>
##$EXPNO= 1
##$NAME= <H-F>
##$PROCNO= 1
##$TYPE= <nmr>
##$USER= <she>
##$AMP= (0..31)
100 100 100 100 100 100 100 100 100 100 100 100 100 100 100 100 100 100 
100 100 100 100 100 100 100 100 100 100 100 100 100 100 
##$AQSEQ= 0
##$AQ_mod= 1
##$AUNM= <au_zg>
##$AUTOPOS= <>
##$BF1= 200.13
##$BF2= 200.13
##$BF3= 200.13
##$BF4= 200.13
##$BF5= 200.13
##$BF6= 200.13
##$BF7= 200.13
##$BF8= 200.13
##$BYTORDA= 1
##$CFDGTYP= 0
##$CFRGTYP= 5
##$CHEMSTR= <none>
##$CNST= (0..31)
1 1 145 1 1 1 1 1 1 1 1 1 1 1 1 1 1 1 1 1 1 1 1 1 1 1 1 1 1 1 1 1 
##$CPDPRG= <>
##$CPDPRG1= <>
##$CPDPRG2= <>
##$CPDPRG3= <>
##$CPDPRG4= <mlev>
##$CPDPRG5= <mlev>
##$CPDPRG6= <mlev>
##$CPDPRG7= <mlev>
##$CPDPRG8= <mlev>
##$CPDPRGB= <>
##$CPDPRGT= <>
##$D= (0..31)
0 1.2 0 0 0 0 0 0 0 0.06 0 0.03 0 0 0 0 0.0002 0 0 0 0 0 0 0 0 0 0 0 0 
0 0 0 
##$DATE= 1639036319
##$DBL= (0..7)
120 120 120 120 120 120 120 120 
##$DBP= (0..7)
150 150 150 150 150 150 150 150 
##$DBP07= 0
##$DBPNAM0= <>
##$DBPNAM1= <>
##$DBPNAM2= <>
##$DBPNAM3= <>
##$DBPNAM4= <>
$$ [...]
##$SUBNAM2= <"">
##$SUBNAM3= <"">
##$SUBNAM4= <"">
##$SUBNAM5= <"">
##$SUBNAM6= <"">
##$SUBNAM7= <"">
##$SUBNAM8= <"">
##$SUBNAM9= <"">
##$SW= 18.0517287032376
##$SWIBOX= (0..15)
0 0 2 0 0 0 0 0 0 0 0 0 0 0 0 0 
##$SW_h= 3612.71676300578
##$TD= 16384
##$TD0= 1
##$TE= 0
##$TE2= 300
##$TE3= 300
##$TEG= 300
##$TL= (0..7)
0 120 120 120 120 120 120 120 
##$TP= (0..7)
150 150 150 150 150 150 150 150 
##$TP07= 0
##$TPNAME0= <>
##$TPNAME1= <>
##$TPNAME2= <>
##$TPNAME3= <>
##$TPNAME4= <>
##$TPNAME5= <>
##$TPNAME6= <>
##$TPNAME7= <>
##$TPOAL= (0..7)
0.5 0.5 0.5 0.5 0.5 0.5 0.5 0.5 
##$TPOFFS= (0..7)
0 0 0 0 0 0 0 0 
##$TUNHIN= 0
##$TUNHOUT= 0
##$TUNXOUT= 0
##$USERA1= <user>
##$USERA2= <user>
##$USERA3= <user>
##$USERA4= <user>
##$USERA5= <user>
##$V9= 5
##$VALIST= <valist>
##$VCLIST= <CCCCCCCCCCCCCCC>
##$VD= 0
##$VDLIST= <DDDDDDDDDDDDDDD>
##$VPLIST= <PPPPPPPPPPPPPPP>
##$VTLIST= <TTTTTTTTTTTTTTT>
##$WBST= 1024
##$WBSW= 4
##$XGAIN= (0..3)
0 0 0 0 
##$XL= 0
##$YL= 0
##$YMAX_a= 830429
##$YMIN_a= -635217
##$ZGOPTNS= <>
##$ZL1= 120
##$ZL2= 120
##$ZL3= 120
##$ZL4= 120
##$ABSF1= 15.70281
##$ABSF2= -2.349039
##$ABSG= 5
##$ABSL= 3
##$ALPHA= 0
##$AQORDER= 0
##$ASSFAC= 0
##$ASSFACI= 0
##$ASSFACX= 0
##$ASSWID= 0
##$AUNMP= <proc_1d>
##$AZFE= 0.1
##$AZFW= 0.1
##$BCFW= 0
##$BC_mod= 2
##$BYTORDP= 0
##$COROFFS= 0
##$CY= -3
##$DATMOD= 1
##$DC= 0
##$DFILT= <>
##$DTYPP= 0
##$F1P= 0
##$F2P= 0
##$FCOR= 1
##$FTSIZE= 16384
##$FT_mod= 6
##$GAMMA= 0
##$GB= 0
##$INTBC= 1
##$INTSCL= 0
##$ISEN= 128
##$LB= 0.24
##$LEV0= 0
##$LPBIN= 0
##$MAXI= 10000
##$MC2= 0
##$MEAN= 0
##$ME_mod= 0
##$MI= 1.114404
##$NCOEF= 0
##$NC_proc= -5
##$NLEV= 6
##$NOISF1= 3.799351
##$NOISF2= 2.8
##$NSP= 0
##$NTH_PI= 0
##$NZP= 0
##$OFFSET= 15.6345
##$PC= 1
##$PHC0= -15668.91
##$PHC1= 11.00081
##$PH_mod= 1
##$PKNL= yes
##$PPARMOD= 0
##$PSCAL= 0
##$PSIGN= 0
##$REVERSE= no
##$SF= 200.13002342412
##$SI= 16384
##$SIGF1= 3
##$SIGF2= 2
##$SINO= 5.538805
##$SIOLD= 16384
##$SREGLST= <1H.CDCl3>
##$SSB= 0
##$STSI= 16384
##$STSR= 0
##$SW_p= 3612.71676300578
##$SYMM= 0
##$S_DEV= 0
##$TDeff= 16384
##$TDoff= 0
##$TI= <>
##$TILT= no
##$TM1= 0
##$TM2= 0
##$TOPLEV= 0
##$USERP1= <user>
##$USERP2= <user>
##$USERP3= <user>
##$USERP4= <user>
##$USERP5= <user>
##$WDW= 1
##$XDIM= 16384
##$YMAX_p= 498341280
##$YMIN_p= -146535
$$ End of Bruker specific parameters
$$ ---------------------------------
##NTUPLES= NMR SPECTRUM
##VAR_NAME=  FREQUENCY,     SPECTRUM/REAL,   SPECTRUM/IMAG
##SYMBOL=    X,             R,               I
##VAR_TYPE=  INDEPENDENT,   DEPENDENT,       DEPENDENT
##VAR_FORM=  AFFN,          ASDF,            ASDF
##VAR_DIM=   16384,         16384,           16384
##UNITS=     HZ,            ARBITRARY UNITS, ARBITRARY UNITS
##FACTOR=    0.220516191357247, 1,           1
##FIRST=     3128.93276113902, 0,            0
##LAST=      -483.784001866759, 0,           0
##MIN=       -483.784001866759, -146535,     0
##MAX=       3128.93276113902, 498341280,    0
$$ Real data points
##PAGE= N=1
##DATA TABLE= (X++(R..R)), XYDATA
$$ [...]
8096B0202220O92229Q67189J030998J230570J408693J557753J659280J491586
8088C0140518R59915M5984r99004j674154j767933j536949j147766p14976l45596
8079B2960039q598K40704M02230L75141L0788n64189j290103j797736j869295
8070A8478981j718535j487312j201302r89585q41066p34355o24463n63727m91365
8061I827271m03418l45428l22357l08570k78091l02527l24429l18873l08882l07554
8051F607142l00259k98994k66968k37843k13194j96973j72838j79121j81798j50455
8041D408699r6318j14369r7833q9560o8386o8337n9064n2247o8834p2122p2967
8030C548662o6439q1916j02644q8522p8870o5192n4663m6569m7831m1007n0545
$$ y = [20202220, 20894449, 21761638, 22792636, 24023206, 25431899, 26989652, 28648932, 30140518, 31100433, 31146417, 30147413, 28473259, 26705326, 25168377, 24020611, 23305635, 22960039, 22951441, 23192145, 23594375, 23969516, 24000304, 23436115, 22146012, 20348276, 18478981, 16760446, 15273134, 14071832, 13082247, 12241181, 11506826, 10882363, 10318636, 9827271, 9423853, 9078425, 8756068, 8447498, 8169407, 7866880, 7542451, 7223578, 6914696, 6607142, 6306883, 6007889, 5740921, 5503078, 5289884, 5092911, 4920073, 4740952, 4559154, 4408699, 4312381, 4198012, 4100179, 4010619, 3942233, 3873896, 3814832, 3762585, 3693751, 3621629, 3548662, 3482223, 3400307, 3297663, 3209141, 3130271, 3065079, 3010416, 2963847, 2916016, 2875009, 2824464]
8019B824464n5735n0783o9329n4235l9035n2528p1261o0048m3687k5023k8818
8008B273982l3207k8007j6824l2331l1914l1708k5674m0611j2461J3814J129M431
7996B040619P075J0956p690J2240J804j934J0012J7057q676P766O600K525M191
7983B102545j0208k1750n8646k7875k7883j7014r306K2129J5778M0465M7383M8113
7971B103731M7149N816k0777m111m1747j1323J6146P187o882o7800o9686o3369
7959A894334o0670m4379m3548n7147n0366m7220n7807n7450l3117k6089o566J1404
7947A421379k0183j713N64j7163k3198l5524j5341j094n468j4132p912N256Q343
7934A293814N146j5342k4427j9422m4057m0861k4734j0091j1429k3495q279k943
$$ y = [2824464, 2768729, 2717946, 2648617, 2594382, 2555347, 2502819, 2431558, 2371510, 2327823, 2302800, 2273982, 2240775, 2212768, 2195944, 2163613, 2131699, 2099991, 2074317, 2033706, 2021245, 2035059, 2036188, 2040619, 2047694, 2058650, 2050960, 2063200, 2065004, 2063070, 2073082, 2090139, 2081463, 2089229, 2095829, 2098354, 2102545, 2092337, 2070587, 2011941, 1984066, 1956183, 1939169, 1929863, 1951992, 1967770, 2008235, 2055618, 2103731, 2150880, 2156696, 2135919, 2131808, 2090061, 2078738, 2094884, 2102071, 2095189, 2027389, 1957703, 1894334, 1833664, 1789285, 1745737, 1688590, 1638224, 1591004, 1533197, 1475747, 1442630, 1416541, 1409975, 1421379, 1401196, 1399483, 1400047, 1382884, 1359686, 1324162, 1308821, 1307727, 1302259, 1288127, 1280215, 1285471, 1293814, 1298960, 1283618, 1259191, 1239769, 1195712, 1154851, 1130117, 1120026, 1108597, 1085102, 1076823, 1073880]
7922A073880j1668J6499O093q448J3507K488j8493l211R478J3771K3806L4116
7910A151818M5369M6966N3174O7987O2736N7962Q4724P6612K3445k875j1676j5289
7898A640953j8194l9858q1452p2397m2802k5217j3605l0952m6768o1800n2819
7887A155089q6184q3290o3723o2048o0838m2773m4587k5998j4516l8498k4168
7876F08466j5091j2960m4671J442j240o891j4971k2034j7286q731m577m860q296
7863D48300l2542q67J40m769k735l0343j6165J0289J2940j0476j0608q715j0975
7850C43474j9941N888q392J1925j137q351l941j866J558m766J586o436N995j069
7836C14527j1439r174J8678P056j2447J2386O42l232n538N143O100m633j8104
$$ y = [1073880, 1062212, 1078711, 1084804, 1076356, 1089863, 1092351, 1073858, 1070647, 1080125, 1093896, 1117702, 1151818, 1197187, 1244153, 1297327, 1365314, 1428050, 1486012, 1570736, 1647348, 1670793, 1667918, 1656242, 1640953, 1622759, 1582901, 1501449, 1429052, 1386250, 1361033, 1347428, 1316476, 1269708, 1207908, 1155089, 1068905, 985615, 921892, 859844, 799006, 756233, 711646, 685648, 671132, 632634, 608466, 593375, 580415, 535744, 537186, 535946, 529055, 514084, 492050, 474764, 466033, 461456, 456596, 448300, 415758, 414891, 415031, 410262, 407527, 377184, 361019, 371308, 384248, 373772, 363164, 354449, 343474, 323533, 329421, 321029, 332954, 331817, 323466, 319525, 317659, 319217, 314451, 316037, 309601, 315596, 314527, 303088, 293914, 312592, 319648, 307201, 319587, 320229, 316997, 311459, 316602, 322702, 318069, 299965]
7823B99965j4021Q646n392j0470J2770j8130Q105L300O61J044L205r184N058M635
7809B90192m302p970J772K1082J1163J0098L4652J2336N2702J21938j05670k1419
7797D16574j3735k638j0435j7233j2665J0821j0945o30J1398n614J4776j7310
7785C62364j2521p220o856j3145o674j3982j1426k8632n528M280J966O275Q682
7772B77583J4922j3565N263k527o851K262j9861k980l679n943p334R443J6158
7759B62891N56j0127q365j4156j222M326j3586l0772j6571j6143m605k669J899
7746A51456j5365j5226o011K4082O220q355J3539Q250j505j0160J6341L283R01
7733A67450j898p96J033J3582j7461r358J0382r533q830m482J45l144P423O92
$$ y = [299965, 285944, 294590, 289198, 278728, 291498, 273368, 281473, 284773, 285434, 286478, 289683, 280499, 285557, 290192, 285890, 277920, 279692, 300774, 311937, 322035, 356687, 369023, 421725, 543663, 437993, 416574, 402839, 400201, 389766, 372533, 359868, 370689, 359744, 359114, 370512, 364898, 379674, 362364, 349843, 342623, 335767, 322622, 315948, 301966, 290540, 261908, 256380, 260660, 262626, 268901, 277583, 292505, 278940, 284203, 281676, 274825, 277087, 257226, 254246, 250567, 244624, 237290, 246733, 262891, 263447, 253320, 244955, 230799, 229577, 233903, 220317, 189545, 172974, 156831, 152226, 149557, 151456, 136091, 120865, 114854, 138936, 145156, 136801, 150340, 158590, 157085, 146925, 163266, 166549, 167450, 165552, 164756, 165789, 179371, 161910, 152552, 162934, 153401, 144571, 140089, 140234, 137090, 144513, 145205]
7719A45205j2260k233m943q265L966j6765k4351l745k704o804j5725j1754J7349
7706E6971n648r896j3837P689k733j529o133j9105k5211R339r818J2922J594j326
7692f721j825k3705j5544L957J0660M245R989k368Q634j1438j0422q842j3489
7679e6869L272J3865n201j72J2123j6166J1012p174j6654l23R816K672J360J0247
7665c8192n765J028O163q81J3730O635j0416j120Q708L069o111K802l493r366
7651c3209r043J1065J1165J664N61j3850P8p946L683l214J3834K5224j2743j9305
7637c2036K036Q879K930n639j4516N888J9520j2348l35J3954k2106J6389J172
7624a6212J202J864n140J006J9000j5067J5576M916J3366O65l439n606j1453k461
$$ y = [145205, 132945, 130712, 125769, 117504, 121470, 104705, 80354, 76609, 73905, 67101, 51376, 39622, 56971, 51323, 41427, 27590, 35279, 32546, 31017, 24884, 5779, -19432, -10093, -19911, -6989, -5395, -6721, -8546, -32251, -47795, -43838, -33178, -28933, -18944, -21312, -12678, -24116, -34538, -43380, -56869, -53597, -39732, -44933, -45105, -32982, -49148, -38136, -45310, -61964, -62287, -52471, -49799, -48439, -38192, -43957, -42929, -36766, -37647, -23917, -17282, -27698, -28818, -20110, -17041, -23152, -20350, -23843, -33209, -42252, -31187, -20022, -18358, -17797, -31647, -31569, -39515, -35832, -39046, -25212, 12, -12731, -32036, -30000, -21121, -18191, -23830, -38346, -32458, -12938, -25286, -25621, -11667, -33773, -17384, -16212, -15010, -13146, -18286, -17280, 1720, -13347, 2229, 7145, 20511, 21176, 17737, 12131, 678, -1783]
7610a783j11j5555L041n244N659J4249m940M277k8J373l749M681r260o52O037
7595b005M647R071j2440J0618J9301J5191J0010J2933p889j1732j63k0410l075
7582B4057j3113j0502L152Q692r379j7831M544J7273m166j1163L672N618K4014
7569B4868m988M272O485P386K620q238N948k59j7287j8469L502J021M696l0889
7555a9332R703L188m996p73l343m150J4177J5903p12Q359J7525Q85K4954K1841
7541H3229k524M911o101q898j1069j1148k572o042K051l151j4610l805O138m156
7527B2253l776r049K034J128o773R054K955J4113Q090J2531J5634j226K849j025
7513F8792O850K863Q092J5856l695j7364r325o717k4276p563n654m567J5217j5222
$$ y = [-1783, -1894, -17449, -14408, -19652, -13993, 256, -4684, -407, -435, 938, -2811, 1870, -7390, -8042, -2005, 2642, 11713, -727, 9891, 29192, 44383, 54393, 67326, 59437, 47705, 47542, 27132, 24057, 10944, 442, 3594, 12286, 2907, -14924, -10380, 6893, 2727, -8436, -4764, 854, 24868, 19880, 24152, 30637, 38023, 40643, 32405, 38353, 38094, 20807, 2338, 5840, 6861, 11557, -19332, -9629, -6441, -11437, -12210, -15553, -19703, -5526, 10377, 9665, 18024, 35549, 36434, 61388, 83229, 80705, 85616, 79515, 70617, 59548, 48400, 45828, 39786, 41837, 38686, 24076, 20271, 26409, 22253, 18477, 9428, 11462, 12590, 5817, 14871, 17826, 31939, 40029, 52560, 68194, 66968, 69817, 68792, 75642, 78505, 86597, 102453, 98758, 81394, 72069, 65352, 41076, 33513, 27859, 23292, 38509, 23287]
7499B3287R52J2367j4914o934J5455J5166O952L494Q78J3161K0830K1631k739
7486A09586j7287o929r27L669j2779m981n435p574N251j58k235j2135J762J4175
7472F4003J5022J6405j8814J052J6123Q112Q733K4655J1576n433J4417j9122j7841
7459A18888m4546p276P299k2553k0654j1831p011j6908j6376J339K480o529K310
7446b1368M009j3180K194J221K931J3055O539M93J696k98L056r126j4040p478
7432c0296j8816j4624J0256J8001l1160o15k276L369l679r68o659j7161J0822
7419h3806Q212j2489P228M84j4378j6092j327J0344p063J1825K0913l026j7951
7406i7126R851o427M01j7122m905J1861J0963j6930r866P056J0040m480K93N967
$$ y = [23287, 24239, 36606, 21692, 14758, 30213, 45379, 52331, 55825, 56703, 69864, 90694, 112325, 109586, 92299, 85370, 84443, 88112, 75333, 70352, 64917, 57343, 62594, 62436, 60201, 48066, 49828, 64003, 79025, 95430, 76616, 77668, 93791, 101903, 110636, 135291, 146867, 141434, 155851, 136729, 118888, 74342, 67066, 74365, 51812, 31158, 19327, 12316, -4592, -20968, -19629, -17149, -23678, -21368, -17359, -30539, -28345, -27124, -24193, -11138, -4599, -4106, -2410, -2708, 348, -8778, -22818, -30296, -49112, -63736, -53480, -35479, -66639, -67254, -69530, -66161, -69840, -70808, -77467, -94628, -83806, -75594, -88083, -80855, -80371, -94749, -110841, -112168, -101824, -108887, -97062, -76149, -79175, -97126, -87275, -93702, -93301, -110423, -115328, -103467, -92504, -109434, -119300, -112244, -102204, -106684, -106391, -100424]
7392a00424k081P976o586Q25N620P776k080J0344L602j6057L655o104j1574J5083
7378i0025j876k031p171k789r54p554O043J828m989j0802J5661M959j3397q32
7364a13929J2302J873j2269N665J7542n294Q383M902q195l285m291J514Q264l118
7350h9936L359O073p737J6747K679J0546j5407j31o724m409J1169j2596l45J4813
7336g1899m437o089J0739j4609o950r85K69P159K0176K671l151k2479K530J2418
7322g4637o66m979j1671Q978o512q86J5777J1869M443R739J1754o568m558J0999
7308c6918k1417j3683M035m680N427k1710k415J2441n150o626o413m588l20M547
7294i7470q886J4822j1686M25R119r363J3351j4872l449R496J6509q966J188j03
$$ y = [-100424, -102505, -94529, -101115, -100290, -94670, -86894, -88974, -78630, -75028, -91085, -87430, -93534, -105108, -90025, -91901, -93932, -101103, -103892, -104846, -112400, -106357, -104529, -109518, -120320, -104659, -99700, -113097, -113929, -101627, -99754, -112023, -106358, -88816, -94110, -85727, -80825, -89020, -92305, -96596, -95082, -86818, -89936, -86577, -80504, -88241, -71494, -68815, -58269, -73676, -73807, -80531, -84940, -73771, -86367, -86712, -71899, -76336, -82425, -71686, -86295, -93245, -94230, -93961, -86802, -66626, -63955, -67106, -89585, -87055, -74637, -75303, -80282, -91953, -82975, -89487, -90373, -74596, -62727, -58284, -48545, -36791, -43359, -47917, -36918, -58335, -72018, -67983, -72663, -67236, -88946, -91361, -78920, -84070, -90696, -97109, -101697, -102017, -97470, -106356, -91534, -103220, -102795, -93676, -103039, -89688, -104560, -108009, -98513, -82004, -90970, -89782, -89885]
7280h9885j1740k333n991J7049l10m116O60k572o160J2557R069j1237n722J1168
7266h9563k720j1015j442m4j9532O971Q199J0575j3911k4619J1258l364L215Q232
7252a17760k224j3972J4003J5939q891o410P878J5684N17o774j701P200q108l034
7238a07653l320m30K712P423O969j075M370J4472j1182K119K108j0844k909Q697
7224h8543J0424M097o545j5424M845o741O394R284L314n722o672J841K944J2112
7210g4392j1701J918J4068Q702m174m216K167j145J5181j1327j5782L664r918
7197h6955j0463J3646j6159p163K0238J3867J2755p079p490n217k4529l290J6494
7184i1345J5498N72O288P78N850j4908m319Q112M191M706m805J3775J8582j8663
$$ y = [-89885, -101625, -103958, -109949, -92900, -93210, -97326, -96666, -99238, -105398, -92841, -83772, -95009, -100731, -89563, -92283, -103298, -104740, -104784, -124316, -117345, -109146, -98571, -112482, -137101, -125843, -129207, -125992, -117760, -119984, -133956, -119953, -104014, -112905, -119315, -111437, -95753, -95236, -102010, -103711, -96511, -104619, -107653, -110973, -111403, -108691, -101268, -94299, -95374, -91004, -76532, -87714, -85595, -83487, -94331, -97240, -88543, -78119, -74022, -80567, -95991, -91146, -97887, -91493, -82209, -78895, -84617, -91289, -89448, -86504, -74392, -86093, -84175, -70107, -61405, -65579, -69795, -67628, -68773, -53592, -64919, -80701, -77037, -86955, -97418, -83772, -99931, -107094, -86856, -72989, -60234, -67313, -74803, -80020, -104549, -107839, -91345, -75847, -75275, -68987, -68209, -62359, -77267, -81586, -73474, -69283, -64577, -69382, -55607, -37025, -55688]
7170e5688K0767n999P044k735k2005J8227J1559Q272J0577K2377J250n850O761
7157A4557R772J8885o221m322Q985k429Q409n758q971m313J1341j7763k5192O420
7143C400J492K03Q080j6959j3885m488J3916J4862J3283O882k787K568j1456q930
7129F181m412j5655k49p864k1205k330J0771j1325j4252p382J2473L805O440J6027
7115b8977k5090n495J1399p850m794q533k323j788J3040K74K0293j4767j7422
7102g2033M662j0117J6183O060J20p459J5841J5041m187o862r463n41j824l930
7088e8509m991R361P252j010j0688Q655K4521O424k0277o570J2779J889K0383
7075a0781j6852O681K4486J0857R758O749P529j0591o776k7267k442J2330J618
$$ y = [-55688, -34921, -40920, -33876, -36611, -58616, -40389, -28830, -20558, -9981, 12396, 13646, 7796, 14557, 24329, 43214, 36993, 32671, 41656, 39227, 47636, 41878, 32907, 28594, 39935, 22172, -3020, 3400, 4892, 5095, 13175, -3784, -17669, -22157, -8241, 6621, 19904, 26786, 23999, 26567, 15111, 6181, 1769, -13886, -14135, -21999, -43204, -45534, -34763, -46088, -60340, -67722, -55249, -51444, -45004, -28977, -54067, -59562, -48163, -56013, -60807, -69340, -71663, -73451, -60411, -60137, -39844, -54611, -72033, -67371, -77488, -61305, -55245, -55125, -62584, -46743, -31702, -35889, -42751, -52214, -52755, -54579, -58509, -63500, -54139, -46887, -47897, -58585, -49930, -25409, -18985, -39262, -45832, -33053, -31164, -10781, -27633, -20952, 3534, 14391, 24149, 30898, 38427, 27836, 21060, -6207, -8649, 3681, 5299]
7062E299m603J0187N64l694k1306j5921J9613J4026o146P357J7220j1335P943
7049A9204k5968K654Q475O108k442j117K707J3876J1728O166J3243q172m93k663
7035D3306J5927N248n910J7215J973j0544M309J5200l610l560J371L649j5295
7022F9279M580O412J7590k084m92J7069n968K2521J3496J303J2363K0369M416
7009A80854j6716J7381K5529K1909L6151n317j2033j9712J1702J2066K428Q17
6997B55059O778n991k4089l8408k1667O236O85j0907k0888o006J0380m451j7802
6984A28929q998l390P139J7979Q717M32k421p940Q669L753M326q218n022P133
6970A51088O729N704J447K5874N211l78P815J1977J9299J2104r472K8370J4161
$$ y = [5299, 696, 10883, 11447, 7753, -13553, -29474, -9861, 4165, -1981, 5376, 22596, 11261, 19204, -6764, -4110, 4365, 10473, 8031, 6914, 9621, 23497, 35225, 41391, 54634, 46462, 45969, 43306, 59233, 64481, 58571, 75786, 77759, 67215, 71524, 86724, 83114, 79554, 80925, 84574, 69279, 73859, 80271, 97861, 95777, 95285, 112354, 106386, 128907, 142403, 143706, 156069, 176438, 180854, 164138, 181519, 207048, 228957, 265108, 259791, 247758, 228046, 239748, 251814, 254242, 255059, 261837, 255846, 231757, 193349, 171682, 177918, 178603, 167696, 146808, 140802, 151182, 146731, 128929, 119931, 116541, 123680, 141659, 150376, 150808, 148387, 140447, 149116, 152869, 157195, 148977, 143955, 151088, 157817, 163521, 164968, 190842, 196053, 195675, 203490, 215467, 234766, 246870, 237398, 265768, 279929]
6957B79929L346Q426J4769P168J4989J4323L024L5742O251K1011J6643K1358K3562
6944D70541J5088L1531K2620L4356L8445L8781K4037M9428N1742M5568M4126O8911
6932I35174N1247N2705O6757O2647J00892R8855J13351R4744Q4046J51616J48622
6921A960656J94469K44026L11545L58560M39579N04793O07498O68126Q18908J008987
6911G117147J191023Q45112Q16106K82577j529755j738149j451369j091603p58756
6902C682333n71345l86332l00291k38509k02414j81488j70454j36732j07792j13701
6892A273275j02969p5259p1218o2930n9650l5926m3923n5690n3493j6713n2836
6881F42668m5153j5441l067k8382l2736k2678q970l4272l5913l4413r362j4300
$$ y = [279929, 283275, 291701, 306470, 313638, 328627, 342950, 345974, 381716, 387967, 408978, 425621, 446979, 470541, 485629, 517160, 539780, 574136, 612581, 651362, 675399, 724827, 776569, 822137, 866263, 935174, 986421, 1039126, 1105883, 1168530, 1269422, 1368277, 1481628, 1576372, 1660418, 1812034, 1960656, 2155125, 2399151, 2710696, 3069256, 3508835, 4013628, 4621126, 5289252, 6108160, 7117147, 8308170, 9153282, 9969388, 10251965, 8722210, 6984061, 5532692, 4441089, 3682333, 3110988, 2724656, 2424365, 2185856, 1983442, 1801954, 1631500, 1494768, 1386976, 1273275, 1170306, 1095047, 1023829, 960899, 901249, 865323, 821400, 765710, 712217, 695504, 642668, 597515, 582074, 579007, 550625, 517889, 495211, 486241, 451969, 416056, 381643, 372281, 357981]
6869C57981N7k1245o182L530O60o954P34J2463J794J3430O428l834J4642j784
6855C71720M295J8379j1841j5357p224j2862k820l83o686j2822j4794k4548k5936
6842B59121k4079o886k4579k2560j9253j0540l1066m556n788j4548k1405j9764
6830E4097K789j2042l404j0079k889n417o516q012j3397k876r189j992Q864j70
6816a0233j3054j2982o795L244l140p589J5185J1833j9256o314j052j2848j3645
6803g6646J968L721K1465J8757j4476J658j4139j0090p006j3418J9376K0037n933
6790e4726j0093M083j8629J5241J3907j5658n326o537J7572j15n495j1750N375
6777g2151Q057m280r740L831M675O918q649j2240J6510K994q408o14j036o97j6251
$$ y = [357981, 358038, 336793, 330611, 334141, 334801, 327847, 328581, 341044, 342838, 356268, 362696, 358862, 373504, 371720, 376015, 394394, 382553, 367196, 359972, 347110, 344290, 343907, 337221, 324399, 309605, 285057, 259121, 235042, 228156, 203577, 181017, 161764, 151224, 120158, 115602, 109814, 95266, 73861, 54097, 56886, 44844, 41440, 31361, 28472, 23055, 16539, 8527, -4870, -7746, -16935, -18927, -10063, -10233, -23287, -36269, -43064, -39820, -42960, -50549, -35364, -23531, -42787, -49101, -50153, -63001, -76646, -74678, -70957, -49492, -30735, -45211, -43553, -57692, -67782, -74788, -88206, -68830, -48793, -54726, -64819, -60736, -79365, -64124, -50217, -65875, -71201, -77738, -60166, -60281, -65776, -77526, -72151, -64094, -68374, -78114, -74283, -69608, -62690, -71339, -83579, -67069, -64075, -72483, -73097, -74133, -74830, -91081]
6762i1081Q685J947J2238r41L191o20j1588J2922L891K022l317Q416Q173j5692
6748f1754J0588J5544j2652j1367K869K687K537l241o915p359J4318J1464j2808
6735e6089j0703L261J373j1208K3672J622L336L495j417r954K748J062j1345j2812
6721g2959J4704l36P686P677n791p942N707J7244j5606k199o497J6152J3870J9105
6707i185r504q268m120O193R544J546O828p58R476P847p759Q325j485j9954j8368
6692b9642L878N764j3840j526j31p897o881K391k969Q184N043r935o72n998J5010
6677c9221j1101j6649Q137j2914N536Q367m774j1063O827j4985o59R560O351j5061
6663h1649j3047J1411k3058J625K2885j2188q923P644j0540j0151Q311k714Q32
$$ y = [-91081, -82396, -80449, -68211, -69152, -65961, -66581, -78169, -65247, -61356, -59334, -62651, -54235, -46062, -61754, -51166, -35622, -48274, -59641, -56772, -54085, -51548, -54789, -61704, -69063, -54745, -43281, -56089, -66792, -63531, -62158, -73366, -49694, -48072, -44736, -41241, -42658, -52612, -49864, -48802, -60147, -72959, -58255, -58591, -50905, -43228, -49019, -56961, -51254, -34010, -49616, -51815, -58312, -42160, -28290, -9185, -18689, -26957, -31077, -24884, -15340, -13794, -6966, -7724, 1752, 9599, 1840, 10165, 8680, -11274, -29642, -25764, -20000, -33840, -35366, -35497, -43394, -50275, -47884, -50853, -42669, -37626, -47561, -48233, -54231, -39221, -50322, -66971, -58834, -71748, -66212, -57845, -62619, -73682, -66855, -81840, -82499, -72939, -66588, -81649, -94696, -83285, -106343, -104718, -81833, -94021, -102944, -95300, -105840, -115991, -107680, -110394, -109562]
6650a09562q375O310r989k103O594n304J1386n765O95n112K5098k225r989R589
6636i8752L496k115n838m996j2039k005m309L127M23o077J6748J4050n537j1534
6622a15358j978r758J2663K347p389O461J4490P432k3934J771N009P834O810n659
6608i9259m881J063N091L192k0838J593J7802R269m653j8499J297J5581O965j396
6594h7673J926q679Q727L449j5380l914J2862Q538n873m922j7774J0977l07o365
6580a04408M790J4449J1r508m094r42P810L221o3L447k296K09m381J4193O50k742
6564g9654O889r234j0735J3952J8245j2310q439k553l911j0963J5847j0007K786
6551i0087J2309j709R86l083j1630J6329m291r568R592J572J9310n553n618m177
$$ y = [-109562, -117937, -111627, -121616, -123719, -117125, -122429, -111043, -116808, -116113, -121225, -96127, -98352, -108341, -98752, -95256, -97371, -103209, -108205, -120244, -122249, -126558, -123431, -123008, -129085, -112337, -98287, -103824, -115358, -117336, -127094, -114431, -112084, -119473, -113012, -98522, -91090, -115024, -113253, -108244, -100410, -93600, -99259, -104140, -103077, -97986, -94794, -115632, -114039, -96237, -86968, -91621, -110120, -108823, -93242, -86277, -87673, -85747, -94426, -85699, -82250, -97630, -101544, -88682, -80144, -86017, -90939, -108713, -97736, -98043, -104408, -99618, -85169, -85158, -94666, -98760, -99702, -91892, -88671, -88734, -85287, -87583, -87374, -91755, -77562, -76912, -79654, -72765, -81999, -92734, -78782, -60537, -72847, -81286, -83839, -87750, -98713, -82866, -92873, -90087, -77778, -79487, -78501, -81584, -93214, -76885, -81176, -90744, -81152, -79580, -60270, -65823, -71441, -75618]
6537g5618q097m61L570n769j1292m552M698J2899k878j6094m012j63j2335L265
6523a16839L828l688R487o314J4446j893n987j3179M021N18M594J4136q184L628
6509a01426l988L727J352N58K668k179J789M607J577Q880j8475k486K752n932
6495a06576n574j8903j5482J1430J6219p194J400R685j6049J0697O088n381j2672
6482a32312N213L460J0053j0740j2097j749j208N557o991J7168J6172j9115mO01
6468a25992q824J2829j1294M302N921R601J8960j6360j0577n720L559J0344j147
6455a14398P648Q087j2739P716m462P577R162j3117K8035q043r490o616j210q056
6441a09906l05J1261j735N451P15M22k943R613j190n87q579j223J6149J1022n34
$$ y = [-75618, -83715, -84176, -80606, -86375, -97667, -102219, -97521, -84622, -87500, -103594, -107606, -107769, -120104, -116839, -113011, -116699, -107212, -113526, -99080, -100973, -106960, -120139, -116118, -115600, -111006, -96870, -105054, -101426, -105414, -101687, -100335, -99777, -97109, -99288, -97499, -92892, -91315, -82435, -100910, -103396, -100644, -106576, -112150, -131053, -146535, -135105, -118886, -126080, -124680, -114995, -131044, -120347, -114259, -119640, -132312, -127099, -123639, -113586, -124326, -136423, -138172, -139380, -133823, -140814, -123646, -107474, -126589, -126593, -125992, -134816, -121987, -133281, -128979, -123058, -113457, -94497, -110857, -121434, -127154, -123595, -113251, -114398, -106750, -98663, -111402, -103686, -108148, -100571, -91409, -104526, -76491, -84534, -94024, -100640, -101850, -109906, -110211, -98950, -100685, -95234, -94519, -94097, -97040, -87427, -88617, -89204, -97783, -99006, -82857, -71835, -72369]
6426g2369K960L363J726J8437j0125k0952O748K340O299J7054l514l558r154J9665
6412d1080K074k242j0295m734L864K4145k800n120P111J0772j1707q715m446J5125
6398b8048J449j5748p483m221O332R458o583K57J684J3586J0757k5929k307m498
6384e1294R243j2272M105m762N974N390M425J919n944K740l959K1445j9117j4298
6370e6405J0555j181L586j889N615K701J919r902j6237R103O015J4996J3460l594
6356b1258m821l519J4367k58J2581J6657L424k826J140j331K8919J616n803J0084
6342D8972j1626j6502j3171k1754j2181n787k260j2411j9952o390L811j4635m282
6329h8168K097L384m531P441K39j9431R104N169k431j4942l148k298O979j004
$$ y = [-72369, -69409, -66046, -64320, -45883, -56008, -76960, -70212, -67872, -61573, -44519, -48033, -51591, -60745, -41080, -39006, -41248, -51543, -56277, -52413, -28268, -31068, -36188, -29077, -18305, -30012, -38727, -43173, -28048, -26599, -42347, -49830, -54051, -47719, -38261, -44844, -44587, -42903, -29317, -18560, -44489, -46796, -51294, -42051, -54323, -50218, -54980, -49006, -43616, -39191, -37272, -43216, -40476, -44435, -22990, -42107, -56405, -45850, -47031, -43445, -45334, -39719, -37018, -35099, -45001, -61238, -52135, -46120, -31124, -17664, -21258, -26079, -29598, -15231, -15489, -2908, 13749, 17173, 14347, 15487, 14156, 43075, 44691, 38888, 48972, 37346, 20844, 7673, -14081, -26262, -32049, -34309, -46720, -66672, -73062, -69251, -83886, -88168, -86071, -82687, -87218, -79777, -79538, -98969, -89865, -84696, -87127, -102069, -105217, -107515, -100536, -101540]
6315a01540j3563J1066K918K632P060L004j1058J2613M574o474j9509r048R285
6302a08040J184P081K697Q023n687L094k839J6613k385r100r165N404r944l26
6288a03390J3336J2286r065J3360K675p282Q378q236j6936J3285l44L898L617
6275g4418j557m757j2930Q268P727K471k0312j6814J2294O361Q706K3559r114
6262g0516m356J981k208k967j546K278l370m142K689P16j399j0817J8260l215
6248g8612R799M48k477m149L851n705L0147l139O838M474K379j1614J1929M853
6234c0978L295n398j772J9431k6301M574R075J2792O056q007J156j847j9753O601
6220c1076q77m182j242O432j8590M029P249O112o678Q012R172j789q028r7N877
$$ y = [-101540, -115103, -104037, -101119, -98487, -91427, -88423, -99481, -86868, -82294, -88768, -108277, -117325, -108040, -106856, -99775, -97078, -89055, -94742, -91648, -94487, -77874, -80259, -89359, -98524, -93120, -103064, -103390, -90054, -77768, -86833, -73473, -70798, -78080, -69702, -77938, -94874, -81589, -81933, -78035, -74418, -75975, -80732, -93662, -85394, -77667, -75196, -95508, -112322, -100028, -93667, -84961, -61402, -70516, -74872, -72891, -75099, -78066, -79612, -77334, -80704, -84846, -82157, -81441, -82840, -93657, -75397, -78612, -68813, -68365, -70842, -74991, -71140, -76845, -46698, -49837, -42999, -38525, -36146, -47760, -35831, -30978, -27683, -33081, -34853, -15422, -41723, -37149, -28074, -15282, -9226, -17233, -16077, -17924, -37677, -31076, -31953, -36135, -37377, -30945, -49535, -45506, -38257, -32145, -38823, -30811, -21639, -23428, -31456, -31553, -25676]
6205b5676m956l0801l689j918J5816M880j8024m62j2018K0527P24r933n731l089
6191g4350M488m905J3691k041p133M471K029j6281J1086J5601p394k844J4925
6178d8657j6509o613M53j2866O428R065J8377J6121o732m484n149J0887J8337
6165b1342l509L814p163O44P886K0074K538p790m764k021n816k098k905N741O936
6150i775N564q98q104J966K026l203j1768R490n612m88P936m843j1252q730J2722
6135b4969m367m593n729P055J444O135J8790J3911J1308j5838L381K596O718J6690
6121C2532j3671n469o534j4037p414P135J261r75N127n582M488K1397r436q457
6107C65o224k0644L226K2530J3317j534j0932P432L060O354l013N282o851J939
$$ y = [-25676, -30632, -61433, -65122, -67040, -51224, -46344, -64368, -64830, -76848, -56321, -55597, -65530, -71261, -74350, -69862, -74767, -61076, -63117, -70250, -65779, -63750, -80031, -68945, -53344, -60738, -63582, -48657, -65166, -71779, -71326, -84192, -77764, -68699, -50322, -34201, -40933, -45417, -50566, -39679, -21342, -24851, -21037, -28200, -27556, -19670, 404, 2942, -4848, -9612, -11633, -17449, -19547, -22452, -16711, -9775, -4211, -5109, -13213, -11247, -9221, -12424, -24192, -14702, -20314, -20802, -12866, -17709, -28961, -37691, -24969, -29336, -33929, -39658, -32603, -31159, -25024, -6234, 7677, 18985, 3147, 6528, 9124, 15842, 32532, 18861, 13392, 6858, -7179, -14593, -7458, -6197, -7172, -2045, -7627, -3139, 18258, 8822, 365, -5859, -26503, -23277, -747, 12570, 11036, 104, 7536, 10596, 16950, 13937, 19219, 12368, 14307]
6093A4307O102J7941N847j6156Q366J2837m254m696m959O986j2462n654K1571
6080D5776n804R305j0445J3168J4107j6390n674n854j3080L175M513J6974J609
6067E1380j9170j6030J839R616j0199q226Q337q00K394J4264l59O06j2733J0466
6053C1385M112O078K777o128J3079j6951J205n128l581K4783l084J036J0378O687
6039F6648J273k5446Q724Q128J628M274J5483o297l023j5019m53L25n563J2448
6025F3130J7433k871J276J0912m774l334m560J9362j6813j5348j916K1686J1866
6012I6049J19p413J2431k291o627M29j2004J5706Q690J5844M176k804K0556K7028
5998A69889M229R127J071j8135K55J2707R237J5410k524M954Q173j61J152j1400
$$ y = [14307, 20409, 38350, 44197, 28041, 36407, 49244, 44990, 40294, 35335, 42321, 29859, 24205, 45776, 39972, 49277, 38832, 52000, 66107, 49717, 44043, 38189, 25109, 28284, 32797, 49771, 51380, 32210, 16180, 18019, 27635, 17436, 9210, 17547, 16747, 19141, 33405, 33046, 33652, 20919, 31385, 35497, 41575, 44352, 38224, 51303, 34352, 35557, 30429, 26848, 51631, 48547, 49583, 59961, 66648, 67921, 42475, 51199, 59327, 60955, 65229, 80712, 74415, 71392, 56373, 55920, 56245, 50682, 63130, 80563, 77692, 78968, 89880, 85106, 81772, 77212, 96574, 79761, 64413, 62497, 84183, 96049, 96168, 88755, 101186, 98895, 92268, 92697, 80693, 96399, 105089, 120933, 125109, 122305, 142861, 169889, 174118, 183245, 184316, 166181, 166436, 179143, 188380, 203790, 201266, 206220, 214393, 214232, 215384, 203984]
5984B03984N747K4707J9715j290O50K14j9915Q076K0025L005J4313Q312J4882
5971C02425P684J9504P417J3148k362P218K318q708j4486j3191l561J4994K460
5958C34860k1922j5233k150K3812j0405q629Q442J7261K786J296N999J4138j058
5945C49197k936J535J2433M758K6816J7413K4794K0525Q168R209K2562J4859P102
5932E16435K4766O404j2401L839Q706k241J596K0826J4568l380L9264k901J1337
5919F26818M2770J8542J8874K2600L0041J8826K4154K3515J1242L3739M1518K7266
5907I39905L3732L2543J5573L8836L9959J5727J9417J7661J5404J4384J1869L6923
5895A231933L7081L9716M1905M4457M0308L7381J4472L1155L2912K6289L3125
$$ y = [203984, 209731, 234438, 254153, 252863, 253513, 253727, 233812, 241888, 261913, 264918, 279231, 287543, 302425, 310109, 329613, 337030, 350178, 347816, 355034, 357352, 348644, 334158, 320967, 317406, 332400, 334860, 312938, 297705, 295555, 319367, 308962, 300333, 308775, 326036, 328822, 330118, 336117, 350255, 349197, 346261, 347796, 360229, 364987, 391803, 409216, 434010, 454535, 462703, 471912, 494474, 509333, 516435, 541201, 547605, 535204, 539043, 547749, 545508, 547104, 567930, 582498, 579118, 618382, 615481, 626818, 669588, 688130, 707004, 729604, 759645, 778471, 802625, 826140, 837382, 871121, 912639, 939905, 973637, 1006180, 1021753, 1060589, 1100548, 1116275, 1135692, 1153353, 1168757, 1183141, 1195010, 1231933, 1269014, 1308730, 1350635, 1395092, 1435400, 1472781, 1487253, 1518408, 1551320, 1577609, 1610734]
5884A610734K5485L7853M7939L6998L7919M9544N2303O8294Q2006P2827P6868
5873B198770Q3940J10593J18859J16101J27266J43827J51603J79983J95107K17445
5863C643494K46087K82599L34694L59625M15436M66099N04676N12464N49598N34164
5853G848936M48063L11709J21717m7109j77677k50714k48694j88097o6304L4091
5843G785921J51888K28769K71224L07580K86944J93518K2070j67380l87331n19445
5833H173758n86284n78793n28229m44161l76425l22573k62209k25141j58940j33241
5823D557762j20327p4065o3238r2154p7503o2186m7156k6043K501j2217K0252
5812D005626L2728K1385L2928N5824O0808R3319R9029P4898R6150J02401J21955
$$ y = [1610734, 1636219, 1674072, 1722011, 1759009, 1796928, 1846472, 1898775, 1967069, 2049075, 2121902, 2198770, 2282710, 2393303, 2512162, 2628263, 2755529, 2899356, 3050959, 3230942, 3426049, 3643494, 3889581, 4172180, 4506874, 4866499, 5281935, 5748034, 6252710, 6765174, 7314772, 7848936, 8296999, 8608708, 8730425, 8683316, 8505639, 8254925, 8006231, 7818134, 7751830, 7785921, 7937809, 8166578, 8437802, 8745382, 9032326, 9225844, 9247914, 9080534, 8693203, 8173758, 7587474, 7008681, 6480452, 6036291, 5659866, 5337293, 5075084, 4849943, 4691003, 4557762, 4437435, 4363370, 4300132, 4207978, 4130475, 4068289, 4021133, 3995090, 3997591, 3985374, 4005626, 4038354, 4059739, 4092667, 4148491, 4209299, 4302618, 4401647, 4476545, 4572695, 4675096, 4797051]
5801D797051J54534J89003K06482K42690K67418K78372L14651L52753M35795N01622
5791G740371N83031O39484P06786P87210Q33364Q54146Q33224P04691M87131K07008
5781A4376446r5170l31081m37194m16157l59928k07570n7219Q7748K26309L01820
5771A3088004L32382K98680J21567r3593l98001p22173r36004j036382j028473
5762I626007r39944q62787p38315o32905n42016m71361m27727l62400k86395k72315
5752D089842k42140k02522j97660j67090j32265j32080j27081r0869r2434p5745
5742B629956r9032j09570o7138m3341o5601p1350o4333k1389m7492n2011k3264
5731A965435k4694k7073j4881p866P07k7634K803J6239P931J8334J9539K3736
$$ y = [4797051, 4951585, 5140588, 5347070, 5589760, 5857178, 6135550, 6450201, 6802954, 7238749, 7740371, 8323402, 8962886, 9669672, 10456882, 11290246, 12144392, 12977616, 13682307, 14169438, 14376446, 14281276, 13950195, 13513001, 13096844, 12736916, 12529346, 12472127, 12559875, 12786184, 13088004, 13420386, 13719066, 13840633, 13747040, 13349039, 12626866, 11690862, 10654480, 9626007, 8686063, 7823276, 7084961, 6452056, 5910040, 5438679, 5010952, 4648552, 4362157, 4089842, 3847702, 3645180, 3447520, 3280430, 3148165, 3016085, 2889004, 2798135, 2705701, 2629956, 2530924, 2421354, 2354216, 2310875, 2245274, 2173924, 2109591, 2088202, 2040710, 1988699, 1965435, 1940741, 1913668, 1898787, 1890921, 1891628, 1863994, 1866797, 1883036, 1890967, 1909301, 1928840, 1952576]
5719A952576L7977P2875O0042M5661O8221M0379N228J6188L7086L7829L0668O973
5707B411703k2230m7236p1497n0402p5604l5306l7239m1988n8912n1792l6394
5696A883103m1174k038J7530K3173M1360M5637N3978L8419J401M730K6557K2481
5684B115157L6981K6248k8378k8740n9219n5811o0377n9493m4424l8034o1619
5673A742291p3172p1090m9740k9053m9206j3142j676j4230J2624o792J1511L7133
5661A495458J2492J5922L3063L7287J3622K5375K0828n773K0141L4992J8824L5018
5649A757249N4607M6402M1488O2637K7487M3613O3499O3865O5671Q1232P4822
5638B382572O9496P7727R7435Q7813J21765J26959J27119J31645J51280J81234
$$ y = [1952576, 1990553, 2063428, 2123470, 2169131, 2237352, 2277731, 2282959, 2299147, 2336233, 2374062, 2404730, 2411703, 2389473, 2342237, 2270740, 2220338, 2144734, 2109428, 2072189, 2030201, 1971289, 1919497, 1883103, 1841929, 1839891, 1857421, 1880594, 1921954, 1967591, 2021569, 2059988, 2061389, 2066119, 2092676, 2115157, 2152138, 2178386, 2150008, 2121268, 2062049, 2006238, 1945861, 1886368, 1841944, 1803910, 1742291, 1669119, 1598029, 1548289, 1519236, 1470030, 1456888, 1455212, 1440982, 1453606, 1446814, 1458325, 1495458, 1507950, 1523872, 1556935, 1594222, 1607844, 1633219, 1654047, 1648274, 1668415, 1703407, 1722231, 1757249, 1811856, 1858258, 1899746, 1962383, 1989870, 2033483, 2096982, 2160847, 2226518, 2307750, 2382572, 2452068, 2529795, 2627230, 2715043, 2836808, 2963767, 3090886, 3222531, 3373811, 3555045]
5628C555045J91097K03406K07086K53027K73137K99233L23663L60516M22201M77225
5618F565636N09970N71302O36503P07290P53016P70051P81689P17269N64828M00290
5608A2977844J43976j64169m12613n67213o03658n38690m53896l26369j89897
5599I865315n5752M9137J63556K80537L75446M47634N27529N47418N28540M62064
5589A3191424K70665J5892k92349o14575q45767r86944r96273r19978p95766o77634
5579G348695n62116m71576m09125l35585l05806k56732k27533k08610j62933j40961
5569D267718j13534q4653o4961l6146l6472k9622n804L941L7514L3886O0877P8317
5557D111061P7324R1047R6359J10840J17079J55648J60140K17141K70832L00519
$$ y = [3555045, 3746142, 3949548, 4156634, 4409661, 4682798, 4982031, 5305694, 5666210, 6088411, 6565636, 7075606, 7646908, 8283411, 8990701, 9743717, 10513768, 11295457, 12012726, 12577554, 12977844, 13121820, 12957651, 12545038, 11977825, 11374167, 10835477, 10381581, 10055212, 9865315, 9809563, 9858700, 10022256, 10302793, 10678239, 11125873, 11653402, 12200820, 12729360, 13191424, 13462089, 13477981, 13185632, 12571057, 11725290, 10738346, 9742073, 8822095, 8026329, 7348695, 6786579, 6315003, 5905878, 5570293, 5264487, 5007755, 4780222, 4571612, 4408679, 4267718, 4154184, 4069531, 4004570, 3968424, 3931952, 3902330, 3896526, 3900467, 3937981, 3971867, 4032744, 4111061, 4188385, 4279432, 4375791, 4486631, 4603710, 4759358, 4919498, 5136639, 5407471, 5707990]
5547E707990L30877L83166M37833M53185M70474M49467L65068K42212P5935j18860
5537H797347k84649l81344l95830l61586k92072k26560j55738r9521j8370Q2429
5527F664106J48699K09006K58089L23181L48490L47599K91615J50055q272k48561
5517H484007m49590n79176o47479o46337n83381n30932m26202l51164l18587k45029
5507C706130k25121j85919j58284j56909j45910j36743j34974j16395r3261o3338
5497B289276o8141m5882l5486k2114k185k2942k0137O419l7542k9438m9929j3946
5485A947953p373L084k1034n329k9563p0055q8475o7626n3898l9777j5927k0878
5473A531102k001k779r07j7605l2571n8333q4409j01066p6398o2652k8019m1041
$$ y = [5707990, 6038867, 6422033, 6859866, 7313051, 7783525, 8232992, 8598060, 8840272, 8916207, 8797347, 8512698, 8131354, 7735524, 7373938, 7081866, 6855306, 6699568, 6600047, 6581677, 6664106, 6812805, 7021811, 7279900, 7603081, 7951571, 8299170, 8590785, 8740840, 8732568, 8484007, 8034417, 7455241, 6807762, 6161425, 5578044, 5047112, 4620910, 4269746, 3951159, 3706130, 3481009, 3295090, 3136806, 2979897, 2833987, 2697244, 2562270, 2445875, 2352614, 2289276, 2221135, 2175253, 2139767, 2117653, 2115468, 2092526, 2072389, 2078808, 2041266, 2011828, 1961899, 1947953, 1940580, 1943664, 1922630, 1917301, 1887738, 1817683, 1729208, 1661582, 1607684, 1567907, 1551980, 1531102, 1529101, 1526322, 1525415, 1507810, 1475239, 1416906, 1332497, 1231431, 1155033, 1092381, 1064362, 1023321]
5461A023321l0149l7731k3428l8603k8439k2503l2153l0379k1689j4968j0138
5450G33141k1125l2868k0635K261j6423j021j3673j2365N88q938k1220j8375r106
5437E60241q298L14M141Q958j2683k959n176P39n470J105J372k0637K2781j6118
5423E28310j1838n225k8198P143m469q240L290j6601k370L277R406r052j3355
5410D52078J3067L21o852n143o066J440k366J5552R476m389L563j7072O827p31
5396D59705J292k70p243P789R760j2181j1741j5164k455O136P087J0207l341j0549
5382D39032j045J9132N685n879P061l541o0j995r578j2101m156m920J083M708
5368D33426m486Q66Q927M852O499J7359M192K3893K9967N667o637k7718k1339
$$ y = [1023321, 993172, 955441, 932013, 893410, 864971, 842468, 810315, 779936, 758247, 743279, 733141, 712016, 679148, 658513, 660774, 644351, 643330, 629657, 617292, 617880, 608942, 587722, 569347, 560241, 551943, 552257, 556398, 565356, 552673, 549714, 544538, 545277, 539807, 540912, 542284, 521647, 544428, 528310, 516472, 511247, 483049, 490192, 485723, 477483, 480773, 464172, 461802, 465079, 474485, 465433, 452078, 465145, 465466, 458614, 453471, 447405, 448845, 446479, 462031, 471507, 467118, 470681, 453609, 460436, 459705, 460997, 460727, 453484, 461273, 471033, 458852, 447111, 431947, 429492, 435628, 442715, 452922, 449581, 439032, 437987, 457119, 462804, 456925, 463986, 460445, 460385, 458390, 448812, 436711, 432555, 427635, 428718, 433426, 428940, 429806, 438733, 443585, 450084, 467443, 471635, 495528, 525495, 531162, 524525, 496807, 475468]
5355D75468j0146o883p206k362J507K2730J5578j000k5012n305k1030l339k6200
5342D06800k7555j5725J1085K0268J4617K823J828o695k7205j9988j3768j2489
5330C33996r68R837k2500J5579J5959K1083O945Q179j4203o404j9997j9484p432
5317C20590o529L11J7682k458P30j1332j9572R171J1565j2953j819J1591R594
5304C26571j43J1167J914L640P651J0825q559j5655k718M9k0152O70j83l0095
5290B84982l328j4452k942J3050M559r645Q176N255J1290m245p191J5105J4158
5277C14772M125K6353J4344j7335P193K433J7253j95k352J4573j960l32N513K1554
5263D05939K2903j1017m911K3391J6731K2386J5673O154J5051M7038K4912K0742
$$ y = [475468, 465322, 458439, 451233, 448871, 450378, 473108, 488686, 487686, 462674, 457369, 436339, 433000, 406800, 379245, 363520, 374605, 394873, 409490, 412313, 414141, 407446, 380241, 360253, 346485, 333996, 333028, 342865, 320365, 335944, 351903, 372986, 379931, 388110, 373907, 367503, 347506, 328022, 320590, 314061, 314372, 332054, 329596, 330326, 318994, 299422, 308593, 320158, 307205, 305386, 316977, 326571, 326428, 337595, 339509, 343149, 350800, 361625, 353066, 337411, 334693, 334742, 314590, 315260, 315077, 284982, 281654, 267202, 264260, 277310, 281869, 272224, 280400, 285655, 296945, 292700, 285509, 300614, 314772, 318897, 345250, 359594, 342259, 349452, 351885, 369138, 368943, 366591, 381164, 379204, 378872, 384385, 405939, 428842, 417825, 412914, 436305, 453036, 475422, 491095, 497249, 512300, 559338, 584250, 604992]
5251F04992L5774K0696R37k2125j4780j849j2054q001p025m257O148q508j3150
5238E76798K0670M43M084q115K426J0772K5339L8672N157K6153K6856K1196L5926
5225G86377J7684L3256K3189p948j0563k9214j9284k3795R135m788p800L69J7095
5212G83713M4500J8937K0293K0912K1039L0797K035N103J5943J214O471J8913
5200I89870J5273J7154K6367J6424L380P572J1551J8651K0386K4435K2723L2576
5188A206362M2178L6132M8334M7771N1358O7610O3134N5373N7358j1719m7688
5177A616203l4131l4310m7990K1877R355R453O262J6888P83m504n788K5706L4276
5164A614080M2713O0110L8365N8833P2277P4551O7087Q0743Q3956Q0941P8320
$$ y = [604992, 640766, 661462, 662399, 640274, 625494, 623645, 611591, 603590, 596565, 592308, 598456, 589948, 576798, 597468, 597911, 601995, 593880, 596306, 607078, 632417, 671089, 676246, 702399, 729255, 750451, 786377, 804061, 837317, 860506, 852558, 841995, 812781, 793497, 769702, 778837, 774049, 766249, 766618, 783713, 828213, 847150, 867443, 888355, 909394, 940191, 942226, 947329, 963272, 964486, 970957, 989870, 1005143, 1022297, 1048664, 1065088, 1068468, 1076040, 1087591, 1106242, 1126628, 1151063, 1173786, 1206362, 1248540, 1284672, 1333006, 1380777, 1432135, 1499745, 1562879, 1618252, 1675610, 1663891, 1616203, 1582072, 1547762, 1499772, 1521649, 1531004, 1540457, 1546719, 1563607, 1564390, 1559886, 1554098, 1579804, 1614080, 1656793, 1716903, 1755268, 1814101, 1886378, 1960929, 2028016, 2108759, 2192715, 2273656, 2351976]
5153B351976O6285R267j8976l5962p95K5639K5738N1497N2514R0318P4453Q4894
5141B776848R2429Q8539J41680J31043J60054J65426J99976K17253K30834K41840
5131D445922K89692L14693L17901L28594L04117K94826K82121K91155K47759J98308
5121G315088K11853K18224K66521L14140L96243M57099N28947O02171O55720O52493
5111A1618499O12987N48026M58858L94521L51851L06120K65464K22078J62943
5102A4941347J11075J41430J86966K40801K96108L48850L57403L60966L26202
5093A7311148K37949J36371k8548k33883m02247m75986m60789m17719m11305m10647
5083A4844344l60137k94816k13959j46502j21264j39184j99267k57859l09732
$$ y = [2351976, 2418261, 2427528, 2408552, 2372590, 2371795, 2397434, 2423172, 2474669, 2527183, 2617501, 2691954, 2776848, 2869277, 2957816, 3099496, 3230539, 3390593, 3556019, 3755995, 3973248, 4204082, 4445922, 4735614, 5050307, 5368208, 5696802, 6000919, 6295745, 6577866, 6869021, 7116780, 7315088, 7526941, 7745165, 8011686, 8325826, 8722069, 9179168, 9708115, 10310286, 10966006, 11618499, 12231486, 12779512, 13238370, 13632891, 13984742, 14290862, 14556326, 14778404, 14941347, 15052422, 15193852, 15380818, 15621619, 15917727, 16266577, 16623980, 16984946, 17311148, 17549097, 17685468, 17656920, 17423037, 17020790, 16544804, 16084015, 15666296, 15254991, 14844344, 14484207, 14189391, 13975432, 13828930, 13707666, 13568482, 13369215, 13111356, 12801624]
5074A2801624l49626l96659m81606n63190o25168o56722o39540n72103m70049
5065H046961l89027l06241k26097j81035j52864j41386j86139k36041k46145l16731
5055E665255l57538l03315k72838k26200j86464j57857j28855j00268q6564l6338
5045C809018m3211p714M4127P4910P5304J12476J13061J37593J68035J81122J60976
5034D825697M6659r5259k51741l01674l16871l12289k38959j82197j39066j22025
5024B912275j18157r3793p1461p4492q1712q4395q0304n6419m5081n8996l8938
5013B108527k6701k3080j0260l6644l4996k3089j4975j5653k5556p870p431j7773
5001A864499r819K0839K4472J5781P12k0777O603R194j3156k1329k8450k9088
$$ y = [12801624, 12451998, 12055339, 11573733, 11010543, 10385375, 9728653, 9089113, 8517010, 8046961, 7657934, 7351693, 7125596, 6944561, 6791697, 6650311, 6464172, 6228131, 5981986, 5665255, 5307717, 5004402, 4731564, 4505364, 4318900, 4161043, 4032188, 3931920, 3845356, 3809018, 3765807, 3758093, 3802220, 3877130, 3952434, 4064910, 4177971, 4315564, 4483599, 4664721, 4825697, 4872356, 4777097, 4525356, 4223682, 3906811, 3594522, 3355563, 3173366, 3034300, 2912275, 2794118, 2700325, 2628864, 2554372, 2472660, 2388265, 2307961, 2251542, 2206461, 2147465, 2108527, 2081826, 2058746, 2048486, 2011842, 1976846, 1953757, 1938782, 1923129, 1897573, 1889703, 1882272, 1864499, 1854680, 1875519, 1899991, 1915772, 1916484, 1895707, 1902310, 1911504, 1898348, 1877019, 1848569, 1819481]
4989A819481j5767j2950j6850l17M561k463k0905m689p805n5262m6501j6304j9161
4976A605068j6717j2102j9123m087o621m781J9303J4042O672M122j3862k4792
4964A547122m3211l2636l6522n8660l0383J314l036J01l185J4240J8891K477J513
4951A378025M0038M0849J0259K7059j2861q572Q599K082M595K193k8940k3465
4939A439861r310R879K0070l187j6710k3365M747J4804J3542J8843L9660O1777
4927A570611N1666N1804L5465L2136K6027j6319j176Q61q581L030j431K7658J5161
4914A786912j3322j4456J1453J0022k8681o918r184r964O859K3101J8098L0663
4902A804583N8749P5004P9308N9598Q6363P0325M3934L4596K8926M5705M7486
$$ y = [1819481, 1803714, 1790764, 1773914, 1773597, 1778158, 1775695, 1754790, 1750101, 1742296, 1687034, 1640533, 1624229, 1605068, 1588351, 1576249, 1557126, 1553039, 1546418, 1541637, 1560940, 1574982, 1581654, 1585776, 1571914, 1547122, 1503911, 1471275, 1434753, 1376093, 1345710, 1347024, 1343988, 1344089, 1340904, 1355144, 1374035, 1376512, 1378025, 1418063, 1458912, 1469171, 1496230, 1483369, 1474797, 1483396, 1485478, 1490073, 1492266, 1463326, 1439861, 1430551, 1440430, 1460500, 1457313, 1440603, 1417238, 1421985, 1436789, 1450331, 1469174, 1508834, 1570611, 1622277, 1674081, 1709546, 1741682, 1767709, 1751390, 1750214, 1751075, 1742494, 1745524, 1744093, 1771751, 1786912, 1773590, 1759134, 1770587, 1780609, 1751928, 1745010, 1735826, 1725862, 1732721, 1755822, 1773920, 1804583, 1863332, 1938336, 2017644, 2077242, 2163605, 2233930, 2277864, 2312460, 2341386, 2387091, 2434577]
4891B434577O2375P3874N4505L2921M7544L2465M4307M9833M9456M7822N5038
4880B984717Q0950P8703Q8526N9367M2038Q2372P0850P7801O0525O3029J05251
4869C794129J09387J20386J29697J01372R5270J06392J13079P1923P7855Q1749
4859D801239P6279Q4990R4738J04624R4126J00329J14125J23611J55702J38601
4849E888364J23189J04858R1921R6319J19672J23163J22992J34861J66832J64806
4839G136977J69854J78971J97235K14652K26232K21069J84335J38017J49202J22533
4829H939077J43846J53356J63484J80195J83637K01822K16512K34626K46502K45539
4819A0908596K57596K58802K59297K83715K87093L21392L59875M18499M49583
$$ y = [2434577, 2496952, 2570826, 2625331, 2658252, 2705796, 2738261, 2782568, 2832401, 2881857, 2929679, 2984717, 3065667, 3144370, 3232896, 3292263, 3334301, 3416673, 3487523, 3565324, 3625849, 3688878, 3794129, 3903516, 4023902, 4153599, 4254971, 4350241, 4456633, 4569712, 4641635, 4719490, 4801239, 4877518, 4962508, 5057246, 5161870, 5255996, 5356325, 5470450, 5594061, 5749763, 5888364, 6011553, 6116411, 6208332, 6304651, 6424323, 6547486, 6670478, 6805339, 6972171, 7136977, 7306831, 7485802, 7683037, 7897689, 8123921, 8344990, 8529325, 8667342, 8816544, 8939077, 9082923, 9236279, 9399763, 9579958, 9763595, 9965417, 10181929, 10416555, 10663057, 10908596, 11166192, 11424994, 11684291, 11968006, 12255099, 12576491, 12936366, 13354865, 13804448]
4810A3804448M61809M77537N43414N77754O04073O60570O87809O91276O95805
4801A9204495O96865P15814P41306Q24373R26510J043860J204857J368989J527490
4792B8254559J739946J946742K150091K325489K452486K419227K279273J892030
4784D5459843J332649P93922K44529k20558n28676p88147q73204q33308o36188
4775D3950862m37950k09761L2118K80448N46490Q20769J044210J274440J449380
4766D8751006J663370J910870K163492K347168K436916K444355K314198J884414
4758F5915789J513654J468998J754291K200919K749196L254475L816153M344523
4750H7017998M966045N661500O520718P344478Q294922R339147J0441692J1699346
$$ y = [13804448, 14266257, 14743794, 15287208, 15864962, 16469035, 17129605, 17817414, 18508690, 19204495, 19901360, 20617174, 21358480, 22182853, 23109363, 24153223, 25358080, 26727069, 28254559, 29994505, 31941247, 34091338, 36416827, 38869313, 41288540, 43567813, 45459843, 46792492, 47586414, 47830943, 47610385, 47081709, 46293562, 45420358, 44587050, 43950862, 43512912, 43303151, 43335269, 43615717, 44162207, 44982976, 46027186, 47301626, 48751006, 50414376, 52325246, 54488738, 56835906, 59272822, 61717177, 64031375, 65915789, 67429443, 68898441, 70652732, 72853651, 75602847, 78857322, 82673475, 87017998, 91984043, 97645543, 104166261, 111510739, 119805661, 129144808, 139586500, 151285846]
4742A51285846J3504487J5681518J8106160K0603334K3243179K5621192K8158496
4735B96204212L0953627L4562963L9055873M1608058L5937362K0019185q228728
4728D90112552m0116923n3576524n2843968m7365631l9307080l1243196k4581869
4721B01077361j9658814j6140489j3919323j2777023j1929613j0750610r312011
4714A06589478p819004o485028n434972m540455l653077k970160k440822k194009
4706G1051951k176571k413622k534336k416286k269697k145869k147265k380833
4698E2567472k522748k452737k326651k185450k053176j888414j733058j545777
4690C5859461j323903j190318j074763r98631r55824r19464q70783q49061p78628
$$ y = [151285846, 164790333, 180471851, 198578011, 219181345, 242424524, 268045716, 296204212, 327157839, 361720802, 400776675, 442384733, 478322095, 498341280, 490112552, 449995629, 396419105, 343575137, 296209506, 256902426, 225659230, 201077361, 181418547, 165278058, 151358735, 138581712, 126652099, 115901489, 106589478, 98770474, 92285446, 86850474, 82310019, 78656942, 75686782, 73245960, 71051951, 68875380, 66461758, 63927422, 61511136, 59241439, 57095570, 54948305, 52567472, 50044724, 47591987, 45265336, 43079886, 41026710, 39138296, 37405238, 35859461, 34535558, 33345240, 32270477, 31271846, 30316022, 29396558, 28525775, 27676714, 26898086]
4681B6898086o50232n83083n33369m60688m17259m11545m36223m82025m88915
4672B2434747n13638n02266m62017l97211l81589l67016l57912l61752l84780
4663A8706566m36149m68505n00911n07828m86063m49966m03411l01062k97630
4654A4855041k78023k34610k26579k31449k02160j74011j68453j44845j41688
4645A3053223j63306k01198k51162k19707k81361k88481k39660j86934j55667
4636A1065747j19323j29295q7773j15056j15571o3287k7495Q022O0381Q0310J51808
4625A0708468K28080K90414L31968L80844M13475M71046N37620O78539P69302
4616A4809756Q67945R66147J081943J147526J134662R59518O83890J76953l94596
$$ y = [26898086, 26247854, 25664771, 25131402, 24670714, 24253455, 23841910, 23405687, 22923662, 22434747, 21921109, 21418843, 20956826, 20559615, 20178026, 19811010, 19453098, 19091346, 18706566, 18270417, 17801912, 17301001, 16793173, 16307110, 15857144, 15453733, 15152671, 14855041, 14577018, 14342408, 14115829, 13884380, 13682220, 13508209, 13339756, 13194911, 13053223, 12889917, 12688719, 12437557, 12217850, 11936489, 11648008, 11408348, 11221414, 11065747, 10946424, 10817129, 10729356, 10614300, 10498729, 10435442, 10407947, 10415969, 10476350, 10556660, 10708468, 10936548, 11226962, 11558930, 11939774, 12353249, 12824295, 13361915, 14040454, 14809756, 15677701, 16643848, 17725791, 18873317, 20007979, 20967497, 21651387, 21828340, 21433744]
4607B1433744o85414o46614m30255j45522J84711M23649O34466P06816O47656
4598B2123237M23170J1919n42135r03875q81381o53087l35794n7416J47455J83814
4588A9515907P7139j57612n55467q97416r60448q12428n91571l31553j16818P5811
4578A5245544J81677J79189M7137k00630o67411j085144j264066j210369j032414
4569A0193513q64101o78389n38524m71422l97611l63605l21002k75155k26828
4560F056876j96100j64514j43094j57740j45176j46814j74040j57908j48795j43812
4550D478883j36725j17967j04535q4439o5000m6524m4057m4598n1470n2763n0287
4539C680518n1049o7501m7065k1385k3046k2051Q909K3230O251k1034k3755k4295
$$ y = [21433744, 20748330, 20101716, 19671461, 19525939, 19710650, 20134299, 20768765, 21475581, 22123237, 22546407, 22558326, 22016191, 21112316, 20230935, 19577848, 19242054, 19184638, 19332093, 19515907, 19593046, 19435434, 18879967, 17982551, 17022103, 16209675, 15618104, 15286551, 15169733, 15245544, 15427221, 15606410, 15653547, 15452917, 14785506, 13700362, 12436296, 11225927, 10193513, 9329412, 8651023, 8112499, 7641077, 7243466, 6879861, 6558859, 6283704, 6056876, 5860776, 5696262, 5553168, 5395428, 5250252, 5103438, 4929398, 4771490, 4622695, 4478883, 4342158, 4224191, 4119656, 4035217, 3970217, 3923693, 3879636, 3835038, 3783568, 3730805, 3680518, 3629469, 3561968, 3514903, 3493518, 3470472, 3448421, 3457330, 3480560, 3486811, 3465777, 3442022, 3417727]
4527C417727k945k909j7951K230n05k0794j2782j0864l6120o4130p1150m5847
4515C133960k0440m6514j5175J0632l35J5713K5027J503k8062m5915n1581n9400
4503B919413l9860l8452k4329o749J120K0617j742j9897j5212R210J5743L5931
4491B855793K5519J8298R487l7260o9905n0236l9380n4671n1783j9658r474j0089
4479B566641L4k0166l8931o4172j05492p8399o7990n7502k9757k1220J0232J6778
4467B110056R805l3129k2618m0320n8539k4539p761M771J6884J0126K170R175
4455A976081Q779k8811m5355p7770q7834n0032o4328n5398l7375k2825o910l0635
4443A477587j4256L401p429r589Q182K4715J7330N1209N6079M1561Q4426J00833
$$ y = [3417727, 3414782, 3411873, 3393922, 3396152, 3395647, 3374853, 3362071, 3351207, 3315087, 3250957, 3179807, 3133960, 3113520, 3067006, 3051831, 3062463, 3062128, 3077841, 3102868, 3104371, 3076309, 3030394, 2978813, 2919413, 2879553, 2841101, 2816772, 2810023, 2811143, 2831760, 2830018, 2810121, 2794909, 2804119, 2819862, 2855793, 2881312, 2899610, 2909097, 2871837, 2801932, 2751696, 2712316, 2657645, 2605862, 2586204, 2576730, 2566641, 2566675, 2546509, 2507578, 2443406, 2337914, 2259515, 2191525, 2134023, 2104266, 2083046, 2093278, 2110056, 2119861, 2086732, 2064114, 2023794, 1965255, 1940716, 1932955, 1937726, 1954610, 1964736, 1966906, 1976081, 1984860, 1956049, 1910694, 1832924, 1745090, 1695058, 1630730, 1575332, 1537957, 1515132, 1508222, 1477587, 1463331, 1466732, 1459303, 1449714, 1457896, 1482611, 1499941, 1551150, 1607229, 1648790, 1733216, 1834049]
4431A834049J03937J25016J29743J59660J68941K05003K09387K29269J79475P7185
4421C421665q2085k35336k91645l05762k59479k07356j64833j21068j09920q6469
4411A557712p5491o6842p7755p0849m2901l0045n8678m9721l5013l2270n671j4798
4399I97678m55q992k738l347k579j4248j2320o642J702M216j2147j4195Q689L642
4385I38264k5286j6117j7244j3987k9438j4773m033j1884j8407o456o264k721
4373G71654j4372Q127M798j031L634K258j320P781k652J8123J4289p423J7644
4360H21510J1665j1160N981M158L51K830L856l181j4951j864J3147O763J1895
4347H51000M4564K1619j837j1120k5349k5635k431n313Q996l5483j222j7039j7926
$$ y = [1834049, 1937986, 2063002, 2192745, 2352405, 2521346, 2726349, 2935736, 3165005, 3344480, 3421665, 3339580, 3104244, 2812599, 2506837, 2247358, 2040002, 1875169, 1754101, 1644181, 1557712, 1482221, 1415379, 1337624, 1266775, 1223874, 1193829, 1135151, 1085430, 1050417, 1018147, 1012476, 997678, 997223, 988231, 985493, 982146, 979567, 965319, 952999, 946357, 948059, 952275, 940128, 925933, 934622, 938264, 912978, 896861, 879617, 865630, 836192, 821419, 817386, 805502, 787095, 780639, 774375, 771654, 757282, 765409, 770207, 769176, 772810, 775068, 773748, 781529, 778877, 797000, 811289, 803866, 821510, 833175, 822015, 827996, 832154, 832505, 835335, 839191, 836010, 821059, 819195, 832342, 839105, 851000, 895564, 917183, 915346, 904226, 878877, 853242, 850811, 845498, 854494, 819011, 817789, 800750, 782824]
4334G82824j4160j6863o320k8421k3888R668P978O130K653o905n133k0626j7450
4321F69487n215k1240j0260J574j1388p603k0162m2842j2406J6335j5481m636
4309E36163P010L955l010P825J0543R206K4177J6539L7514L5965K9403M3018L2780
4296G91088M2896L9913J6153J4488l3391l4347l6001p2956m6980m6458m2000m0336
4284E52069k9168l8416J1897j2359k5694P077m111p270q822j546Q004M645k1644
4271D34662N878j5632j1238m651K246Q862j1612j799p451k3890p975M815j8551
4258C53664K453o816j731k404M028j4962j803J6001P67K0357K0527J1968J837
4245D03886J3326L73K0165l827R256P362L346K937j3837N604L675L2743Q433M944
$$ y = [782824, 768664, 751801, 745481, 717060, 693172, 702840, 710818, 716948, 719601, 712696, 707563, 686937, 669487, 664272, 643032, 632772, 634346, 622958, 615355, 595193, 552351, 539945, 556280, 540799, 536163, 543173, 547128, 544118, 551943, 562486, 571692, 595869, 612408, 649922, 685887, 715290, 758308, 791088, 833984, 873897, 890050, 904538, 871147, 836800, 800799, 727843, 680863, 634405, 592405, 552069, 522901, 484485, 496382, 484023, 458329, 465406, 461295, 454025, 445203, 443657, 451661, 456306, 434662, 440540, 424908, 413670, 409019, 411265, 420127, 408515, 406716, 399265, 375375, 367400, 372215, 353664, 356117, 349301, 347570, 345166, 349194, 334232, 332429, 348430, 349197, 369554, 390081, 402049, 403886, 417212, 417585, 437750, 433923, 443179, 450541, 453887, 456824, 442987, 448591, 452266, 485009, 493442, 498386]
4231D98386K3631J5547M1085J5210J1224R379L2328K7508J7562L0811K2447M8207
4219G93325P1837O3291Q2654R8354Q9272J22445J52632J65709J72722J20431k1305
4208A911367j74901k29299j96015j63253j15788p7489p1330m7004l7242m2066
4198G56980k2780l3732k5901j3981o507k73j6083j3394J0140k638L227N14j0685
4185F24887N669q60j95j2174j473J7800j3991j6633m238j4354p446k3818r207
4172E43967j389r532n727n161p173O849j2589j3354J1859J2123l171k5221k484
4159D88997J4793j0352n275j385j1162R555J953N174p456j817R32m497J0608K341
4145D92409k398R995J4485o376j0671J5194k631l213J1181J0750j507K60L533
$$ y = [498386, 522017, 537564, 578649, 593859, 605083, 614462, 646790, 674298, 691860, 722671, 745118, 793325, 865162, 928453, 1011107, 1109461, 1198733, 1321178, 1473810, 1639519, 1812241, 1932672, 1911367, 1736466, 1507167, 1311152, 1147899, 1032111, 954622, 883292, 836288, 799046, 756980, 734200, 700468, 674567, 660586, 654079, 653806, 637723, 624329, 634469, 631831, 635058, 635572, 624887, 630556, 629696, 629501, 617327, 615854, 633654, 619663, 603030, 598792, 584438, 576992, 553174, 543967, 542578, 533046, 527319, 522158, 514985, 521834, 509245, 495891, 507750, 519873, 516702, 491481, 488997, 503790, 493438, 488163, 486778, 475616, 485171, 487124, 492298, 484842, 483025, 483957, 479460, 490068, 492409, 490011, 500006, 514491, 508115, 497444, 512638, 510007, 506794, 517975, 528725, 527218, 527478, 531011]
4132E31011j568J0346K2237N887m026j1782k923j0551r36J516J6138K0254Q511
4119E84114Q018P788N509K023L438J3663N709O807J1113L052j844K4062J2292
4106F85744M524l380K6051K7823R250Q524K5400M5418L4372M3676L1907K5295
4094I64604K6975N9966L5471M4624N0143J114o6363o4794l0711m1124k1289K296
4082I60912q112o760k983n052J2884q07j2896O778Q909N014j98J0887J1702P906
4068I88184J6077K3506O565K881J5387P17J0236J8632M2686J4317Q188L2383K6941
4055A206700M1477M7544M5208M1496N0230M2237K5918l4534m1535r623j170l1747
4043A382201k8439l748N970L861k267o511R374R374J131K0001Q987J6900O102
$$ y = [531011, 529443, 539789, 562026, 567913, 563887, 552105, 549182, 538631, 537695, 539211, 555349, 575603, 584114, 592132, 599920, 605429, 607452, 610890, 624553, 630262, 637069, 648182, 651234, 649390, 673452, 685744, 690268, 686888, 712939, 740762, 750012, 758536, 783936, 829354, 863726, 907402, 939309, 964604, 991579, 1051545, 1087016, 1131640, 1181783, 1182897, 1116534, 1051740, 1021029, 979905, 958616, 960912, 952800, 946040, 943057, 938005, 950889, 950082, 937186, 943964, 952873, 957887, 957689, 968576, 980278, 988184, 1004261, 1027767, 1034332, 1037213, 1052600, 1053317, 1063553, 1082185, 1124871, 1139188, 1147376, 1179759, 1206700, 1248177, 1295721, 1340929, 1382425, 1432655, 1474892, 1500810, 1466276, 1424741, 1415118, 1413948, 1382201, 1353762, 1350014, 1355984, 1359845, 1357578, 1351067, 1360441, 1369815, 1370946, 1390947, 1399934, 1416834, 1422936]
4030A422936k836K3587P579N971o802J0815P084K7249P947L062J619K0978O236
4017A535425J4659J0440L768J5244J7366M6697J7580Q396K6092K4789o290J7832
4005A731998J6784J710K838O774L3013Q634O044L222M679J6162K278J2184J5586
3992A861906K1316J2516J0011P427K289K1831J4633Q211L5547J5764N860J5194
3980B032505J8086K0460Q299L1467K7547m3L0300J9569J6174J8471J5588K1687
3968B260110L0953J7064R976P216J4688J5696K1276K1840p10r864L3159J9877
3956B441281K9950m507K98K4738Q642K0L72L7397Q565J9150J0313Q466K7256J5116
3942B627057J9938R683K7942K4129J8944K8565J4137L9189L8283J1603J0022L280
$$ y = [1422936, 1420100, 1443687, 1451266, 1457237, 1450435, 1461250, 1468334, 1495583, 1503530, 1506592, 1508211, 1529189, 1535425, 1550084, 1560524, 1564292, 1579536, 1596902, 1643599, 1661179, 1669575, 1695667, 1720456, 1714166, 1731998, 1748782, 1750492, 1753330, 1760104, 1793117, 1801751, 1807795, 1811017, 1815696, 1831858, 1834136, 1846320, 1861906, 1883222, 1895738, 1905749, 1913176, 1915465, 1937296, 1951929, 1960140, 1995687, 2011451, 2017311, 2032505, 2050591, 2071051, 2079350, 2110817, 2138364, 2138321, 2168621, 2188190, 2204364, 2222835, 2238423, 2260110, 2291063, 2308127, 2318103, 2325319, 2340007, 2355703, 2376979, 2398819, 2398109, 2388245, 2421404, 2441281, 2471231, 2466724, 2467022, 2491760, 2500402, 2500422, 2500794, 2538191, 2546756, 2565906, 2576219, 2584685, 2611941, 2627057, 2646995, 2656678, 2684620, 2708749, 2727693, 2756258, 2770395, 2809584, 2847867, 2859470, 2869492, 2872772]
3930B872772J382J2707L312K745j67Q034J8592j1042N605J538j0100J9394J7876
3917B942648K190j1015J2497J5307m639J1653J0413J0410m050R859J265r211K4175
3904C011502J4543k96N587J7607O487m44K6997J0138K0719J9706N931r092J8574
3891C147959K2313K1545o211P673L6511J2334K9758J6041J3664O189P512l999
3879C311289L6585J8933N221K3631K4841M876J9701K6138J0358K2231L924L8328
3867C546056L4879K2583J7686K9725K3341K1504K4775J3354M0254N2317L8155
3856C864629K1910M8708L7321M4172O6821O4157M9902L8626L4890K2137K945N315
3844D301533j0649q997n162j2440l0P523J2414N496J4324o398J8668L4910J8207
$$ y = [2872772, 2874154, 2886861, 2890173, 2892918, 2892751, 2900785, 2919377, 2908335, 2913940, 2915478, 2905378, 2924772, 2942648, 2944838, 2933823, 2946320, 2961627, 2956988, 2968641, 2979054, 2989464, 2985414, 2995273, 2996538, 2987327, 3011502, 3026045, 3025749, 3031336, 3048943, 3055430, 3054986, 3081983, 3092121, 3112840, 3132546, 3138477, 3129385, 3147959, 3170272, 3191817, 3185606, 3193279, 3229790, 3242124, 3271882, 3287923, 3301587, 3307776, 3315288, 3311289, 3347874, 3366807, 3372028, 3395659, 3420500, 3425376, 3445077, 3471215, 3481573, 3503804, 3507728, 3546056, 3580935, 3603518, 3621204, 3650929, 3674270, 3695774, 3720549, 3733903, 3774157, 3826474, 3864629, 3886539, 3935247, 3972568, 4016740, 4083561, 4147718, 4197620, 4236246, 4271136, 4293273, 4296218, 4301533, 4290884, 4281887, 4276725, 4264285, 4264255, 4271778, 4284192, 4289688, 4304012, 4297614, 4316282, 4351192, 4369399]
3831D369399J8372M7302M1569K5043L5163M5277M7308K1095K1985K3963N4781
3820D751257L5383L4975L9797M6814K3628M4217M2023K4610M5990M5835L7947
3809E172476M5957M8569M4660L8423M8130L5913M6034M3307M2217N3915M3229
3798E662830L5142M2288L3788L6397N5442N4014L7600N4564O1624N5686N3728
3787F183103M8293O5906O6972N0139O0016N5741N8325N7944M6763P1388P6419
3776F841009M0613O4378P4704M9857M6664P0262O2953N5226O0825N2316N2320
3765G471127M9575L2193J7434N8507L9694N4534M5072N6503N7849O3588N1877
3754G997953M8467K0217M2186M3406L3183K9681M5433M5082L5867J6135K7731
$$ y = [4369399, 4387771, 4435073, 4476642, 4501685, 4536848, 4582125, 4629433, 4650528, 4672513, 4696476, 4751257, 4786640, 4821615, 4861412, 4908226, 4931854, 4976071, 5018094, 5042704, 5088694, 5134529, 5172476, 5218433, 5267002, 5311662, 5350085, 5398215, 5434128, 5480162, 5523469, 5565686, 5619601, 5662830, 5697972, 5740260, 5774048, 5810445, 5865887, 5919901, 5957501, 6012065, 6073689, 6129375, 6183103, 6231396, 6297302, 6364274, 6414413, 6474429, 6530170, 6588495, 6646439, 6693202, 6764590, 6841009, 6881622, 6946000, 7020704, 7070561, 7117225, 7187487, 7250440, 7305666, 7366491, 7418807, 7471127, 7520702, 7552895, 7570329, 7628836, 7668530, 7723064, 7768136, 7824639, 7882488, 7946076, 7997953, 8046420, 8066637, 8108823, 8152229, 8185412, 8215093, 8260526, 8305608, 8341475, 8357610, 8385341]
3743H385341L2682K1432K1888K9446J7601l707J3642J4541L1656K4530q76O161
3731H594337J3K635K8132J1549J2388J6288N928R264J7432m977K6255K3016J85
3718H742445J4140L1032K5275k751K8371M5952K4999J6624K0400J1569K5162L5903
3706I019121M1635M3266K4754J3122K7917K6071K1661K6683R982o435J4303M024
3694I266104J3807P194M68j385r434N468q928k0219j0101k4252j7914k1278j7391
3681I162139r053j9484P243r229m554j535k8484k576M96L160P519m0400K056L189
3667I070487R718J994n101P899r911q907m196M564J281J1184K1376L177J1647
3654I115212J1337L319P625L3512K5676Q859K8144L9182Q623K5783M7661L8942
$$ y = [8385341, 8418023, 8439455, 8461343, 8490789, 8508390, 8504683, 8518325, 8532866, 8564522, 8589052, 8588176, 8594337, 8594350, 8596985, 8625117, 8636666, 8649054, 8665342, 8671270, 8680534, 8697966, 8692989, 8719244, 8742260, 8742445, 8756585, 8787617, 8812892, 8810141, 8838512, 8884464, 8909463, 8926087, 8946487, 8958056, 8983218, 9019121, 9060756, 9104022, 9128776, 9141898, 9169815, 9195886, 9217547, 9244230, 9254212, 9247777, 9262080, 9266104, 9279911, 9287105, 9287573, 9286188, 9276754, 9282222, 9273294, 9253075, 9242974, 9218722, 9200808, 9179530, 9162139, 9153086, 9133602, 9140845, 9131616, 9127062, 9125527, 9097043, 9094467, 9094963, 9098123, 9105642, 9065242, 9067298, 9070487, 9080205, 9082199, 9077098, 9084997, 9075086, 9066179, 9061983, 9066547, 9067828, 9079012, 9100388, 9103565, 9115212, 9126549, 9129868, 9137493, 9171005, 9196681, 9205540, 9233684, 9272866, 9281489, 9307272, 9354933, 9393875]
3642I393875M1290J7351L1191M5622M0798L4766L9766O7666K6459M4976N7545
3631I841305M5709L8851M1564K4861L6424M0956L8541L4339L2858K9636K7148
3620A0232192L7122J4683O0526M7871N8474P5405N5793Q4069N6196O6454Q7182
3609A0875967P2849O2270Q0561J09532J00102R6343M5330K3919L4208M1096N0613
3598A1592790N4346J8962L5624L2651J3773l439J1340N34J0571K2879J044K7627
3586A1818702N2020K4625K6588K8259N0763L9036N2886O2805N4009N0034L1832
3575A2291559O7612M2710M0966M2633M9562M3848L3552J6436K9809K2549J4568
3564A2695804k355k495j1018J1804L0915n215J4698L3670K7993K5570K5706L7137
$$ y = [9393875, 9435165, 9452516, 9483707, 9529329, 9570127, 9604893, 9644659, 9712325, 9738784, 9783760, 9841305, 9887014, 9925865, 9967429, 9992290, 10028714, 10069670, 10108211, 10142550, 10175408, 10205044, 10232192, 10269314, 10283997, 10344523, 10392394, 10450868, 10526273, 10582066, 10666135, 10722331, 10788785, 10875967, 10948816, 11011086, 11091647, 11201179, 11301281, 11397624, 11442954, 11466873, 11501081, 11542177, 11592790, 11647136, 11666098, 11701722, 11734373, 11748146, 11744707, 11756047, 11756581, 11767152, 11790031, 11791075, 11818702, 11870722, 11895347, 11921935, 11950194, 12000957, 12039993, 12092879, 12155684, 12209693, 12259727, 12291559, 12359171, 12401881, 12442847, 12485480, 12535042, 12578890, 12612442, 12628878, 12658687, 12681236, 12695804, 12693449, 12690954, 12679936, 12691740, 12722655, 12717440, 12732138, 12765808, 12793801, 12819371, 12845077, 12882214]
3552A2882214M6580L6448N5884M5804M5109N2834M8468M8474M5259N0093N5924
3541A3413091M3506O6499M1538K0267K9735K6394L6868J2534J3713J1037K8256
3530A3743438K5913M1961L4580L3793L7130N0379N0737L9654M8642O1287N6912
3519A4224426N7460O1830M5886O2328N0990N8684R2957O5038O7102P1332Q0677
3508A4938710Q0990O7498Q6157O6811O6285O6705Q3527P5505P3312R2757R2744
3497A5791001Q1881R9667J06926R6363J01090J20025J14745J13801J08253J40166
3487A6873918J40938J33837J41799J40451J55569J53534J51929J67688J55425
3478A8215088J65706J58686J63199J65077J85336J92752J66526J96363J86428
$$ y = [12882214, 12928794, 12965242, 13021126, 13066930, 13112039, 13164873, 13213341, 13261815, 13307074, 13357167, 13413091, 13456597, 13523096, 13564634, 13584901, 13614636, 13641030, 13677898, 13690432, 13704145, 13715182, 13743438, 13769351, 13811312, 13845892, 13879685, 13916815, 13967194, 14017931, 14057585, 14106227, 14167514, 14224426, 14281886, 14343716, 14389602, 14451930, 14502920, 14561604, 14654561, 14719599, 14786701, 14858033, 14938710, 15019700, 15087198, 15173355, 15240166, 15306451, 15373156, 15456683, 15532188, 15605500, 15698257, 15791001, 15872882, 15972549, 16079475, 16175838, 16276928, 16396953, 16511698, 16625499, 16733752, 16873918, 17014856, 17148693, 17290492, 17430943, 17586512, 17740046, 17891975, 18059663, 18215088, 18380794, 18539480, 18702679, 18867756, 19053092, 19245844, 19412370, 19608733, 19795161]
3469A9795161J83031J98618J90261J89244J96528K05892J93913J98778K18341
3460B1569767K11134K32613K11284K19901K23382K28240K33042K33683K33814
3451B3596860K43857K56834K55609K55722K65066K74821K67493K79358K89470
3442B5985090K90196K84722K97651K93045K96500K97355K96773L09875K97934
3433B8649141L12248L50132L36598L37492L73107L73383M08037M18483M13740
3424C1972361M38456M64772M76190M83018M91950N12664N19698N33748N23850
3415C6416707N33839N66209N74275N82717N76963N87701N78587O07364O23642
3406D1648004O24926O84033P12466O99335P51244P82394Q04948Q43602Q72358
$$ y = [19795161, 19978192, 20176810, 20367071, 20556315, 20752843, 20958735, 21152648, 21351426, 21569767, 21780901, 22013514, 22224798, 22444699, 22668081, 22896321, 23129363, 23363046, 23596860, 23840717, 24097551, 24353160, 24608882, 24873948, 25148769, 25416262, 25695620, 25985090, 26275286, 26560008, 26857659, 27150704, 27447204, 27744559, 28041332, 28351207, 28649141, 28961389, 29311521, 29648119, 29985611, 30358718, 30732101, 31140138, 31558621, 31972361, 32410817, 32875589, 33351779, 33834797, 34326747, 34839411, 35359109, 35892857, 36416707, 36950546, 37516755, 38091030, 38673747, 39250710, 39838411, 40416998, 41024362, 41648004, 42272930, 42956963, 43669429, 44368764, 45120008, 45902402, 46707350, 47550952, 48423310]
3397D8423310R05729R55627R97568J018899J062711J116593J133391J138689J151403
3388E7903920J188168J224369J217087J225029J212165J218425J228475J235856
3380F7653494J241049J289513J313092J350443J427013J477028J554766J614512
3372G8920910J714135J822056J893341K008210K106734K229215K384489K503122
3364I5582212K656800K798546K939137L117772L353176L580994L823002M123802
3356A21975441M437394M802703N193034N651760O146344O644867P191648P790529
3348A69833720Q399885Q984775R588584J0061116J0418631J0591817J0443372
3341B38321900R995047R106518P652662N569593K783310n52692m158077p549349
$$ y = [48423310, 49329039, 50284666, 51282234, 52301133, 53363844, 54480437, 55613828, 56752517, 57903920, 59092088, 60316457, 61533544, 62758573, 63970738, 65189163, 66417638, 67653494, 68894543, 70184056, 71497148, 72847591, 74274604, 75751632, 77306398, 78920910, 80635045, 82457101, 84350442, 86358652, 88465386, 90694601, 93079090, 95582212, 98239012, 101037558, 103976695, 107094467, 110447643, 114028637, 117851639, 121975441, 126412835, 131215538, 136408572, 142060332, 148206676, 154851543, 162043191, 169833720, 178233605, 187218380, 196806964, 206868080, 217286711, 227878528, 238321900, 248316947, 257423465, 265076127, 270645720, 273429030, 272876338, 268718261, 261168912]
3333B61168912j0125026j1493214j1704393j1242738j0428713r444445q441441
3326A88288942p502656o690748o024262n459227m985582m551119m166153l874091
3318A45035104l576069l336230l179094l014451k882594k755883k690104k633958
3310A20966721k631456k598194k553080k508377k489629k468235k444141k397168
3302A00876441k363368k335801k288551k255265k159380k098594k030544j954523
3294H3390415j850453j773547j710508j623261j547641j471607j409366j337381
3286G0666651j254244j200851j123434j076537j046766j013437r88321r74971
3278F1988090r31892r27629q83936q59149q36712q02322p74623p62035p59401
$$ y = [261168912, 251043886, 239550672, 227846279, 216603541, 206174828, 196730383, 188288942, 180786286, 174095538, 168071276, 162612049, 157626467, 153075348, 148909195, 145035104, 141459035, 138122805, 134943711, 131929260, 129046666, 126290783, 123600679, 120966721, 118335265, 115737071, 113183991, 110675614, 108185985, 105717750, 103273609, 100876441, 98513073, 96177272, 93888721, 91633456, 89474076, 87375482, 85344938, 83390415, 81539962, 79766415, 78055907, 76432646, 74885005, 73413398, 72004032, 70666651, 69412407, 68211556, 67088122, 66011585, 64964819, 63951382, 62963061, 61988090, 61056198, 60128569, 59244633, 58385484, 57548772, 56746450, 55971827, 55209792, 54450391]
3269E4450391p51984p74597p61649p25818o98569o55349o09124n99111n85008
3260D8289182n65743n14576n16810n06615m86246m92283m91062m76958m54982
3251D3783907m43899m45380m24467m10559m15757l93461l91856l76980l98264
3242D0083284l72660l63433m06071l93673m04904m11786m08868m12248l94761
3233C6514880l79274l60517l46610l41250l23207l14031k92494k84623k84456
3224C3588418k93726k95730k69137k65463k72000k56968k42721k38868k09376
3215C1244429k22874k21262j84653j89885j91164j72398j61808j86607j53132
3206B9560646j53094j80173j85719j58679j49458j58755j47788j47656j42069
$$ y = [54450391, 53698407, 52923810, 52162161, 51436343, 50737774, 50082425, 49473301, 48874190, 48289182, 47723439, 47208863, 46692053, 46185438, 45699192, 45206909, 44715847, 44238889, 43783907, 43340008, 42894628, 42470161, 42059602, 41643845, 41250384, 40858528, 40481548, 40083284, 39710624, 39347191, 38941120, 38547447, 38142543, 37730757, 37321889, 36909641, 36514880, 36135606, 35775089, 35428479, 35087229, 34764022, 34449991, 34157497, 33872874, 33588418, 33294692, 32998962, 32729825, 32464362, 32192362, 31935394, 31692673, 31453805, 31244429, 31021555, 30800293, 30615640, 30425755, 30234591, 30062193, 29900385, 29713778, 29560646, 29407552, 29227379, 29041660, 28882981, 28733523, 28574768, 28426980, 28279324, 28137255]
3197B8137255j43159j55489j38315j39492j32214j42873j26723r8303j24241j26125
3187B6810321j11211j10166j06466j17030j24096q7637r2095j05281j07819j05182
3177B5743338j25676j01508j25886j28802j05970j40556j34512j44920j47600
3168B4587908j50170j80021j57528j37944j66246j75137j49110j51053j65806
3159B3154893j70631j64846j51730j37016j34338j27935j24318j29318j17411
3150B1897350r4635j24341r2811q4764j03331j07407j09417r2920j08559j21083
3140B0858082j23906j34036j45883j35351j54663j47226j54236j39126j25285
3131A9598370j37685j31109j38695j43850j05563j03971j13003q5282r8937o7605
$$ y = [28137255, 27994096, 27838607, 27700292, 27560800, 27428586, 27285713, 27158990, 27060687, 26936446, 26810321, 26699110, 26588944, 26482478, 26365448, 26241352, 26153715, 26061620, 25956339, 25848520, 25743338, 25617662, 25516154, 25390268, 25261466, 25155496, 25014940, 24880428, 24735508, 24587908, 24437738, 24257717, 24100189, 23962245, 23795999, 23620862, 23471752, 23320699, 23154893, 22984262, 22819416, 22667686, 22530670, 22396332, 22268397, 22144079, 22014761, 21897350, 21802715, 21678374, 21585563, 21500799, 21397468, 21290061, 21180644, 21087724, 20979165, 20858082, 20734176, 20600140, 20454257, 20318906, 20164243, 20017017, 19862781, 19723655, 19598370, 19460685, 19329576, 19190881, 19047031, 18941468, 18837497, 18724494, 18639212, 18540275, 18472670]
3121A8472670l5283o8794n1710k5573k3586m3258k7419p012j1168m94j4808j0817
3109A8152748j1716k0758J087r495m442L276J3995J5667J0713K3547K6961M2756
3097A8244339K1604K1883L7858N9786O3654P2556Q3561P3154J08230J12838J40302
3086A9039765J51653J38869J52234J70273J76351J84921J71817J66656J61831
3077B0514370J85589J86105J85153J86230J99022K21661K04470K36247K39956
3068B2358803K20047K40898K32624J99764K17127J70574J78993K00007K03032
3059B4221869K05938K23188K53157K91927K78842K97994L18296L08188L68545
3050B6767944L57733L65850L86610M30138M79646N07282N31308N62630O07600
$$ y = [18472670, 18437387, 18368593, 18316883, 18291310, 18267724, 18224466, 18197047, 18190035, 18178867, 18178373, 18163565, 18152748, 18141032, 18120274, 18121361, 18111866, 18107424, 18110700, 18124695, 18140362, 18151075, 18174622, 18201583, 18244339, 18265943, 18287826, 18325684, 18385470, 18449124, 18521680, 18605241, 18678395, 18786625, 18899463, 19039765, 19191418, 19330287, 19482521, 19652794, 19829145, 20014066, 20185883, 20352539, 20514370, 20699959, 20886064, 21071217, 21257447, 21456469, 21678130, 21882600, 22118847, 22358803, 22578850, 22819748, 23052372, 23252136, 23469263, 23639837, 23818830, 24018837, 24221869, 24427807, 24650995, 24904152, 25196079, 25474921, 25772915, 26091211, 26399399, 26767944, 27125677, 27491527, 27878137, 28308275, 28787921, 29295203, 29826511, 30389141, 30996741]
3041C0996741O49611O87933P16598P31074P77319Q08877Q50397Q94092R39136
3032C8051778J000144J057131J117269J161049J185710J221536J247701J256258
3024D7298576J237816J194274J167944J077306R98171Q87061P92436P40087P24896
3015E6118567P38686P86926Q42272R30814J025248J138871J281205J368161J537338
3006F5768088J687442J840080K020760K185897K343398K500991K652315K766698
2998H3765669K840891K840989K744740K524808K172711J686169J114926L07653
2990I9998556p46474j741829k241566k095937j744722j340837r17446m11552J2738
2981H8770931L51246O46649Q67014J030969J122400J194861J247950J254913J222172
$$ y = [30996741, 31646352, 32334285, 33050883, 33781957, 34559276, 35368153, 36218550, 37112642, 38051778, 39051922, 40109053, 41226322, 42387371, 43573081, 44794617, 46042318, 47298576, 48536392, 49730666, 50898610, 51975916, 52974087, 53861148, 54653584, 55393671, 56118567, 56857253, 57644179, 58486451, 59417265, 60442513, 61581384, 62862589, 64230750, 65768088, 67455530, 69295610, 71316370, 73502267, 75845665, 78346656, 80998971, 83765669, 86606560, 89447549, 92192289, 94717097, 96889808, 98575977, 99690903, 99998556, 99252082, 97510253, 95268687, 93172750, 91428028, 90087191, 89169745, 88758193, 88770931, 89122177, 89768826, 90635840, 91666809, 92789209, 93984070, 95232020, 96486933, 97709105]
2972I7709105J172833J091479R25964O44058L21403q2764m55957q20229j137050
2963I9368842j354956j532825j716905j976951k318999k464930k297158j998441
2955H3707677j717519j423046j154422r19011p47805o22440n45807n57223o23112
2946G5397292p21758q52613j028933j238276j421596j622043j841180k090594
2938F4580299k245152k324494k328853k255234k130269k007467j894638j739377
2930D7654815j598960j470354j337669j225656j132023j068911r72245q98280
2922C7950717q57581q07831p73534p78010p81277p50962p57711p32981p19861
2913C0990969p22659p08944o68403o68585o73799o61118o36041o20354o07238
$$ y = [97709105, 98881938, 99973417, 100899381, 101543439, 101864842, 101782078, 101326121, 100505892, 99368842, 98013886, 96481061, 94764156, 92787205, 90468206, 88003276, 85706118, 83707677, 81990158, 80567112, 79412690, 78493679, 77745874, 77123434, 76577627, 76020404, 75397292, 74675534, 73822921, 72793988, 71555712, 70134116, 68512073, 66670893, 64580299, 62335147, 60010653, 57681800, 55426566, 53296297, 51288830, 49394192, 47654815, 46055855, 44585501, 43247832, 42022176, 40890153, 39821242, 38848997, 37950717, 37093136, 36285305, 35511771, 34733761, 33952484, 33201522, 32443811, 31710830, 30990969, 30268310, 29559366, 28890963, 28222378, 27548579, 26887461, 26251420, 25631066, 25023828]
2904B5023828n96604n83023n63686n16718m83138m76239m66340m49994m31662
2895B0456424m08464l97698l84218l77240l29871l13303l02135k76683k63004
2886A7403808k50041k39384k41557k42070k55094k42001k53033k49395k44468
2877A5186765k67006k65805k67515k80692k95896k82219k75758k88771k55987
2868A2707116k70837k51273k41740k35868k18592j96033j92461j65378j49543
2859A0785391j48147j44365j39879j40943j17593j12821j31616j21563j26927
2850I601537j59414j70154j41477j55375j50564j60778j64382j30506j21239j24944
2840H122704j26557j29781j06908j32334j33668j15103j17103j04049r5235j19297
$$ y = [25023828, 24427224, 23844201, 23280515, 22763797, 22280659, 21804420, 21338080, 20888086, 20456424, 20047960, 19650262, 19266044, 18888804, 18558933, 18245630, 17943495, 17666812, 17403808, 17153767, 16914383, 16672826, 16430756, 16175662, 15933661, 15680628, 15431233, 15186765, 14919759, 14653954, 14386439, 14105747, 13809851, 13527632, 13251874, 12963103, 12707116, 12436279, 12185006, 11943266, 11707398, 11488806, 11292773, 11100312, 10934934, 10785391, 10637244, 10492879, 10353000, 10212057, 10094464, 9981643, 9850027, 9728464, 9601537, 9442123, 9271969, 9130492, 8975117, 8824553, 8663775, 8499393, 8368887, 8247648, 8122704, 7996147, 7866366, 7759458, 7627124, 7493456, 7378353, 7261250, 7157201, 7061966, 6942669]
2830F942669r7925r9244j08014p3116p4586r9108q1843p7142p4099q5993p4279
2819E997320o9411o5287o6244m0201p0557p8429p0302n4225o2743m9555n9306
2808E311060n7340n5523l8626m2495m3891l0451l7110m8460n5645k8246j9000
2797D854273l0474m2963m2082k9790k4271j5228k0353k4045l4180m7875j5005
2786D528007k8563k6346k9337l7465m0249j1733l8293n3644l0542j6098k2777
2775D192960k0829k5473n6083k2630j7625l4580l5364j2976j4049m5050j4729
2764C893572k1288l7047j7066j9506j3585j0432k3735r48l6184k2663q912n790
2752C676416L060l969k4779j3631n549k0858k8954j3684n872O832k9340j8064
$$ y = [6942669, 6844744, 6745500, 6637486, 6564370, 6489784, 6390676, 6308833, 6231691, 6157592, 6071599, 5997320, 5927909, 5862622, 5796378, 5756177, 5685620, 5607191, 5536889, 5482664, 5419921, 5370366, 5311060, 5253720, 5198197, 5159571, 5117076, 5073185, 5042734, 5005624, 4957164, 4901519, 4873273, 4854273, 4823799, 4780836, 4738754, 4708964, 4684693, 4669465, 4649112, 4625067, 4590887, 4543012, 4528007, 4499444, 4473098, 4443761, 4406296, 4366047, 4354314, 4316021, 4262377, 4231835, 4215737, 4192960, 4172131, 4146658, 4090575, 4067945, 4050320, 4015740, 3980376, 3967400, 3953351, 3908301, 3893572, 3872284, 3835237, 3818171, 3798665, 3785080, 3774648, 3750913, 3749965, 3713781, 3691118, 3682206, 3676416, 3679476, 3675507, 3650728, 3637097, 3631548, 3610690, 3581736, 3568052, 3562180, 3569012, 3539672, 3521608]
2740C521608j509k7342j2518k8553p03j9697j4195l419j2809k6536l0370j6909
2728C327048k2956j7570k2091N556j6053k4815j9945j4311m168L636P440j091
2716C200680r235Q26N911l081K725j1138k0812j1392R89l1340j6771j9314k4510
2703C063538m3391l6534j2208n702j1150r828j3248j9398j9705q712j4528j7975
2691B851159j2626k0209j4477j3407j9364j9478j476j1968j2411l1109j0922j5582
2679B668130k1909k9868l6406p185k1194k8654k8299k0719j4090l5665l6313j4596
2667B373232j49j3884k0223j4061k7291k2095j3018k0134k6119j9891k6009k3711
2655B146647l6089m4275k8556j7800k0779l7483m4778p482k0679l3887k3563j4441
$$ y = [3521608, 3520099, 3492757, 3480239, 3451686, 3450983, 3431286, 3417091, 3413672, 3400863, 3374327, 3343957, 3327048, 3304092, 3286522, 3264431, 3269987, 3253934, 3229119, 3209174, 3194863, 3190695, 3194331, 3201771, 3200680, 3191445, 3192271, 3198182, 3195101, 3197826, 3186688, 3165876, 3154484, 3155473, 3124133, 3107362, 3088048, 3063538, 3020147, 2983613, 2971405, 2965703, 2954553, 2944725, 2931477, 2912079, 2892374, 2883662, 2869134, 2851159, 2838533, 2818324, 2803847, 2790440, 2771076, 2751598, 2750122, 2738154, 2725743, 2694634, 2683712, 2668130, 2646221, 2616353, 2579947, 2572762, 2551568, 2522914, 2494615, 2473896, 2459806, 2424141, 2387828, 2373232, 2373083, 2359199, 2338976, 2324915, 2297624, 2275529, 2262511, 2242377, 2216258, 2196367, 2170358, 2146647, 2110558, 2066283, 2037727, 2019927, 1999148, 1961665, 1916887, 1909405, 1888726, 1854839, 1831276, 1816835]
2643A816835j7374j4962k6115j0589j8690k0438j8708j7647m823j5346k7901j5238
2631A609004n185j1530p727j6877k862n518L045j0350m640m230j5635j2049j5529
2618A499917o109k5841j7682o827j0641p45k3884j2238r31k0389l264j4465j2812
2605A344089k2526o805N248k1369p858r873O604l313l736l9720j7492N412o543
2592A222118j1948j6507l014j2408l0332n566j462k149j9599j6563L022J5955
2580A121547j0426j5961r675r918p549L043j3739q135L66j0441j8467j1242J4457
2567A023860l57j9886j2967L21L611k307k4910J6371j3962O971j0023o429j1958
2554I48335l401j0767m622l843j2820J4030m210q877j9255j5987j7202n922r778
$$ y = [1816835, 1799461, 1784499, 1758384, 1747795, 1729105, 1708667, 1689959, 1672312, 1667489, 1652143, 1624242, 1609004, 1603819, 1592289, 1584562, 1567685, 1564823, 1559305, 1562350, 1552000, 1547360, 1543130, 1527495, 1515446, 1499917, 1493808, 1467967, 1450285, 1443458, 1432817, 1432072, 1408188, 1395950, 1395019, 1374630, 1371366, 1356901, 1344089, 1321563, 1314758, 1320006, 1298637, 1290779, 1280906, 1287510, 1284197, 1280461, 1240741, 1223249, 1228661, 1222118, 1210170, 1193663, 1190649, 1178241, 1147909, 1142343, 1140881, 1138732, 1119133, 1102570, 1105592, 1121547, 1111121, 1095160, 1085485, 1075567, 1068018, 1071061, 1057322, 1049187, 1049553, 1039112, 1020645, 1009403, 1023860, 1023503, 1003617, 990650, 990971, 994582, 992275, 967365, 983736, 969774, 976745, 966722, 960293, 948335, 944934, 934167, 929545, 925702, 912882, 926912, 922702, 913825, 894570, 878583, 861381, 855459, 845681]
2541H45681L492j3441q480j293j2596J697l764j3661J862l347l699k3353p944
2528G61154p98k3848j2662j590j0472r272j4441P519L123j7293r862o592J9896
2515F84862j4125p81L503r134l77k5400o378j788r14R111k2156n976o434m941
2501E99072j1024l230r753p14J391j3967L039o952L493j0431O595j0967j1135
2488E35417L347j355j9499J46j0824k3607P98p559J0248o735o093p761J2789Q257
2474D87569j7400j3938Q289k443k5823n880l552j2834k575o661m27l697L282k983
2460D00927J930j2156Q590O16k7151n561j8183L222J5385j8456L041o885L498
2447C48817M52k526o312j3795r097j4150j588J4004J2665j0480j0120r558J4893
$$ y = [845681, 849173, 835732, 827252, 825959, 813363, 815060, 811296, 797635, 799497, 796150, 792451, 769098, 761154, 760356, 736508, 723846, 722256, 711784, 702512, 688071, 695590, 698713, 681420, 671558, 664966, 684862, 670737, 669956, 673459, 664325, 663948, 638548, 632170, 630382, 629468, 638579, 616423, 610447, 604013, 599072, 588048, 584818, 575065, 574351, 575742, 561775, 564814, 557862, 561355, 550924, 557519, 546552, 535417, 538764, 537409, 517910, 518056, 507232, 483625, 484423, 476864, 487112, 480377, 474284, 466523, 479312, 487569, 470169, 456231, 464520, 462077, 436254, 430374, 426822, 413988, 411413, 404752, 404325, 400628, 403910, 400927, 402857, 390701, 399291, 399907, 372756, 367195, 349012, 352234, 367619, 349163, 352204, 345319, 348817, 349269, 346743, 340431, 326636, 317539, 303389, 301801, 315805, 328470, 317990, 307870, 298312, 313205]
2434C13205p091r952L889m111n268n879j745j556j865j0277k254n377o635q83
2420B54201n910K98j623l353p425Q269n058J2018p489r667J4274j61k15M411j1126
2405B41444j3074r812r6M174l584Q670J1829j9949m704m403q306K236n560K700
2391B01565K7841j5546p105K691o660M049p935k0333n4J5674j2062j4377J428
2378A69176J9127k915j5652m415J1608o248j0814J7443n63N203L21n138k0235
2365A56898k2761K3754J704J9022K0560j1172j4678n103L548J12J5136k3901j0486
2352A52633k315M159O399J183m429J47o974J6361L215k8560k905K985J0538j194
2338A51243J4508j2222K83k269o805r798O314q057l641L099J5970j288L880j254
$$ y = [313205, 306114, 296162, 300051, 295940, 290672, 284793, 283048, 281492, 279627, 269350, 267096, 261719, 255084, 254201, 248291, 248589, 246966, 243613, 236188, 244457, 239399, 251417, 243928, 234261, 248535, 248374, 248159, 252570, 241444, 228370, 218558, 218462, 222636, 219052, 227722, 239551, 219602, 214898, 210495, 202189, 204425, 198865, 201565, 229406, 213860, 206755, 209446, 202786, 206835, 198900, 178567, 178513, 194187, 182125, 167748, 169176, 188303, 185388, 169736, 165321, 176929, 170681, 159867, 177310, 176747, 181950, 182271, 177133, 156898, 134137, 157891, 159595, 178617, 199177, 188005, 173327, 168224, 171772, 171884, 187020, 163119, 152633, 150318, 154477, 160876, 162059, 157630, 157777, 150803, 167164, 170379, 141819, 138914, 141899, 152437, 151243, 165751, 153529, 153812, 151543, 144738, 134940, 141254, 133197, 129556, 132655, 148625, 147337, 151217, 149963]
2324A49963j0358J9172q446q251n096J2975L678R084K474j3386r127L655M045
2311A50382r988p662J0269L519K08j0195j0530J8404J948j0426j0744J3464r059
2298A29590M17J0009n322j5256J1303Q760J394m270j0995L800R841n081l887O360
2284A36663J5508M921r465l823N48O256p166j1758P609o72o544m305j3676M640
2270A18736O327J1476J747q377M355j19j0501n969r758P026P179J2836J982K004
2256A38944j243O087m113j4765J1100K4510Q76p583K70J0768R864j0059n362K0532
2242A79826N611J0672N72L717J0891l949o902J4547P485O294J3045m059o859J1699
2228B42590Q810Q339K1981J3180K3964J0638K0856l79J3303P645J8814L5683M5536
$$ y = [149963, 139605, 158777, 150331, 142080, 136984, 149959, 153637, 162721, 165195, 151809, 142682, 146337, 150382, 140394, 132732, 143001, 146520, 146728, 136533, 126003, 144407, 146355, 135929, 125185, 138649, 129590, 130007, 140016, 134694, 119438, 130741, 139501, 140895, 136625, 125630, 129430, 139271, 134190, 130303, 136663, 152171, 157092, 147627, 143804, 144352, 150608, 143442, 131684, 139293, 138621, 132077, 127772, 114096, 118736, 125063, 136539, 138286, 129909, 134264, 134145, 123644, 117675, 107917, 114943, 122122, 134958, 136940, 138944, 137701, 143788, 139675, 124910, 136010, 160520, 161396, 153813, 154083, 164851, 174715, 164656, 159294, 179826, 185437, 196109, 196681, 200398, 211289, 207340, 200438, 214985, 222470, 228764, 241809, 237750, 230891, 242590, 251400, 259739, 281720, 294900, 318864, 329502, 350358, 349979, 363282, 370927, 389741, 425424, 470960]
2215D70960J8457L4849M6192M7628K4452O0503Q8924N5880L3470L3457R0162J20324
2203A125258J39065J85100K01931K41591K49320L39310L77008N04510N95141O85523
2193D643757R8461q79946o76805m39720m87380m20366l03890k08818j45033j20948
2183A059312q6330p0727n5440n7584n7401m6862m5085m0624l6377m9348l1760
2172D81774j4022l1146l2876k3390j4516j4251o545k5635o760o769N439j0089
2160C01214k2762k2738p507J8362o751k7281l2880Q73N885J5181R691k7707r683
2147A93897J3596r951o024r962k1304q75J9493O045M392j9283j030n478j1862
2134A51654j0949K8150P13p684P33j1731K216j6175l452o903P834q781q72p857
$$ y = [470960, 489417, 524266, 570458, 618086, 642538, 703041, 791965, 847845, 881315, 914772, 1004934, 1125258, 1264323, 1449423, 1651354, 1892945, 2142265, 2481575, 2858583, 3363093, 3958234, 4643757, 4742218, 3862272, 3185467, 2745747, 2258367, 1838001, 1534111, 1325293, 1180260, 1059312, 972982, 902255, 846815, 789231, 731830, 684968, 639883, 599259, 562882, 513534, 481774, 467752, 436606, 403730, 380340, 365824, 351573, 345028, 319393, 312633, 305864, 311303, 301214, 278452, 255714, 248207, 266569, 259818, 232537, 199657, 200530, 206415, 221596, 231287, 203580, 193897, 207493, 197542, 191518, 181556, 160252, 159377, 178870, 184915, 189307, 170024, 168994, 163516, 151654, 140705, 168855, 169568, 161884, 162617, 150886, 153102, 136927, 133475, 126572, 134406, 125625, 124753, 116896]
2120A16896K908J5133j993n770k3793o832P705O339n86j2957m230K071R770j5834
2106H8827J19m487M157J3698k28p663m191j9655j0364J6584lq274P888q710P024
2091G4722M667m794j4669k427M422l7j9321P186J7641j6754n048J0669l078r787
2077D3392P470j058o351k202M858J330m352j6900P74k0466K7696J3519n416l093
2063C9201o150J7136j3249j399o457r316L5130K883j2801q083j7329q12R985M445
2049C3184j5298J3089p083k306r019J4819o418k6057L617J0518m221p916Q29N202
2035B940k989l952R116J1983j2715j651O949L205j175q183r879O757K697P321
2021A0424J2268k1403k281J4162m138L866k5n287K293j3644j4081M629K292l821
$$ y = [116896, 119804, 134937, 132944, 127174, 103381, 96549, 104254, 110593, 110007, 97050, 92820, 94891, 104661, 88827, 88946, 84459, 88616, 102314, 102086, 94423, 90232, 70577, 60213, 76797, 76794, 68520, 76408, 67698, 74722, 79389, 74595, 59926, 57499, 61921, 61884, 42563, 49749, 67390, 50636, 45588, 56257, 53179, 43392, 50862, 49804, 43453, 41251, 46109, 47439, 43087, 26187, 26961, 6495, 34191, 47710, 42294, 39201, 33051, 50187, 36938, 35539, 29082, 19766, 54896, 57779, 44978, 36895, 19566, 18754, 28739, 33184, 17886, 30975, 23892, 21586, 12567, 27386, 20968, -5089, -1472, 9046, 4825, -3091, -2262, 2940, -49, -4001, 5115, 17098, 4383, 2732, 9681, 12886, 11711, 3528, -6351, 406, 3103, 10424, 22692, 1289, -992, 13170, 9032, 12898, 12873, 7586, 9879, -3765, -17846, -13217, -10925, -14746]
2007a4746R895j8160m58P094l979K3354K123o081q283J3998J0495j2830j7007
1994a4585O29J4254j300O017J0594m892q718j4544N570R684n256M05o654R452
1980F56r511L98J1457K903o254l210l811M436N001k408R415J1043l1045J5995
1966E065P093P373k1011j4118J4643R555j1512J8114q70n579J0372r668J239J263
1952A1959L988O251q813l017J8815Q294p844r03j9094J825M991M860O723n768
1938B2267k4221K897J2962L697q064q359J3228J0085n575R030K2728j021P983
1925E7637k0660l859K001K0634j9542J1572o04j145p427j7877K59J2795l745M039
1911C4078o814m819J8291j4408k559P753l377O613r659L077Q296r56j492j0470
$$ y = [-14746, -4851, -23011, -23469, -16375, -20354, 3000, 5123, -958, -9241, 4757, 15252, 2422, -14585, -13956, 298, -1002, 5015, 15609, 10717, 1999, -12545, -6975, 2709, -2547, -2142, -8796, 656, -8855, -8457, 3000, 5903, -351, -3561, -7372, -2936, 2065, -343, 9072, 20115, -10930, 5065, 12158, 19531, -1480, -15598, -955, 8600, -2912, 15202, 14332, 8753, 19125, 9457, 10696, 11959, 15947, 22198, 13385, 10368, 29183, 37477, 29633, 28730, 9636, 11461, 16452, 21312, 28035, 22267, -1954, 943, 13905, 17602, 9538, 1179, 14407, 24492, 18917, 27947, 50675, 49654, 57637, 36977, 33118, 35119, 55753, 36211, 47783, 47179, 46034, 38607, 20730, 20989, 33784, 30039, 34078, 27264, 22445, 40736, 26328, 23769, 31522, 28145, 34758, 25099, 28176, 36472, 35516, 34024, 23554]
1897B3554j5663L445J6463j0529k022j5533l274M51L089J066l194K128m054L535
1883e38P208o247O749l523R969J6683p170J069O436k0423q236M506J4225Q47j0982
1868A0573O460j9426J3275n744k3429J090J4626R54j838j1166N500J1301j0202
1855h026l555O183j0663j593m184R345j559k455K3406j1419j4452J0391j604r874
1841b0059M679r527j0161J3159R056N839m510j3577k979J1512k975j1623N155
1828b6011L132j0250m605Q017R091n89l481j200j3500P387r95k038J0425j47P51
1813b4013q297j1696j4413J4576J9820J220N178l616m371j0335O707m070q319
1800d1629Q928M618j0730k707n144o078J5604N535P753p69J168q266p122J5203
$$ y = [23554, 7891, 11336, 27799, 17270, 15248, -285, -3559, -3108, -19, 1047, -2147, -19, -4073, -538, 6670, 423, 7172, 3649, 13618, 30301, 23131, 24200, 30636, 10213, 1977, 6483, 20708, 21555, 10573, 17033, -2393, 10882, 5138, -18291, -17201, -2575, -1621, -3459, -14625, -9125, 2176, -8026, -11581, -5398, -16061, -17654, -21838, -12493, -14052, -16507, 6899, -4520, -18972, -8581, -10185, -20059, -15380, -24907, -35068, -21909, -12853, -7014, -11524, -25101, -28080, -16568, -19543, -31166, -26011, -22879, -33129, -37734, -29717, -20626, -21215, -24696, -25896, -39396, -32009, -33004, -35042, -24617, -24764, -24013, -32310, -44006, -58419, -43843, -24023, -22803, -17625, -21241, -25612, -35947, -29240, -33310, -41629, -32701, -28083, -38813, -41520, -46664, -52742, -37138, -31603, -23850, -24619, -23451, -31717, -38839, -23636]
1786b3636q238N058J0397j3369J069o25k4885P256L433J49k355M341J1656J80
1772b9569L445L725M365R92L522n278q633N786P125J303k039J1916N633n271q728
1757a1706J2706j0633j3927O491M360J1892M377P675o291L241l558j7955O621
1744f707N078l940J0957j693M347J8569M423j7686l38n933P1J7080o377K602L448
1729B3901n775k69P648M919K552j0124k371m133O555Q780o083j472o150j5347
1715B631l050j005M010M499N439J0753N463l1739j2920J6153N459k248P296K433
1701A3174L472q625P199N679j3074K581o154J740k2651L48J0568j300J5049j4207
1687f201l636Q358o487m781p9N164J1721j4559k0843J0954l044j49P411j4106
$$ y = [-23636, -31874, -26816, -16419, -29788, -28719, -29344, -54229, -46973, -43540, -43391, -45746, -41405, -29749, -29569, -26124, -22399, -18034, -17042, -13520, -18798, -27431, -21645, -14520, -13217, -15256, -3340, 2293, -2978, -11706, 1000, -9633, -23560, -17069, -12709, -817, 3560, 11235, 4944, 8185, 4627, -13328, -6707, -1629, -5569, 5388, 3695, 8042, 26611, 31034, 13348, 13010, 7077, 7148, 24228, 17851, 20453, 23901, 18126, 17857, 25505, 30424, 32976, 22852, 20481, 16348, 22903, 31683, 25600, 24128, 17978, 2631, -419, -1424, 2586, 7085, 12524, 23277, 28740, -2999, -15919, 234, 5693, 3445, 10741, 13174, 16646, 8021, 15220, 20899, 7825, 10406, 4252, 5992, -16659, -16311, -5743, -7043, 8006, -6201, -9837, -1479, -7966, -12747, -12826, -7662, 4059, -10500, -31343, -20389, -23433, -23582, -16171, -30277]
1673c0277o933J6728j268j5852N691J0321k3697J666J7029L031j937p152r410
1660d2060J1728O4l0456L620J6412J4723N475r030J453k286J732O590N734k0058
1646c6359J0653k133Q439j6670m628J550N653Q043N647r380r692o381o716j097
1632e3071O817m775k599P335r77K1308M001p162l430M412R328n26k6288p004J4022
1617c8609K227p020K2741o55J16j3793N316M626l489k214l386P37O676J174O796
1602a8757j832j6607j923K4461j0069Q612J0336j8510m615l289Q363N806l354
$$ y = [-30277, -37210, -20482, -21750, -37602, -31911, -21590, -45287, -43621, -26592, -23561, -25498, -32650, -42060, -30332, -30268, -60724, -57104, -40692, -25969, -20494, -29524, -28071, -30357, -28625, -22035, -16301, -36359, -25706, -27839, -19400, -36070, -40698, -39148, -33495, -25452, -19805, -29185, -38877, -45258, -51974, -53071, -46254, -51029, -53628, -46293, -47270, -25962, -21961, -29123, -32553, -28141, -18813, -19339, -45627, -52631, -38609, -36382, -43402, -20661, -21316, -21200, -34993, -29677, -25051, -28540, -30754, -34140, -33403, -26727, -25553, -18757, -20589, -37196, -39119, -14658, -24727, -16115, -5779, -24289, -28904, -32193, -23830, -18024, -21378]
$$ [...]
##END NTUPLES=NMR SPECTRUM
##END=
