##TITLE=1H_CA-8957-3
 CDCl3
 8 sc, 
 6.12.2021
##JCAMPDX= 6.0         $$ Bruker NMR JCAMP-DX V2.0
##DATA TYPE= NMR SPECTRUM
##DATA CLASS= NTUPLES
##ORIGIN= UXNMR, Bruker Analytische Messtechnik GmbH
##OWNER= root
$$ XWIN-NMR		Version 3.5
$$ Mon Dec  6 10:50:13 2021 Russian Standard Time (UT+4h)  she@DPX200
##.OBSERVE FREQUENCY= 200.131346
##.OBSERVE NUCLEUS= ^1H
##.ACQUISITION MODE= SIMULTANEOUS
##.ACQUISITION SCHEME= undefined
##.AVERAGES= 8
##.DIGITISER RES= 18
##SPECTROMETER/DATA SYSTEM= spect
##.PULSE SEQUENCE= zg30
##.SOLVENT NAME= D2O
##.SHIFT REFERENCE= (INTERNAL, D2O, 0, 15.7105)
##AUDIT TRAIL= $$ (NUMBER, WHEN, WHO, WHERE, WHAT)
$$ ##TITLE= Audit trail, XWIN-NMR		Version 3.5
$$ ##JCAMPDX= 5.01
$$ ##ORIGIN= Bruker BioSpin GmbH
$$ ##OWNER= she
$$ F:/spectra/data/she/nmr/H-F/1/pdata/1/auditp.txt
$$ ##AUDIT TRAIL=  $$ (NUMBER, WHEN, WHO, WHERE, WHAT)
(   1,<2021-12-06 10:48:39.57 +0400>,<she>,<DPX200>,
      <created by zg, POWCHK disabled, PULCHK disabled
       configuration hash MD5:
       00 E9 B6 7A A2 85 ED C7 34 08 36 98 17 FE 4E 26
       data hash MD5: 16K
       B2 5C E9 83 56 35 4E 8A DB 0A 02 83 1C CE 70 5C>)
(   2,<2021-12-06 10:48:42.42 +0400>,<she>,<DPX200>,
      <Start of raw data processing
       efp BC_mod = 2 LB = 0.24 FT_mod = 6 PKNL = 1 PHC0 = -15518.13 PHC1 = 18.40081 SI = 16K 
       data hash MD5: 16K
       B3 4D 5E C0 06 21 C5 9F B3 42 7C F4 E1 D3 72 70>)
(   3,<2021-12-06 10:49:00.34 +0400>,<she>,<DPX200>,
      <pk PHC0 = 4.984164 PHC1 = -1.8 
       data hash MD5: 16K
       EB 90 2B 38 53 93 63 AF 33 39 D3 E7 02 68 87 20>)
(   4,<2021-12-06 10:49:05.37 +0400>,<she>,<DPX200>,
      <abs ABSG = 5 
       data hash MD5: 16K
       1A 8F 80 08 14 BF F7 38 20 1D 68 B0 A0 E2 34 08>)
(   5,<2021-12-06 10:49:25.14 +0400>,<she>,<DPX200>,
      <pk PHC0 = 2.14241 PHC1 = -4 
       data hash MD5: 16K
       96 B8 88 91 AF AC A2 F9 A3 76 F1 2A 3F 9F 30 54>)
(   6,<2021-12-06 10:49:31.03 +0400>,<she>,<DPX200>,
      <abs ABSG = 5 
       data hash MD5: 16K
       0C 91 16 D2 C8 9F 87 C5 B5 0F 0B 0B FA D5 1B 15>)
$$ ##END=
$$ 
$$ hash MD5
$$ E7 DE 8B E1 42 FB C0 EB BC F8 78 3E 0F D2 12 F8
##$RELAX= 
##$RELAX= 
##$RELAX= 
##$RELAX= 
##$RELAX= 
##$RELAX= 
$$ Bruker specific parameters
$$ --------------------------
##$DU= <F:/spectra>
##$EXPNO= 1
##$NAME= <H-F>
##$PROCNO= 1
##$TYPE= <nmr>
##$USER= <she>
##$AMP= (0..31)
100 100 100 100 100 100 100 100 100 100 100 100 100 100 100 100 100 100 
100 100 100 100 100 100 100 100 100 100 100 100 100 100 
##$AQSEQ= 0
##$AQ_mod= 1
##$AUNM= <au_zg>
##$AUTOPOS= <>
##$BF1= 200.13
##$BF2= 200.13
##$BF3= 200.13
##$BF4= 200.13
##$BF5= 200.13
##$BF6= 200.13
##$BF7= 200.13
##$BF8= 200.13
##$BYTORDA= 1
##$CFDGTYP= 0
##$CFRGTYP= 5
##$CHEMSTR= <none>
##$CNST= (0..31)
1 1 145 1 1 1 1 1 1 1 1 1 1 1 1 1 1 1 1 1 1 1 1 1 1 1 1 1 1 1 1 1 
##$CPDPRG= <>
##$CPDPRG1= <>
##$CPDPRG2= <>
##$CPDPRG3= <>
##$CPDPRG4= <mlev>
##$CPDPRG5= <mlev>
##$CPDPRG6= <mlev>
##$CPDPRG7= <mlev>
##$CPDPRG8= <mlev>
$$ [...]
##$SUBNAM2= <"">
##$SUBNAM3= <"">
##$SUBNAM4= <"">
##$SUBNAM5= <"">
##$SUBNAM6= <"">
##$SUBNAM7= <"">
##$SUBNAM8= <"">
##$SUBNAM9= <"">
##$SW= 18.0517287032376
##$SWIBOX= (0..15)
0 0 2 0 0 0 0 0 0 0 0 0 0 0 0 0 
##$SW_h= 3612.71676300578
##$TD= 16384
##$TD0= 1
##$TE= 0
##$TE2= 300
##$TE3= 300
##$TEG= 300
##$TL= (0..7)
0 120 120 120 120 120 120 120 
##$TP= (0..7)
150 150 150 150 150 150 150 150 
##$TP07= 0
##$TPNAME0= <>
##$TPNAME1= <>
##$TPNAME2= <>
##$TPNAME3= <>
##$TPNAME4= <>
##$TPNAME5= <>
##$TPNAME6= <>
##$TPNAME7= <>
##$TPOAL= (0..7)
0.5 0.5 0.5 0.5 0.5 0.5 0.5 0.5 
##$TPOFFS= (0..7)
0 0 0 0 0 0 0 0 
##$TUNHIN= 0
##$TUNHOUT= 0
##$TUNXOUT= 0
##$USERA1= <user>
##$USERA2= <user>
##$USERA3= <user>
##$USERA4= <user>
##$USERA5= <user>
##$V9= 5
##$VALIST= <valist>
##$VCLIST= <CCCCCCCCCCCCCCC>
##$VD= 0
##$VDLIST= <DDDDDDDDDDDDDDD>
##$VPLIST= <PPPPPPPPPPPPPPP>
##$VTLIST= <TTTTTTTTTTTTTTT>
##$WBST= 1024
##$WBSW= 4
##$XGAIN= (0..3)
0 0 0 0 
##$XL= 0
##$YL= 0
##$YMAX_a= 134392
##$YMIN_a= -279162
##$ZGOPTNS= <>
##$ZL1= 120
##$ZL2= 120
##$ZL3= 120
##$ZL4= 120
##$ABSF1= 15.72375
##$ABSF2= -2.328099
##$ABSG= 5
##$ABSL= 3
##$ALPHA= 0
##$AQORDER= 0
##$ASSFAC= 0
##$ASSFACI= 0
##$ASSFACX= 0
##$ASSWID= 0
##$AUNMP= <proc_1d>
##$AZFE= 0.1
##$AZFW= 0.1
##$BCFW= 0
##$BC_mod= 2
##$BYTORDP= 0
##$COROFFS= 0
##$CY= -3
##$DATMOD= 1
##$DC= 0
##$DFILT= <>
##$DTYPP= 0
##$F1P= 0
##$F2P= 0
##$FCOR= 1
##$FTSIZE= 16384
##$FT_mod= 6
##$GAMMA= 0
##$GB= 0
##$INTBC= 1
##$INTSCL= 0
##$ISEN= 128
##$LB= 0.24
##$LEV0= 0
##$LPBIN= 0
##$MAXI= 10000
##$MC2= 0
##$MEAN= 0
##$ME_mod= 0
##$MI= 1.114404
##$NCOEF= 0
##$NC_proc= -8
##$NLEV= 6
##$NOISF1= 3.799351
##$NOISF2= 2.8
##$NSP= 0
##$NTH_PI= 0
##$NZP= 0
##$OFFSET= 15.71053
##$PC= 1
##$PHC0= -15511.01
##$PHC1= 12.60081
##$PH_mod= 1
##$PKNL= yes
##$PPARMOD= 0
##$PSCAL= 0
##$PSIGN= 0
##$REVERSE= no
##$SF= 200.130008208957
##$SI= 16384
##$SIGF1= 3
##$SIGF2= 2
##$SINO= 5.538805
##$SIOLD= 16384
##$SREGLST= <1H.CDCl3>
##$SSB= 0
##$STSI= 16384
##$STSR= 0
##$SW_p= 3612.71676300578
##$SYMM= 0
##$S_DEV= 0
##$TDeff= 16384
##$TDoff= 0
##$TI= <>
##$TILT= no
##$TM1= 0
##$TM2= 0
##$TOPLEV= 0
##$USERP1= <user>
##$USERP2= <user>
##$USERP3= <user>
##$USERP4= <user>
##$USERP5= <user>
##$WDW= 1
##$XDIM= 16384
##$YMAX_p= 486428731
##$YMIN_p= -1114330
$$ End of Bruker specific parameters
$$ ---------------------------------
##NTUPLES= NMR SPECTRUM
##VAR_NAME=  FREQUENCY,     SPECTRUM/REAL,   SPECTRUM/IMAG
##SYMBOL=    X,             R,               I
##VAR_TYPE=  INDEPENDENT,   DEPENDENT,       DEPENDENT
##VAR_FORM=  AFFN,          ASDF,            ASDF
##VAR_DIM=   16384,         16384,           16384
##UNITS=     HZ,            ARBITRARY UNITS, ARBITRARY UNITS
##FACTOR=    0.220516191357247, 1,           1
##FIRST=     3144.14855411699, 0,            0
##LAST=      -468.568208888795, 0,           0
##MIN=       -468.568208888795, -1114330,    0
##MAX=       3144.14855411699, 486428731,    0
$$ Real data points
##PAGE= N=1
##DATA TABLE= (X++(R..R)), XYDATA
$$ [...]
5591A9270143j08131p48L34320p0664k30529N7694j24306p6631L07869M1103j53009
5580A9247111q573j89385J56416m0455l02355L67789j44139m71051K65795J7277
5570A8898430o9091M51292J95726k60256r2817k6141l36372J01708M25881j47677
5560A9140683k16390j75704m05628L14480K34793k48802j4200L89422J29833m87427
5550A8661060k49097M58788j49377M3410j87443K8800j7058l00407K91604n94208
5540A7986072m33631k683K14473L38179l18994J2198K9780l09859r2247k22324
5530A7200964q2907J67615O045k18567n79997O7653J23256L93314R3641j66786
5520A7004231P0059k90117K5286l7043R184J59086P5113O036M1199L13530O4741
$$ y = [19270143, 19162012, 19161264, 19495584, 19424920, 19194391, 19252085, 19127779, 19051148, 19359017, 19400120, 19247111, 19238538, 19049153, 19205569, 19165114, 18862759, 19230548, 19086409, 18615358, 18881153, 18898430, 18829339, 19280631, 19476357, 19216101, 19123284, 19097143, 18760771, 18862479, 19288360, 19140683, 18924293, 18748589, 18342961, 18657441, 18892234, 18643432, 18629232, 19018654, 19148487, 18661060, 18411963, 18870751, 18721374, 18764784, 18577341, 18606141, 18589083, 18288676, 18580280, 17986072, 17552441, 17549758, 17764231, 18102410, 17783416, 17795614, 17825394, 17515535, 17423288, 17200964, 17118057, 17285672, 17291717, 17073150, 16493153, 16560806, 16684062, 17077376, 17171017, 17004231, 17074290, 16784173, 16809459, 16772416, 16781600, 16940686, 17015799, 17021835, 17063034, 17376564, 17441305]
5509A7441305K1299P98992M58136M47584N43936K48847K41726J13107j81323j159129
5499A8974480q22814m94585r50162q7177j13547j30584j46103m78267l22658K43324
5489A5671907K5439l81897J64985L11792l40301j50127j10350l35402j67262L82055
5479A5070839j35078j3567l12556J36774o6080j18295L04371j19617l77761J52178
5469A4521208L30285k61130p7779M50079M70037o44918m4122k9963l72851m7469
5459A4293377l594K90898l26331N4474j77572k81487J31060p6410J15286j1076
5449A4008625k78642M41725Q293m57267n1745l79491k5504N0232J2878l17003
5439A3012101K09947j30310L99089J20981K8575l88518J28402k5115k98013L56081
$$ y = [17441305, 17462604, 18261596, 18719732, 19167316, 19711252, 19960099, 20201825, 20314932, 20133609, 18974480, 18151666, 17657081, 16706919, 16619742, 16506195, 16375611, 16229508, 15751241, 15428583, 15671907, 15697346, 15315449, 15480434, 15792226, 15451925, 15301798, 15191448, 14856046, 14688784, 15070839, 14935761, 14922194, 14609638, 14746412, 14680332, 14562037, 14866408, 14746791, 14369030, 14521208, 14851493, 14590363, 14512584, 14962663, 15432700, 14787782, 14743660, 14713697, 14340846, 14293377, 14289783, 14580681, 14254350, 14308824, 14131252, 13849765, 13980825, 13904415, 14019701, 14008625, 13729983, 14171708, 14180001, 13722734, 13670989, 13291498, 13265994, 13316226, 13329104, 13012101, 13222048, 13091738, 13490827, 13611808, 13640383, 13251865, 13380267, 13355152, 13057139, 13413220]
5429A3413220n7201m94233n33947k96451L76274N30353l31938N7904l46101L09129
5419A2627009O9410J17755j02757l09562K67978l43181k71433K27854J86216r2371
5409A2376918o19422m32862L81786J49643j70112J94082N5195K3972k76628J49645
5399A1832217l47954o8760L37037J11241R0518k504l13106l03359J61004J03366
5389A1599700R3336l02925l3086L44982Q8516K0652n1255K35716k2740k25924
5379A1746972Q3036k20810q1869Q4176k05139j03967L55256j03273j43037l38595
5369A1072750J84575K9485k8063J04653j55174n006M22826J32453l84382k12913
5359A1161204K51110k59039N2125j53971J46726L54214M77p311J94499N4333l11217
$$ y = [13413220, 13356019, 12861786, 12327839, 12031388, 12407662, 12938015, 12606077, 12663981, 12317880, 12627009, 12696419, 12814174, 12711417, 12401855, 12669833, 12326652, 12055219, 12283073, 12469289, 12376918, 11757496, 11324634, 11706420, 11856063, 11685951, 11880033, 11935228, 11959200, 11682572, 11832217, 11484263, 11415503, 11752540, 11863781, 11954299, 11951795, 11638689, 11335330, 11496334, 11599700, 11693036, 11390111, 11357025, 11702007, 11790523, 11811175, 11759920, 11995636, 11972896, 11746972, 11830008, 11609198, 11527329, 11611505, 11406366, 11302399, 11657655, 11554382, 11411345, 11072750, 11257325, 11286810, 11258747, 11363400, 11208226, 11203220, 11626046, 11758499, 11374117, 11161204, 11412314, 11153275, 11205400, 11051429, 11198155, 11552369, 11552846, 11545535, 11740034, 11794367, 11483150]
5348A1483150l18782j76331N5283M7497M5207M48507Q1356j62255K76707j47865
5338A1632474l37984L78734J6139k51963l67980M5136j7494m13091N16899L29600
5328A1530470M41769K78144J44033m2009l36753p2391J75486J1500j83183j33733
5318A1813333K45241q7081k02669P84612m5896J59913k66815L9584L49099l95154
5308A2394167o9312J52195J5103j33988J37284P4673j16122P8531N72195J37545
5298A3242271l93904L77032l38913n6994M29140j43994J01812m90770P30786j47898
5288A3308568j30723J04981K52619j59003N9271J75077j01320L68563k559j31052
5278A3744422M54467l2834K73052p2933j57912L02901K01055J74814n3984M22287
$$ y = [11483150, 11164368, 10988037, 11043320, 11090817, 11136024, 11584531, 11665887, 11503632, 11780339, 11632474, 11294490, 11673224, 11689363, 11437400, 11069420, 11114556, 11097062, 10683971, 11200870, 11530470, 11972239, 12250383, 12394416, 12352407, 12015654, 11943263, 12118749, 12130249, 11947066, 11813333, 12058574, 11971493, 11768824, 12553436, 12507540, 12667453, 12400638, 12440222, 12789321, 12394167, 12324855, 12477050, 12492153, 12358165, 12495449, 12570122, 12454000, 12532531, 13104726, 13242271, 12848367, 13225399, 12886486, 12829492, 13258632, 13114638, 13216450, 12725680, 13456466, 13308568, 13177845, 13282826, 13535445, 13376442, 13435713, 13610790, 13509470, 13878033, 13875474, 13744422, 14198889, 14166055, 14439107, 14366174, 14208262, 14511163, 14712218, 14887032, 14833048, 15255335]
5268A5255335J80835K95321J05383L25989K87595j48957O64187L86296M12188
5259A7764172P03827N82242K44335N6771l96667l87574p1405j98615o41133j84778
5249A7471175J05861N649M7817J47887L74941p7181L15903O99680P50987J7460
5239A9860179O32519L81786M35601N34857M61967K99483l71565J0291n97325p75504
5229B0872289l93105l81162k23741j6895k1376R5684j97720K22930j48991k59623
5219A9548290K2426o8049Q1837K61779o4841J86189k1579K9230J21741k9412k63030
5208A9804581L58001K75839J0281l0312N1852P61107k9532r211j41237L32671
5198B1384040P8153L13233k93857K52048J51982K2303N95677M46538J66473n29193
$$ y = [15255335, 15436170, 15731491, 15836874, 16162863, 16450458, 16301501, 16965688, 17351984, 17764172, 18467999, 19050241, 19294576, 19351347, 18954680, 18567106, 18495701, 18297086, 17655953, 17471175, 17577036, 17582685, 17630502, 17778389, 18153330, 18076149, 18392052, 19091732, 19842719, 19860179, 20492698, 20874484, 21310085, 21844942, 22306909, 22606392, 22234827, 22245118, 21647793, 20872289, 20479184, 20098022, 19874281, 19857386, 19836010, 19931694, 19733974, 19956904, 19807913, 19548290, 19570716, 19502667, 19584504, 19846283, 19781442, 19967631, 19946052, 19975282, 20097023, 20067611, 19804581, 20162582, 20438421, 20448702, 20418390, 20470242, 21231349, 21201817, 21192606, 21051369, 21384040, 21462193, 21775426, 21481569, 21733617, 21885599, 21907902, 22503579, 22950117, 23116590, 22587397]
5188B2587397Q2216N49192m6427P1024O3916j5970N90280J49321N46815k01678
5178B4376086P4263K89418K29546N24938j98621L92369M15518J28764M95688M92269
5168B7220238n9656N46997q2431J62331N31672K38639R396O72576q3920J68931
5158B9324773M42266J32416n3395K78376Q67303J68600Q7570L0146k619M86842
5148C1762278K26804L52860N51233O08595K11830L04799K92193K00799O65516
5139C5176907L72033N6230k19355L09403K78306K05515L88150M35460N61719K46278
5129C7810646J36997Q8991K25319K08629J60983O52166Q60909P3010m24362M58703
5119D0251991K78060L03191L78244M36442j44049O93426M20337J07032O25603
$$ y = [22587397, 22669613, 23218805, 23172378, 23243402, 23307318, 23291348, 23881628, 24030949, 24577764, 24376086, 24450349, 24739767, 24969313, 25494251, 25295630, 25687999, 26103517, 26232281, 26727969, 27220238, 27160582, 27707579, 27625148, 27787479, 28319151, 28557790, 28567186, 29239762, 29155842, 29324773, 29767039, 29899455, 29846060, 30124436, 30991739, 31160339, 31247909, 31278055, 31275436, 31762278, 31989082, 32341942, 32893175, 33501770, 33713600, 34018399, 34310592, 34511391, 35176907, 35548940, 35605170, 35385815, 35695218, 35973524, 36179039, 36567189, 37002649, 37564368, 37810646, 37947643, 38036634, 38261953, 38470582, 38631565, 39283731, 40144640, 40217650, 39793288, 40251991, 40530051, 40833242, 41211486, 41647928, 41503879, 42197305, 42617642, 42724674, 43350277]
5110D3350277K02785N09768J98398j04135N42139J82910J61389L76475K87572
5101D5707578J11560K49656P2740M7880L54853r6665N42312P11559j63066M3105
5091D7581512N7305P4234Q104O3341L4624K02592m65481m1998K12639k09132k16002
5080D7301738N22290o5346j73547L21583l41534n57922l65129L53897Q8693j14942
5070D6969781k71120l5049R8535P58970j62772o5663K69966K31433M15766K92558
5060D8502405K69917Q65465M18419l71572r17577n24354j198641j346047o47093
5051D5050922p37454o32604o35893J22600k25260l95377k75640o24134n20036
5042D1127124o8812l36621l66650n09476Q7909n33496j03855k79678m35082K38298
$$ y = [43350277, 43553062, 44062830, 44261228, 44157093, 44699232, 44882142, 45043531, 45420006, 45707578, 45819138, 46068794, 46141534, 46189414, 46544267, 46447602, 46989914, 47701473, 47538407, 47581512, 47638817, 47713051, 47721155, 47784496, 47819120, 48021712, 47556231, 47514233, 47726872, 47517740, 47301738, 47824028, 47758682, 47585135, 47906718, 47565184, 47007262, 46642133, 46996030, 47084723, 46969781, 46698661, 46663612, 46762147, 47521117, 47358345, 47292682, 47562648, 47794081, 48209847, 48502405, 48772322, 49637787, 50056206, 49684634, 48767057, 48242703, 47044062, 45698015, 45050922, 44313468, 43680864, 43044971, 43167571, 42942311, 42546934, 42271294, 41647160, 41127124, 41058312, 40721691, 40355041, 39845565, 39933474, 39399978, 39296123, 39016445, 38581363, 38819661]
5032C8819661m18023o5459n9176m00591j25897l60859l65400l06815l18459M7316
5022C6446298j48527m08512l93000l9760j56714l51592o7884j62633j02233q2674
5012C4532769L36162k29924m52684l6254O81488p6675n58863l00940j36673j4353
5002C3744053j69021l2323P3101l40607j7205l5826j38617k68576m35962R8360
4992C2477377J48168J20312M6971J7110J10946J37824K92004O1305k42643O56738
4982C3826112j96693p7223J29330m54437n43096o72454o21010K95674n62240l62429
4972C0761534J03262n10264j39622j90026R1446o0072k83077J09984j48195J52775
4962B9887745K24734l14567l72764M10254j23723L23371k72824j04080N48488
$$ y = [38819661, 38401638, 38336179, 38277003, 37876412, 37750515, 37389656, 37024256, 36717441, 36398982, 36446298, 36297771, 35889259, 35496259, 35456499, 35299785, 34948193, 34880309, 34717676, 34615443, 34532769, 34868931, 34639007, 34186323, 34150069, 34831557, 34754882, 34196019, 33895079, 33758406, 33744053, 33575032, 33542709, 33615810, 33275203, 33257998, 33222172, 33083555, 32814979, 32379017, 32477377, 32625545, 32745857, 32792828, 32809938, 32920884, 33058708, 33350712, 33412017, 33169374, 33826112, 33629419, 33552196, 33681526, 33227089, 32683993, 32011539, 31390529, 31686203, 31123963, 30761534, 30864796, 30354532, 30214910, 30024884, 30116330, 30056258, 29773181, 29883165, 29734970, 29887745, 30112479, 29797912, 29425148, 29835402, 29711679, 30035050, 29762226, 29658146, 30206634]
4953C0206634M0345J9660N3146r3533O7802l48087l99211l80470K08588N00744
4943B9875618K86577Q3774J30228J95064Q5368r8303k232Q0186K50485Q8587K65056
4932C1240408J70342m23970K57241K69531j57230K96970l01369o3529L96121q4839
4922C1599676L96966M60219K23271k90174L17819N81232N59192j85255O24148
4913C4287094K05140J87797L40291K87820J53662R83597P35288K92772O90226
4904C8163687l8249k57589l83482j84915J79167j25531R9139J11358L76102n3329
4894C7886358K60443k62307M6686P89402j82803L51078L27296O3644j07320N19725
4884C9692202M39516K29046N34334L19408N14435L79628K70567L29815N4565P04356
$$ y = [30206634, 30246979, 30266639, 30319785, 30226252, 30294054, 29945967, 29546756, 29166286, 29374874, 29875618, 30162195, 30245969, 30376197, 30571261, 30656629, 30558326, 30556094, 30636280, 30886765, 30975352, 31240408, 31410750, 30986780, 31244021, 31513552, 31356322, 31653292, 31351923, 31288394, 31684515, 31599676, 31996642, 32456861, 32680132, 32389958, 32707777, 33289009, 33848201, 33662946, 34287094, 34492234, 34680031, 35020322, 35308142, 35461804, 36445401, 37180689, 37473461, 38163687, 38125438, 37867849, 37484367, 37299452, 37478619, 37353088, 37452227, 37563585, 37939687, 37886358, 38146801, 37884494, 37931180, 38720582, 38537779, 38888857, 39216153, 39279797, 39172477, 39692202, 40131718, 40360764, 40895098, 41214506, 41728941, 42108569, 42379136, 42708951, 42763516, 43467872]
4874D3467872R50323Q53895N35625M62368O33611L38404R40709Q29516N64525
4865D9576848K97515J1630K71036L80880O11235O47190N17528P1869L64204P42549
4855E3492484P31560P31589Q56644P87173N30873J443318P48752R26484J198137
4846F1447014R18863J367539J567385R25818J446016J810873J304423J587890
4838G2375821J510594J738287J426704J397398J277716J067300J291950J074827
4830H3160597Q71509J355425J747441J091440J074971J408474J210743Q28312
4822I2748912J005177J541385O17589J352667J574579J385504J568192J078153
4814A02872158J361068J900991K526949K703403K655500K814819L174725L654016
$$ y = [43467872, 44418195, 45272090, 45807715, 46270083, 46903694, 47242098, 48182807, 49012323, 49576848, 49874363, 49885993, 50157029, 50537909, 51149144, 51796334, 52313862, 52385731, 52749935, 53492484, 54224044, 54955633, 55812277, 56599450, 57130323, 58573641, 59322393, 60248877, 61447014, 62365877, 63733416, 65300801, 66226619, 67672635, 69483508, 70787931, 72375821, 73886415, 75624702, 77051406, 78448804, 79726520, 80793820, 82085770, 83160597, 84032106, 85387531, 87134972, 88226412, 89301383, 90709857, 91920600, 92748912, 93754089, 95295474, 95913063, 97265730, 98840309, 100225813, 101794005, 102872158, 104233226, 106134217, 108661166, 111364569, 114020069, 116834888, 120009613, 123663629]
4806A23663629L257205J991678m2131n08484k67954K47304J484181J941151K185356
4797A33951935K933549L179577L544043L229162K400626R34158K57353M25122
4789A50855525J190046K033506K744113L364065M331970M858575N759252N662403
4781A80799455N375166N285247L339137J23464l798453o155184p169399o117524
4773A71681909n024851m436665l904981k523173k521633k281427j412135j531650
4765A48045394q28159j271776j139606p17439p11746p96286j38250j11185j37764
4756A42193183M0192L20011L69101o94046l46118J34555o9307j90645M1691P89742
4746A42588359M26532O21067J050623J964438J646052J581159J989152J776776
$$ y = [123663629, 126920834, 128912512, 128870381, 128361897, 128093943, 128341247, 129825428, 131766579, 133951935, 136885484, 140065061, 143609104, 146838266, 149238892, 150173050, 150430403, 150855525, 152045571, 154079077, 156823190, 160187255, 164519225, 169377800, 175137052, 180799455, 186174621, 191459868, 194799005, 194922469, 191124016, 184968832, 177799433, 171681909, 166657058, 162220393, 158315412, 155792239, 153270606, 150989179, 149577044, 148045394, 147217235, 145945459, 144805853, 144088414, 143376668, 142580382, 142442132, 142330947, 142193183, 142233375, 142553386, 142922487, 142228441, 141882323, 142016878, 141947571, 141756926, 141798617, 142588359, 143014891, 143635958, 144686581, 146651019, 148297071, 149878230, 151867382, 153644158]
4738A53644158K011954J986279J665487J697748J974553J567218J498586J042854
4730A67088837J028831K98415O25792o5636Q01363R13020J268047J950893J804995
4721A75714557J849563J136079l10185j274586q27152j158401j302010j137712
4713A72690153j272273j858329k033048k105076k287533j887277k236865k001390
4705A57008362j934733k405584k034328j491322j472990j183135j477586k132076
4697A42876608j628688j182229j518089j098171j069392j450394j405268j178737
4689A32345640j538903j269873j221329j163438j138043r96073r29626j183107
4681A22905248j157187j479316j360505p85520j049847j455955r82187j079767
$$ y = [153644158, 155656112, 157642391, 159307878, 161005626, 162980179, 164547397, 166045983, 167088837, 168117668, 168416083, 169041875, 168976239, 169777602, 170690622, 171958669, 173909562, 175714557, 177564120, 178700199, 178390014, 177115428, 176288276, 175129875, 173827865, 172690153, 171417880, 169559551, 167526503, 165421427, 163133894, 161246617, 159009752, 157008362, 155073629, 152668045, 150633717, 149142395, 147669405, 146486270, 145008684, 142876608, 141247920, 140065691, 138547602, 137449431, 136380039, 134929645, 133524377, 132345640, 130806737, 129536864, 128315535, 127152097, 126014054, 125017981, 124088355, 122905248, 121748061, 120268745, 118908240, 118122720, 117072873, 115616918, 114634731, 113554964]
4673A13554964q45671j138901j309061o30241p76521j192681j240831j471125
4665A04949932r17735j025106q75928q00074r92685r61214j040862j166909q37009
4656I6332410p66705q08376r22943p84200q19320p04140n87596l52375o22266
4647H9964489r94008o51064p98068k38837p70788r38709j085845q41069n43328
4638H3102773p91355q05012p77919r37485o06695n22045q23557q9907q75076p36758
4628G6136964l64338l81250k29114m05666p41599r27485m18011m88580j240362
4619G0940559o15114o04414j017922r72814n02777r77969o98285l46924o12572
4610F4591768m08016n17809k74321o85492l44814l03014n08850m39287o87497
$$ y = [113554964, 112709293, 111570392, 110261331, 109631090, 108854569, 107661888, 106421057, 104949932, 104032197, 103007091, 102131163, 101331089, 100338404, 99377190, 98336328, 97169419, 96332410, 95565705, 94757329, 93834386, 93050186, 92230866, 91526726, 90939130, 90586755, 89964489, 88970481, 88319417, 87521349, 87282512, 86511724, 85573015, 84487170, 83646101, 83102773, 82311418, 81506406, 80728487, 79791002, 79184307, 78662262, 77838705, 77748798, 76873722, 76136964, 75772626, 75391376, 75162262, 74756596, 74014997, 73087512, 72669501, 72180921, 70940559, 70325445, 69721031, 68703109, 67730295, 67227518, 66249549, 65551264, 65204340, 64591768, 64183752, 63665943, 63391622, 62706130, 62361316, 62058302, 61549452, 61110165, 60422668]
4601F0422668l75169q42602o90526p49065l64491r19803k72436l51569j52378
4592E5704629p31594o13918n01595j11192j13484L1935n67787n52855j9524n72580
4582E1952035l86469q77360j89295l53483n36859n1168m63849k37418K22635n97446
4572D8481323N3034l83434p51K64560j8898L17785L04235m21248j33456M15300
4562D8878450K8928q6826N51295l57787O25418M24300r2723j52098L74895L35767
4552E0529619M30555M8535o37338l46601j06220m44449k30287m32555l22554Q8378
4542D8577083m38419m75385m89135m57510O397l72337L9927p62440j48305O1360
4532D5541236k1223k57169k92718J01485P1641K20326K35558L19064O3402J64536
$$ y = [60422668, 60047499, 59204897, 58514371, 57765306, 57400815, 56481012, 56208576, 55857007, 55704629, 54973035, 54359117, 53857522, 53746330, 53632846, 53664781, 53096994, 52544139, 52524615, 51952035, 51565566, 50688206, 50498911, 50145428, 49608569, 49557401, 49093552, 48856134, 49078769, 48481323, 48534357, 48150923, 48150172, 48414732, 48395834, 48713619, 49017854, 48596606, 48463150, 48878450, 48907378, 48820552, 49371847, 49014060, 49639478, 50063778, 49971055, 49818957, 50193852, 50529619, 50960174, 51008709, 50371371, 50024770, 49918550, 49474101, 49243814, 48811259, 48488705, 48577083, 48138664, 47663279, 47174144, 46716634, 46723031, 46350694, 46390621, 45628181, 45479876, 45541236, 45520013, 45262844, 44970126, 45071611, 45143252, 45363578, 45599136, 45918200, 45981602, 46146138]
4522D6146138n7331M51167O6299k33987n13308n51362k55534m64909R9923k0228
4512D4666868n69316l39519m86733j35940k40990K2788p03137k37281J67606m39081
4502D1705265Q3289L14103n9749l78250m47826m9619k61502n3685M99288M99348
4492D1850662k94358n28633j025645r90038o84675q29712m75430m16294p82212
4483C5823665n44872k82135l21977l39634n02268l23766j04516o71205l89330
4474C2343962p1268P4733l97416J55324j92389k98745J66847r5081K58112l76633
4464C1567446q02373m00585j79466m3677j39155n59303r70840j34566l28369m43848
4454B7565264p25826n61466j45598j57704j155485l76479o0897q14681k81405
$$ y = [46146138, 46088807, 46539974, 46606273, 46372286, 45858978, 45307616, 45052082, 44587173, 44687096, 44666868, 44097552, 43758033, 43271300, 43135360, 42894370, 42917158, 42214021, 41976740, 42144346, 41705265, 41788554, 42102657, 42042908, 41664658, 41216832, 41167213, 40905711, 40852026, 41351314, 41850662, 41556304, 41027671, 40002026, 39011988, 38327313, 37497601, 37022171, 36605877, 35823665, 35278793, 34996658, 34674681, 34335047, 33832779, 33509013, 33404497, 32733292, 32343962, 32272694, 32347427, 31950011, 32105335, 31912946, 31614201, 31781048, 31685967, 31944079, 31567446, 30765073, 30364488, 30185022, 30141345, 30002190, 29442887, 28472047, 28337481, 28009112, 27565264, 26839438, 26277972, 26132374, 25974670, 24819185, 24442706, 24381809, 23567128, 23285723]
4445B3285723m20927l05108j92399K85980l51936j012384k64144j74376n43157
4436B0307272l28387R3887p2914j98368k16462l75751m11087j19533l51793l61308
4426A7965556M2476j62485l15244m24678L11290l39505l96796o5539p4100o41391
4416A5899584q036K24112p8962k6902k43213j68358l93881J57485K34375l83268
4406A5212936j65493k77454j82466J0355p824n74420o6712j4667J91413J54083
4396A4279751n04230n10875k64489l54931P43966M7216k71820j30961n14236M013
4386A2523404R0549K2835k41649O3289J14230K89133j80143l39641m85933p891
4376A1848183O61040M7222m75057k65764j85926p6413m92748l40365M46854l5132
$$ y = [23285723, 22864796, 22559688, 22367289, 22653269, 22301333, 21288949, 21024805, 20850429, 20307272, 19978885, 20072772, 19999858, 19801490, 19585028, 19209277, 18798190, 18678657, 18326864, 17965556, 18008032, 17845547, 17530303, 17105625, 17416915, 17077410, 16680614, 16615075, 16540975, 15899584, 15891548, 16115660, 16036698, 16009796, 15766583, 15598225, 15204344, 15361829, 15596204, 15212936, 15047443, 14769989, 14587523, 14597878, 14590054, 14015634, 13948922, 13934255, 14125668, 14279751, 13775521, 13264646, 13000157, 12645226, 13389192, 13436408, 13164588, 13033627, 12519391, 12523404, 12613953, 12636788, 12395139, 12458428, 12572658, 12861791, 12681648, 12342007, 11856074, 11848183, 12509223, 12556445, 12081388, 11815624, 11629698, 11553285, 11060537, 10720172, 11167026, 11131894]
4366A1131894j5544k99639j06992M82910n14316j48774M29757l02180l0008j62597
4356A0464511j00871R0335j46352L54209l13398l20205R4893K8723P8700l86894
4346I843651k46133J90624m3553K70111K4168n96966k08977J81806k33880k54712
4336H926139L15476K16415j828j02791n2191j93721j17409J04579J63764l18435
4326H939998J99429k14040j42772J50840m99059O2261L78556o8726k87722K65598
4316H784363k68945j69928K778K93059j96826n18323K61002q7824l57898J61314
4306G902772p3174M6329R6974k21921J04485M7315J4678k21395j21337j2624K96285
4295G858387J2678J96440J51785o8402j96615k92771L01598l65095n9326j22912
$$ y = [11131894, 11116350, 10816711, 10709719, 11192629, 10678313, 10529539, 10959296, 10657116, 10627108, 10464511, 10363640, 10453975, 10307623, 10661832, 10348434, 10028229, 10123122, 10151845, 10230545, 9843651, 9597518, 9788142, 9744589, 10014700, 10038868, 9441902, 9232925, 9414731, 9180851, 8926139, 9241615, 9458030, 9456202, 9353411, 9301220, 9107499, 8990090, 9094669, 9258433, 8939998, 9139427, 8925387, 8782615, 8933455, 8434396, 8496657, 8875213, 8806487, 8518765, 8784363, 8515418, 8345490, 8348268, 8641327, 8444501, 7926178, 8187180, 8099356, 7741458, 7902772, 7829598, 7875927, 7972901, 7750980, 7855465, 7902780, 7917458, 7696063, 7574726, 7562102, 7858387, 7871065, 8067505, 8219290, 8150888, 7954273, 7661502, 7963100, 7598005, 7538679, 7415767]
4285G415767n3918J71632l85142M8834K04007m41077K09887q1623J95020j73672
4275G109715j76762o1579N0039J06917l19047J02399J14592j02192L37683L8455
4265G200220j85513j74134l0378P0489L91798n11858l05436O62940k47105J01216
4255F972239j94934l38086M76796J47820k37448q2415l5927L13140J9038j05109
4245F935114o8770k68371J11425k05930R0716N08036K8919l7341O3207J87200
4235G344205P6108l50231K29714K79931p8719J32025k41181M75858O5871J87834
4225H121415k22061N43682p3393k98298l08959j21158o445J18297r7025l17706
4215G338349J74998k46495k38562K92217l19370j96555k40751o1353K48475l9619
$$ y = [7415767, 7361849, 7533481, 7148339, 7197173, 7401180, 6960103, 7169990, 7088367, 7283387, 7109715, 6932953, 6871374, 6921413, 7028330, 6709283, 6811682, 6926274, 6824082, 7161765, 7200220, 7014707, 6840573, 6810195, 6880684, 7272482, 6760624, 6455188, 7118128, 6871023, 6972239, 6777305, 6439219, 6916015, 7063835, 6826387, 6743972, 6708045, 7021185, 7040223, 6935114, 6866344, 6597973, 6709398, 6503468, 6594184, 7102220, 7131139, 7093798, 7157005, 7344205, 7420313, 7070082, 7299796, 7579727, 7501008, 7633033, 7391852, 7867710, 7933581, 8121415, 7899354, 8443036, 8369643, 8071345, 7762386, 7641228, 7634783, 7753080, 7656055, 7338349, 7513347, 7266852, 7028290, 7320507, 7001137, 6804582, 6563831, 6502478, 6750953, 6711334]
4205F711334k06538j0363J82928R9056m0296M0277n54504k16863L05703K27048
4195F537782K36152j42082J5779j14388J71718l44058p5689m63222K36453K67366
4185F325811p2202P7132M3629k67682K60889M60883k23461q4079N8717k74803
4175F304834j4938j8692j500r6903Q6915M6825l83827P1279Q5889k6010J36803
4164F190675K41604R5527k17768l06523k58356K48536r3372P3610N9564k93382
4154E740115J04068j15174M1860K57955Q5346n8659L31942J43167p7671O4992
4144F517941K91751K5110m07150L56658j8112J8113o3130j52918J41542M48621
4134G158426M3843j64727k0381q4322K7195J14141k71476n26981J10857J43809
$$ y = [6711334, 6504796, 6494433, 6677361, 6776417, 6736121, 6776398, 6221894, 6005031, 6310734, 6537782, 6773934, 6631852, 6647631, 6533243, 6704961, 6360903, 6285214, 5821992, 6058445, 6325811, 6253609, 6330741, 6374370, 6106688, 6367577, 6828460, 6604999, 6520920, 6579637, 6304834, 6289896, 6271204, 6269704, 6172801, 6259716, 6306541, 5922714, 5993993, 6079882, 6053872, 6190675, 6432279, 6527806, 6310038, 6003515, 5745159, 5993695, 5900323, 5973933, 6033497, 5740115, 5844183, 5729009, 5770869, 6028824, 6114170, 6055511, 6387453, 6530620, 6452949, 6517941, 6809692, 6834802, 6427652, 6784310, 6766198, 6784311, 6721181, 6568263, 6709805, 7158426, 7202269, 7037542, 7017161, 6932839, 6960034, 7074175, 6802699, 6275718, 6386575, 6530384]
4124F530384K77156p5294J6128L13813r5480j77464m1737J77889J69027N18j93617
4113F901323K3405L15816O83413J2146n66482l17989J88125J73285j92032M15843
4103G636853M21165M66012m02893k46467n9262M55129J08965O4044L89544p8084
4093H755006J39786J37214k27464j28558J29604P06804N27733K58314P0801J6161
4083A0385401L51148M02589m8763q1409L56225K592K35262j14764M89534J26837
4073A2104652K79528M49474r8229L05915J99710L95774M17436Q1307J19647K36550
4063A4491764M30683M17775m487N89119K27993o0161Q62150K01922M40187L45977
4053A7942922M06824M00079L91486O32160Q43169P35673M36422J67811P34977
$$ y = [6530384, 6807540, 6732246, 6748374, 7062187, 6966707, 6789243, 6747506, 6925395, 7094422, 7094940, 6901323, 6924728, 7240544, 7923957, 7936103, 7369621, 7051632, 7239757, 7413042, 7221010, 7636853, 8058018, 8524030, 8121137, 7874670, 7815408, 8270537, 8379502, 8443546, 8833090, 8755006, 8894792, 9032006, 8804542, 8675984, 8805588, 9512392, 10040125, 10298439, 10369240, 10385401, 10736549, 11139138, 11090375, 11008966, 11365191, 11367783, 11603045, 11488281, 11977815, 12104652, 12384180, 12833654, 12735425, 13041340, 13241050, 13636824, 14054260, 14135567, 14255214, 14491764, 14922447, 15340222, 15335735, 15924854, 16152847, 16092686, 16954836, 17156758, 17596945, 17942922, 18349746, 18749825, 19141311, 19773471, 20616640, 21352313, 21788735, 21956546, 22691523]
4044B2691523O19984O85831P91467N88292N74763P38660R24156J03677P80121
4035B8498474Q57430J060228P59493R71298R47454J103735J303500J001444Q36724
4026C7339780N84912L50657P14389K90272L14576j40233O4849O16289J136819
4017D1272310M75973K1439Q69587M73897L52328K22762P8098n36141p30318l93366
4007D2106569p62532p67799o52427n87313q55554m82724k15741n52279n94870
3998C6635330o14031m52120r12488j068261j567282j177929q74580j114706j161170
3989B7692763q33563j273756p43511p09661n76790l82951j211922n22389o38178
3980B0800042r87849m41497q52241r54023q64638l16960o87852p81101n09025
$$ y = [22691523, 23311507, 23997338, 24788805, 25377097, 25951860, 26690520, 27614676, 27718353, 28498474, 29355904, 30416132, 31175625, 32146923, 33094377, 34198112, 35501612, 36503056, 37339780, 37924692, 38275349, 38989738, 39280010, 39594586, 39454353, 39519202, 40135491, 41272310, 41748283, 41769722, 42639309, 43113206, 43465534, 43688296, 43766394, 43230253, 42499935, 42106569, 41344037, 40576238, 39923811, 39336498, 38480944, 37998220, 37782479, 37230200, 36635330, 36021299, 35569179, 34656691, 33588430, 32021148, 30843219, 29968639, 28853933, 27692763, 26859200, 25585444, 24841933, 24132272, 23555482, 23172531, 21960609, 21438220, 20800042, 19812193, 19370696, 18518455, 17564432, 16699794, 16382834, 15694982, 14913881, 14404856]
3971A4404856o18563m50994k41560q25061q74559L70045m04874j88626k13601
3962A0957063n70677k33099n29398k80247l75427l9419j92041k68551M8386m11000
3952H105590l12001j23415L05474l23455m03762k09032j21750K19133K01254m46327
3942F891709j11812J48185m98603k12310K6153j05611l1597q9694K36223m57498
3932E795145k54799N5767l10546K7806M1799K23255j31860l39435k9074J59306
3922E237364m1614K70745o7774k84331j77402Q7002j62988k62343k76124n8135
3912D264400o1231K36833M32115J88481l93411k64854k26770K15694J47211k78126
3902D260342p4739j17950J59957J33851J30493l12076k14924q9495K52384o6010
$$ y = [14404856, 13786293, 13335299, 13093739, 12268678, 11394119, 11764164, 11359290, 11170664, 10957063, 10386386, 10153287, 9623889, 9343642, 8968215, 8928796, 8736755, 8468204, 8516590, 8105590, 7793589, 7670174, 7975648, 7652193, 7248431, 7039399, 6917649, 7136782, 7338036, 6891709, 6779897, 6928082, 6429479, 6217169, 6243322, 6137711, 6106114, 6016420, 6252643, 5795145, 5540346, 5596113, 5285567, 5313373, 5355172, 5578427, 5446567, 5107132, 5078058, 5237364, 5195750, 5466495, 5398721, 5114390, 4936988, 5023990, 4861002, 4598659, 4322535, 4264400, 4203169, 4440002, 4872117, 5060598, 4667187, 4402333, 4175563, 4391257, 4538468, 4260342, 4185603, 4067653, 4227610, 4361461, 4491954, 4179878, 3964954, 3875459, 4127843, 4061833]
3892D061833j01895p3323K5323P8732J5638k76895P9799j37023o1091M87001J54665
3881D252764m22673k04999J223o7842K49728k06749j14391j92019J86452L67761
3871C849255k7258l91387m4134L62996K5600j32584J76976q2210K81160J67830
3861D186244m12230J19680q83m48774p985K78775K34693N3333j95998j4881k35583
3850C556391j21536O1952j86446l04731l0297M96772P9677k30093J50367L57544
3840C829600M6450l58684m70333o0982m1407m2358J16928K11399l1320J03337
3830C302630L15011p7562n37078L51764J75215r0105l87504N1950J11336j35962
3820C079695k26076l17126M04894O56759J50895l91814m55162K03280K74345K56776
$$ y = [4061833, 3959938, 3886615, 3911938, 3990670, 4006308, 3729413, 3809212, 3672189, 3611098, 4098099, 4252764, 3830091, 3625092, 3626315, 3558473, 3808201, 3601452, 3487061, 3295042, 3481494, 3849255, 3821997, 3430610, 3386476, 3749472, 3775072, 3642488, 3819464, 3737254, 4018414, 4186244, 3774014, 3893694, 3892811, 3444037, 3436052, 3714827, 3949520, 4002853, 3806855, 3791974, 3556391, 3434855, 3496807, 3310361, 3005630, 2975333, 3472105, 3551782, 3321689, 3472056, 3829600, 3876050, 3517366, 3047033, 2986051, 2944644, 2902286, 3019214, 3230613, 3199293, 3302630, 3617641, 3540079, 3003001, 3354765, 3529980, 3439875, 3052371, 3104321, 3215657, 3079695, 2853619, 2536493, 2941387, 3598146, 3749041, 3357227, 2902065, 3105345, 3379690, 3636466]
3810C636466K10219n72988R728J1522N58169R9619K46437k45767O1827j89794
3800C825438k00544O5394k451l49030L2470M44183L0839L16025M2547k06380n06729
3789C491762M57993k3358l80123n1469L0512K5964J16801k25705j48950L70643
3779C664070j22338k7184n8962m0391j43388J75896N8229J98103J49341k80871
3769C572505l40850l14938j82545M33004j59262L17933p4221Q7054j26077n6704
3759C155899R7985O38707j01768k42147K81283j58567q619j02750K87392M2168
3749C889583j51486p4032L7087j47634J21822k9765K2986K46872r5496m18022
3739C401915K14869j78528K58810j09254l7697M05207R5586L24791j12579J18852
$$ y = [3636466, 3846685, 3273697, 3283425, 3294947, 3853116, 3952735, 4199172, 3953405, 4015232, 3825438, 3624894, 3690288, 3687837, 3338807, 3371277, 3815460, 3846299, 4162324, 4204871, 3998491, 3491762, 3949755, 3926397, 3546274, 3494805, 3525317, 3551281, 3668082, 3442377, 3293427, 3664070, 3541732, 3514548, 3455586, 3415195, 3271807, 3447703, 3505932, 3704035, 3853376, 3572505, 3231655, 2916717, 2734172, 3167176, 3007914, 3325847, 3251626, 3338680, 3212603, 3155899, 3253884, 3892591, 3790823, 3548676, 3829959, 3671392, 3662773, 3560023, 3847415, 3889583, 3738097, 3664065, 3701152, 3553518, 3675340, 3645575, 3668561, 3915433, 3819937, 3401915, 3616784, 3438256, 3697066, 3587812, 3550115, 3955322, 4050908, 4375699, 4263120, 4381972]
3729D381972k96962o0001J19350J94438M0182q486M06489P9159K18039k18652
3719D855528N52993m32167m06856K35892j02492q3946P9826L2406K14040J85352
3709E130576M73l8504K151j92423J54757l4171j54148r6908N05886J8040P7148
3698E372877j04975J89705k87794O5963J49623k72938L11615J22904L2296k57082
3688E322194j48793J26953j12115N4758L62746L82016l37307k727J4097l76103
3678E285719K64700m5994k63913j54604k3159j2743K29751l13331L92112L45276
3668E703814k57296k0639K76104l32657J38662K59680j55158l31776K13544N19627
3658F013905J31962o8666m64848l06749M2989L39249K98392P6086P2548L5737
$$ y = [4381972, 4085010, 4025009, 4144359, 4338797, 4378979, 4370493, 4776982, 4856141, 5074180, 4855528, 5408521, 4976354, 4569498, 4805390, 4702898, 4618952, 4698778, 4731184, 4945224, 5130576, 5131049, 5092545, 5094696, 4902273, 5057030, 5022859, 4868711, 4771803, 5277689, 5295729, 5372877, 5267902, 5457607, 5169813, 5235776, 5385399, 5112461, 5424076, 5546980, 5579276, 5322194, 5173401, 5300354, 5188239, 5242997, 5605743, 5987759, 5650452, 5647725, 5661822, 5285719, 5550419, 5504425, 5240512, 5085908, 5062749, 5050006, 5279757, 4966426, 5358538, 5703814, 5446518, 5425879, 5701983, 5369326, 5507988, 5767668, 5612510, 5280734, 5494278, 6013905, 6145867, 6077201, 5612353, 5305604, 5348593, 5687842, 5986234, 6062320, 6134868, 6170605]
3648F170605k1699L01396K60538k85079l9226q1344M80401L820l75257Q4743J24450
3637F623348J87174k3090K89648O528j10081l74583j33179K83060n8347J01039
3627F791517o936L17525m12989m730l10534l04900O80585M19225k25622Q8000
3617G031141o4502J69154l47590j34105K65769J860J75099k7522p17433m08579
3607E943292L13618O23070m5593m24364L57603j01017J26143R667P2639o0150
3597F814908k971k24330J74554K43855K05151j51926j55592M15524j39944k10155
3587F969074J90670o961K92194j85630J45862l9137M96181J94994n6556R0324
3577H091015K2676J99656j09313q2455J17557r6209J89647M28957L19007L30633
$$ y = [6170605, 6148906, 6450302, 6710840, 6425761, 6386535, 6305191, 6785592, 6789412, 6414155, 6498898, 6623348, 6810522, 6787432, 7077080, 7083608, 6973527, 6598944, 6465765, 6748825, 6690478, 6791517, 6784581, 7102106, 6689117, 6684387, 6373853, 6068953, 6749538, 7168763, 6943141, 7031141, 6966639, 7135793, 6788203, 6654098, 6919867, 6921727, 7096826, 7069304, 6351871, 5943292, 6256910, 6879980, 6834387, 6410023, 6767626, 6666609, 6792752, 6802419, 6875058, 6814908, 6811937, 6587607, 6762161, 7006016, 7211167, 7059241, 6903649, 7319173, 7179229, 6969074, 7159744, 7152783, 7444977, 7259347, 7405209, 7366072, 7862253, 8057247, 8000691, 8091015, 8113691, 8313347, 8204034, 8121579, 8239136, 8142927, 8332574, 8761531, 9080538, 9411171]
3567I411171l75278j18690L52229M26716l95874K4990K40552m6465l46796P01998
3557I874553J99964j5833J24500O8924L05048j48693L92592p6365J91148K09062
3547A1124900L81405n6992l688l58216K35771N61891J69179m2902j89299L85534
3537A2207583J60694R240j96610K09559K63641j54744j8830P21278r9347n670
3527A3096794R3846K51893M6906o9777m9946M06093K31430K59730N4256J91506
3517A4512731L17251L01243K86979K70248N69165L45758J69105M31591L08166
3508A7512237O96857J30855N8008P07396M45291L52827J28874O09132O81427L69917
3498B1692821M03007P53438L21908L64796R33174P43658K98473O85093P56244
$$ y = [9411171, 9035893, 8917203, 9269432, 9696148, 9300274, 9325264, 9565816, 9519351, 9172555, 9874553, 10074517, 10058684, 10183184, 10252108, 10557156, 10408463, 10801055, 10724690, 10915838, 11124900, 11506305, 11449313, 11445625, 11087409, 11323180, 11885071, 12054250, 12011348, 11822049, 12207583, 12368277, 12377517, 12180907, 12390466, 12654107, 12499363, 12480533, 13201811, 13102464, 13096794, 13190640, 13442533, 13489439, 13419662, 13369716, 13775809, 14007239, 14266969, 14321225, 14512731, 14829982, 15131225, 15418204, 15688452, 16257617, 16603375, 16772480, 17204071, 17512237, 18209094, 18339949, 18397957, 19105353, 19550644, 19903471, 20032345, 20641477, 21322904, 21692821, 22095828, 22849266, 23171174, 23535970, 24469144, 25212802, 25511275, 26196368, 26952612]
3489B6952612R58916L48144l76813P19306N31827J5620J72930J91033J82209J57931
3479B9853715K14442K72983L19730J22886M34975J14429L02908m1174O8754K8580
3469C1692228L16742L48372l3243r6544O88327K32516l80100O44779K90558M10626
3459C4114261O1909R4428M54352J05714J327020L26755N52951J04762Q55552Q73340
3449C8871044N62546J353786J100712J119173J465270J480669J191625J507056
3441D8651881J703970J608999J628722J863201K131185K169609J870473J979477
3433F3607517J956399J891642J764527J632815K297029K142421J473891K007946
3425G8774187J729253J170487J170001J850569J713793J328353J122121J588566
$$ y = [26952612, 27911528, 28259672, 27882859, 28602165, 29133992, 29149612, 29322542, 29513575, 29695784, 29853715, 30068157, 30341140, 30660870, 30783756, 31218731, 31333160, 31636068, 31594894, 31663648, 31692228, 32008970, 32357342, 32324099, 32227555, 32915882, 33148398, 32768298, 33413077, 33703635, 34114261, 34176170, 34270598, 34724950, 34830664, 36157684, 36484439, 37037390, 37142152, 37997704, 38871044, 39433590, 40787376, 41888088, 43007261, 44472531, 45953200, 47144825, 48651881, 50355851, 51964850, 53593572, 55456773, 57587958, 59757567, 61628040, 63607517, 65563916, 67455558, 69220085, 70852900, 73149929, 75292350, 76766241, 78774187, 80503440, 81673927, 82843928, 84694497, 86408290, 87736643, 88858764, 90447330]
3417I0447330J126252M56803K24070k65654k46730n44177j136647j893515j257987
3408H6909745r99562j778924j704451j211432r32834j567609j519493j285913
3400G5909527j368074j460722j390855k163016k470278k333369k175570j933702
3392F0613941j912497k011423j998561k033818j261765j093166j385798q21796
3384D8095117r34643r38439j224783m12467N10740m30496p71752l99808n5854
3375D3437615k52469J31217L56755K3501k82375O92633m7932N0631J65186J00993
3365D4375755L72483K45491O23043K57734L95747J9974R8305N70995L08773K27251
3355D7495551o8849K15102O78717L11230L39707J54864N23052N92576O10924O13394
$$ y = [90447330, 91573582, 92030385, 92254455, 91988801, 91742071, 91197894, 90061247, 88167732, 86909745, 85910183, 84131259, 82426808, 81215376, 80282542, 78714933, 77195440, 75909527, 74541453, 73080731, 71689876, 69526860, 67056582, 64723213, 62547643, 60613941, 58701444, 56690021, 54691460, 52657642, 51395877, 50302711, 48916913, 48095117, 47160474, 46222035, 44997252, 44584785, 45095525, 44665029, 43893277, 43493469, 43437615, 43185146, 43316363, 43673118, 43696619, 43414244, 44106877, 44058945, 44109576, 44274762, 44375755, 44748238, 44993729, 45616772, 45874506, 46270253, 46290227, 46388532, 46959527, 47268300, 47495551, 47426702, 47641804, 48320521, 48631751, 48971458, 49126322, 49649374, 50241950, 50852874, 51466268]
3345E1466268l5178R4101L60578M30703N2450K09439M53807K40350L53715L55250
3335E3981483Q77576P90207K94461L63282J023557J190410Q99018P03106R26920
3326F1050020J117658R53626J551690J259032J117913J297604J322731J295135
3318G0965409J551628J952816J718912J439389J546502K107978K375027J780234
3310H5437895K135092K498784K598465K453851K692882K764765K647325L043391
3302A06272450K584446K464007K499164K618066K770730K362360K120106K272052
3294A25963381K536843K201713K487177K025235K118801K601887K243465K369849
3286A44548351K783292K931519K868912L653808M036489M606816M434255N116755
$$ y = [51466268, 51431090, 51525191, 51885769, 52316472, 52368922, 52578361, 53032168, 53272518, 53626233, 53981483, 54859059, 55649266, 55943727, 56307009, 57330566, 58520976, 59419994, 60123100, 61050020, 62167678, 63121304, 64672994, 65932026, 67049939, 68347543, 69670274, 70965409, 72517037, 74469853, 76188765, 77628154, 79174656, 81282634, 83657661, 85437895, 87572987, 90071771, 92670236, 95124087, 97816969, 100581734, 103229059, 106272450, 108856896, 111320903, 113820067, 116438133, 119208863, 121571223, 123691329, 125963381, 128500224, 130701937, 133189114, 135214349, 137333150, 139935037, 142178502, 144548351, 147331643, 150263162, 153132074, 156785882, 160822371, 165429187, 169863442, 174980197]
3278A74980197N390630O316101P032836P814420Q001266R102295R629582J0367297
3270B38634624J1610483J1410290J1420216J0932171J0895235R443914Q865794
3263C13212727O936246N927467M312912L116770K353392J062456P25375l40084
3255C37307261j159351j010382r33935j202416n77103o80460l73216q05419j261833
3246C29303146k341433l173264m729896o055912p332520q353450r144712r353910
3238B78818049r476457q682176q179279p362343o251630n198411l926330l831996
3230B25909427k293260j146448r90322j53121M3113P17254J002572K95813p74481
3221B22610547j600571j593642k869020m276209m547438m772222o192041o716529
$$ y = [174980197, 180370827, 186686928, 193719764, 201534184, 209535450, 218637745, 228267327, 238634624, 250245107, 261655397, 273075613, 284007784, 294903019, 304346933, 313212727, 320148973, 326076440, 330389352, 333506122, 335859514, 336921970, 337647345, 337307261, 336147910, 335137528, 334203593, 333001177, 332424074, 331743614, 331370398, 330564979, 329303146, 326961713, 323788449, 319058553, 313002641, 305670121, 297316671, 288171959, 278818049, 269341592, 260659416, 252480137, 245117794, 238866164, 233667753, 229741423, 225909427, 223616167, 222469719, 221479397, 221326276, 221369389, 222086643, 223089215, 223385028, 222610547, 221009976, 219416334, 216547314, 212271105, 207723667, 202951445, 196759404, 190042875]
3213A90042875o084101o270720o263412n825032n379416n544683n048338m478915
3205A45148258l914463l787708k976735k280168j818976k368804k277670j074003
3197A24649731r47320q33916n00681j045143p38146o43965j061536p62218r72385
3188A17144421j383569j820576k606736k443251j808763k340339k509886l147919
3180I9083382k692511k550597k902858k583410k391824j841786k221927k515007
3172G9383462j530362j559917j205946j279215j927845j229546l74398j045603
3164F9230630o81036q26479n11262l90744n36496o393k43156n85898L6069j11396
3154F5373839K25276K26986R9635L11260m38073k45035P38214K80452J43811K61052
$$ y = [190042875, 183958774, 177688054, 171424642, 165599610, 160220194, 154675511, 149627173, 145148258, 141233795, 137446087, 134469352, 132189184, 130370208, 128001404, 125723734, 124649731, 123702411, 122868495, 122367814, 121322671, 120584525, 119940560, 118879024, 118116806, 117144421, 115760852, 113940276, 111333540, 108890289, 107081526, 104741187, 102231301, 99083382, 96390871, 93840274, 90937416, 88354006, 85962182, 84120396, 81898469, 79383462, 77853100, 76293183, 75087237, 73808022, 71880177, 70650631, 70276233, 69230630, 68549594, 67723115, 67211853, 66821109, 66284613, 66278220, 66035064, 65449166, 65485235, 65373839, 65599115, 65826101, 65925736, 66236996, 65798923, 65553888, 66292102, 66572554, 66716365, 66977417]
3144F6977417N0741L15667P99342J92885K48804M10950o2644J68699O9605j06797
3134F9064669Q1228j78743k64102m16046m55699l93549n10844o88651k54663k20054
3124F5763546p17120k93662J04621m8629j38965J90361K92034J6246N92610K45276
3114F6006318l3813O75889P34882J485615J164540J034454K074748K090023J888948
3105G7121604K177943K684848L051385K534716K988634L274387L254579L544874
3097A00632970L484685K992270K847744K175525J469594J989547P42007P58319
3089A17092661R4562j69490o07213j054757q47027r17007j192994j486347j807067
3080A09105321k068631k457311l287192l850928m031715m455195m647972m340788
$$ y = [66977417, 67028158, 67343825, 68143167, 68336052, 68584856, 68995806, 68933162, 69101861, 69171466, 69064669, 69145897, 68967154, 68703052, 68287006, 67831307, 67437758, 66926914, 66238263, 65983600, 65763546, 65046426, 64752764, 64857385, 64808756, 64669791, 64860152, 65152186, 65168432, 65761042, 66006318, 65972505, 66648394, 67383276, 68868891, 70033431, 71067885, 73142633, 75232656, 77121604, 79299547, 81984395, 85035780, 87570496, 90559130, 93833517, 97088096, 100632970, 104117655, 107109925, 109957669, 112133194, 113602788, 115592335, 116334342, 117092661, 117187223, 117017733, 116410520, 115355763, 114508736, 113591729, 112398735, 110912388, 109105321, 107036690, 104579379, 101292187, 97441259, 93409544, 88954349, 84306377, 79965589]
3072G9965589m285835l585935m091784m111251k934667k586189l120126k419973
3064E2829829k329837k015319k006867j872877j769695j218741q42085j204623
3056C9569785j101398j031793k23256p97219j228072r80194q79195l76239m44890
3047C2507529n05192l83990p0811r76890N7993R8232m24789j38865j85185m79580
3037B9498452k07849j81257r1861J87584K18911j48745K59239M72393L6837m9314
3027B9994390M44310J3320m26283j03436J57918N0872m17624j89789J15052o16870
3017B9021860j067157n99441k93958n0191k92158n49478m04779o63227j28931
3008B4972540j19018j81111L3949k78567J4172n5480j62521j67864k03993J19915
$$ y = [79965589, 75679754, 72093819, 68002035, 63890784, 60956117, 58369928, 55249802, 52829829, 50499992, 48484673, 46477806, 44604929, 42835234, 41616493, 40774408, 39569785, 38468387, 37436594, 37213338, 36416119, 35188047, 34207853, 33328658, 32952419, 32507529, 32002337, 31618347, 31547536, 30570646, 30628639, 30726871, 30302082, 30163217, 29978032, 29498452, 29290603, 29109346, 29017485, 29205069, 29423980, 29275235, 29534474, 30006867, 30043704, 29994390, 30438700, 30452020, 30025737, 29922301, 30080219, 30131091, 29713467, 29523678, 29638730, 29021860, 27954703, 27355262, 27061304, 27011113, 26718955, 26169477, 25764698, 25101471, 24972540, 24853522, 24672411, 24706360, 24427793, 24441965, 24386485, 24223964, 24056100, 23852107, 23972022]
2998B3972022Q3195N7034J08295L78429K23047q9921K75819O23635N75006N37975
2988B6744536N5444O19434L63233L2215j80340M3037k78194p2940P7419k8608
2978B7375236J24337p6704K57205M7897J04417J09289K94561r8723p6497J87486
2968B8248504N13809M80375N18453L76740K17751L95176P85846M49029P30655
2959C2716338N74732M10811P49796Q65337M88520K74347M74983Q85048P21139
2950C8161051M93637L06422N45655m2016M44778O69697J62595P89047M08014O36417
2940D2575297J315629Q09853N32617N29040Q18588Q71837J020392J141080J950930
2931E1565263J415131J082751J567710J421929J217517J522948J385850J496574
$$ y = [23972022, 24055217, 24112251, 24220546, 24598975, 24822022, 24732101, 25007920, 25631555, 26206561, 26744536, 26799980, 27419414, 27782647, 27814862, 27634522, 27677559, 27399365, 27326425, 27403844, 27375236, 27499573, 27422869, 27680074, 27727971, 27832388, 27941677, 28236238, 28137515, 28061018, 28248504, 28762313, 29242688, 29761141, 30137881, 30355632, 30750808, 31536654, 31985683, 32716338, 33291070, 33701881, 34451677, 35317014, 35805534, 36079881, 36554864, 37439912, 38161051, 38654688, 38961110, 39506765, 39464749, 39909527, 40579224, 40741819, 41530866, 41938880, 42575297, 43890926, 44700779, 45233396, 45762436, 46581024, 47452861, 48473253, 49614333, 51565263, 52980394, 54063145, 55630855, 57052784, 58270301, 59793249, 61179099, 62675673]
2923F2675673M65309L995L61461j76598Q5789L09175k54053P9042J84920M0654
2913F3775367L43694N58785J074611J226099J097951J575983J743613J598755
2905G2994858K147404K293515K158056K480688K173747K801685K977002K675927
2897I2702882K754205L222897K847898K588150K554787K593998J826864J332493
2889A12424174N69717n33215j61924J5477K7541R9418k66421p90010o8693R91194
2879A12307258J518921K046880K198268J679812J580508J616016J237587J406961
2871A25592211K685493L291984L852718L970619L480797M024037L883086L845486
2863A54626431L902082L822449M990202M653800O210452P407006P575508P974574
$$ y = [62675673, 63140982, 63144977, 63506438, 63329840, 63415629, 63724804, 63470751, 63549793, 63734713, 63775367, 64119061, 64677846, 65752457, 66978556, 68076507, 69652490, 71396103, 72994858, 75142262, 77435777, 79593833, 82074521, 84248268, 87049953, 90026955, 92702882, 95457087, 98679984, 101527882, 104116032, 106670819, 109264817, 111091681, 112424174, 112993891, 112460676, 112298752, 112314229, 112341770, 112441188, 112174767, 111384757, 111316064, 112307258, 113826179, 115873059, 118071327, 119751139, 121331647, 122947663, 124185250, 125592211, 128277704, 131569688, 135422406, 139393025, 142873822, 146897859, 150780945, 154626431, 158528513, 162350962, 167341164, 171994964, 178205416, 185612422, 193187930, 201162504]
2855B01162504Q901021R340923J0958110J3274489J6175778J9498655K2173730
2848C01485210K5451587K8260578K9723285L0796901K8944822K3258252J4961295
2841D82881930L546801r249910k1281840l0238449l6671253l8543332l6466783
2834C13977164l1922194k7489721k3608658k0118917j7632634j5066087j3430072
2827A64708881j1781850j0032013r273614q504373p202077o845521n927106m952138
2819A00190189m487264m499229m019544l297118l183011l300096k729310l072611
2811G1602006k391286j929617k110018k140880j705847j786095j516716j870094
2803E6151453j502580j954302j329531j566808j435482j278807j336294p33434
$$ y = [201162504, 210063525, 219404448, 230362558, 243637047, 259812825, 279311480, 301485210, 326936797, 355197375, 384920660, 415717561, 444662383, 467920635, 482881930, 486428731, 477178821, 455896981, 425658532, 388987279, 350443947, 313977164, 282054970, 254565249, 230956591, 210837674, 193205040, 178138953, 164708881, 152927031, 142895018, 133621404, 125117031, 117914954, 111069433, 105142327, 100190189, 95702925, 91203696, 87184152, 83887034, 80704023, 77403927, 74674617, 71602006, 69210720, 67281103, 65171085, 63030205, 61324358, 59538263, 58021547, 56151453, 54648873, 52694571, 51365040, 49798232, 48362750, 47083943, 45747649, 45014215]
2795D5014215r84727j216331j125857p44528q20861j412047j441196j035927o48603
2786C5584138m37558p72981q93267q72322j60242n83627l34198k16481n38831
2777C0774631p0526p44138j00475J28904m63199q11840m90527m42791n79242l70394
2767B6830403q14944o28450r08549n23093p27341k39509j3516p26035n67941k33150
2757B1447875l98989P535n33191j86045n90351n30674Q886k40373k67442N5266
2747A8772497l24447o15978o07144j70658l14894j54267k40012n1505k41513j51241
2737A5900838j97614j26029L97014m9832l81659k61551P2145K6282l33280Q8082
2727A5134396m35996o64109m2739j93283o7409j82827k35274m3844l72860j77739
$$ y = [45014215, 44029488, 42813157, 41687300, 40942772, 40121911, 38709864, 37268668, 36232741, 35584138, 35146580, 34373599, 33480332, 32608010, 32447768, 31864141, 31529943, 31313462, 30774631, 30704105, 29959967, 29859492, 29988396, 29525197, 28713357, 28222830, 27780039, 27200797, 26830403, 26015459, 25387009, 24478460, 23955367, 23228026, 22988517, 22975001, 22248966, 21681025, 21447875, 21048886, 21056421, 20523230, 20337185, 19746834, 19216160, 19225046, 18984673, 18717231, 18772497, 18448050, 17832072, 17224928, 17054270, 16739376, 16585109, 16345097, 16293592, 16052079, 15900838, 15703224, 15577195, 15974209, 15924377, 15542718, 15281167, 15353312, 15379594, 15046314, 15134396, 14698400, 14034291, 13991552, 13798269, 13730860, 13548033, 13312759, 13268915, 12896055, 12718316]
2717A2718316l33844j21075l19016L1380J32265j26294k75987p5913j98619m25108
2707A1006105k64200k38444J03797n98596m05367J66658o54167j80958m4940J70169
2697I060057l10481n5017l05159k93931J97057m13954O3850k01145j06286r9126
2687G535865k8441j94069l95118Q0324K6744L36184m90248o73986M02136j98158
2677F401233O673j84221m0684p2905j45559k04522J3702n6496j05364k51604L03827
2666E664080L48446k57335l44044k13692L64695k53042p2803N6472J5113k51755
2656E056135m3829K66088n54137M45437k93531k37140N35749k78825r7066M07366
2646E206247l4029k85276k00430O14581R0141k76651k2393l53168m8044J06572
$$ y = [12718316, 12384472, 12263397, 11944381, 11975761, 12108026, 11981732, 11705745, 11629832, 11431213, 11006105, 10741905, 10503461, 10607258, 10008662, 9603295, 9769953, 9115786, 8934828, 8889888, 9060057, 8749576, 8694559, 8389400, 8095469, 8292526, 7878572, 7942422, 7741277, 7634991, 7535865, 7507424, 7313355, 6918237, 6998561, 7025305, 7361489, 6871241, 6197255, 6599391, 6401233, 6407906, 6223685, 6183001, 6110096, 5964537, 5760015, 5773717, 5717221, 5611857, 5360253, 5664080, 6012526, 5755191, 5411147, 5197455, 5562150, 5309108, 5236305, 5292777, 5307890, 5056135, 5012306, 5278394, 4724257, 5169694, 4876163, 4639023, 5174772, 4895947, 4798881, 5206247, 5172218, 4886942, 4686512, 5301093, 5391234, 5114583, 5092190, 4739022, 4690978, 4797550]
2636D797550m5831K70610J933m7838K89882n13294k22536J08672J15281o88012
2626D066417K1119J30897J72281J72266m26242M5489N3401K96786m02556o09457
2616C520401K5449M51086L82116K86831J84851k84089k52952M40002K11948J76829
2606E142472n9212l52370k82961Q1721j07065K0298k41982K00209M7697l16782
2596D132025l05199j48094L62179p2167l824Q1435l3424K81154p4265L7789l3316
2585D224293k19929j49153K26687L76961o69206N1912M74358q7233J03426j58522
2575D173594R4352j62745L4031K95268N1333l65794l4442p415K07290P6837l96255
2564C966054m6705k1462J80318J59228O20859j78173M21449k10343l79640O8880
$$ y = [4797550, 4751719, 5022329, 5024262, 4976424, 5266306, 4753012, 4530476, 4639148, 4754429, 4066417, 4087536, 4218433, 4390714, 4562980, 4136738, 4182227, 4235628, 4532414, 4129858, 3520401, 3545850, 3996936, 4379052, 4665883, 4850734, 4566645, 4313693, 4753695, 4965643, 5142472, 5083260, 4730890, 4447929, 4529650, 4422585, 4442883, 4200901, 4401110, 4448807, 4132025, 3826826, 3678732, 4040911, 3968744, 3964920, 4046355, 4012931, 4294085, 4219820, 4257609, 4224293, 4004364, 3855211, 4081898, 4458859, 3789653, 3841565, 4315923, 4228690, 4332116, 4173594, 4267946, 4105201, 4139232, 4434500, 4485833, 4120039, 4085597, 4078182, 4285472, 4362309, 3966054, 3919349, 3897887, 4078205, 4237433, 4858292, 4680119, 5101568, 4891225, 4511585, 4580465]
2554D580465K5450L9225m45589k57786o06033j84211K08444l59718J8979J74934
2544C194160Q7116j36853l88886j36055J16408j33247k97035J75189N2845K26526
2534B760168r6439j02979k95797l45698j54766R3612j23816K2258Q5226j52653
2524A689116l29121j83086J00007J72386J23710J02081l189k74838J498j03845
2514A294719K83253P9572J29186J28217n84574j69464L45786j06194p3198P5116
2504A402419J70719l5403k8706j40121K27635j91290n4746P8428j50827l99502
2494H78606q3971K63436j4006M0927J35273j23621l461l26510J06587q1704j78006
2483F13550L61673K28484j39147k76760j32885M51453n5378k47041k6357J70973
$$ y = [4580465, 4605915, 4645140, 4199551, 3941765, 3335732, 3151521, 3359965, 3000247, 3019226, 3194160, 3281276, 3144423, 2755537, 2619482, 2735890, 2602643, 2305608, 2480797, 2533642, 2760168, 2663729, 2560750, 2264953, 1919255, 1764489, 1858101, 1734285, 1756543, 1841769, 1689116, 1359995, 1176909, 1276916, 1449302, 1573012, 1675093, 1671904, 1397066, 1398564, 1294719, 1577972, 1657544, 1786730, 1914947, 1330373, 1160909, 1506695, 1400501, 1327303, 1402419, 1573138, 1537735, 1509029, 1368908, 1596543, 1405253, 1350507, 1428935, 1278108, 878606, 794635, 1058071, 1044065, 1084992, 1220265, 1096644, 1093183, 766673, 873260, 791556, 613550, 975223, 1203707, 1064560, 787800, 654915, 1106368, 1050990, 803949, 777592, 948565]
2473I48565j05975O4743j92786K283N6771J69417K13412k75326k43255J22030
2463G59879J00004j78774K35194k47727j22372l34409L72166L79323L63009m28636
2453H97657p570p8188k70686M36883j31863j54675M24185l62268J91768L887l93152
2442E55978p4271j50963O20632k18479j96683N0171k90147N23977k65536j0310
2432E44369N09085k44046j52814p8959k03537o3917J99817j75571J9561q1899
2422B72089L18229K20848j63715o2429k95747m11604L36325L48707k91410K98423
2412E69716L52553p4432n9527J61859l85797L76505n7137k10773J22991j75304
2402F20654L31144N40083j51658n35777L23836j39995j07037M97247K12194J86110
$$ y = [948565, 842590, 907333, 714547, 716830, 773601, 943018, 1156430, 881104, 637849, 759879, 859883, 681109, 916303, 668576, 546204, 211795, 583961, 963284, 1326293, 897657, 890087, 811899, 541213, 978096, 846233, 691558, 1115743, 753475, 945243, 949130, 555978, 481707, 330744, 951376, 732897, 536214, 586385, 296238, 820215, 554679, 544369, 1053454, 809408, 656594, 577635, 374098, 310181, 509998, 334427, 353988, 272089, 590318, 811166, 647451, 585022, 289275, -122329, 213996, 562703, 271293, 569716, 922269, 847837, 788310, 950169, 564372, 940877, 883740, 672967, 795958, 620654, 951798, 1491881, 1340223, 804446, 1128282, 988287, 881250, 1378497, 1590691, 1776801]
2392A776801R0247J56009k57680k73535j890o54439k92841J84770L52096k19295
2382H60243k83763j5193J81340N438J03421j45072J62619J61852l69197k5786
2372F35902M8225J49190k004m5529l78893k1254J18240K03049J20979p35j84957
2361F42213j9691k013j02328J78433K54998k35991Q2187j51838k20880Q0763j65529
2350C40324J27408K57242L20708k415j32766m6693l64948o3505M9307p1761K21482
2339F34383n3005r5084M1143o1149m12195L89840N06436j84257l9509j56060k46262
2328C24281k04174k1930K08769L6250j53868O3662K11873K09218k5034J20288
2318G69335J50823p4268q9210k31341O5363J51222j70445n48683L40204M35782
$$ y = [1776801, 1867048, 2023057, 1765377, 1491842, 1489952, 835513, 542672, 727442, 1079538, 860243, 576480, 561287, 742627, 748065, 851486, 706414, 869033, 1030885, 661688, 635902, 684127, 833317, 831313, 785784, 406891, 385637, 503877, 706926, 827905, 827170, 642213, 622522, 620509, 518181, 696614, 951612, 715621, 797808, 645970, 425090, 505853, 340324, 467732, 724974, 1045682, 1043267, 910501, 863808, 498860, 435355, 484662, 412901, 634383, 581378, 486294, 527437, 466288, 54093, 443933, 950369, 766112, 726603, 570543, 324281, 120107, 98177, 306946, 343196, 189328, 252990, 464863, 674081, 649047, 769335, 920158, 845890, 756680, 525339, 590702, 741924, 571479, 22796, 363000, 798782]
2308G98782m37922J4643k279N7522j30485J09864L86799L3480j65955q4376K26181
2297H06254P5587q1488k57567k63054j41655J89990K56044j85434k60865K83096
2287D20908M66877n09579n34479k64055K86577L35933J94206q420K49524J2942
2277F50434l11821K65636J32823N7494K76648j51133j83277L20103k54361j17346
2267F85200J33707J07224q3758r0011K10076k90621K03684M92447J60570l12201
2257A216317P5205K66438r0327m13027n9048P4255P6706K69680m63390m8061J21832
2246A026580N3243K85112n8192L8416L19855Q5256k4679j85350j90826l8665R5069
2235A405819n8358N12662j98569j22646p9509Q063j5194k4271N52669K87119j62559
$$ y = [798782, 360860, 375503, 373224, 430746, 300261, 410125, 796924, 830404, 664449, 580073, 806254, 881841, 800353, 542786, 279732, 138077, 328067, 584111, 398677, 137812, 420908, 887785, 378206, -156273, -420328, -133751, 202182, 396388, 387968, 637492, 650434, 338613, 604249, 737072, 794566, 1071214, 920081, 736804, 1056907, 802546, 685200, 818907, 926131, 842373, 752362, 962438, 671817, 875501, 1367948, 1528518, 1216317, 1291522, 1557960, 1467633, 1054606, 995558, 1069813, 1146519, 1416199, 952809, 904748, 1026580, 1079823, 1364935, 1306743, 1345159, 1665014, 1750270, 1725591, 1540241, 1349415, 1310750, 1405819, 1347461, 1860123, 1661554, 1538908, 1459399, 1467462, 1452268, 1427997, 1980666, 2267785, 2105226]
2224B105226L7272k8224k30093n0314L64468L36549l47415M06646R5327m35536
2214B253906J67128K95474L41394j02289J4559J63292j6894l9995Q0102m184N18743
2203C671236M5581o8572K5821R8229M63451P67181l59856m21147O4206Q45447
2193E131577m45422N330L04420M29081p0188j93219J89789J24579J44421Q6846
2183E707214P68985m75854L47828N97625n0177j24557L47205N80302m7254K50896
2173G902213K89291K51253L27053J73638O15K22014J89315N92978M21359O0636
2163A0430365K71044M63461M51458L71998J96468K48609R44568P31805K82721
2154A4392497R32610J123308J253496J120372J187871J517063J457004Q78471
$$ y = [2105226, 2142498, 2114274, 1884181, 1833867, 2198335, 2534884, 2187469, 2594115, 2689442, 2253906, 2421034, 2716508, 3057902, 2955613, 2970172, 3133464, 3116570, 3076575, 3156677, 3152493, 3671236, 3716817, 3648245, 3674066, 3772295, 4235746, 5002927, 4643071, 4221924, 4286130, 5131577, 4686155, 4691485, 4995905, 5424986, 5354798, 5161579, 5351368, 5475947, 5620368, 5707214, 6476199, 6000345, 6348173, 6945798, 6895621, 6771064, 7118269, 7698571, 7651317, 7902213, 8191504, 8442757, 8769810, 8943448, 8944063, 9166077, 9355392, 9948370, 10369729, 10430365, 10701409, 11164870, 11616328, 11988326, 12184794, 12433403, 13377971, 14109776, 14392497, 15325107, 16448415, 17701911, 18822283, 20010154, 21527217, 22984221, 23862692]
2146B3862692J908404K182511J801042K106241K227164L306296L389316K963841
2138D3747507L194553M301106N670011O922444Q405913J1319224J3470041J6752123
2130A13782922J9382944K0571490K5287562L3272625L4059273J9406966k9765557
2123B35998225m6419649l8055834l0603087k0552390j6032181j1155186r268697
2116F3911201o193653m842543m183921l274009k465073k033305j713786k952207
2108C6252704l115198k977849k153329k157359j632711j608611q80631p98085
2100B0928931r16925p22523r44626k27348p53649j153877p12506m94766k94386
2091A4708325n96485q36543p92545n434m66583j86349q65481k28817j006753K939
$$ y = [23862692, 25771096, 27953607, 29754649, 31860890, 34088054, 37394350, 40783666, 43747507, 46942060, 51243166, 56913177, 63835621, 72241534, 83560758, 97030799, 113782922, 133165866, 153737356, 179024918, 212297543, 246356816, 265763782, 235998225, 189578576, 151522742, 120919655, 100367265, 84335084, 73179898, 63911201, 57717548, 52875005, 48691084, 45417075, 42952002, 40918697, 39204911, 36252704, 33137506, 30159657, 28006328, 25848969, 24216258, 22607647, 21727016, 20928931, 20012006, 19289483, 18344857, 18117509, 17363860, 16209983, 15497477, 15002711, 14708325, 14111840, 13275297, 12482752, 12477318, 12010735, 11824386, 10958905, 10730088, 9723335, 9726274]
2081I726274o99568l04748o23705k79938K32787L8384m27049j2199n65425m78713
2071F606100N17513k24462p97983Q2132m9066p27730q454R3742k14917O5710k94972
2060E047613k12717n2560j32925k59584J40158p840N2375k85055n3927J59876
2050D395414J10208j98794k52483k82548n25391J82875j34177r887j14388l39612
2040B831217J416K07801K29519m6874j3133k5731k70495l23602J06765l03257
2030B393626j37136J86369m0285k86585j11189j66647l83058M90695J6337J1288
2020A973415L09767l4113k45451j55985j14449j33573L2116J46542j52238k37499
2010A388532j69143J27988K17480k16609j17255j25445N24644k70090m04538k18771
$$ y = [9726274, 9026706, 8721958, 8098253, 7818315, 8051102, 8089486, 7662437, 7650238, 7084813, 6606100, 7123613, 6899151, 6101168, 6183300, 6134234, 5406504, 5398050, 5491792, 5276875, 5342585, 5047613, 4834896, 4782336, 4649411, 4389827, 4529985, 4522145, 4574520, 4289465, 4235538, 4395414, 4505622, 4306828, 4054345, 3771797, 3246406, 3429281, 3295104, 3285217, 3170829, 2831217, 2832633, 3040434, 3269953, 3223079, 3209946, 3184215, 2913720, 2590118, 2696883, 2393626, 2256490, 2442859, 2402574, 2115989, 2004800, 1838153, 1455095, 1945790, 1962127, 1973415, 2283182, 2249069, 2003618, 1847633, 1733184, 1599611, 1631727, 1778269, 1626031, 1388532, 1219389, 1347377, 1564857, 1348248, 1230993, 1105548, 1630192, 1360102, 955564, 736793]
2000G36793m7415J7983k00965K17120J77263m1408O7595j15685K1101K26950K58826
1989A318158M4094n87552Q1585K01317L39556m13624K6179K2601n18339J82555
1979F96530q4247j49647J92717J66854K21588l84163J69266l12142N3505P5971
1969F46232k8402R9619L29979K16728l06765j1365k52086j74553n208m5832K90697
1958G59044j28081k96090M73897M40270o01853n0030O8145R442J44192L3947j70446
1947F82437j45386k0350L32256m2944P6180l00383j21015M41073j38435l22028
1937D41405K80881p1801j74793j51921r992j74563l04447N25290J35672j99899
1927B95832j21370L63507r2240k95533J33322K74296k91430k40312L757J71087
$$ y = [736793, 689378, 707361, 506396, 723516, 900779, 859371, 926966, 811281, 832382, 1059332, 1318158, 1362252, 774700, 856285, 1057602, 1397158, 983534, 1009713, 1032314, 513975, 696530, 612283, 462636, 655353, 822207, 1043795, 659632, 828898, 516756, 570261, 646232, 617830, 717449, 1047428, 1264156, 957391, 946026, 693940, 519387, 514179, 468347, 759044, 630963, 334873, 808770, 1249040, 647187, 597157, 665302, 674744, 818936, 852883, 682437, 537051, 516701, 848957, 806013, 882193, 581810, 460795, 901868, 763433, 441405, 722286, 650485, 475692, 323771, 313779, 139216, -165231, 360059, 495731, 295832, 174462, 537969, 445729, 150196, 283518, 557814, 266384, 26072, 29829, 200916]
1917B00916r2958N08661l89132j55559J29831O7227M74433n35587l39492J09370
1907b2290L81167j33629l11122K5322o3323K81288J21194J48433K7309j70403
1897B83946J21302N3997r1706n1107j51339k76173J25524J41245J01639l73500
1887a16172k25663L96089J31546o28121O6091K49990R1330j662L73643J61021
1877D98092O9546k71522p5989j69800J48863M35493p381j5511j25797K74667j64617
1866E96044J58094l4246k1321N9143k16799Q0449n9007J93353j37177M52074N73578
1855A644185k39319M2866k51494m29171m3054J15772l0508j10984P3116j37016
1845F34393j38133l29821j60015K65213M55223O6533l37237l4738k95897j19452
$$ y = [200916, 107958, 616619, 227487, 71928, 201759, 268986, 743419, 207832, -131660, -22290, 358877, 225248, -85874, -60552, -123875, 157413, 278607, 427040, 454349, 283946, 405248, 459245, 367539, 316432, 165093, -111080, 14444, 155689, 257328, -116172, -341835, 54254, 185800, -442321, -376230, -126240, -34910, -36572, 337071, 498092, 567638, 296116, 220127, 50327, 199190, 634683, 627302, 611791, 485994, 760661, 596044, 754138, 719892, 698571, 757714, 540915, 621364, 562357, 755710, 618533, 1070607, 1644185, 1404866, 1447732, 1196238, 767067, 724013, 839785, 809277, 698293, 771409, 634393, 496260, 166439, 6424, 271637, 726860, 793393, 456156, 421418, 125521, 6069]
1835F069m8207J04336J8999K81256R389L9988p0674n2484o78150j13755N08225
1824D992O1295m16558j88045J77735M56830K07030k75021k75333p9150l42519
1814f68744L13312J29104k79516J92990L48240N1064j13560J53977J12330j58962
1804H0235n296j28886j35411j04877K08964J09396l4604l48459P6331J83362o31449
1793g30694O0935K84887J40205L95145n6653J9676j74819j9643J36210K88639
1783C43888m16554n3918J52823m09690K7091J57984Q6532M96824l08332l40567
1773b63919N8705J71051N1816l51163L45736j31195l5313m8352l2639m4286P6114
1762b03445P2888m47358O9295J65350m50975O34003J25156Q999l89160k55955
$$ y = [6069, -42138, 62198, 81197, 362453, 371842, 411830, 341156, 288672, -389478, -503233, 4992, 66287, -350271, -538316, -360581, 96249, 303279, 28258, -247075, -326225, -668744, -355432, -226328, -505844, -312854, 35386, 86450, -27110, 126867, 239197, 80235, 74939, -53947, -189358, -294235, -85271, 24125, -10479, -358938, -282607, -99245, -730694, -669759, -384872, -244667, 150478, 93825, 113501, -61318, -80961, 55249, 343888, -72666, -126584, 26239, -383451, -356360, -198376, -111844, 384980, 76648, -263919, -205214, -34163, 17653, -333510, 12226, -118969, -154282, -202634, -235273, -279559, -203445, -130557, -577915, -508620, -343270, -794245, -160242, -35086, -26087, -415247, -671202]
1752f71202N44024M57922R8302k25105k12779q169l16517K84238J24236j57164
1742h2214j55941k36395j57882K3162O3897L6842L64608o9329J74212L69208k4593
1731C05575k16132O1507m80393k497J66278N1116j67954R2504M82971l26601m9760
1720h3386R7905q5016P8461p4055L6318j81826j64387L32897j32700K32891j81691
1709a24589j06110j15696L29308K87542l06988j22234L55476l46407j89516M64547
1699A25333J55912O0712m59670r6287M9410J1887K2323l46056N4346O2571J54076
1688b05443O9239j08315k55489L08908J443k23003R0593j92115P1877N25678K7891
1677A11264k02154K72104K58496m90990K48372j06449j80165l23333J5110L15255
$$ y = [-671202, -127178, 330744, 429046, 203941, -8838, -17007, -333524, -49286, 74950, -82214, -238155, -474550, -632432, -609270, -545373, -508531, -143923, -213252, -39040, 330168, 305575, 89443, 150950, -329443, -331940, -165662, -114546, -282500, -189996, 292975, -33626, -83386, 14519, -70497, 7964, -66091, -29773, -211599, -375986, -43089, -175789, 57102, -124589, -230699, -346395, -17087, 270455, -36533, -158767, 196709, -149698, -339214, 125333, 281245, 341957, -117713, -214000, -164590, -152703, -130380, -476436, -422090, -359519, -205443, -136204, -244519, -500008, -191100, -189657, -412660, -322067, -514182, -442305, 83373, 111264, -90890, 181214, 439710, -51280, 197092, 90643, -89522, -412855, -397745, -82490]
1667h2490k18624k09908K14257L29406L527j50960M4897O9070J31433k40270k25311
1656c34973N7153L99225j29866K0296K45248k20890k00484k77049O11823k29820
1646e9337r4213J32924J57416R3955k64023k58760p6753L6018n4463k19257M57639
1635a48854M93739n66539k92385K21113k54929J50376o2469O8274L60648q27k72400
1624c04253J70799q3885J92626L1725l52211l06962M79936j57068J98868L01962
1614A71537l6408L66446j85610q7078l650p8560n2577j09658K95330m79500l07299
1603e07027k903J40844J71035J94048j22151j99241j50702Q2333L5985M25811
1593F8032k01915R9422J28245k34299K56698P5681l93432j41124L9361p9951k85622
$$ y = [-82490, -301114, -511022, -296765, 32641, 36168, -114792, -69895, -825, 130608, -109662, -334973, -277820, 121405, -8461, 11835, 257083, 36193, -164291, -441340, 170483, -59337, -153550, -20626, 136790, 230745, -33278, -292038, -368791, -332773, -387236, -606493, -148854, 344885, -221654, -514039, -292926, -547855, -397479, -459948, -391674, -31026, -31853, -304253, -133454, -217339, -24713, 7012, -345199, -652161, -172225, -329293, -130425, 171537, 135129, 501575, 315965, 228887, 225237, 146677, 94100, -15558, 279772, -199728, -507027, -509930, -369086, -198051, -4003, -126154, -325395, -476097, -393764, -357779, 68032, -133883, -34461, 93784, -140515, 116183, 191864, -201568, -342692, -303331, -383282, -668904]
1582f68904K01259K52930J04170L55829n8001k01436Q1599J90283n13895j85367
1572d41533N23434k7016k11771J85039R8056J61563k5115m34379j79015J07715
1562b43022L27933Q3018l62679j83983m00910L02575J98190l1907K1768L23153
1552C4136j58512J31088o0115o5547J16904O0369j57329l84760j7609M31607J45401
1541G5633J53788K18005k94073p6335j13498j46013j5748K8064M8729K61629k28646
1530h8465K4201J89972k40581L99687j14321p0480j63929J60544j88964l27807
1520d20143K04409j72752K33627P5549k10243R2463L04120K09824p8291q3212
1510A55351k72848J82215m18228j041L04585K22668k96723m36183J11151N31883
$$ y = [-668904, -467645, -214715, -110545, 245284, 187283, -14153, 67446, 257729, -256166, -441533, 81901, 54885, -156886, 28153, 126209, 287772, 262657, -171722, -350737, -243022, 84911, 167929, -194750, -378733, -779643, -477068, -278878, -310785, -289017, 34136, -124376, 6712, -53403, -118950, -2046, 58323, -99006, -483766, -501375, -69768, 75633, 229421, 447426, 153353, 77018, -36480, -182493, -198241, -170177, -121448, 140181, -88465, -64264, 125708, -114873, 284814, 170493, 100013, -63916, 96628, -92336, -420143, -215734, -388486, -154859, -79310, -289553, -197090, 107030, 316854, 238563, 155351, -117497, 64718, -353510, -354551, -49966, 172702, -124021, -560204, -449053, 82830]
1500H2830l8386l4591j50413N6206K36046k06989N6608j7806k91357L3535J16155
1489a58162M09016j87390o9019M7409J46089j59456j48594J62320R3563n87519
1479d51743M71801L32804l97238P8210k54438J26392r9664j808k8238k34384J47015
1468c11291M40978K61203M7406o673J26404K5420m58092m18653k54320j55572
1458g03190N64950k00267p0035J12374M18315Q3197J96217k55067j61400q0754
1448i5660m0453L66684k79469k92501K89529l1744m2607o1848R5536p6835L81515
1437B12147k44573k46103j7384J2646k37535P56072r9547J02811J81714j76110
1427B44138M2728l46696k24374R7638n1136j9756K33795k27837p9743L42384J32718
$$ y = [82830, 44444, 9853, -140560, -84354, 151692, -55297, 1311, -16495, -307852, -274317, -158162, 250854, 63464, -5555, 41854, 187943, 28487, -120107, 42213, 135776, -451743, 20058, 352862, -44376, 33834, -220604, -94212, -193876, -195684, -223922, -458306, -311291, 129687, 390890, 438296, 431623, 558027, 583447, 125355, -293298, -547618, -703190, -138240, -338507, -408542, -296168, 122147, 205344, 401561, 146494, -14906, -95660, -136113, 230571, -48898, -341399, -51870, -83614, -126221, -188069, -92533, -169368, 212147, -32426, -278529, -295913, -283267, -520802, 235270, 135723, 238534, 420248, 244138, 286866, -59830, -284204, -186566, -237702, -257458, -23663, -251500, -331243, 11141, 143859]
1416A43859k34627K4443O5861l5811l84154K04351N6777p8596n4300K76354j37581
1405a53424j95833j51470L33542k95147l7484K44550j9322L89131j54551j86491
1395b26499n47855k15556O04588J40305N00439L3852k96734j6764m9890J82994
1385A08880R9028n83544J55863N7656L5482K01415k94014j11490J86146k36918
1375c81496J77665L40065k52413K35932k60168K25352j97122M3757P5503P531
1365A4606l47477j08373k59244K00538P78614j19222n13252j39933K06019K53164
1355c4560Q2986m2362j24804l34305M12451M6973m12000L7476K71637j64343K64837
1344C986J57345j25777r5744m5598K89989J14675n1623l33570k30324J64263k01606
$$ y = [143859, -90768, -66325, -464, -36275, -420429, -216078, -159301, -237897, -292197, -15843, -153424, -349257, -500727, -167185, -462332, -499816, -255266, -274588, 114543, -40008, -226499, -774354, -989910, -385322, -245017, 255422, 289274, -7460, -24224, -74114, 108880, 207908, -375636, -219773, -162117, -126635, 74780, -219234, -330724, -144578, -381496, -203831, 136234, -116179, 119753, -140415, 84937, -112185, -68428, 7075, 14606, -332871, -441244, -700488, -499950, 278664, 159442, -353810, -493743, -287724, -34560, 48426, 6064, -118740, -453045, -40594, 6379, -405621, -368145, -96508, -260851, 3986, 161331, 35554, -60190, -105788, 184201, 298876, 247253, -86317, -316641, -152378, -353984]
1333c53984N7211l4076L27305K0919k92874M49587j01386j61413k84554q9483
1323d62748K35513J55665J14802L49973R9789n47400l5517M2273l76355J88420
1313b35585L44623j44294l250j66293L06391R8122k10841P9641J2639j02912k41799
1302b63558j87594Q2945J46699N3458j79264l24469M71274N4033K75006r0687
1292C7843k76705J91894k71939M53360p4157L4734K29723j44680l35439K4875
1282a30491K76313J2611k04232J54243M4198R0219R611k14525j22406P1391j02373
1271a15441k10947R3408l9276p8984P1812j05192J84486Q3259j43524l58761J61032
1260d58128J71033j18005M10127L8095r038q6005J75546j78060L7703Q2481K77504
$$ y = [-353984, -296773, -330849, -3544, 17375, -275499, 174088, 72702, -88711, -373265, -462748, -227235, -71570, 43232, 393205, 492994, -54406, -89923, -47650, -424005, -235585, 109038, -35256, -38506, -204799, 101592, 199714, -11127, 68514, 81153, -21759, -263558, -451152, -368207, -221508, -168050, -347314, -671783, -200509, -146476, 128530, 37843, -238862, -46968, -318907, 134453, 60296, 95030, 324753, 180073, -155366, -130491, 145822, 158433, -45799, 108444, 152642, 242861, 252472, 37947, -84459, -13068, -115441, -326388, -232980, -272256, -351240, -279428, -384620, -200134, -116875, -260399, -619160, -458128, -287095, -405100, 5027, 43122, 34084, -51921, 123625, -54435, -16732, 65749, 343253]
1249C43253o97496J79769M30775j92726j14798j72835j52487k53221N6181O05898
1239C2313j36368n7592L82443o4451m9042k92090M5955j5314J25222j06239o6425
1228b01588J09974K94643m04334n9411N9394K77327J60422k74667P7038J84207
1218B23005q8458n4687j76066k14660O79416j89143l33947j59722L86779n4865
1208A7652k10764J84264l27288K56777J43716k69117J33278L86784j0108n32480
1198b27286J51813M29173K1198j99342q3943K5105j06865K08394m58499J58456
1188h1796M4301J55603R8837j94609m5519J33563l35653J8425k30621L10129L50103
1177B22763q5136j02885m94105J50547J00235L9978L42595M3890o75537j03155
$$ y = [343253, -354243, -174474, 256301, 63575, -51223, -224058, -376545, -629766, -573585, 32313, -104055, -161647, 220796, 156345, 107303, -184787, -138832, -154146, -28924, -135163, -201588, -91614, 203029, -201305, -260716, -201322, 76005, 236427, -38240, 38798, 223005, 134547, 79860, -96206, -310866, 368550, 179407, -154540, -314262, 72517, 17652, -193112, -8848, -336136, -79359, 64357, -204760, -71482, 315302, 305194, -227286, -75473, 353700, 374898, 175556, 91613, 116718, 9853, 218247, -240252, -81796, -37495, 118108, 216945, 22336, -23183, 110380, -225273, -206848, -437469, -127340, 222763, 137627, 34742, -459363, -308816, -208581, -168603, 173992, 217882, -457655, -560810]
1167e60810M17954L39239l87071J67359l14307k54943M68021J61849o0969j61888
1157a85566j69670o9687p3174K72394j7905K35779M6888J72002j52634J55615
1147B14042K22650k02976m23630J7700J37007l97675M3253j21917P8679j42637
1137e75504M15230N95365q8628l67259M564J4475k00427J68642K61376k82052
1127e4218o3898K15875o14809j13327L87067k859J64838M98628l04547m98770
1117c86020m1628K59974o4426J24270N12059m0693K5032k47530j95487J35136
1107H0687J10133q0147K36220k27357N4504J25128L8372k98661l39164J71568
1097a28717L26851l60485l07588J74035J24980K44037q0502j8929j32649j44111
$$ y = [-560810, -142856, 196383, -190688, -23329, -337636, -592579, -124558, 37291, -23678, -185566, -355236, -424923, -498097, -225703, -243608, -7829, 39059, 211061, 58427, 214042, 436692, 233716, -189914, -172214, -35207, -432882, -389629, -511546, -432867, -575504, -160274, 435091, 346463, -20796, -16232, -1757, -202184, -33542, 227834, -54218, -118116, 97759, -517050, -630377, -243310, -246169, -81331, 417297, 112750, -386020, -427648, -167674, -232100, -107830, 404229, 363536, 388568, 141038, -54449, 80687, 190820, 110673, 346893, 119536, 174040, 299168, 337540, 38879, -300285, -128717, 198134, -162351, -469939, -295904, -170924, 73113, -7389, -26318, -158967, -303078]
1087c03078N94142L41563j71445l06802m30846r2604k23469L13157L5769O7935
1077a75678k35567K0673O0588M8113o2398L6113J34517j78766L75273k33743K19453
1066H578J85927m5622K23567m75835J72222K23429q776j0642k78302o1006K44367
1055A77907J22074K84528j74398m75051k09024J73797M71273m6182P9641l20883
1045H3682j38909J32732k95902o8901K48523K14935m5768J2480K24176k98681
1035F8367k29356K72364j03441k66728K82280q2577j72462m672n7066M1082J50124
1024a02085q2188M13546P6633l19079L5756j08038J73131J73957j32424l85253
1014b56044r6059K13624N2477j60047K72027K18121k9341l4549n01307L72625
$$ y = [-303078, 291064, 632627, 461182, 154380, -276466, -369070, -592539, -279382, -243613, -175678, -411245, -390572, -329984, -281871, -344269, -308156, -173639, -352405, 22868, -210875, 8578, 194505, 148883, 372450, -103385, 68837, 292266, 283490, 272848, -5454, -66460, 177907, 299981, 584509, 410111, -64940, -273964, -100167, 371106, 324924, 404565, 83682, -55227, 77505, -218397, -287298, -38775, 176160, 130392, 142872, 367048, 68367, -160989, 111375, 7934, -258794, 23486, -59091, -231553, -236225, -293291, -252209, -102085, -184273, 229273, 305906, -13173, 22583, -85455, 87676, 261633, 129209, -256044, -352103, -138479, -86002, -246049, 25978, 244099, 214758, 180209, -321098, 51527]
1004E1527j59106n4851M3953K56495K25561m44069j78054k1109N5031j51880J04978
993b71524N4066J40229n9891J01679j05626K66606j53548r5680N62925l8477n5233
982C45526l82542m96987L84997P1752k60788j07925p131J04211K63358J5519m4355
971a14365Q0670Q8634L125k16581M18338J0386k66069K7400L04258j59026J97166
960C73936j66899j43259k02849l53232J52124M8607k24257k89413L02445j25850
950f28647R7541K46023l31707N68590j33317k36993N1014K02640N96036k07771
940B23409j96748j28354M3580J83317j02363N2937k03275j4333L05011j96006
930c2825j18051l4555J88557j02989r7721j07831j28288K17625J62167J2604L82500
$$ y = [51527, -107579, -162430, -118477, 138018, 363579, -80490, -258544, -279653, -224622, -376502, -271524, -217458, -77229, -137120, -35441, -141067, 125539, -28009, -123689, 439236, 400759, 345526, -37016, -534003, -149006, -77254, -338042, -445967, -453098, -348887, -85529, -70010, -114365, -33695, 54939, 58064, -158517, 259821, 270207, 4138, 31538, 335796, 176770, 373936, 207037, 63778, -139071, -492303, -340179, -291572, -515829, -805242, -502797, -628647, -531106, -285083, -616790, -48200, -181517, -418510, -367496, -164856, 431180, 223409, 26661, -101693, -58113, 125204, 22841, 75778, -127497, -141830, 163181, -32825, -150876, -185431, 3126, -99863, -197584, -305415, -433703, -216078, -53911, -41307, 341193]
919C41193K10375m51812K7272L19536k29519l26452P5485J88455J61932k05959
909A10506k72688k84280L38669L13489k50335j16657K2090J89349k42486K20263
899B7920j90553k7589K37838N8325k35805K52743p4691n7489r1220Q5749k08274
888b23046L97044k667m01850m7974K52571J04646o5871J04063J14313K28187j58885
877C00531m44426J15895J54371J70839J66365j07099j62087j76613j65833r0825
867b38882j09041L51133k35028J15483K51991o7075J20226J4834K1965j57483
857F8123J44796j54254l22401j95458L07506M56853P2188k98893l7326l81224
847c40090Q6109K14736j77842J45426n367j56013J46713o4954J66224l27805O46538
$$ y = [341193, 551568, 99756, 127028, 446564, 217045, -109407, -33922, 154533, 316465, 110506, -162182, -446462, -107793, 205696, -44639, -161296, -139206, 50143, -192343, 27920, -162633, -190222, 47616, 105941, -129864, 122879, 48188, -9301, -100521, -14772, -223046, 173998, 171331, -230519, -278493, -25922, 78724, 12853, 116916, 231229, 459416, 300531, -143895, -28000, 126371, 297210, 463575, 356476, 194389, 17776, -148057, -238882, -347923, 3210, -231818, -116335, 135656, 68581, 188807, 203641, 225606, 68123, 212919, 58665, -263736, -459194, -151688, 305165, 377353, 78460, 41134, -340090, -253981, -39245, -217087, -71661, -77028, -233041, -86328, -151282, 14942, -312863, 333675]
836C33675k9787m523r3905l27424L9925j06485r1653J91470J32694L415k62826
825b15424j0645L43400O15095m57637J46993j48450k71661p452Q457l81290K26207
814a52407K93826j58524J1102J59923K48807l24558j28009K55406k59355j54226
804b08015o3895J1302J56346J94110r9451l548N34147o61342j28254K70587J17244
793A19231k37287o0250J09175K6956r7576J01651j77996O8473K01244J5812J80859
782B50292m5499Q2M4991m04351M18694K44522j38066j52856m7787J39833J07359
771D17214m22436k03950L36153M3213j28402l21297k7014J67540L3905J66754
761F1680j43563J80153j57963L38230j17951Q1578K12248k88052r4099K03642
$$ y = [333675, 303888, 299365, 205460, -121964, -82039, -188524, -280177, -88707, 43987, 47402, -215424, -226069, 117331, 732426, 274789, 421782, 273332, 1671, -5781, 2676, -378614, -152407, 141419, -17105, -6003, 153920, 402727, 78169, -49840, 205566, -53789, -208015, -271910, -260608, -104262, 89848, -9603, -13151, 520996, -140346, -268600, 1987, 119231, -118056, -178306, -69131, -42175, -139751, -38100, -216096, -147623, 53621, 69433, 250292, 204793, 204875, 249866, -154485, 264209, 508731, 370665, 217809, 170022, 309855, 417214, -5222, -209172, 126981, 170194, 41792, -279505, -306519, -138979, -105074, 61680, -81883, 98270, -59693, 278537, 160586, 242164, 454412, 166360, 72261, 275903]
751B75903j05391Q5455l08919Q0067N07j38044L15330j64491L5941k73269K1214
740a75697K51537k60742j39642P2365P2239o9289j15474J24392Q7412K8545j97365
729c21719M04629K86434o7820m6910m20526n6464k41529K01998K80387k50396
719b31916j09151J12205J25232K97368L27389l63220J23305l16709k21522R4778
709a62241M81487j08372J91410j22845p0333J8681K24590K66897p3403o39182
699F689k33004L57093k3716Q0219J83141p7988p6781M07881n0067m17373j19990
688C6104j06141k85800K26635k4373k78064K29439K25374P9682K0929J0993j06107
677B8671j78834K22297j93502J6103l11031k40179K73467J12731k0929m1504K17133
$$ y = [275903, 170512, 255967, -52952, 27115, 27622, -110422, 204908, 40417, 76358, -196911, -175697, 75840, -184902, -324544, -252179, -179940, -249229, -364703, -240311, -152899, -124354, -321719, 82910, 369344, 301524, 254614, -165912, -222376, -463905, -261907, 18480, -231916, -341067, -228862, -103630, 193738, 521127, 157907, 281212, -35497, -257019, -162241, 319246, 210874, 402284, 279439, 209106, 227787, 452377, 719274, 645871, 6689, -226315, 130778, 107062, 187281, 370422, 292434, 215653, 623534, 573467, 156094, 36104, -70037, -355837, -129202, -153575, -431639, -202200, 23174, 102856, 123785, 134778, 28671, -150163, 72134, -121368, -105265, -416296, -656475, -383008, -270277, -291206, -332710, -115577]
666a15577K32685j10596K573p8217l826J93686O5338j71737k56923k65336P6270
655d31660L39517k2792J09367N0738k52468l80442M7431M22718K313O0336K20609
644A65667J63l83327K85694L09556k79116J42438l3204k36798J84917j26995l38263
633c09268N37211L8268k90861K35942l84482K3331K35347n481m04185J42852N57756
622C76430M52221k69986k67166q9644J14027l96163j46679L22763P496j23181
612a9882j87746J85773K58732R5069j33235l4494j65676K5650p2863M24622j18874
601B57076l25686l31415M00832J23281q0885l41332J58067L16819j44133j87291
591a54667L70127N5633J65915J02749l3351k2350l25672n9011j45967L44591J74000
$$ y = [-115577, 117108, 6512, 9085, -69132, -72958, 120728, 186066, 14329, -242594, -507930, -431660, -92143, -114935, -5568, 45170, -207298, -587740, -540309, -117591, -115278, -54942, 165667, 165830, -217497, 68197, 377753, 98637, 241075, 207871, -28927, 155990, 28995, -309268, 227943, 266211, -24650, 211292, -173190, -149859, 85488, 80007, -324178, -181326, 376430, 828651, 558665, 291499, 201855, 315882, -80281, -226960, 95803, 103299, -19882, -207628, -21855, 236877, 331946, 198711, 164217, -1459, 24191, -48672, 375950, 257076, -68610, -400025, 807, 124088, 43203, -298129, -140062, 176757, 32624, -154667, 215460, 271093, 437008, 539757, 506406, 484056, 158384, 99373, -46594, 297997, 471997]
580D71997n7926j34497l9645m1866J33776k60394l04993j45035l14281K34072
570d58792M11721J49936K34434j82227m57896M7264O9018J88759J13233j11340
560D110j23045J64431K5288k63393R1408K25638J50008Q8361n82990j62089K32969
549a49304K3134J07261M7644J2554O4903J24677j20855o5175j71435M39443R5639
538D08486m91824J7295L97690j27578K1279Q0105j90107o2007L48308j07933P7869
527C71583k47460J06846N36001k54788m05868k21884J43855j46199L26940r6053
517A12973o45501M46851K51773K70219J54631m38659K90348j19889m16797J13094
507A9043j478j46331K57943j2939m50620j53794J36864K51086j1315K89676K27528
$$ y = [471997, 414071, 279574, 239929, 198063, 331839, 71445, -233548, -378583, -692864, -458792, -47071, 102865, 337299, 155072, -302824, -255560, -186542, 2217, 115450, 4110, -118935, 45496, 70784, -192609, -101201, 124437, 274445, 362806, -220184, -382273, -149304, -126170, -18909, 28735, 41289, 106192, 230869, 110014, 44839, -126596, 312847, 408486, -83338, -66043, 331647, 204069, 225348, 305453, 115346, 53339, 401647, 293714, 371583, 124123, 230969, 766970, 512182, 106314, -115570, 28285, -117914, 209026, 112973, -532528, -85677, 166096, 436315, 590946, 152287, 442635, 322746, -94051, 19043, 17565, -128766, 129177, 116238, -334382, -488176, -351312, -100226, -111541, 178135, 405663]
496D05663N661m20737k1712N76278k10979m51625J24864R1698j04898J28518J36158
485B58889L5450k08594N7823m25505L14561o677r3805J03223L5333K32323l21361
474a8340J7729j20122J04225L3469N43181m74114l7567N2571j50566M68768j84190
463B35044k68773k8636M483p1281q8709k38225k7836K95471L67020L20754J15611
452F14923l65023J38279n35449l46189L97001J6380J54148K33775j12215K51894
442D47524q0687l09193j23893j13911M68739J37741l65383J24909L8365j6819
432B07392J63861j49662k99686J35888J78413j32699k72774K33806k3257j69321
422a28039K09253j44647P605j48746J07685K4628J65192L73986l68816j30179
$$ y = [405663, 411324, -9413, -31125, 545153, 334174, -117451, 7413, 99111, -5787, 122731, 258889, 294339, 85745, 143568, -281937, 32624, 25947, -67858, 35365, 70698, 303021, -18340, -611, -120733, -16508, 16961, 560142, 86028, 48461, 101032, -49534, 419234, 235044, -33729, -62365, -57882, -129163, -217872, -456097, -483933, -188462, 178558, 499312, 614923, 249900, 388179, -147270, -493459, -96458, -80078, 74070, 307845, 195630, 447524, 366837, 57644, -66249, -180160, 288579, 426320, 60937, 185846, 224211, 207392, 371253, 221591, -78095, 57793, 236206, 103507, -169267, 64539, 41282, -128039, 81214, -63433, -55828, -204574, -96889, -72261, 92931, 466917, 98101, -32078]
412c2078J50707k4648J68974j49121J09262j18563n27745K19331L76408P2629
402B45156P1279k2416r1899K15909J30998l09390k56078M75670J36378k75622
392C19985j63923k24658L43388j30071m01149l9396m2650J82287L45688j10016
382G9485K9416O9192l7630j14005K19348O0540J86061j93237O196N3500m60334
371a01468L85928n15579J89453p5866n1928J93644N45019K0406k31068j3279l05950
360C9312J28284j97128j91813L99263J87357m24866K18841K6887O0965k77782
350c0680M17479k55051J40719p9146l90368M19148j67729n4330k57594M8108K8616
339a80828N63435J57356L52939k29332m04819o4338K31362K11415k96711Q9175
$$ y = [-32078, 118629, 93981, 262955, 113834, 223096, 104533, -423212, -203881, 172527, 245156, 316435, 294019, 202120, 418029, 549027, 239637, -16441, 459229, 595607, 319985, 156062, -68596, 274792, 144721, -256428, -295824, -338474, -156187, 189501, 79485, 108901, 178093, 140463, 26458, 245806, 306346, 492407, 299170, 305366, 358866, -101468, 284460, -231119, -41666, -117532, -169460, 24184, 569203, 589609, 358541, 345262, 39312, 167596, -29532, -221345, 177918, 365275, -59591, 159250, 186137, 247102, -30680, 386799, 131748, 272467, 193321, -197047, 222101, 54372, 42, -257552, -209444, -180828, 382607, 539963, 892902, 663570, 258751, 194413, 425775, 637190, 340479, 429654]
329D29654J25754j78824j10745k26867o5552o4075j47517J98839N4053L93797
319D08517Q1684l34049k9098P64l04591p4378K92723M96413K33708p0870l81197
308C19626J88155K1227k95003M0824j98120O33j05811J03377N2029k47496o9276
297a89835K54168J18419O1440K2092k35908n5203Q1506K21729l2639K12204j01325
286C56648L043j60504J11211j00565j83396j53672K58061Q2875n85446R7734J04160
275a69851J26394k19918M4829J43102N8187L81381l62834P6982K06564m7278j42590
264I4968l02695L70651K50611l87612m4396J44093K7314Q8452K133L0248k76696
253b929K75425P1183k94401K81118J01157j52689q0925j03621P03078O8543o48760
$$ y = [429654, 555408, 376584, 265839, 38972, -26580, -90655, -238172, -39333, 14720, 408517, 490201, 156152, 127054, 127818, -176773, -251151, 41572, 537985, 771693, 700823, 319626, 507781, 529008, 234005, 274829, 76709, 77342, -28469, 74908, 126937, -120559, -189835, 64333, 182752, 244192, 266284, 30376, -24827, 56679, 278408, 245769, 457973, 356648, 359691, 199187, 310398, 209833, 26437, -127235, 130826, 213701, -371745, -274011, -169851, -43457, -263375, -218546, -75444, -17257, 364124, 1290, 78272, 284836, 237558, 94968, -207727, 162924, 413535, 25923, -18473, 125620, 152934, 241386, 243519, 273767, -2929, 272496, 343679, 49278, 330396, 431553, 278864, 197939, 94318, 797396, 865939, 217179]
242B17179l8199K96098j75958j42489j97628k2533N40066l10716j43944j20868
232i8992j7899M25686J66403P8759m42173j57720J48407J64038J73283j25214
222C14578J1795p9510q9935J55202P7229k08508k14477J69109k12638l63217K25308
211b15064K74679K0282o1667O4910K16594J03719J64882j52671l94220J28039
201A49483j05612O9065K13175p9136K09455r0314q7974J00352k37338J31507Q4266
190C56929O3131j91656l5107J07183J48597j23962k15731J97233j77215J32009
180B61411p2294L6536J56744j070j43693l30622M25058p6598k34677Q7789k33491
169a24907L84208k48875K79087L0712L3799J49433k91667m5927L34729k43408
$$ y = [217179, 178980, 475078, 299120, 156631, -40997, -63530, 476536, 165820, 21876, -98992, -116891, 308795, 475198, 553957, 111784, -45936, 102471, 266509, 439792, 314578, 326373, 246863, 156928, 312130, 389359, 180851, -33626, 135483, -77155, -440372, -215064, 59615, 79897, 18230, 83140, 299734, 403453, 568335, 415664, 21444, 149483, 43871, 112936, 326111, 246975, 456430, 366116, 278142, 378494, 141156, 272663, 356929, 420060, 228404, 193297, 300480, 449077, 325115, 109384, 306617, 129402, 261411, 189117, 225653, 382397, 381327, 237634, -92988, 332070, 255472, 20795, 108584, -124907, 259301, 10426, 289513, 320225, 354024, 503457, 211790, 165863, 500592, 257184]
159B57184J51504L24613j78352l08543j07226j27855L6794K30433j68145R1509
149B01916Q4867n2248k37254j51760Q1526K72517j84781j1369K59332K42248j52541
138C52453Q287j93373k44282J3205P7188n4493M3040l44065j7062K29997L78971
127B49866Q6602j76156N8105k13547K30805k4372j41133J99638n9198N573N7639
116B73822k7197k47147J95728j27576q3454L84058Q4465j97805j77133p0275K67539
105B75025J09246j31924m6208R9846J63894j94937q5509J57680j52586q7655K96850
94D03722j81721O4677j28763p2769m6297m55029K59978K18736P0822Q2846K0768
83B36970J87953l50907n1870K43616j40487j2287K84353N6411m8997J2572k00777
$$ y = [257184, 408688, 733301, 554949, 246406, 139180, 11325, 48119, 278552, 110407, 201916, 286783, 234535, -2719, -154479, -72953, 199564, 14783, 3414, 262746, 504994, 352453, 360740, 167367, -76915, -63710, 13478, -41015, 2025, -342040, -359102, -129105, 249866, 336468, 160312, 218417, 4870, 235675, 211303, 70170, 269808, 210610, 216183, 273822, 246625, -522, 195206, 67630, -15824, 368234, 452699, 254894, 77761, 7486, 275025, 384271, 252347, 206139, 305985, 469879, 274942, 189433, 347113, 194527, 106872, 403722, 222001, 286678, 157915, 85146, 38849, -416180, -156202, 62534, 133356, 216202, 236970, 424923, 74016, 22146, 265762, 125275, 112988, 397341, 453752, 404755, 417327, 216550]
72B16550k20429Q7077K09429K91523k64468k59406J32448Q0603p4768O3216p7117
61A84658J43668J61099j16963J69305l10792r7710l3682L15923j43936j36867
51A34703j39031J93801R9379j47711J57614m214J10616k749q2289k66091K7742
40H1770j74461Q7793K59728j29815J04903J33072j32120p1263K61704j23222o278
29B91811N0317j06718K72900m43513j03850J81667L11909q6644k81641K03172
19B89410J40568k47928P6633j59196r5391L65071P5817j51297j62846n0485J04172
8A84528N3735j39562P1194o6051J14330j73737J32437K08935
0C85809
$$ y = [216550, -3879, 83198, 292627, 584150, 319682, 60276, 192724, 273327, 198559, 261775, 184658, 328326, 489425, 372462, 541767, 230975, 133265, 99583, 415506, 271570, 134703, -4328, 189473, 288852, 141141, 298755, 294541, 405157, 402408, 320119, 54028, 81770, -92691, -4898, 254830, 125015, 229918, 362990, 230870, 159607, 421311, 298089, 291811, 342128, 235410, 508310, 64797, -39053, 142614, 454523, 367879, 86238, 289410, 429978, 182050, 258683, 99487, 4096, 369167, 444984, 293687, 130841, 80356, 184528, 238263, 98701, 169895, 103844, 218174, 44437, 176874, 385809]
$$ Imaginary data points
##PAGE= N=2
##DATA TABLE= (X++(I..I)), XYDATA
16383d260705j69249L26860J91808j38398J33949j12536j00636K04400J52316
16374c772191M8847J5750J91246J99709j09061k3148J14408L62544j3062k89172
16364c274130J68323J35625k9808J22874l1077J73494o1755K40224P8692N8592
16354b418946R3460R9474j15147N1851N0029l4590J88331K23229o8970j54887
16344b086166m6843j12083K33753n9929L56091n3503N0600Q1715o363J30535K9993
16333a482200L75175j18146o9140J78732K83195K3046k21059J89020L79285j79322
16323f41414j70017K09724L9025k05930K44961J60953k49897K83021K10911R1054
16313b7609j45554n3954K57709R6669N6140p2404O5701q8637L3914J75213p5874
$$ y = [-4260705, -4429954, -4103094, -3911286, -4049684, -3915735, -4028271, -4128907, -3924507, -3772191, -3723344, -3707594, -3516348, -3316639, -3425700, -3448848, -3334440, -2971896, -2984958, -3274130, -3105807, -2970182, -2999990, -2877116, -2908193, -2734699, -2796454, -2556230, -2477538, -2418946, -2325486, -2226012, -2341159, -2289308, -2239279, -2273869, -2085538, -1862309, -1931279, -2086166, -2133009, -2245092, -2011339, -2071268, -1715177, -1768680, -1718080, -1636365, -1642728, -1512193, -1482200, -1107025, -1225171, -1294311, -1115579, -832384, -809338, -1030397, -841377, -462092, -641414, -811431, -601707, -562682, -768612, -523651, -362698, -612595, -329574, -118663, -27609, -173163, -227117, 30592, 127261, 183401, 110997, 176698, 88061, 121975, 297188, 221314]
16302B21314J01370R1213J44631K79697K31117j99628r5573j39117j15214L14985
16292H34795K10713j41653J8648Q7791J87703j98767j53579O026K70189K73015
$$ y = [221314, 322684, 413897, 558528, 838225, 1069342, 869714, 774141, 635024, 519810, 834795, 1045508, 903855, 922503, 1010294, 1197997, 999230, 845651, 851677, 1121866, 1394881]
$$ [...]
##END NTUPLES=NMR SPECTRUM
##END=
