##TITLE=1H_CA-8951-2
 CDCl3
 8 sc, 
 19.11.2021
##JCAMPDX= 6.0         $$ Bruker NMR JCAMP-DX V2.0
##DATA TYPE= NMR SPECTRUM
##DATA CLASS= NTUPLES
##ORIGIN= UXNMR, Bruker Analytische Messtechnik GmbH
##OWNER= root
$$ XWIN-NMR		Version 3.5
$$ Fri Nov 19 12:03:26 2021 Russian Standard Time (UT+4h)  she@DPX200
##.OBSERVE FREQUENCY= 200.131346
##.OBSERVE NUCLEUS= ^1H
##.ACQUISITION MODE= SIMULTANEOUS
##.ACQUISITION SCHEME= undefined
##.AVERAGES= 8
##.DIGITISER RES= 18
##SPECTROMETER/DATA SYSTEM= spect
##.PULSE SEQUENCE= zg30
##.SOLVENT NAME= D2O
##.SHIFT REFERENCE= (INTERNAL, D2O, 0, 15.7083)
##AUDIT TRAIL= $$ (NUMBER, WHEN, WHO, WHERE, WHAT)
$$ ##TITLE= Audit trail, XWIN-NMR		Version 3.5
$$ ##JCAMPDX= 5.01
$$ ##ORIGIN= Bruker BioSpin GmbH
$$ ##OWNER= she
$$ F:/spectra/data/she/nmr/H-F/1/pdata/1/auditp.txt
$$ ##AUDIT TRAIL=  $$ (NUMBER, WHEN, WHO, WHERE, WHAT)
(   1,<2021-11-19 12:01:59.40 +0400>,<she>,<DPX200>,
      <created by zg, POWCHK disabled, PULCHK disabled
       configuration hash MD5:
       00 E9 B6 7A A2 85 ED C7 34 08 36 98 17 FE 4E 26
       data hash MD5: 16K
       E8 45 D0 30 1D B6 D4 BB C8 C4 00 66 0B E2 86 38>)
(   2,<2021-11-19 12:02:01.87 +0400>,<she>,<DPX200>,
      <Start of raw data processing
       efp BC_mod = 2 LB = 0.24 FT_mod = 6 PKNL = 1 PHC0 = -15520.52 PHC1 = 22.40081 SI = 16K 
       data hash MD5: 16K
       77 AF B8 EB EF 86 8E 1B AF DD C5 57 64 12 CC A0>)
(   3,<2021-11-19 12:02:27.59 +0400>,<she>,<DPX200>,
      <pk PHC0 = -4.641287 PHC1 = 3.4 
       data hash MD5: 16K
       FB A0 72 06 56 08 77 2E CD E9 08 04 3C CC B6 2A>)
(   4,<2021-11-19 12:02:30.96 +0400>,<she>,<DPX200>,
      <abs ABSG = 5 
       data hash MD5: 16K
       BF E4 C8 86 04 7B 89 AB 7F BA 5C 25 87 F3 6E E7>)
$$ ##END=
$$ 
$$ hash MD5
$$ B2 21 09 C8 B2 7C 9F CE 1B 20 30 22 C0 B9 CD 2C
##$RELAX= 
##$RELAX= 
##$RELAX= 
##$RELAX= 
##$RELAX= 
##$RELAX= 
$$ Bruker specific parameters
$$ --------------------------
##$DU= <F:/spectra>
##$EXPNO= 1
##$NAME= <H-F>
##$PROCNO= 1
##$TYPE= <nmr>
##$USER= <she>
##$AMP= (0..31)
100 100 100 100 100 100 100 100 100 100 100 100 100 100 100 100 100 100 
100 100 100 100 100 100 100 100 100 100 100 100 100 100 
##$AQSEQ= 0
##$AQ_mod= 1
##$AUNM= <au_zg>
##$AUTOPOS= <>
##$BF1= 200.13
##$BF2= 200.13
##$BF3= 200.13
##$BF4= 200.13
##$BF5= 200.13
##$BF6= 200.13
##$BF7= 200.13
##$BF8= 200.13
##$BYTORDA= 1
##$CFDGTYP= 0
##$CFRGTYP= 5
##$CHEMSTR= <none>
##$CNST= (0..31)
1 1 145 1 1 1 1 1 1 1 1 1 1 1 1 1 1 1 1 1 1 1 1 1 1 1 1 1 1 1 1 1 
##$CPDPRG= <>
##$CPDPRG1= <>
##$CPDPRG2= <>
##$CPDPRG3= <>
##$CPDPRG4= <mlev>
##$CPDPRG5= <mlev>
##$CPDPRG6= <mlev>
##$CPDPRG7= <mlev>
##$CPDPRG8= <mlev>
##$CPDPRGB= <>
##$CPDPRGT= <>
##$D= (0..31)
0 1.2 0 0 0 0 0 0 0 0.06 0 0.03 0 0 0 0 0.0002 0 0 0 0 0 0 0 0 0 0 0 0 
0 0 0 
##$DATE= 1637308918
##$DBL= (0..7)
120 120 120 120 120 120 120 120 
##$DBP= (0..7)
150 150 150 150 150 150 150 150 
##$DBP07= 0
##$DBPNAM0= <>
##$DBPNAM1= <>
##$DBPNAM2= <>
##$DBPNAM3= <>
##$DBPNAM4= <>
$$ [...]
##$SUBNAM2= <"">
##$SUBNAM3= <"">
##$SUBNAM4= <"">
##$SUBNAM5= <"">
##$SUBNAM6= <"">
##$SUBNAM7= <"">
##$SUBNAM8= <"">
##$SUBNAM9= <"">
##$SW= 18.0517287032376
##$SWIBOX= (0..15)
0 0 2 0 0 0 0 0 0 0 0 0 0 0 0 0 
##$SW_h= 3612.71676300578
##$TD= 16384
##$TD0= 1
##$TE= 0
##$TE2= 300
##$TE3= 300
##$TEG= 300
##$TL= (0..7)
0 120 120 120 120 120 120 120 
##$TP= (0..7)
150 150 150 150 150 150 150 150 
##$TP07= 0
##$TPNAME0= <>
##$TPNAME1= <>
##$TPNAME2= <>
##$TPNAME3= <>
##$TPNAME4= <>
##$TPNAME5= <>
##$TPNAME6= <>
##$TPNAME7= <>
##$TPOAL= (0..7)
0.5 0.5 0.5 0.5 0.5 0.5 0.5 0.5 
##$TPOFFS= (0..7)
0 0 0 0 0 0 0 0 
##$TUNHIN= 0
##$TUNHOUT= 0
##$TUNXOUT= 0
##$USERA1= <user>
##$USERA2= <user>
##$USERA3= <user>
##$USERA4= <user>
##$USERA5= <user>
##$V9= 5
##$VALIST= <valist>
##$VCLIST= <CCCCCCCCCCCCCCC>
##$VD= 0
##$VDLIST= <DDDDDDDDDDDDDDD>
##$VPLIST= <PPPPPPPPPPPPPPP>
##$VTLIST= <TTTTTTTTTTTTTTT>
##$WBST= 1024
##$WBSW= 4
##$XGAIN= (0..3)
0 0 0 0 
##$XL= 0
##$YL= 0
##$YMAX_a= 73458
##$YMIN_a= -89967
##$ZGOPTNS= <>
##$ZL1= 120
##$ZL2= 120
##$ZL3= 120
##$ZL4= 120
##$ABSF1= 15.74359
##$ABSF2= -2.308259
##$ABSG= 5
##$ABSL= 3
##$ALPHA= 0
##$AQORDER= 0
##$ASSFAC= 0
##$ASSFACI= 0
##$ASSFACX= 0
##$ASSWID= 0
##$AUNMP= <proc_1d>
##$AZFE= 0.1
##$AZFW= 0.1
##$BCFW= 0
##$BC_mod= 2
##$BYTORDP= 0
##$COROFFS= 0
##$CY= -3
##$DATMOD= 1
##$DC= 0
##$DFILT= <>
##$DTYPP= 0
##$F1P= 0
##$F2P= 0
##$FCOR= 1
##$FTSIZE= 16384
##$FT_mod= 6
##$GAMMA= 0
##$GB= 0
##$INTBC= 1
##$INTSCL= 0
##$ISEN= 128
##$LB= 0.24
##$LEV0= 0
##$LPBIN= 0
##$MAXI= 10000
##$MC2= 0
##$MEAN= 0
##$ME_mod= 0
##$MI= 1.114404
##$NCOEF= 0
##$NC_proc= -9
##$NLEV= 6
##$NOISF1= 3.799351
##$NOISF2= 2.8
##$NSP= 0
##$NTH_PI= 0
##$NZP= 0
##$OFFSET= 15.70833
##$PC= 1
##$PHC0= -15525.16
##$PHC1= 25.80081
##$PH_mod= 1
##$PKNL= yes
##$PPARMOD= 0
##$PSCAL= 0
##$PSIGN= 0
##$REVERSE= no
##$SF= 200.130008651731
##$SI= 16384
##$SIGF1= 3
##$SIGF2= 2
##$SINO= 5.538805
##$SIOLD= 16384
##$SREGLST= <1H.CDCl3>
##$SSB= 0
##$STSI= 16384
##$STSR= 0
##$SW_p= 3612.71676300578
##$SYMM= 0
##$S_DEV= 0
##$TDeff= 16384
##$TDoff= 0
##$TI= <>
##$TILT= no
##$TM1= 0
##$TM2= 0
##$TOPLEV= 0
##$USERP1= <user>
##$USERP2= <user>
##$USERP3= <user>
##$USERP4= <user>
##$USERP5= <user>
##$WDW= 1
##$XDIM= 16384
##$YMAX_p= 506277182
##$YMIN_p= -2804449
$$ End of Bruker specific parameters
$$ ---------------------------------
##NTUPLES= NMR SPECTRUM
##VAR_NAME=  FREQUENCY,     SPECTRUM/REAL,   SPECTRUM/IMAG
##SYMBOL=    X,             R,               I
##VAR_TYPE=  INDEPENDENT,   DEPENDENT,       DEPENDENT
##VAR_FORM=  AFFN,          ASDF,            ASDF
##VAR_DIM=   16384,         16384,           16384
##UNITS=     HZ,            ARBITRARY UNITS, ARBITRARY UNITS
##FACTOR=    0.220516191357247, 1,           1
##FIRST=     3143.70824970811, 0,            0
##LAST=      -469.00851329767, 0,            0
##MIN=       -469.00851329767, -2804449,     0
##MAX=       3143.70824970811, 506277182,    0
$$ Real data points
##PAGE= N=1
##DATA TABLE= (X++(R..R)), XYDATA
$$ [...]
$$ plain form
7623 -523521 738322 1598014 806864 549890 -67928 67582 502256 -128209 -199097 29790
7613 29790 -368602 -474667 81514 819998 1129871 1125327 502221 -392586 -58382 285162
7603 285162 -945792 -826041 -1108554 8917 -88116 -717769 -188908 237343 -363501 -598178
7593 -598178 125988 176148 -686173 -965110 -385172 127377 32050 -307142 -742 236010
7583 236010 177201 -214563 -695176 -804398 77619 -722118 -710924 -497818 -435011 -484389
7573 -484389 -604045 335554 560918 470562 260886 365661 -120848 28376 182052 42817
7563 42817 3760 299410 356331 56936 204558 196443 27345 523495 61106 254665 89689
7552 89689 169815 471969 314597 -265202 -50867 -267012 -198115 390590 434977 233584
$$ packed form
7623e23521J261843Q59692p91150k56974o17818J35510M34674o30465p0888K28887
7613B9790l98392j06065N56181P38484L09873m544o23106q94807L34204L43544
7603B85162j230954J19751k82513J117471r7033o29653N28861M26251o00844k34677
7593e98178P24166N0160q62321k78937N79938N12549r5327l39192L06400K36752
7583B36010n8809l91764m80613j09222Q82017p99737J1194K13106O2807m9378
7573d84389j19656R39599K25364r0356k09676J04775m86509J49224J53676j39235
7563D2817l9057K95650N6921k99395J47622q115j69098M96150m62389J93559j64976
7552H9689Q0126L02154j57372n79799K14335k16145O8897N88705M4387k01393
$$ plain form
7542 233584 -946741 -394844 -165902 428178 570680 -91766 51502 -349064 -972552 -674282
7532 -674282 -412481 -858925 -1035732 -926764 -815635 -7582 79294 572788 854866 -24545
7522 -24545 -225931 35648 187532 -57946 -909203 -1252752 -1220676 -200896 -581677 -330215
7512 -330215 650588 519966 145467 -241094 -256739 -805824 -1075700 -616163 -809032 -655140
7502 -655140 157445 131118 -420400 -861258 -949309 -602104 -75766 759150 243136 413376
7492 413376 335657 -141395 452824 1533283 1028358 982526 545538 222915 84732 -216687
7482 -216687 -501316 -3658 227578 221264 632380 -69257 -298560 14399 -285604 239011
7472 239011 88422 -313723 -153186 225520 -123791 720658 1651705 1048133 677534 517909
$$ packed form
7542B33584j180325N51897K28942N94080J42502o62446J43268m00566o23488K98270
7532f74282K61801m46444j76807J08968J11129Q08053Q6876M93494K82078q79411
7522b4545k01386K61579J51884k45478q51257l43549L2076J019780l80781K51462
7512c30215R80803j30622l74499l86561j5645n49085k69876M59537j92869J53892
7502f55140Q12585k6327n51518m40858q8051L47205N26338Q34916n16014J70240
7492D13376p7719m77052N94219J080459n04925m5832m36988l22623j38183l01419
7482b16687k84629M97658K31236o314M11116p01637k29303L12959l00003N24615
7472B39011j50589m02145J60537L78706l49311Q44449R31047o03572l70599j59625
$$ plain form
7462 517909 1132296 330116 -217812 32032 262883 -19229 526176 580114 20356 188480
7452 188480 212385 185006 918364 709462 788066 410876 632116 910588 710168 85839
7442 85839 95554 299078 -88075 253966 657280 337639 637510 277146 252059 130950
7432 130950 137625 371541 121027 563465 511814 318523 772883 810906 425927 646972
7422 646972 831036 761630 198081 614740 396171 288134 336819 -266060 646050 146036
7412 146036 235101 272886 -338671 -1152466 -1550534 -831040 6854 -30337 -274253 -425639
7402 -425639 246734 499695 725922 491196 208183 367031 751132 851894 667944 786766
7392 786766 473579 475798 231572 345363 575151 507951 587052 688465 791394 448213
$$ packed form
7462E17909O14387q02180n47928K49844K30851k82112N45405N3938n59758J68124
7452A88480K3905k7379P33358k08902P8604l77190K21240K78472k00420o24329
7442H5839R715K03524l87153L42041M03314l19641K99871l60364k5087j21109
7432A30950O675K33916k50514M42438n1651j93291M54360L8023l84979K21045
7422F46972J84064o9406n63549M16659k18569j08037M8685o02879R12110n00014
7412A46036Q9065L7785o11557q13795l98068P19494Q37894l7191k43916j51386
7402d25639O72373K52961K26227k34726k83013J58848L84101J00762j83950J18822
7392G86766l13187K219k44226J13791K29788o7200P9101J01413J02929l43181
$$ plain form
7382 448213 233281 588536 -288141 -954727 -1010820 -140699 289111 494307 254457 300092
7372 300092 -383483 -358533 -20300 282111 345745 -90001 331891 593722 932728 -29916
7362 -29916 -275250 -1602465 -1147902 -305863 -238309 -549251 30512 458238 -502851 -679356
7352 -679356 -458515 -478827 -869939 -249265 -31737 -592627 -1160691 -643198 -454910 95236
7342 95236 -58010 506007 627125 -59484 -116479 150754 128978 -227875 -769356 -272059
7332 -272059 -1163002 -394875 245121 -132959 -471655 -244735 98852 -54859 -557443 -929767
7322 -929767 335185 -127890 -808536 -375532 20995 -566758 -201910 -168019 -182184 -112978
7312 -112978 -977583 -531441 -650747 -838111 -317020 -57830 -614611 -825710 -411549 -196805
$$ packed form
7382D48213k14932L55255q76677o66586n6093Q70121M29810K05196k39850M5635
7372C00092o83575K4950L38233L02411O3634m35746M21892K61831L39006r62644
7362b9916k45334j327215M54563Q42039O7554l10942N79763M27726r61089j76505
7352f79356K20841k0312l91112O20674K17528n60890n68064N17493J88288N50146
7342I5236j53246N64017J21118o86609n6995K67233k1776l56853n41481M97297
7332b72059q90943P68127O39996l78080l38696K26920L43587j53711n02584l72324
7322i29767J264952m63075o80646M33004L96527n87753L64848L3891j4165O9206
7312a12978q64605M46142j19306j87364N21091K59190n56781k11099M14161K14744
$$ plain form
7302 -196805 -253353 -12749 -844452 -914285 -569226 -1445002 -1555422 -1055200 -1099545 -1082702
7292 -1082702 -331016 -193232 -1050322 -1116094 -931872 -1073543 -1124250 -969193 -1353571 -1744241
7282 -1744241 -1207175 -682753 -528899 -504117 -161233 -559353 -887005 -852719 -1228570 -1168344
7272 -1168344 -824927 -514682 -240814 -824461 -704396 -272434 -684123 -915443 -1035340 -1066958
7262 -1066958 -455140 -228961 -771925 -648893 -334856 -124813 105108 -253609 -536716 -1632563
7252 -1632563 -1689828 -814721 -564894 -808511 -239237 -771008 -191856 -361638 -127666 -1164676
7242 -1164676 -1518768 -565685 -514094 -593712 -804249 -807923 -428038 -105453 260645 921272
7232 921272 689363 -312203 -1088465 -415324 -15364 -515792 -297555 -823185 -1402820 -694508
$$ packed form
7302a96805n6548K40604q31703o9833L45059q75776j10420N00222m4345J6843
7292a082702P51686J37784q57090o5772J84222j41671n0707J55057l84378l90670
7282a744241N37066N24422J53854K4782L42884l98120l27652L4286l75851O0226
7272a168344L43417L10245K73868n83647J20065M31962m11689k31320j19897l1618
7262a066958O11818K26179n42964J23032L14037K10043K29921l58717k83107j095847
7252a632563n7265Q75107K49827k43617N69274n31771N79152j69782K33972j037010
7242a164676l54092R53083N1591p9618k10537l674L79885L22585L66098O60627
7232I21272k31909j001566p76262O73141L99960n00428K18237n25630n79635P08312
$$ plain form
7222 -694508 -253795 -931922 -1645202 -1112043 32195 265396 330557 -249647 157033 -264253
7212 -264253 -187243 109471 -389834 -992809 -1284007 -724766 -249412 -130210 -708993 -561459
7202 -561459 -948642 -41104 -327352 -74463 -342424 444530 546989 316423 334354 168202
7192 168202 -182242 -853880 -1828150 -2323928 -1451686 -735536 -1156101 -2300980 -1111235
7183 -1111235 -153418 -808552 -1335183 -1230104 -923077 -1410318 -1508979 -993380 -826758 -293673
7173 -293673 -50882 -316968 -544351 -682183 -90569 -1209986 -1130236 -569288 -195180 -1199307
7163 -1199307 -1751775 -912075 -1103787 -796354 -437495 135489 -254832 -651336 -844293 -1027728
7153 -1027728 -1492122 -794205 -433907 -699459 -753795 -241502 -511804 -686515 -313248 -1046555
$$ packed form
7222f94508M40713o78127p13280N33159J144238K33201O5161n80204M06680m21286
7212b64253P7010K96714m99305o02975k91198N59241M75354J19202n78783J47534
7202e61459l87183R07538k86248K52889k67961P86954J02459k30566J7931j66152
7192A68202l50444o71638r74270m95778Q72242P16150m20565j144879J189745
7183a111235R57817o55134n26631J05079L07027m87241r8661N15599J66622N33085
7173b93673K42791k66086k27383j37832N91614j119417P9750N60948L74108j004127
7163a199307n52468Q39700j91712L07433L58859N72984l90321l96504j92957j83435
7153a027728m64394O97917L60298k65552n4336N12293k70302j74711L73267p33307
$$ plain form
7143 -1046555 -419110 -125309 -184139 -877264 -1151908 -870722 -937277 -1543980 -885162 -164100
7133 -164100 -732712 -759317 -661181 -1065867 -697842 -565577 -912906 -631123 -1244504 -1544833
7123 -1544833 -1668236 -1252119 -578507 -684529 -768743 -2002522 -1502591 -1471130 -1558249 -1579743
7113 -1579743 -1229641 -1590983 -1093301 -1168035 -1556117 -694295 -1318013 -1219636 -939455 -607225
7103 -607225 -936586 -1138327 -1345060 -785192 -810287 -616991 -1161453 -1000584 -368328 -712930
7093 -712930 -1928280 -1700221 -1194784 -739804 -999955 -1433027 -1673632 -1318728 -695493 -1286080
7083 -1286080 -1116726 -910933 -1250253 -858046 -1262381 -1449321 -1630745 -1754322 -1494221 -1766861
7073 -1766861 -1472689 -1192645 -882257 -1125983 -1451106 -1281071 -1746473 -1404588 -675848 -674650
$$ packed form
7143a046555O27445K93801n8830o93125k74644K81186o6555o06703O58818P21062
7133a64100n68612k6605R8136m04686L68025J32265l47329K81783o13381l00329
7123a544833j23403M16117O73612j06022q4214j233779M99931L1461q7119k1494
7113a579743L50102l61342M97682p4734l88082Q61822o23718R8377K80181L32230
7103f07225l29361k01741k06733N59868k5095J93296n44462J60869O32256l44602
7093g12930j215350K28059N05437M54980k60151m33072k40605L54904O23235n90587
7083a286080J69354K05793l39320L92207m04335j86940j81424j23577K60101k72640
7073a766861K94172K80044L10388k43726l25123J70035m65402L41885P28740J198
$$ plain form
7063 -674650 -1240230 -1372665 -1767819 -1327840 -1300355 -1324935 -1124354 -732030 -771493 -897328
7053 -897328 -1510049 -1454433 -1145474 -1187812 -374415 -27300 -353866 -999289 -889716 -1531746
7043 -1531746 -636764 -68913 -1093502 -1399917 -567155 334120 -88228 -474827 -591397
7034 -591397 -716952 -164652 -531380 -678755 -1242645 -1889113 -1353354 -1477355 -1293322 -962811
7024 -962811 -981986 -1525094 -1495277 -1177232 -1336382 -905755 -651941 -217002 -143797 -436223
7014 -436223 -350242 -350772 -120223 -125704 -60112 -470167 -1359978 -666481 -653098 -1184150 -862782
7003 -862782 -770014 -2024740 -2113198 -1041213 -963446 -1516775 -575276 -740283 -422641 -263116
6993 -263116 -545435 -1174280 -1619099 -1467794 -1483274 -1076747 -885584 -315056 -497161 -381566
$$ packed form
7063f74650n65580j32435l95154M39979K7485k4580K00581L92324l9463j25835
7053h97328o12721N5616L08959m2338Q13397L47115l26566o45423J09573o42030
7043a531746Q94982N67851j024589l06415Q32762R01275m22348l86599j16570
7034e91397j25555N52300l66728j47375n63890o46468N35759j24001J84033L30511
7024i62811j9175n43108K9817L18045j59150M30627K53814M34939P3205k92426
7014d36223Q5981n30K30549n481O5592m10055q89811O93497J3383n31052L21368
7003h62782R2768j254726q8458J071985P7767n53329R41499j65007L17642J59525
6993b63116k82319o28845m44819J51305j5480M06527J91163N70528j82105J15595
$$ plain form
6983 -381566 -84548 -876274 -493903 -765090 -395246 -543686 -1471298 -1563079 -1378409 -940492
6973 -940492 -908770 -1384205 -790854 -871263 -361069 -302193 -481750 -408123 -953003 -588382
6963 -588382 -559594 -961207 -1726409 -1262235 -1006946 -1565184 -1067476 -1109751 -1770042 -1050909
6953 -1050909 -889907 -914683 -1073975 -1380061 -856932 -817010 -1194611 -457915 -1105939 -591956
6943 -591956 5791 -450575 -1012740 -1286073 -1180426 -342744 -1021575 -923005 -382830 -347612
6933 -347612 -924449 -2092309 -2443415 -1761795 -977104 -489457 -1180839 -939226 -1408560 -1227646
6923 -1227646 -795970 -1615951 -2048191 -2804449 -1394065 -1663906 -1944922 -1656865 -1624140 -1132408
6913 -1132408 -963513 -1510017 -1455222 -1552102 -1555406 -1579359 -1994979 -1962773 -1553897 -1585791 -1159400
$$ packed form
6983c81566K97018p91726L82371k71187L69844j48440r27612r1781J84670M37917
6973i40492L1722m75435N93351q0409N10194N8876j79557P3627n44880L64621
6963e88382K8788m01613p65202M64174K55289n58238M97708m2275o60291P19133
6953a050909J61002k4776j59292l06086N23129L9922l77601P36696o48024N13983
6943e91956N97747m56366n62165k73333J05647Q37682o78831R8570N40175L5218
6933c47612n76837j167860l51106O81620P84691M87647o91382K41613m69334J80914
6923a227646M31676q19981m32240p56258J410384k69841k81016K88057L2725M91732
6913a132408J68895n46504N4795r6880l304k3953m15620L2206M08876l1894M26391
$$ plain form
6902 -1159400 -940898 -853793 -751845 -734434 -513765 -484154 -733020 -1411445 -1065184 -1191683
6892 -1191683 -1360865 -1152135 -946856 -1315649 -1004798 -1040244 -1479813 -220095 -667021 -1031143
6882 -1031143 -1504834 -1301612 -386904 -820714 -380350 -799157 -1411415 -1031347 -978055 -609946
6872 -609946 -197441 -1380295 -1651787 -859333 -530516 -858923 -944821 -1612858 -1204499 -174927
6862 -174927 -325921 -487593 -75549 -128618 -589666 -618610 -1073735 -1798292 -1612109 -810437
6852 -810437 -873106 -769196 -695832 -999195 -933766 -964021 -801539 -964976 -1282681 -539371
6842 -539371 -1131742 -1620969 -691638 -897934 -376615 -405083 -1024341 -385600 251105 399295
6832 399295 180758 -1082104 -1241331 -828929 -1395518 -549200 -103097 -499914 8828 -107877
$$ packed form
6902a159400K18502Q7105J01948J7411K20669K9611k48866o78425L46261j26499
6892a191683j69182K08730K05279l68793L10851l5446m39569J259718m46926l64122
6882a031143m73691K03222R14708m33810M40364m18807o12258L80068N3292L68109
6872f09946M12505j182854k71492P92454L28817l28407q5898o68037M08359J029572
6862a74927j50994j61672M12044n3069m61048k8944m55125p24557J86183Q01672
6852h10437o2669J03910P3364l03363O5429l0255J62482j63437l17705P43310
6842e39371n92371m89227R29331k06296N21319k8468o19258O38741O36705J48190
6832C99295k18537j262862j59227M12402n66589Q46318M46103l96817N08742j16705
$$ plain form
6822 -107877 -382893 -697838 -602289 -135639 -930749 -1051736 -41069 702450 321983 -149725
6812 -149725 -583967 275722 145489 -270183 -242759 -483049 -216429 -810735 -923575 -69246
6802 -69246 161038 95229 49072 442132 917170 317509 483545 740419 474366 1278285
6792 1278285 1137807 403363 -419394 -296137 399537 293240 296605 -41781 -110740 398884
6782 398884 772742 608755 336241 48578 -414955 -343249 -713689 -911141 -1153041 -673404
6772 -673404 -514105 -252547 -479695 -267375 -717468 -1048421 -1528435 -839715 -117779 124498
6762 124498 185111 483221 -49534 -358066 -148321 130561 -439330 -928655 -389003 67732
6752 67732 342505 -8028 718877 86825 -556050 -50161 111391 -499978 -794572 -1075449
$$ packed form
6822a07877k75016l14945R5549M66650p95110j20987J010667P43519l80467m71708
6812a49725m34242Q59689j30233m15672K7424k40290K66620n94306j12840Q54329
6802f9246K30284o5809m6157L93060M75038n99661J66036K56874k66053Q03919
6792A278285j40478p34444q22757J23257O95674j06297L365l38386o8959N09624
6782C98884L73858j63987k72514k87663m63533P1706l70440j97452k41900M79637
6772f73404J59299K61558k27148K12320m50093l30953m80014O88720P21936K42277
6762A24498O0613K98110n32755l08532K09745K78882n69891m89325N39652M56735
6752F7732K74773l50533P26905o32052o42875N05889J61552o11369k94594k80877
$$ plain form
6742 -1075449 -171091 95623 209234 -998274 -123010 432160 -64810 -521353 -84196
6733 -84196 -1312052 -789498 655906 251969 328141 134714 622028 447643 879868 1514682
6723 1514682 169081 -197398 509710 1783879 800691 852694 777530 225194 597177 1402163
6713 1402163 1580440 1574085 1539915 2181178 2518729 2161166 2372156 2172920 2897068 2581678
6703 2581678 2758704 2393638 3066498 3667117 3473692 3653308 4210655 4326838 3627944 3514451
6693 3514451 3601181 3699702 4343693 4061463 4359208 4102874 3275043 2266401 1775858 1345689
6683 1345689 973932 1122903 1243970 1470426 1550195 800994 1647612 2234626 1553688 1224338
6673 1224338 1099171 1388990 1373037 1771884 1249309 738720 566382 612656 606640 726905
$$ packed form
6742a075449R04358K66714J13611j207508Q75264N55170m96970m56543M37157
6733h4196j227856N22554J445404m03937P6172j93427M87314j74385M32225O34814
6723A514682j345601l66479P07108J274169r83188N2003p5164n52336L71983Q04986
6713A402163J78277o355l4170O41263L37551l57563K10990j99236P24148l15390
6703B581678J77026l65066O72860O00619j93425J79616N57347J16183o98894j13493
6693C514451Q6730R8521O43991k82230K97745k56334q27831j008642m90543m30169
6683A345689l71757J48971J21067K26456P9769p49201Q46618N87014o80938l29350
6673A224338j25167K89819j5953L98847n22575n10589j72338M6274o016J20265
$$ plain form
6663 726905 1279343 983855 1748569 1306809 1506017 898662 739701 466180 -386420 194057
6653 194057 896090 1804821 1497496 235326 102990 -570201 -319924 -23123 -163207 349632
6643 349632 227124 560842 477757 -29910 -231793 -272788 -200800 191762 375741 -404292
6633 -404292 -456845 -209451 -699458 -303262 146985 347257 32699 -162226 -6178 484642
6623 484642 -501067 89021 -1024974 -1091568 -337341 -50429 -168345 -200130 23898 -223830
6613 -223830 -197231 -113716 -27032 -235406 -288926 -805711 -1465461 -433155 -436244 -687685 -428655
6602 -428655 -390934 60190 468022 933720 1386583 1620930 1291498 726840 530243 588401
6592 588401 326080 109067 -318614 251847 -198230 178243 -45119 493773 534156 156233
$$ packed form
6663G26905N52438k95488P64714m41760J99208o07355j58961k73521q52600N80477
6653A94057P02033R08731l07325j262170j32336o73191K50277K96801j40084N12839
6643C49632j22508L33718q3085n07667k01883m0995P1988L92562J83979p80033
6633d04292n2553K47394m90007L96196M50247K00272l14558j94925J56048M90820
6623D84642r85709N90088j113995o6594P54227K86912j17916l1785K24028k47728
6613b23830K6599Q3515Q6684k08374n3520n16785o59750J032306l089k51441K59030
6602d28655L7721M51124M07832M65698M52863K34347l29432n64658j96597N8158
6592E88401k62321k17013m27681N70461m50077L76473k23362N38892M0383l77923
$$ plain form
6582 156233 109456 103578 -357058 189761 908598 959910 106545 -473115 456022 265631
6572 265631 347396 -298899 -19663 136014 -571110 -327895 291018 363588 705729 571434
6562 571434 1324598 1022563 1366991 971220 314131 530400 -207526 -307718 37249 -23269
6552 -23269 74463 54301 223220 1112671 544941 848704 1087666 1211044 1277678 1040587
6542 1040587 1091058 1615677 1374562 1772210 1521317 998152 1465736 1739383 2402962 2995065
6532 2995065 2738841 2282612 1992244 1910139 1561843 1908243 2972164 2465532 1944785 2296176
6522 2296176 2023438 1944474 1061699 830744 731414 1453973 1165148 178537 788182 1808702
6512 1808702 1396456 1289009 996704 653637 1439382 1652729 1274501 1289147 977396 1127043
$$ packed form
6582A56233m6777n878m60636N46819P18837N1312q53365n79660R29137j90391
6572B65631Q1765o46295K79236J55677p07124K43215O18913P2570L42141j34295
6562E71434P53164l02035L44428l95771o57089K16269p37926j00192L44967o0518
6552b3269R7732k0162J68919Q89451n67730L03763K38962J23378O6634k37091
6542A040587N0471N24619k41115L97648k50893n23165M67584K73647O63579N92103
6532B995065k56224m56229k90368q2105l48296L46400J063921n06632n20747L51391
6522B296176k72738p8964q82775k30955r9330P22559k88825r86611O09645J020520
6512A808702m12246j07447k92305l43067P85745K13347l78228J4646l11751J49647
$$ plain form
6502 1127043 1215500 1499354 1584705 1472632 1611648 833742 868068 1384775 1668504 1134704
6492 1134704 1513458 1934109 2319039 1966696 2251963 2765422 2896192 3461977 2772533 2480059
6482 2480059 2532416 2956231 2737940 2281720 2453552 1921052 2663961 2636575 3261101 3212698
6472 3212698 2647144 2626825 3153660 2478709 3434696 3855252 3716820 4250668 4490752 4113187
6462 4113187 4533214 5351869 5400292 5323062 5591927 6346706 6914775 7096799 7046578 7667245
6452 7667245 8768582 9319273 10433800 11454937 12055723 12262501 12714757 13168579 12848004
6443 12848004 12624962 12719978 12160821 11059572 11218511 10979727 10636588 9921174 8390595
6434 8390595 7090312 6797611 6289315 5504551 5390081 5293070 5051678 4278156 3627877 3385223
$$ packed form
6502A127043Q8457K83854Q5351j12073J39016p77906L4326N16707K83729n33800
6492A134704L78754M20651L84930l52343K85267N13459J30770N65785o89444k92474
6482B480059N2357M23815k18291m56220J71832n32500P42909k7386O24526m8403
6472C212698n65554k0319N26835o74951R55987M20556j38432N33848K40084l77565
6462D113187M20027Q18655M8423p7230K68865P54779N68069J82024n0221O20667
6452G667245J101337N50691J114527J021137O00786K06778M52256M53822l20575
6443A2848004k23042R5016n59157j101249J58939k38784l43139p15414j530579
6434H390595j300283k92701n08296p84764j14470r7011k41392p73522o50279k42654
$$ plain form
6424 3385223 3089198 2925985 3084610 3880812 3548939 3851716 3838394 3356617 3793653 3336118
6414 3336118 3096653 3407064 3284373 2962036 3619741 3728136 2903146 2930835 2433819 2781883
6404 2781883 3172107 3841379 3944607 3547120 3837522 4037284 4187601 3932440 3771106 4442548
6394 4442548 4400591 4703193 4257194 3438473 3166856 3515540 3527827 3211020 3190718 3724705
6384 3724705 3891459 3051787 3043412 3982101 3574553 3572601 3221254 3488626 3300311 3194509
6374 3194509 2725565 2796805 3786606 3583280 3144123 3744623 3994149 3637153 4029702 3463206
6364 3463206 2890314 3031386 3103905 1708697 2239746 2779588 2387681 3003674 2765375 2712143
6354 2712143 3042606 1974633 2457225 2382714 2284509 2187473 1838945 2591464 2685348 2759448
$$ packed form
6424C385223k96025j63213J58625P96202l31873L02777j3322m81777M37036m57535
6414C336118k39465L10411j22691l22337O57705J08395q24990K7689m97016L48064
6404B781883L90224O69272J03228l97487K90402J99762J50317k55161j61334O71442
6394D442548m1957L02602m45999q18721k71617L48684J2287l16807k0302N33987
6384C724705J66754q39672q375R38689m07548j952l51347K67372j88315j05802
6374C194509m68944P1240R89801k03326m39157O00500K49526l56996L92549n66496
6364C463206n72892J41072P2519j395208N31049N39842l91907O15993k38299n3232
6354B712143L30463j067973M82592p4511r8205r7036l48528P52519R3884P4100
$$ plain form
6344 2759448 2263017 1208059 1226061 1269818 1338088 1465042 1745082 1748437 1700923 2370983
6334 2370983 1932217 1706049 1748133 1761203 2126497 1671901 1725524 1219262 1170285 1665990
6324 1665990 965696 1281130 936791 626774 908935 771790 1254930 1612543 1191446 784294
6314 784294 2040562 1572492 1043192 1264721 531956 206065 606262 699881 1023540 1591854
6304 1591854 1920404 1546328 1196754 1335964 1682862 1553365 1002341 829813 1027665 314095
6294 314095 334072 960717 396951 156011 269790 1141391 915463 1214499 552596 180621
6284 180621 276116 223101 662126 962174 1300248 343479 920044 377846 32880 978909
6274 978909 81531 475790 600199 -219139 -69376 -543490 -309652 406454 -2406 -418861
$$ packed form
6344B759448m96431j054958J8002M3757O8270J26954K80040L355m7514O70060
6334B370983m38766k26168M2084J3070L65294m54596N3623n06262m8977M95705
6324A665990p00294L15434l44339l10017K82161j37145M83140L57613m21097m07152
6314G84294J256268m68070n29300K21529p32765l25891M00197R3619L23659N68314
6304A591854L28550l74076l49574J39210L46898j29497n51024j72528J97852p13570
6294C14095J9977O26645n63766k40940J13779Q71601k25928K99036o61903l71975
6284A80621R5495n3015M39025L00048L38074r56769N76565n42198l44966R46029
6274I78909q97378L94259J24409q19338J49763m74114K33838P16106m08860m16455
$$ plain form
6264 -418861 510952 449630 1256357 1361483 1196059 601120 -232404 -115425 275546 737733
6254 737733 354446 882744 706160 247962 -96962 17883 426871 461701 984184 691122
6244 691122 100575 836953 -202533 -274924 104948 381112 243880 873176 1469244 358056
6234 358056 51208 661973 468950 133995 568089 -15817 249661 872136 485806 90951
6224 90951 139159 -219331 -99563 95006 910270 539756 -590521 623658 1163035 -30699
6214 -30699 -174500 -543138 -537193 -517203 -842589 263596 462451 654696 592720 289203
6204 289203 -552216 -350500 44093 35572 -580353 -840470 -686558 -135327 -329813 -1020603
6194 -1020603 -842131 -585089 -61852 -115795 -371898 -211595 -243713 -597345 -893449 -265262
$$ packed form
6264d18861R29813o1322Q06727J05126j65424n94939q33524J16979L90971M62187
6254G37733l83287N28298j76584m58198l44924J14845M08988L4830N22483k93062
6244F91122n90547P36378j039486p2391L79872K76164j37232O29296N96068j111188
6234C58056l06848O10765j93023l34955M34094n83906K65478O22475l86330l94855
6224I0951M8208l58490J19768J94569Q15264l70514j130277J214179N39377j193734
6214c0699j43801l68638N945J9990l25386J106185J98855J92245o1976l03517
6204B89203q41419K01716L94593q521o15925k60117J53912N51231j94486o90790
6194a020603J78472K57042N23237n3943k56103J60303l2118l53632k96104O28187
$$ plain form
6184 -265262 -409904 -191867 411543 321042 704593 -48721 -487776 -188975 -381743 -286151
6174 -286151 271785 -19094 -503794 593940 810527 500447 853788 -172707 467822
6165 467822 934514 319486 -224805 -59625 184334 977825 507866 76329 -326874 -751905
6155 -751905 -475488 -109203 458109 748431 498618 -65408 98461 338782 464190 16183
6145 16183 27647 376154 77123 -666779 -704203 -202062 -650569 -898664 -367852 -561236
6135 -561236 -831729 -347978 -617532 -1213825 -1001577 -212111 606989 56861 -245888 -189610
6125 -189610 -394854 -48727 -63214 -181919 -343570 -584134 -1115427 -758674 -837639 3571
6115 3571 290569 -815791 -716114 -970096 -634945 -337117 -101477 38581 945917 -27653
$$ packed form
6184b65262j44642K18037O03410r0501L83551p53314m39055K98801j92768R5592
6174b86151N57936k90879m84700J097734K16587l10080L53341j026495O40529
6165D67822M66692o15028n44291J65180K43959P93491m69959m31537m03203m25031
6155g51905K76417L66285N67312K90322k49813n64026J63869K40321J25408m48007
6145A6183J1464L48507k99031p43902l7424N02141m48507k48095N30812j93384
6135e61236k70493M83751k69554n96293K12248P89466Q19100n50128l02749N6278
6125a89610k05244L46127j4487j18705j61651k40564n31293L56753p8965Q41210
6115C571K86998j106360R9677k53982L35151K97828K35640J40058R07336r73570
$$ plain form
6105 -27653 -167182 -382025 -170209 41977 20945 535026 -4496 114761 92531 785672
6095 785672 942929 1164906 1135604 145371 -332991 -582211 -726564 -151323 -43817 -154147
6085 -154147 115003 -157785 -975520 -1220052 -745231 -367331 -142945 102973 -410033 -284685
6075 -284685 -145607 -196063 -275955 -503926 -303224 68858 31663 183781 -190490 -690813
6065 -690813 -44721 -24999 -79001 -621677 -138588 -238291 -615028 -412463 -754651 -19228
6055 -19228 -667872 -1332835 -714669 -220828 -240412 -423745 -320652 279414 992898 63955
6045 63955 23732 -162024 -359954 236435 30960 -141024 -231459 -74242 -239549 168798
6035 168798 -7266 11568 75047 303908 -31194 625842 671742 700395 255679 -170031
$$ packed form
6105b7653j39529k14843K11816K12186k1032N14081n39522J19257k2230O93141
6095G85672J57257K21977k9302r90233m78362k49220j44353N75241J07506j10330
6085a54147K69150k72788q17735k44532M74821L77900K24386K45918n13006J25348
6075b84685J39078n0456p9892k27971K00702L72082l7195J52118l74271n00323
6065f90813O46092J9722n4002n42676M83089r9703l76737K02565l42188P35423
6055a9228o48644o64963O18166M93841j9584j83333J03093O00066P13484r28943
6045F3955m0223j85756j97930N96389k05475j71984r0435J57217j65307M08347
6035A68798j76064J8834O3479K28861l35102O57036M5900K8653m44716m25710
$$ plain form
6025 -170031 238082 206469 198153 -661004 -50625 1417618 981979 -775193 -155939 -226109
6015 -226109 495960 503380 468951 17293 -764076 -1051580 -1650709 -634200 -1140857 -1381779
6005 -1381779 -540856 -204055 -736413 -744764 248644 253528 -1022510 -791082 -334979 -283807
5995 -283807 1021405 249538 -105239 53765 209670 578880 -324772 -134003 1003877
5986 1003877 980011 407133 -72829 438437 749771 1154637 446863 -188332 154202 356130
5976 356130 1159234 319760 -613828 264552 87108 37800 -459445 37570 336549 572812
5966 572812 337022 521119 136897 -477674 -470498 -11183 941147 768383 1313216 1087575
5956 1087575 431987 -258700 693351 571179 612244 1466875 1247189 851609 1092023 763027
$$ packed form
6025a70031M08113l1613q316q59157O10379J468243m35639j757172O19254p0170
6015b26109P22069P420l4429m51658p81369k87504n99129J016509n06657k40922
6005a381779Q40923L36801n32358q351R93408M884j276038K31428M56103N1172
5995b83807J305212p71867l54777J59004J55905L69210r03652J90769J137880
5986A003877k3866n72878m79962N11266L11334M04866p07774o35195L42534K01928
5976C56130Q03104q39474r33588Q78380j77444m9308m97245M97015K98979K36263
5966E72812k35790J84097l84222o14571P176M59315R52330j72764N44833k25641
5956A087575o55588o90687R52051j22172M1065Q54631k19686l95580K40414l28996
$$ plain form
5946 763027 943915 1386592 2578614 1586541 995406 829956 906170 1060526 993211 308245
5936 308245 846093 671478 1242066 1547284 415373 589433 941187 678552 673959 628140
5926 628140 246453 -33141 523279 636556 1336212 1406182 1226398 1814537 1421487 1335622
5916 1335622 554401 941288 887143 1051404 319448 514815 1389046 1149138 866228 1621251
5906 1621251 1433812 779060 1104398 800832 1177738 1452671 854813 872545 836841 775875
5896 775875 784787 1241045 830721 1689632 1803707 2343948 2592970 1540471 714983 614615
5886 614615 1723652 1710699 1558833 1556496 1774842 2058107 1746937 1486456 1409465 1712240
5876 1712240 1448124 1523977 1018541 1388098 1165005 1318890 1592329 607774 498241 1828488
$$ packed form
5946G63027J80888M42677J192022r92073n91135j65450P6214J54356o7315o84966
5936C08245N37848j74615N70588L05218j131911J74060L51754k62635m593m5819
5926F28140l81687k79594N56420J13277O99656O9970j79784N88139l93050q5865
5916A335622p81221L86887n4145J64261p31956J95367Q74231k39908k82910P55023
5906A621251j87439o54752L25338l03566L76906K74933n97858J7732l5704o0966
5896G75875Q912M56258m10324Q58911J14075N40241K49022j052499q25488j00368
5886F14615J109037j2953j51866k337K18346K83265l11170k60481p6991L02775
5876A712240k64116P5853n05436L69557k23093J53885K73439r84555j09533J330247
$$ plain form
5866 1828488 1862837 1205117 2419289 1930557 1446123 2050612 2024063 884662 601542 467884
5856 467884 1117193 1269188 1320902 2144863 1332659 441922 340206 619046 1418174 1973631
5846 1973631 1700192 1388186 689006 1065194 910998 1059147 1330743 1593425 1492642 2077233
5836 2077233 2095292 981687 1512092 2338188 1988158 1475043 1702832 1351057 1595814 2106215
5826 2106215 1691185 2074445 1993494 1668220 1720681 2099502 2418159 1846000 1244308 959494
5816 959494 1437269 2149080 2084280 1680951 2295321 2052403 2120657 1435754 1744260 1600373
5806 1600373 1895741 1074792 1609876 2074711 1242371 1533415 1781460 908882 1122163 1391776
5796 1391776 1343197 1407757 2036664 2468590 1731764 1149267 1751827 1937749 1124670 1193129
$$ packed form
5866A828488L4349o57720J214172m88732m84434O04489k6549j139401k83120j33658
5856D67884O49309J51995N1714Q23961q12204q90737j01716K78840P99128N55457
5846A973631k73439l12006o99180L76188j54196J48149K71596K62682j00783N84591
5836B077233J8059j113605N30405Q26096l50030n13115K27789l51775K44757N10401
5826B106215m15030L83260q0951l25274N2461L78821L18657n72159o01692k84814
5816I59494M77775P11811o4800m03329O14370k42918O8254o84903L08506j43887
5806A600373K95368q20949N35084M64835q32340K91044K48045q72578K13281K69613
5796A391776m8579O4560O28907M31926p36826n82497O02560J85922q13079O8459
$$ plain form
5786 1193129 1313761 1587657 1234313 1047244 1391267 2275534 1481066 1727163 2560096 2525107
5776 2525107 2320724 1692278 2006324 1863661 1965843 1599540 1399534 2745114 2266779
5767 2266779 738948 870526 1913245 1523545 1295149 1499443 1210591 978751 1044967
5758 1044967 916961 1101554 755916 1044449 1649423 2199197 1814804 1752684 1962696 2038968
5748 2038968 1557261 1365883 1087787 1322902 771212 464460 827113 1292058 1121757 1666905
5738 1666905 1596576 856371 1221573 347448 958160 1791540 1752965 1043845 1363460 2185311
5728 2185311 2242346 1637269 2176595 2363262 2174433 1615209 1756840 1561114 1262514 978768
5718 978768 1349411 1587591 2102876 1849622 1488911 1549799 1209108 1426766 655272 1506098
$$ packed form
5786A193129J20632K73896l53344j87069L44023Q84267p94468K46097Q32933l4989
5776B525107k04383o28446L14046j42663J02182l66303k00006J345580m78335
5767B266779j527831J31578J042719l89700k28396K04294k88852k31840O6216
5758A044967j28006J84593l45638K88533O04974N49774l84393o2120K10012P6272
5748B038968m81707j91378k78096K35115n51690l06752L62653M64945j70301N45148
5738A666905p0329p40205L65202q74125O10712Q33380l8575p09120L19615Q21851
5728B185311N7035o05077N39326J86667j88829n59224J41631j95726k98600k83746
5718I78768L70643K38180N15285k53254l60711O0888l40691K17658p71494Q50826
$$ plain form
5708 1506098 1079396 910256 670530 -35394 869515 1429302 1485637 1824596 1268483 1311723
5698 1311723 1700742 2165206 2259518 1533812 2244609 2056393 1908600 1097853 898539 2090220
5688 2090220 1932500 1552802 2259367 2095861 1797602 1795802 1944084 1813741 2395420 1149352
5678 1149352 501678 1053301 1014629 454211 768164 1115650 1374045 1827150 2492312 2318228
5668 2318228 1115335 2131895 2441288 3251229 3050424 2603491 2113249 2138003 2207169 2150308
5658 2150308 2543444 2487966 2165869 2535572 2881320 3359951 2928208 2886334 2320141 2355192
5648 2355192 2541706 2621571 2107470 2201742 2167213 2286501 3060159 2929416 2285075 2059579
5638 2059579 2644169 2759448 3168278 3322829 3214523 2585674 2623945 3092278 2847734 2623593
$$ packed form
5708A506098m26702j69140k39726p05924R04909N59787N6335L38959n56113M3240
5698A311723L89019M64464R4312p25706P10797j88216j47793q10747j99314J191681
5688B090220j57720l79698P06565j63506k98259j800J48282j30343N81679j246068
5678A149352o47674N51623l8672n60418L13953L47486K58395M53105O65162j74084
5668B318228j202893J016560L09393Q09941k00805m46933m90242K4754O9166n6861
5658B150308L93136n5478l22097L69703L45748M78631m31743m1874n66193L5051
5648B355192J86514P9865n14101R4272l4529J19288P73658j30743o44341k25496
5638B059579N84590J15279M08830J54551j08306o28849L8271M68333k44544k24141
$$ plain form
5628 2623593 3214239 2511143 3058119 3326821 2905403 2613264 2430493 1794861 2676110 3566284
5618 3566284 3224578 4095594 4017259 3898963 3376042 3482212 3754349 3372088 3175298 3809316
5608 3809316 4073248 3502864 3715880 3204316 3724419 4501086 4023628 4687538 4349513 4397210
5598 4397210 4649061 4186328 4481528 4477070 4197082 4080109 3551596 3456800 3945455 3862519
5588 3862519 4277951 4805040 3999789 4665645 4807231 4372760 3467388 4032009 4998679 4447121
5578 4447121 3965419 3924759 4343832 4157832 4401890 4038138 4202561 3831299 3771439 4618883
5568 4618883 4784766 4760822 4531737 4823540 4821291 4616969 4677825 4274993 4664656 4934820
5558 4934820 5194760 6542968 6614913 6149984 6009158 5136321 4548881 4150140 4745781 5420888
$$ packed form
5628B623593N90646p03096N46976K68702m21418k92139j82771o35632Q81249Q90174
5618C566284l41706Q71016p8335j18296n22921J06170K72137l82261j96790O34018
5608C809316K63932n70384K13016n11564N20103P76667m77458O63910l38025M7697
5598D397210K51851m62733K95200m458k79988j16973n28513r4796M88655q2936
5588C862519M15432N27089q05251O65856J41586m34471r05372N64621R66670n51558
5578D447121m81702m0660M19073j86000K44058l63752J64423l71262n9860Q47444
5568D618883J65883k3944k29085K91803k249k04322O0856m02832L89663K70164
5558D934820K59940J348208P1945m64929j40826q72837n87440l98741N95641O75107
$$ plain form
5548 5420888 6470835 6451998 6296425 6116225 5955144 5740425 5604919 5455815 6118816 6486995
5538 6486995 5604629 5185922 5780540 6218372 6789480 6581838 5876954 6017259 6006415 6028294
5528 6028294 6953366 6755510 7962295 7756815 7401567 7604450 7317375 7011971 7557580
5519 7557580 7739517 7820846 8303580 8250517 8846206 8267734 7323880 7524737 7761418 6532442
5509 6532442 5863972 5458614 5683415 5769651 6099760 5645268 6249455 6297271 5369220 5309431
5499 5309431 5314306 5363914 6114085 6530676 6065531 5741629 6285369 6195669 5830556 7004447
5489 7004447 7668363 8220169 8666876 8641805 9165991 9274428 8871284 8903134 8446583 8215924
5479 8215924 8756412 8421839 8097247 8175389 7805069 6669266 6976735 6876290 6317054 6193341
$$ packed form
5548E420888J049947j8837j55573j80200j61081k14719j35506j49104O63001L68179
5538F486995q82366m18707N94618M37832N71108k07642p04884J40305j0844K1879
5528F028294R25072j97856J206785k05480l55248K02883k87075l05404N45609
5519G557580J81937Q1329M82734n3063N95689n78472r43854K00857K36681j228976
5509F532442o68470m05358K24801Q6236L30109m54492O04187M7816r28051n9789
5499E309431M875M9608P50171M16591m65145l23902N43740q9700l65113J173891
5489G004447O63916N51806M46707k5071N24186J08437m03144L1850m56551k30659
5479H215924N40488l34573l24592P8142l70320j135803L07469j00445n59236j23713
$$ plain form
5469 6193341 5961986 5765679 6360516 6526870 6536118 6746039 7251121 7063494 7130361 7966680
5459 7966680 8112179 8379430 7744148 7792787 8376770 7417351 8769633 8790847 8952841 8457013
5449 8457013 7608217 6971760 7379494 7081990 7132320 7339493 6138808 6158038 5942332 6265679
5439 6265679 6983969 7446891 6375649 5616188 5828224 6198115 6415019 6207443 5912477
5430 5912477 5574681 6067387 6026966 5851875 6149837 6797568 6973083 6027627 6146651 6015290
5420 6015290 5588472 6409176 7111013 6930215 6077626 5971202 6492897 5356848 4816057
5411 4816057 5176811 5896342 5700895 6045067 5814975 5390024 5009035 5561391 5488582 5722133
5401 5722133 6226442 6007400 5651330 6081027 5828131 4815908 5042944 5646155 6427237
$$ packed form
5469F193341k31355j96307N94837J66354R248K09921N05082j87627O6867Q36319
5459G966680J45499K67251o35282M8639N83983r59419J352282K1214J61994m95828
5449H457013q48796o36457M07734k97504N0330K07173j200685J9230k15706L23347
5439F265679P18290M62922j071242p59461K12036L69891K16904k07576k94966
5430E912477l37796M92706m0421j75091K97962O47731J75515r45456J19024j31361
5420F015290m26818Q20704P01837j80798q52589j06424N21695j136049n40791
5411D816057L60754P19531j95447L44172k30092m24951l80989N52356p2809K33551
5401E722133N04309k19042l56070M29697k52896j012223K27036O03211P81082
$$ plain form
5392 6427237 6389012 5346246 4880178 4695404 4933283 4977488 5514553 6285028 6222790 6425336
5382 6425336 6198002 5263167 5479885 5698102 6148014 5918315 5662990 6451696 6441709 6451667
5372 6451667 7157442 6579219 5861063 4999385 4748397 5453106 5857446 5123062 5483163 5462763
5362 5462763 6614014 7322721 6753918 6497063 5826278 5224629 5509086 6292254 6819005
5353 6819005 7113561 6896383 7058944 6990552 6818473 6110442 7364639 7630080 8302202 7724339
5343 7724339 7076079 8286701 8141670 7607939 8017905 8520421 8755599 8478568 8061996
5334 8061996 7794948 7622418 7775885 8782727 9208972 8937705 9294890 9662477 10099052
5325 10099052 9896488 9531979 10255423 9708105 9582578 10638381 11003409 10531010 10676683
$$ packed form
5392F427237l8225j042766m66068j84774K37879M4205N37065P70475o2238K02546
5382F425336k27334r34835K16718K18217M49912k29699k55325P88706r987R958
5372F451667P05775n78223p18156q61678k50988P04709M04340p34384L60101k0400
5362E462763J151251P08707n68803k56855o70785o01649K84457P83168N26751
5353F819005K94556k17178J62561o8392j72079p08031J254197K65441O72122n77863
5343G724339o48260J210622j45031n33731M09966N02516K35178k77031m16572
5334H061996k67048j72530J53467J006842M26245k71267L57185L67587M36575
5325A0099052k02564l64509P23444n47318j25527J055803L65028m72399J45673
$$ plain form
5316 10676683 10564736 11372007 10700084 10910459 11470709 11382128 11667188 11543966 12237651 11409362
5306 11409362 10931734 11550741 11854348 12977541 13097946 12139159 11763088 12100056 12721768
5297 12721768 12454698 12615109 12933578 13140363 13370838 13524589 14001181 13966048 14260735 14182203
5287 14182203 14229736 14483397 15482001 16761615 16101339 16602014 15864321 15625808 16208678
5278 16208678 15187411 14443516 14509613 14180656 14016897 13744421 14504808 14458296 14301697 14862924
5268 14862924 14110251 14723587 14551065 14197460 13864899 13824278 14764301 15157804 15243551 16083170
5258 16083170 15517164 15775685 15617715 15619876 15817114 15314408 16519901 16900182 17061793 16598638
5248 16598638 15907077 15975877 15947711 14681984 14479161 14480039 13988541 13767945 14063436 13403838
$$ packed form
5316A0676683j11947Q07271o71923K10375N60250q8581K85060j23222O93685q28289
5306A1409362m77628O19007L03607J123193J20405r58787l76071L36968O21712
5297A2721768k67070J60411L18469K06785K30475J53751M76592l5133K94687p8532
5287A4182203M7533K53661R98604J279614o60276N00675p37693k38513N82870
5278A6208678j021267p43895O6097l28957j63759k72476P60387m6512j56599N61227
5268A4862924p52673O13336j72522l53605l32561m0621R40023L93503Q5747Q39619
5258A6083170n66006K58521j57970K161J97238n02706J205493L80281J61611m63155
5248A6598638o91561O8800k8166j265727k02823Q78m91498k20596K95491o59598
$$ plain form
5238 13403838 12602306 12150587 12382041 12638840 12714101 12780372 12330726 13152414 13492833 13633287
5228 13633287 13382956 13948079 14502060 14745084 14403368 13948427 14485737 14817860 14784609 14597307
5218 14597307 15199307 15313351 15118787 15619843 16803515 17121754 17184224 17713757 18215704
5209 18215704 18638355 19931104 20868269 22092032 21807612 21753112 20956987 20032971 18474496
5200 18474496 17896423 17539473 16224452 15972608 15886468 15261060 15157708 15538328 15651285
5191 15651285 15352243 15134902 15066848 15206429 15880785 16287312 16630406 16325224 16314801 15621940
5181 15621940 15759791 15722235 14867120 14179784 13976447 13440402 12597616 11728950 11468026 11780503
5171 11780503 11797616 11357237 11215234 10412587 9994497 10250136 10287831 10513936 10589635 9870150
$$ packed form
5238A3403838q01532m51719K31454K56799P5261O6271m49646Q21688L40419J40454
5228A3633287k50331N65123N53981K43024l41716m54941N37310L32123l3251j87302
5218A4597307O02000J14044j94564N01056J183672L18239O2470N29533N01947
5209A8215704M22651J292749R37165J223763k84420n4500p96125r24016j558475
5200A8474496n78073l56950j315021k51844q6140o25408j03352L80620J12957
5191A5651285k99042k17341o8054J39581O74356M06527L43094l05182j0423o92861
5181A5621940J37851l7556q55115o87336k03337n36045q42786q68666k60924L12477
5171A1780503J7113m40379j42003q02647m18090K55639L7695K26105P5699p19485
$$ plain form
5161 9870150 10103925 9638952 9056723 9115056 10077435 10017011 9873606 9074404 9051988 9655367
5151 9655367 9311655 9298999 9348517 9750663 9271256 8558036 8844085 10580252 10048237 9066577
5141 9066577 9026818 9641164 10361759 9729255 9308599 9344759 9456388 9251650 9388246 9655735
5131 9655735 10139760 10352354 10237161 9734884 10036284 10009675 10650352 10929893 10507263 10567176
5121 10567176 10780363 11795961 11624953 11344863 11845734 11515011 12535405 12585620 11909288
5112 11909288 12604697 13307746 13152900 13670359 14017150 14196686 14989985 15390141 14367430
5103 14367430 14144233 14626550 14858741 14336757 14301899 15209282 15461275 14924133 12842026
5094 12842026 13482567 14465057 14196888 14236172 14177807 14668177 15874298 15796912 15620854 16608170
$$ packed form
5161I870150K33775m64973n82229N8333R62379o0424j43405p99202k2416O03379
5151I655367l43712j2656M9518M02146m79407p13220K86049J736167n32015r81660
5141I066577l9759O14346P20595o32504m20656L6160J11629k04738J36596K67489
5131I655735M84025K12594j15193n02277L01400k6609O40677K79541m22630N9913
5121A0567176K13187J015598j71008k80090N00871l30723J020394N0215o76332
5112A1909288O95409P03049j54846N17459L46791J79536P93299M00156j022711
5103A4367430k23197M82317K32191n21984l4858R07383K51993n37142k082107
5094A2842026O40541R82490k68169L9284n8365M90370J206121p7386j76058R87316
$$ plain form
5084 16608170 17271448 17008859 16962493 16982885 17286184 17013574 18008134 18641788 18704103 17922557
5074 17922557 17793710 18144658 17827627 18022614 18136914 17089953 17275530 16970441 16739371
5065 16739371 16807741 16374282 15516339 15252613 15374763 15866931 15216368 15000310 14499872 14846525
5055 14846525 15804216 15732444 15402990 16151926 17429608 16954365 17268744 17046787 16738735
5046 16738735 17114870 17458037 17956283 17809487 17684712 17552098 18294697 18711569 19233721
5037 19233721 19188539 19225163 18788933 18491074 19186947 19225903 19471523 19471051 18964206 18736666
5027 18736666 19434749 19935780 19333293 18842567 19337542 18895290 18404678 18055514 18797131
5018 18797131 18997435 18536380 17588804 18218938 19068351 19003535 18583100 18854038 18594588 18339929
$$ packed form
5084A6608170O63278k62589m6366K0392L03299k72610R94560O33654O2315p81546
5074A7922557j28847L50948l17031J94987J14300j046961J85577l05089k31070
5065A6739371O8370m33459q57943k63726J22150M92168o50563k16058n00438L46653
5055A4846525R57691p1772l29454P48936J277682m75243L14379k21957l08052
5046A6738735L76135L43167M98246j46796j24775j32614P42599M16872N22152
5037A9233721m5182L6624m36230k97859O95873L8956K45620m72n06845k27540
5027A8736666O98083N01031o02487m90726M94975m42252m90612l49164P41617
5018A8797131K00304m61055r47576O30134Q49413o4816m20435K70938k59450k54659
$$ plain form
5008 18339929 17925168 17205149 16835838 17663993 17388086 16455932 17125773 17442705 16958311
4999 16958311 16675753 16777824 16920725 17266547 17893101 17373115 16797026 17110082 16435840
4990 16435840 15918830 17298423 18376868 18144148 17519616 17610514 18012282 18453771 17761315
4981 17761315 18230219 18507460 17968197 17793278 18272591 18117078 18733585 18738561 18974058 19761801
4971 19761801 19835251 19464809 19435433 20052194 20210879 20091549 20384613 20789378 21369258 22191494
4961 22191494 22877861 22442511 22245242 22830424 22941293 23478704 23147497 23325232 24431064
4952 24431064 24767857 24714156 24750182 24501105 25449354 25743496 26398525 27715343 27835430 28239039
4942 28239039 28757424 29203379 29256590 29983884 31147047 30818820 31137684 31600207 32307125
$$ packed form
5008A8339929m14761p20019l69311Q28155k75907r32154O69841L16932m84394
4999A6958311k82558J02071J42901L45822O26554n19986n76089L13056o74242
4990A6435840n17010J379593J078445k32720o24532R0898M01768M41489o92456
4981A7761315M68904K77241n39263j74919M79313j55513O16507M976K35497P87743
4971A9761801P3450l70442k9376O16761J58685j19330K93064M04765N79880Q22236
4961B2191494O86367m35350j97269N85182J10869N37411l31207J77735J105832
4952B4431064L36793n3701L6026k49077R48249K94142O55029J316818J20087M03609
4942B8239039N18385M45955N3211P27294J163163l28227L18864M62523P06918
$$ plain form
4933 32307125 33213521 33759586 35308742 37273319 38607191 40453816 40867517 41711710 43919777
4924 43919777 46274537 49368029 52767280 56559889 60077725 63425125 67537140 71525580
4916 71525580 75477731 80753777 85709199 89549966 91556224 89609180 86699475 81714644
4908 81714644 78396712 75831780 73235333 70804002 68479409 66722819 64980929 64020072
4900 64020072 63273432 62005940 60981242 59620641 57327426 56039584 55251016 54916331 54778598
4891 54778598 54866914 55463323 56779108 57343128 57406187 58338429 59063568 60496291 61858266
4882 61858266 63246473 64311675 65968779 68135346 69973526 71974424 74338920 76458541
4874 76458541 79097089 82020175 85652687 89696873 93502129 97560144 101273522 104735953
$$ packed form
4933C2307125R06396N46065J549156J964577J333872J846625M13701Q44193K208067
4924D3919777K354760L093492L399251L792609L517836L347400M112015L988440
4916G1525580L952151N276046M955422L840767K006258j947044k909705m984831
4908H1714644l317932k564932k596447k431331k324593j756590j741890r60857
4900F4020072p46640j267492j024698j360601k293215j287842p88568l34685j37733
4891E4778598Q8316N96409J315785N64020O3059R32242P25139J432723J361975
4882F1858266J388207J065202J657104K166567J838180K000898K364496K119621
4874G6458541K638548K923086L632512M044186L805256M058015L713378L462431
$$ plain form
4866 104735953 104728679 100512267 95167489 91585260 89006985 85927970 84824028 83858870 82141162
4857 82141162 81531281 81443292 80971103 80589640 81169115 80841396 81346962 82883537 84045019
4848 84045019 85220295 86549689 87661910 89499892 91318042 92404672 93866957 95096932
4840 95096932 96785619 99392082 101600642 103871235 105611237 107020165 108790240 110929642
4832 110929642 112402667 115432361 119347659 122926780 127174266 131495963 133766038 134644112
4824 134644112 136302753 139554086 143014616 146504133 150651196 155068125 160083796 162677164
4816 162677164 164970027 167835813 171774986 176561499 181566545 187625433 194316999 201709990
4808 201709990 209908517 219356946 229494218 241551231 254265516 267026169 278946232
$$ packed form
4866A04735953p274m216412n344778l582229k578275l079015j103942r65158j717708
4857H2141162o09881q7989m72189l81463N79475l27719N05566J536575J161482
4848H4045019J175276J329394J112221J837982J818150J086630J462285J229975
4840I5096932J688687K606463K208560K270593J740002J408928J770075K139402
4832A10929642J473025L029694L915298L579121M247486M321697K270075Q78074
4824A34644112J658641L251333L460530L489517M147063M416929N015671K593368
4816A62677164K292863K865786L939173M786513N005046O058888O691566P392991
4808B01709990Q198527R448429J0137272J2057013J2714285J2760653J1920063
$$ plain form
4801 278946232 288493158 296868931 304920967 314486956 324621565 335481642 347277342 362024769
4793 362024769 378902049 395682789 412921901 426706855 436450809 440956656 444525922
4786 444525922 444869802 441830622 435691911 427693816 419562400 410164292 399240115 388741918
4778 388741918 376752059 363210984 349825760 336761142 323148729 309690566 297548488
4771 297548488 285247887 272999814 261699670 250993394 241969736 231916299 221425401
4764 221425401 210965439 200408328 191141874 182201567 174734052 167573467 162302993 157594225
4756 157594225 152441229 147781605 144373881 140800616 137549941 134469042 131228147 128993597
4748 128993597 126973270 124868991 122805401 121771949 121104484 120210608 118486277 117743151
$$ packed form
4801B78946232R546926Q375773Q052036R565989J0134609J0860077J1795700J4747427
4793C62024769J6877280J6780740J7239112J3784954R743954M505847L569266
4786D44525922L43880l039180o138711p998095q131416r398108j0924177j0498197
4778C88741918j1989859j3541075j3385224j3064618j3612413j3458163j2142078
4771B97548488j2300601j2248073j1300144j0706276r023658j0053437j0490898
4764B21425401j0459962j0557111r266454q940307p467515p160585n270474m708768
4756A57594225n152996m659624l407724l573265l250675l080899l240895k234550
4748A28993597k020327k104279k063590j033452o67465q93876j724331p43126
$$ plain form
4740 117743151 117901546 116270299 115113701 114640439 114240838 114123576 114236951 114614859 115375567
4731 115375567 115333368 116666268 118215676 119894898 122240419 124666834 127098241 130417085
4723 130417085 133923400 137787053 140446213 144113358 147580315 151603578 154999917 156882597
4715 156882597 157833518 157069146 154793461 151000698 146916958 143264849 140752609 139567246
4707 139567246 137794557 137331388 136547866 136086682 136516900 136661414 137447419 138303810 138977301
4698 138977301 138979151 140026974 141357641 141704029 140929548 141015268 140853531 140147625 139121185
4689 139121185 137812850 136790098 135739164 134090841 132561319 131240447 128784450 126920623
4681 126920623 124672496 122882108 121866415 119804972 117982096 116407497 113245531 110758607
$$ packed form
4740A17743151J58395j631247j156598m73262l99601j17262J13375L77908P60708
4731A15375567m2199J332900J549408J679222K345521K426415K431407L318844
4723A30417085L506315L863653K659160L667145L466957M023263L396339J882680
4715A56882597R50921p64372k275685l792763m083740l652109k512240j185363
4707A39567246j772689m63169p83522m61184M30218J44514P86005Q56391O73491
4698A38977301J850J047823J330667L46388p74481Q5720j61737p05906j026440
4689A39121185j308335j022752j050934j648323j529522j320872k455997j863827
4681A26920623k248127j790388j015693k061443j822876j574599l161966k486924
$$ plain form
4673 110758607 109239600 106260641 102710145 100087724 97818338 94941839 92376553 89765864
4665 89765864 87075034 84702519 82528786 79943252 77949138 76051057 74391114 72602615
4657 72602615 70476174 69170773 67134878 65444947 64542903 63444638 62949685 62491310 61301000
4648 61301000 58984327 57654471 57391073 56656764 54861755 53675821 51934151 50765967
4640 50765967 49741150 48902083 48377160 46660267 46011134 45945840 45411040 44605858 43274563
4631 43274563 43418691 42227855 41813691 41572978 41569339 39831492 39360387 39437168 38555273 37824178
4621 37824178 37255207 36963730 36784343 36277134 36261583 35197998 35160858 35760510 35506426 35105949
4611 35105949 34688618 35053750 34505594 34513287 34308559 34194484 34092326 34078721 33636698 34306878
$$ packed form
4673A10758607j519007k978959l550496k622421k269386k876499k565286k610689
4665H9765864k690830k372515k173733k585534j994114j898081j659943j788499
4657G2602615k126441j305401k035895j689931r02044j098265m94953m58375j190310
4648F1301000k316673j329856k63398p34309j795009j185934j741670j168184
4640E0765967j024817q39067n24923j716893o49133o5294n34800q05182j331295
4631D3274563J44128j190836m14164k40713l639j737847m71105P6781q81895p31095
4621C7824178n68971k91477j79387n07209j5551j063585l7140N99652k54084m00477
4611C5105949m17331L65132n48156P693k04728j14075j02158j3605m42023O70180
$$ plain form
4601 34306878 34051068 34032561 34311431 34781255 35143885 35217740 35779567 35557286 35094938 35717542
4591 35717542 36224796 34766940 33434584 33525427 32607147 30662365 29255702 28111543 27314690
4582 27314690 26403178 25614529 25432914 24420660 23591511 24275279 26046022 25714546 25437321
4573 25437321 25068825 24680098 24306006 24075473 23685169 23179407 22485314 21782330 20624808
4564 20624808 20465911 19427933 18776697 18360668 18586214 18341393 18230320 17993222 17636997
4555 17636997 17927819 17672365 17378399 17972725 18068415 17368776 16818679 16642818 15518076
4546 15518076 15087595 15686105 15967979 15208837 14896761 15139337 14671076 13809024 14516507
4537 14516507 14944418 14383458 15888232 16023642 15522248 14824230 14218639 13963139 13726102
$$ packed form
4601C4306878k55810j8507K78870M69824L62630P3855N61827k22281m62348O22604
4591C5717542N07254j457856j332356R0843r18280j944782j406663j144159p96853
4582B7314690r11512p88649j81615j012254q29149O83768J770743l31476k77225
4573B5437321l68496l88727l74092k30533l90304n05762o94093p02984j157522
4564B0624808j58897j037978o51236m16029K25546k44821j11073k37098l56225
4555A7636997K90822k55454k93966N94326R5690o99639n50097j75861j124742
4546A5518076m30481N98510K81874p59142l12076K42576m68261q62052P07483
4537A4516507M27911n60960J504774J35410n01394o98018o05591k55500k37037
$$ plain form
4528 13726102 13113648 13705974 13769133 14137685 13793156 14890373 15301686 14164642 14626950
4519 14626950 15243130 14940832 15111861 14807009 14755434 14810481 14727840 14750229 14580457 14180911
4509 14180911 14101522 14706474 14607840 13904931 13177002 13138219 13271332 12438902 12310270 12488364
4499 12488364 12807305 12593771 13271679 13332045 13386590 12610916 12212887 11912260 12217936 12201898
4489 12201898 12397759 12607037 12574194 12491358 11599840 11651476 11478203 10995983 11088000 10609333
4479 10609333 10089484 10209468 10026694 9946165 9905359 10063326 9438583 9263924 9573092 8954432
4469 8954432 8361275 9215187 9155089 9189090 9209815 8993483 8253808 8485245 7853765 7042257
4459 7042257 7505280 7241123 7388016 7549559 8045361 7985701 8086500 8292263 7691640 7806956
$$ packed form
4528A3726102o12454N92326O3159L68552l44529J097217M11313j137044M62308
4519A4626950O16180l02298J71029l04852n1575N5047q2641K2389j69772l99546
4509A4180911p9389O04952r8634p02909p27929l8783J33113q32430j28632J78094
4499A2488364L18941k13534O77908O0366N4545p75674l98029l00627L05676j6038
4489A2201898J95861K09278l2843q2836q91518N1636j73273m82220R2017m78667
4479A0609333n19849J19984j82774q0529m0806J57967o24743j74659L09168o18660
4469H954432n93157Q53912o0098L4001K0725k16332p39675K31437o31480q11508
4459G042257M63023k64157J46893J61543M95802n9660J00799K05763o00623J15316
$$ plain form
4449 7806956 7815065 7452515 7515798 7931610 7311669 7195240 7725432 7124146 7082145 8328642
4439 8328642 7720855 6906409 7889180 7939699 8456981 8145193 7348966 7398891 6862547 7303712
4429 7303712 7243327 8409943 8111510 7953913 8063903 7607982 7465116 7685487 7843297 8102678
4419 8102678 7738921 7368848 7848245 7892154 7723005 7634797 7894014 6850602 6679559 6562511
4409 6562511 7095799 7309171 6913466 6792751 7050938 6738031 6602210 6462515 5625577 6117325
4399 6117325 6826356 6455731 6020564 6679424 6536487 5888616 5753868 6296238 6007175 6202020
4389 6202020 6240812 5796255 6603575 6599864 6796380 6478995 5684232 5539280 6076121 7540121
4379 7540121 7147272 7178521 7155198 7232507 7733947 7604922 7525504 7065123 7231205 7610425
$$ packed form
4449G806956Q109l62550O3283M15812o19941j16429N30192o01286m2001J246497
4439H328642o07787q14446R82771N0519N17282l11788p96227M9925n36344M41165
4429G303712o0385J166616k98433j57597J09990m55921j42866K20371J57810K59381
4419H102678l63757l70073M79397M3909j69149q8208K59217j043412j71043j17048
4409F562511N33288K13372l95705j20715K58187l12907j35821j39695q36938M91748
4399F117325P09031l70625m35167O58860j42937o47871j34748N42370k89063J94845
4389F202020L8792m44557Q07320l711J96516l17385p94763j44952N36841J464000
4379G540121l92849L1249k3323P7309N01440j29025p9418m60381J66082L79220
$$ plain form
4369 7610425 7194988 8032256 8503957 8083930 7532054 8564475 8654884 7914197 7636628 7893974
4359 7893974 8612740 9255970 8882882 8527968 8723347 8573138 9160978 8544549 8407738 8051275
4349 8051275 7789071 8174739 7917841 7380853 7890534 8228716 8201964 7532714 7859512 8259475
4339 8259475 8069668 8304144 7080164 6172819 6906422 7482128 8059502 8005534 7864452 7655297
4329 7655297 7329133 6989109 6505062 6608700 6255335 7356280 7386814 6135132 6398163
4320 6398163 6527480 6678155 5837532 6059674 6159058 5840582 6047637 6089283 6668080 6083547
4310 6083547 5124350 5449369 5225825 4710861 4694132 5382942 4770222 4508544 4969408 4293570
4300 4293570 4262582 4407532 3234598 3235107 2786458 2970802 2687927 3798941 3597175 2804038
$$ packed form
4369G610425m15437Q37268M71701m20027n51876J032421R0409p40687k77569K57346
4359G893974P18766O43230l73088l54914J95379j50209N87840o16429j36811l56463
4349H051275k62204L85668k56898n36988N09681L38182k6752o69250L26798L99963
4339H259475j89807K34476j223980r07345P33603N75706N77374n3968j41082k09155
4329G655297l26164l40024m84047J03638l53365J100945L0534j251682K63031
4320F398163J29317J50675q40623K22142R9384l18476K07055M1646N78797n84533
4310F083547r59197L25019k23544n14964j6729O88810o12720k61678M60864o75838
4300D293570l0988J44950j172934N09m48649J84344k82875J111014k01766p93137
$$ plain form
4290 2804038 3130038 3191780 3478921 3550829 3489426 2988356 2694999 2067681 2218999 2509296
4280 2509296 2828488 3710014 3248840 2446475 2088267 2402353 3074035 3592687 3004228 2900030
4270 2900030 3070533 3071348 3217574 3087009 2409527 2485767 2877952 2679317 3173733 2434046
4260 2434046 1735738 1673960 1116382 1429426 2173960 2073506 3219046 3078602 3428841 3053850
4250 3053850 2859803 2636040 2441679 2622089 3025599 2241729 1296438 1293236 1753268 1538333
4240 1538333 1429569 1748753 1606381 1469257 1347239 1723126 1580688 1353062 1628819 1583375
4230 1583375 1714751 1235559 1569648 2362541 2919835 2485665 1716374 609915 890911
4221 890911 850079 1556435 1759650 1496717 1605558 1655126 1802743 1761661 1783556 2131784
$$ packed form
4290B804038L26000O1742K87141P1908o1403n01070k93357o27318J51318K90297
4280B509296L19192Q81526m61174q02365l58208L14086O71682N18652n88459j04198
4270B900030J70503Q15J46226j30565o77482P6240L92185j98635M94416p39687
4260B434046o98308o1778n57578L13044P44534j00454J145540j40444L50239l74991
4250C053850j94047k23763j94361J80410M03510p83870r45291l202M60032k14935
4240A538333j08764L19184j42372j37124j22018L75887j42438k27626K75757m5444
4230A583375J31376m79192L34089P92893N57294m34170p69291j106459K80996
4221H90911m0832P06356K03215k62933J08841M9568J47617m1082K1895L48228
$$ plain form
4211 2131784 2047245 1353161 1101708 1381141 1885778 1276839 1278731 942033 1036554 1620897
4201 1620897 1819905 1136199 785109 1230013 1003909 1304173 2251575 2230393 2257904 2171721
4191 2171721 1306380 999154 1154791 1411105 2491740 2217943 1684175 1355707 1586224
4182 1586224 2253131 1863191 937371 1134729 1091505 1404790 1936346 1940092 2068530 2002204
4172 2002204 1773940 737921 319452 1306486 1481660 819868 376664 447675 856337 612200
4162 612200 566000 567465 739136 1176533 1442834 1629775 1785652 1847386 1719575 1323791
4152 1323791 1110433 1682263 1469465 1574901 2048169 2431181 2878529 2209913 1479959 1057383
4142 1057383 1490582 1184274 719555 1239702 2033796 2260335 1125424 1532267 1865806
$$ packed form
4211B131784q4539o94084k51453K79433N04637o08939J892l36698R4521N84343
4201A620897J99008o83706l51090M44904k26104L00264R47402k1182K7511q6183
4191B171721q65341l07226J55637K56314J080635k73797n33768l28468K30517
4182A586224O66907l89940r25820J97358m3224L13285N31556L746J28438o6326
4172B002204k28264j036019m18469R87034J75174o61792m43204P1011M08662k44137
4162F12200m6200J465J71671M37397K66301J86941J55877O1734j27811l95784
4152A323791k13358N71830k12798J05436M73268L83012M47348o68616p29954m22576
4142A057383M33199l06308m64719N20147P94094K26539j134911M06843L33539
$$ plain form
4133 1865806 1820391 1806739 1688336 1677487 1641275 1562581 1715087 2308709 1741546 1426916
4123 1426916 1322647 1263255 1685876 1562933 1829299 1633566 2053321 2589630 1818250 2279428
4113 2279428 2829064 2995541 3648418 3607020 4697433 5808272 5956539 6097968 6727009
4104 6727009 8250854 9800312 9685976 11211772 13068603 14530432 16480769 16308386 13696052
4095 13696052 10866820 8437974 7111985 6380606 4896672 4154742 4318992 4296367 3812601
4086 3812601 3230187 2781329 2389812 3047815 2875050 2477543 1785283 1548796 1563948 1633852
4076 1633852 1455246 1328752 963611 799688 1022914 1141650 1498168 1259904 2137782 3159521
4066 3159521 1602274 1461463 2821597 2782494 3334110 2835061 2649314 2220410 1495975
$$ packed form
4133A865806m5415j3652j18403j0849l6212p8694J52506N93622n67163l14630
4123A426916j04269n9392M22621j22943K66366j95733M19755N36309p71380M61178
4113B279428N49636J66477O52877m1398J090413J110839J48267J41429O29041
4104F727009J523845J549458j14336J525796J856831J461829J950337j72383k612334
4095A3696052k829232k428846j325989p31379j483934p41930J64250k2625m83766
4086C812601n82414m48858l91517O58003j72765l97507o92260k36487J5152O9904
4076A633852j78606j26494l65141j63923K23226J18736L56518k38264Q77878J021739
4066C159521j557247j40811J360134l9103N51616m99049j85747m28904p24435
$$ plain form
4057 1495975 819636 1478782 1318470 756056 622445 1311559 1907429 1451650 1419335 1459595
4047 1459595 802198 1529001 1281048 1248594 1274251 1241643 1129295 1099685 1181089 1324029
4037 1324029 1657301 2060222 2479116 1768539 1705769 2198976 2781461 2724783 2049236 2204471
4027 2204471 1567884 1808238 1829575 1590781 1651465 1681494 1884367 2318734 1845248 1737158
4017 1737158 2125117 1665872 1533317 1728005 2257243 2657275 2480898 1919233 2149522 1366490
4007 1366490 942130 876878 659937 1531228 1377794 1856356 2362942 1444943 1408809 1864314
3997 1864314 1261140 1016491 1607874 1276164 1331082 1931662 2222421 1967702 2309427 2408004
3987 2408004 2563809 2848946 3203189 1845148 1507490 2265318 1951717 2108732 1843730
$$ packed form
4057A495975o76339O59146j60312n62414j33611O89114N95870m55779l2315M0260
4047A459595o57397P26803k47953l2454K5657l2608j12348k9610Q1404J42940
4037A324029L33272M02921M18894p10577o2770M93207N82485n6678o75547J55235
4027B204471o36587K40354K1337k38794O0684L0029K02873M34367m73486j08090
4017A737158L87959m59245j32555J94688N29238M00032j76377n61665K30289p83032
4007A366490m24360o5252k16941Q71291j53434M78562N06586r17999l6134M55505
3997A864314o03174k44649N91383l31710N4918O00580K90759k54719L41725R8577
3987B408004J55805K85137L54243j358041l37658P57828l13601J57015k65002
$$ plain form
3978 1843730 2054554 1614818 481061 1168759 1422513 1232405 1369665 1380660 1624994 2100051
3968 2100051 1342052 813812 927894 1086634 781576 1300397 878505 217467 889434 336142
3958 336142 1035507 1949178 1820497 1436511 831963 955964 886940 648052 1087104 1469418
3948 1469418 1099380 685490 754153 221748 -201483 -105995 -170865 553685 1256463 1984981
3938 1984981 1009122 401628 913105 1149269 1081147 1432014 1301180 559914 862972 1067198
3928 1067198 1173728 1525938 1355704 1034825 1454933 657843 472775 742564 1376401 1428622
3918 1428622 756782 945128 1238276 744318 338383 787079 701386 1111835 1518910 1241950
3908 1241950 753030 502123 470701 968870 935438 1059450 1125895 1203098 680965 1500012
$$ packed form
3978A843730K10824m39736j133757O87698K53754j90108J37260J0995K44334M75057
3968B100051p57999n28240J14082J58740l05058N18821m21892o61038O71967n53292
3958C36142O99365R13671j28681l83986o04548J24001o9024k38888M39052L82314
3948A469418l70038m13890O8663n32405m23231R5488o4870P24550P02778P28518
3938A984981r75859o07494N11477K36164o8122L50867j30834p41266L03058K04226
3928A067198J06530L52210j70234l20879M20108p97090j85068K69789O33837N2221
3918A428622o71840J88346K93148m93958m05935M48696q5693M10449M07075k76960
3908A241950m88920k50907l1422M98169l3432J24012O6445P7203n22133Q19047
$$ plain form
3898 1500012 2663804 1777503 1088667 1006565 467899 424776 935126 410623 586574 1024587
3888 1024587 842890 1610318 1810318 912012 1332395 547556 1011320 1183808 658883 1079955
3878 1079955 1093096 1456642 1938250 1320444 1386331 974342 933394 944606 1011216 2428504
3868 2428504 2785530 2563888 2920360 1599096 1906406 1304050 833315 1236280 1271580 1933227
3858 1933227 2082618 1692691 1625129 1496521 1206586 1925919 1581063 1096775 1659594 1653996
3848 1653996 1504166 1174741 1486219 1829816 1418935 1497419 1248212 1519037 1615656 1534744
3838 1534744 1913187 2085940 1264890 1372578 1542678 1759206 1409461 2025061 2331281 2854157
3828 2854157 2701309 2922124 2727967 3085321 3081517 2612012 2220699 1454180 2429641 2495815
$$ packed form
3898A500012J163792q86301o88836q2102n38666m3123N10350n24503J75951M38013
3888A024587j81697P67428K00000q98306M20383p84839M63764J72488n24925M21072
3878A079955J3141L63546M81608o17806O5887m11989m0948J1212O6610J417288
3868B428504L57026k21642L56472j321264L07310o02356m70735M02965L5300O61647
3858A933227J49391l89927o7562j28608k89935P19333l44856m84288N62819n598
3848A653996j49830l29425L11478L43597m10881P8484k49207K70825R6619q0912
3838A534744L78443J72753q21050J07688J70100K16528l49745O15600L06220N22876
3828B854157j52848K20815j94157L57354l804m69505l91313p66519R75461O6174
$$ plain form
3818 2495815 2773235 2460401 2057041 2540122 2836086 2653334 2410026 2613931 3110019 3262673
3808 3262673 3074358 3214295 3457094 2735173 2055446 2167781 1663202 1682975 2045715 1781323
3798 1781323 1697498 2243093 2616916 2490880 1672842 1526575 1177715 863510 1549803 1681325
3788 1681325 1173578 1004742 1726260 1076738 576087 1223594 1870022 1855038 2143345 2183667
3778 2183667 1966925 1300877 1022712 1491792 1639694 1556028 1183669 1396485 565280 869708
3768 869708 1605589 1756664 1861318 1752437 1115949 1037583 689855 917840 872397 925046
3758 925046 1356364 1536836 1293686 292701 704807 816803 468866 911868 872848 900516
3748 900516 776958 810300 638731 221670 524764 482217 1339730 976027 387979 127394
$$ packed form
3818B495815K77420l12834m03360M83081K95964j82752k43308K03905M96088J52654
3808C262673j88315J39937K42799p21921o79727J12335n04579J9773L62740k64392
3798A781323q3825N45595L73823j26036q18038j46267l48860l14205O86293J31522
3788A681325n07747j68836P21518o49522n00651O47507O46428j4984K88307M0322
3778B183667k16742o66048k78165M69080J47902q3666l72359K12816q31205L04428
3768H69708P35881J51075J04654j08881o36488p8366l47728K27985m5443N2649
3758I25046M31318J80472k43150j000985M12106J11996l47937M43002l9020K7668
3748I00516j23558L3342j71569m17061L03094m2547Q57513l63703n88048k60585
$$ plain form
3738 127394 262134 549638 866404 1447947 1792468 688572 351722 868474 977580 770240
3728 770240 774239 1301816 823143 362506 819599 641775 17179 319 160924 786759
3718 786759 1332954 1350122 1720059 1631765 1217670 1055952 747238 -21904 536257 22827
3708 22827 987582 1104736 1110882 285251 575195 2129338 1674957 828232 656279 895328
3698 895328 433600 880240 843405 481394 522783 1127544 1410888 1728819 1534274 1357432
3688 1357432 1031044 287200 315858 581320 638728 1049321 1118261 1144434 546550 847108
3678 847108 1639474 1268752 604884 1238767 916128 1022896 824785 1410904 1530235 1321289
3668 1321289 542869 -25026 -234121 131019 818100 -219634 420013 1469452 1447999
$$ packed form
3738A27394J34740K87504L16766N81543L44521j103896l36850N16752J09106k07340
3728G70240L999N27577m78673m60637M57093j77824o24596j6860J60605O25835
3718G86759N46195J7168L69937q8294m14095j61718l08714p69142N58161n13430
3708B2827R64755J17154O146q25631K89944J554143m54381q46725j71953K39049
3698H95328m61728M46640l6835l62011M1389O04761K83344L17931j94545j76842
3688A357432l26388p43844K8658K65462N7408M10593O8940K6173n97884L00558
3678H47108P92366l70722o63868O33883l22639J06768j98111N86119J19331k08946
3668A321289p78420n67895k09095L65140O87081j037734O39647J049439k1453
$$ plain form
3659 1447999 1154966 1304221 638316 417186 1325083 635516 241192 564979 961540 1869848
3649 1869848 1235847 441789 1148723 1218786 233483 145048 136093 143840 1397479 1399181 791868
3638 791868 1135622 392805 966109 1154071 324840 309030 1052893 1789777 65480 -234490
3628 -234490 575667 -298552 -268561 517460 876296 1112185 786897 301056 185783 450875
3618 450875 734563 1238588 1471664 1163609 907429 1419799 1169632 -55040 -707071 -555971
3608 -555971 -418624 6229 -430396 8153 351814 190746 -173095 -13498 320769 231090
3598 231090 553890 398109 432555 639125 505097 451310 894104 140259 258599 -603174
3588 -603174 -142628 856489 736731 509781 -106521 265169 505113 86202 556225 -113049
$$ packed form
3659A447999k93033J49255o65905k21130R07897o89567l94324L23787L96561R08308
3649A869848o34001p94058P06934P0063r85303q8435q955P747J253639J702o07313
3638G91868L43754p42817N73304J87962q29231j5810P43863P36884j724297k99970
3628b34490Q10157q74219K9991P86021L58836K35889l25288m85841j15273K65092
3618D50875K83688N04025K33076l08055k56180N12370k50167j224672o52031J51100
3608e55971J37347M24853m36625M38549L43661j61068l63841J59597L34267q9679
3598B31090L22800j55781L4446K06570j34028n3787M42794p53845J18340q61773
3588f03174M60546R99117j19758k26950o16302L71690K39944m18911M70023o69274
$$ plain form
3578 -113049 -109768 268725 891377 490027 218569 696174 10077 -726332 -393686 -140403
3568 -140403 -116464 309296 359326 562920 242086 656297 763994 80496 446392 622772
3558 622772 1170722 1180045 1221009 1913150 1690348 384471 -227736 691325 615144 15961
3548 15961 -67411 653884 663032 707311 304008 -288083 -320170 -172816 969779 1219360 1124294
3537 1124294 1517106 1741072 1571934 1628572 1597325 1433518 449957 -113699 760743 472565
3527 472565 302932 -434878 171873 479402 469933 390504 -107655 178997 9373 12269 22155
3516 22155 -483004 146660 713366 894651 302472 -14993 590419 550241 304475 -10195
3506 -10195 172228 1215773 1246080 335127 836177 1280351 796857 943580 1024429 371236
$$ packed form
3578a13049L281L78493O22652m01350k71458M77605o86097p36409L32646K53283
3568a40403K3939M25760N0030K03594l20834M14211J07697o83498L65896J76380
3558F22772N47950R323M0964O92141k22802j305877o12207R19061p6181n99183
3548A5961q3372P21295R148M4279m03303n92091l2087J47354J142595K49581r5066
3537A124294L92812K23966j69138N6638l1247j63807r83561n63656Q74442k88178
3527D72565j69633p37810O06751L07529r469p9429m98159K86652j69624K896R886
3516B2155n05159O29664N66706J81285n92179l17465O05412m0178k45766l14670
3506a0195J82423J043545L0307r10953N01050M44174m83494J46723Q0849o53193
$$ plain form
3496 371236 381046 -140309 -274546 570394 978932 981108 854023 621198 651673 287393 141611
3485 141611 382614 469115 1238516 918745 1078897 1245173 899242 -27238 539753 301526
3475 301526 1108640 945625 566508 1363545 1733180 1378704 1114614 810389 472320 268153
3465 268153 142904 579618 659091 420445 72086 -243333 -354226 8281 -447121 161141
3455 161141 -573056 -399178 370597 1222223 1070752 1012818 992248 889163 846066 1277315
3445 1277315 738210 498089 -430663 -391220 -312787 898202 1275596 1529281 1387679 684893
3435 684893 1278064 1379280 763142 387124 200040 -235066 -189075 559501 572636 1077838
3425 1077838 1594254 1395079 1484384 1152094 1036451 888596 936586 1194930 1379349 1310994
$$ packed form
3496C71236R810n21355j34237Q44940M08538K176j27085k32825L0475l64280j45782
3485A41611K41003Q6501P69401l19771J60152J66276l45931r26480N66991k38227
3475C01526Q07114j63015l79117P97037L69635l54476k64090l04225l38069k04167
3465B68153j25249M36714P9473k38646l48359l15419j10893L62507m55402O08262
3455A61141p34197J73878P69775Q51626j51471n7934k0570j03085m3097M31249
3445A277315n39105k40121r28752L9443P8433J210989L77394K53685j41602p02786
3435F84893N93171J01216o16138l76018j87084m35106M5991P48576J3135N05202
3425A077838N16416j99175Q9305l32290j15643j47855M7990K58344J84419o8355
$$ plain form
3415 1310994 559875 448534 1012426 1340344 1278385 1385560 2331757 1759188 1558670 2085612
3405 2085612 2741779 2379921 2405254 2046003 2677422 3544164 3703385 2919121 3840361 4022404
3395 4022404 3875222 4648738 4427150 4446795 3933905 3813444 3632700 3395751 3402711 3222936
3385 3222936 3681126 3518851 2749123 2916521 4009228 3597035 2584337 3339845 3612360
3376 3612360 3628405 5075080 4932362 4154026 4995089 4491504 4855920 4998205 5062456 5674769
3366 5674769 6633869 5881426 5597820 6392876 5658224 6665266 7120165 6773255 6919877
3357 6919877 7113160 5971162 6143981 5805160 5655325 5016087 4432931 4359049 3989293 3361539
3347 3361539 3859899 4069577 4102860 5140740 5494888 5626423 4408996 4402107 4543304 5030900
$$ packed form
3415A310994p51119j11341N63892L27918o1959J07175R46197n72569k00518N26942
3405B085612O56167l61858K5333l59251O31419Q66742J59221p84264R21240J82043
3395D022404j47182P73516k21588J9645n12890j20461j80744k36949O960j79775
3385C222936M58190j62275p69728J67398J092707m12193j012698P55508K72515
3376C612360J6045J446675j42718p78336Q41063n03585L64416J42285O4251O12313
3366E674769R59100p52443k83606P95056p34652J007042M54899l46910J46622
3357F919877J93283j141998J72819l38821j49835o39238n83156p3882l69756o27754
3347C361539M98360K09678L3283J037880L54148J31535j217427o889J41197M87596
$$ plain form
3337 5030900 5115926 5170112 5319379 4762387 5219651 5982751 6244433 5627531 5472983 5378232
3327 5378232 5784892 5751479 6374585 6205301 5884925 5351905 6186944 6022723 5296741 5751940
3317 5751940 6197385 5913056 5781282 5097137 4918930 6269088 6517476 6406876 6215948
3308 6215948 5617726 5556525 5513842 4677568 5296089 4835798 5928353 6430535 7125596 7171678
3298 7171678 6955109 6973558 7324565 8109788 7672796 8345316 8166378 8319274 9528068 9451123
3288 9451123 10114613 9883771 11135844 11946434 12456978 13824085 14690958 15209962 16058708
3279 16058708 15685742 16074742 15522679 16504606 16904870 16978872 17312482 17605821 19137574
3270 19137574 19530173 20193486 21290524 22406558 21787975 21313210 21378432 21003255 20463341
$$ packed form
3337E030900Q5026N4186J49267n56992M57264P63100K61682o16902j54548r4751
3327E378232M06660l3413O23106j69284l20376n33020Q35039j64221p25982M55199
3317E751940M45445k84329j31774o84145j78207J350158K48388j10600j90928
3308F215948n98222o1201m2683q36274O18521m60291J092555N02182O95061M6082
3298G171678k16569J8449L51007P85223m36992O72520j78938J52896J208794p6945
3288I451123O63490k30842J252073Q10590N10544J367107Q66873N19004Q48746
3279A6058708l72966L89000n52063R81927M00264P4002L33610K93339J531753
3270A9137574L92599O63313J097038J116034o18583m74765O5222l75177n39914
$$ plain form
3261 20463341 20055897 19986263 20104306 19168718 20287619 21183807 21919283 22967103 23881952
3252 23881952 24995030 26582961 27484930 27587840 27195200 26293989 25940646 24473575 23091797
3243 23091797 22229318 21641677 21236601 21184498 19989307 19116770 18828748 18574876 18820084
3234 18820084 17859504 17830425 17597237 17899346 17273036 17454902 18373211 18285970 18875443 19571380
3224 19571380 20145040 21761765 22396035 23053080 24463286 25766793 27454914 28255101 28586303
3215 28586303 27884571 26354915 25864426 24653649 22849034 21358082 20352111 19362978 18277994
3206 18277994 17656381 16539441 16764437 16234273 16374849 15577391 14380565 13550418 12576516
3197 12576516 12965471 12367873 12885260 13188164 13004532 13848788 13642040 13873753 13884092 13748617
$$ packed form
3261B0463341m07444o9634J18043r35588J118901Q96188P35476J047820R14849
3252B3881952J113078J587931R01969J02910l92640r01211l53343j467071j381778
3243B3091797q62479n87641m05076n2103j195191q72537k88022k53872K45208
3234A8820084r60580k9079k33188L02109o26310J81866R18309q7241N89473O95937
3224A9571380N73660J616725O34270O57045J410206J303507J688121Q00187L31202
3215B8586303p01732j529656m90489j210777j804615j490952j005971r89133j084984
3206A8277994o21613j116940K24996n30164J40576p97458j196826q30147r73902
3197A2576516L88955n97598N17387L02904j83632Q44256k06748K31713J0339j35475
$$ plain form
3187 13748617 13509218 13985116 14432117 14498566 13898963 13382583 12767546 12544916 11338924
3178 11338924 10381077 10068548 9286554 9564045 9151666 8556837 8466856 8063318 7130070 5667433
3168 5667433 5409232 5766054 6049250 5884451 5105696 5551227 5548443 5322797 4411717 4478677
3158 4478677 4485861 4236947 3984627 3816128 3598069 4300416 3702588 3505892 3752904 3801821
3148 3801821 3845775 3833016 2571884 1872373 2584125 2312470 1984309 2241532 2381269 1659147
3138 1659147 2047767 2660957 2136391 1964141 2287063 2442917 2070964 1850002 2033706 2270907
3128 2270907 2400567 1895538 1241943 946049 921184 1330343 1300973 1107504 2084759 1500550
3118 1500550 580892 1231221 1247100 1499802 1882313 1512574 1353477 701661 1490247 1506632
$$ packed form
3187A3748617k39399M75898M47001O6449n99603n16380o15037k22630j205992
3178A1338924r57847l12529p81994K77491m12379n94829q9981m03538r33248j462637
3168E667433k58201L56822K83196j64799p78755M45531k784k25646r11080O6960
3158D478677P184k48914k52320j68499k18059P02347n97828j96696K47012M8917
3148C801821M3954j2759j261132o99511P11752k71655l28161K57223J39737p22122
3138A659147L88620O13190n24566j72250L22922J55854l71953k20962J83704K37201
3128B270907J29660n05029o53595k95894k4865M09159k9370j93469R77255n84209
3118A500550r19658O50329J5879K52702L82511l69739j59097o51816P88586J6385
$$ plain form
3108 1506632 1064936 1092305 1564844 1804806 501062 1430537 1844604 1356996 107535
3099 107535 22527 -47659 294953 1048959 1704740 1204076 1249588 846483 126019 754144
3089 754144 6123 82190 310729 608720 -31530 -31796 207407 822758 473730 348057
3079 348057 758343 776329 183290 -366645 554914 371664 85508 309473 -662163 -440843
3069 -440843 -991628 -972075 -124161 -950246 -1024701 -707360 -937949 -306158 -361501 -641636
3059 -641636 -433666 -666200 361648 -78609 -994667 -1531074 -1174702 -447692 -575809 -504806
3049 -504806 225591 147955 -293293 -455452 -1113765 -163012 43756 -371060 -291887 -352871
3039 -352871 -353059 -110047 -293098 101186 42915 -171757 -211695 -315700 658327 877455 -32747
$$ packed form
3108A506632m41696K7369M72539K39962j303744R29475M14067m87608j249461
3099A07535q5008p0186L42612P54006O55781n00664M5512m03105p20464O28125
3089G54144p48021P6067K28539K97991o40250k66K39203O15351l49028j25673
3079C48057M10286J7986n93039n49935R21559j83250k86156K23965r71636K21320
3069d40843n50785J9553Q47914q26085p4455L17341k30589O31791n5343k80135
3059f41636K07970k32534J027848m40257r16058n36407L56372P27010j28117P1003
3049e04806P30397p7636m41248j62159o58313R50753K06768m14816P9173o0984
3039c52871j88K43012j83051L94284n8271k14672l9938j04005R74027K19128r10202
$$ plain form
3028 -32747 77344 202225 125185 -824446 -1198190 -775624 -1005670 -725821 -153879 -269259
3018 -269259 -859453 -229081 -433876 -534658 -352808 -1691938 -1381843 -1144672 -361139 35355
3008 35355 -278798 -295450 -482321 -680845 173506 131544 -188545 319100 385058 -253101
2998 -253101 -598652 -1144977 -1303303 -893409 -589861 -332554 -446095 -578575 -476417 -508745
2988 -508745 118614 -57222 -558956 -283710 -247366 -932135 -1160835 -516758 -506564 -119788
2978 -119788 7915 52235 -314449 -465621 -525106 -230950 222336 441061 376260 94009
2968 94009 179841 -297715 -949936 -502477 77262 -414398 340381 855446 241527 597752
2958 597752 403149 465845 29258 86841 964788 814047 650507 1066798 998876 1474581
$$ packed form
3028c2747J10091J24881p7040r49631l73744M22566k30046K79849N71942j15380
3018b69259n90194O30372k04795j00782J81850j339130L10095K37171P83533L96494
3008C5355l14153j6652j86871j98524Q54351m1962l20089N07645O5958o38159
2998b53101l45551n46325j58326M09894L03548K57307j13541j32480J02158l2328
2988e08745O27359j75836n01734K75246L6344o84769k28700O44077J0194L86776
2978a19788J27703M4320l66684j51172n9485K94156M53286K18725o4801k82251
2968I4009Q5832m77556o52221M47459N79739m91660P54779N15065o13919L56225
2958E97752j94603O2696m36587N7583Q77947j50741j63540M16291o7922M75705
$$ plain form
2948 1474581 1192447 610193 490031 970129 236726 326803 415484 1241135 655884 902665
2938 902665 406570 768847 1668586 1209878 1970623 938858 914902 1131050 1068145 1423879
2928 1423879 1365369 1243333 1571221 1808189 1635229 1982216 1449613 1462506 1284999 1172059
2918 1172059 900912 908128 771164 1411277 1453882 1287418 1403121 1382463 1356646 862648
2908 862648 1075675 976600 558436 802049 1377515 1956879 2090523 1611948 1803829 2400934
2898 2400934 2374656 1486764 1452126 2061912 1235679 1179543 1338423 1694273 1121854 764982
2888 764982 1989140 2116675 1458596 1245392 1163654 1358264 1155928 616595 1464160 935165
2878 935165 815351 1037903 968521 1152245 1132443 862956 1508729 726835 1030076 788801
$$ packed form
2948A474581k82134n82254j20162M80098p33403R0077Q8681Q25651n85251K46781
2938I02665m96095L62277Q99739m58708P60745j031765k3956K16148o2905L55734
2928A423879n8510j22036L27888K36968j72960L46987n32603J2893j77507j12940
2918A172059k71147P216j36964O40113M2605j66464J15703k0658k5817m93998
2908H62648K13027r9075m18164K43613N75466N79364J33644m78575J91881N97105
2898B400934k6278q87892l4638O09786q26233n6136J58880L55850n72419l56872
2888G64982J224158J27535o58079k13204q1738J94610k02336n39333Q47565n28995
2878I35165j19814K22552o9382J83724j9802k69487O45773p81894L03241k41275
$$ plain form
2868 788801 130717 -247786 454335 637194 217232 -129014 -443124 262896 131143 -769381
2858 -769381 -99797 74089 307848 -201934 -373124 -350571 434181 -7203 -169566 -615002
2848 -615002 -411665 -35721 -458120 616812 -881396 -885314 -352170 -211603 -719374 -1230784
2838 -1230784 -458439 -711025 -437752 -448986 -406610 -837463 -534355 -497767 -985787 -819937
2828 -819937 -885586 -516131 -745502 -1169209 -1377588 -1563809 -1573887 -932774 -501444 -388796
2818 -388796 -1555590 -1596502 -663777 -581322 -1613693 -1180854 -1171473 -1031295 -1007152 -1293586
2808 -1293586 -1418546 -1475985 -1023390 -1245790 -556476 -573455 -395503 -157739 -107212 -708319
2798 -708319 -912280 -385988 -698906 -1312601 -1997113 -2021247 -1232799 -1137896 -1841926 -1851798
$$ packed form
2868G88801o58084l78503P02121J82859m19962l46246l14110P06020j31753r00524
2858g69381O69584J73886K33759n09782j71190K2553P84752m41384j62363m45436
2848f15002K03337L75944m22399J074932j498208l918N33144J40567n07771n11410
2838a230784P72345k52586K73273j1234M2376m30853L03108L6588m88020J65850
2828h19937o5649L69455k29371m23707k08379j86221j0078O41113M31330J12648
2818c88796j166794m0912R32725Q2455j032371M32839R381J40178K4143k86434
2808a293586j24960n7439M52595k22400O89314j6979J77952K37764N0527o01107
2798g08319k03961N26292l12918o13695o84512k4134P88448R4903p04030r872
$$ plain form
2788 -1851798 -1139490 -843728 -606180 -1156828 -1285649 -1089937 -988400 -1178925 -1412130 -1204608
2778 -1204608 -1515206 -1587019 -579712 -667349 -737011 -379649 -959549 -1230390 -1167069 -757851
2768 -757851 -1309137 -1593444 -1262145 -945466 -1602219 -1501393 -602440 -786037 -443821 -661319
2758 -661319 -1383534 -393894 -274351 -821932 -1080004 -1609307 -1100658 -652694 -674178 -1048734
2748 -1048734 -1361979 -1527372 -1022741 -782411 -1667615 -1377120 40696 -471046 -1620866
2739 -1620866 -1384475 -498217 -1112033 -1060222 -1637813 -1698362 -1794555 -1900067 -1221905 -1908708
2729 -1908708 -1109959 -351330 -240372 -1232464 -1055501 -1272599 -1073569 -1384151 -1189923 -1248781
2719 -1248781 -2274308 -1864095 -1062229 -1443005 -622246 -847002 -679711 -1241424 -714549
$$ packed form
2788a851798P12308K95762K37548n50648j28821J95712J01537j90525k33205K07522
2778a204608l10598p1813J007307q7637o9662L57362n79900k70841O3321M09218
2768g57851n51286k84307L31299L16679o56753J00826Q98953j83597L42216k17498
2758f61319p22215R89640J19543n47581k58072n29303N08649M47964k1484l74556
2748a048734l13245j65393N04631K40330q85204K90495J417816n11742j149820
2739a620866K36391Q86258o13816N1811n77591o0549r6193j05512O78162o86803
2729a908708P98749P58629J10958r92092J76963k17098J99030l10582J94228n8858
2719a248781j025527M10213Q01866l80776Q20759k24756J67291n61713N26875
$$ plain form
2710 -714549 -765242 -814033 -1986034 -1748154 -1000726 -444906 -979221 -1800569 -1221575 -1131364
2700 -1131364 -1740698 -1805387 -1387171 -1563151 -1699632 -2075958 -1680176 -1724410 -1869307 -1763883
2690 -1763883 -1532441 -1529344 -1544210 -1752142 -1630376 -1165366 -1299746 -1157740 -988150 -1696321
2680 -1696321 -1130236 -595990 -350249 -730212 -975218 -1484721 -1661277 -1046834 -401793 -1000101
2670 -1000101 -1653932 -1822566 -1725536 -1192042 -652819 -952058 -1211585 -1880930 -1286695 -1285302
2660 -1285302 -1602190 -1546880 -2198707 -2031044 -1104043 -1020867 -1089632 -1360767 -1746840 -1145721
2650 -1145721 68095 120818 -4350 -441545 -740701 -918102 -590197 -550995 -851541 -1001043
2640 -1001043 -595112 -747886 -1036545 -1780227 -1622146 -1051262 -1169999 -1001329 -647741 -871946
$$ packed form
2710g14549n0693m8791j172001K37880P47428N55820n34315q21348N78994R0211
2700a131364o09334o4689M18216j75980j36481l76326L95782m4234j44897J05424
2690a763883K31442L097j4866k07932J21766M65010j34380J42006J69590p08171
2680a696321N66085N34246K45741l79963k45006n09503j76556O14443O45041n98308
2670a000101o53831j68634R7030N33494N39223k99239k59527o69345N94235J393
2660a285302l16888N5310o51827J67663R27001Q3176o8765k71135l86073O01119
2650a145721J213816N2723j25168m37195k99156j77401L27905L9202l00546j49502
2640a001043M05931j52774k88659p43682J58081N70884j18737J68670L53588k24205
$$ plain form
2630 -871946 -310751 -811880 -503436 -201383 -308781 -259313 165338 -940572 -820866 -252157
2620 -252157 609093 129191 8026 -5022 -363442 -452963 -785245 -527112 -1068544 -1059544
2610 -1059544 -1292564 -603348 52829 -351324 -613447 -919520 -834453 -212704 -487487 -170261
2600 -170261 -813992 -829063 -400195 -1080664 -2168067 -1839212 -970733 -1131093 -927256 -471932
2590 -471932 -1367611 -642151 -1115470 -1764016 -1939446 -1921192 -1098808 -730252 -616535 -554957
2580 -554957 -1399118 -1126304 -838705 -672171 -885643 -1213436 -669075 -1100943 -1045586 -527008
2570 -527008 -1117868 -1178469 -526026 -644055 -1586371 -1581312 -1145279 -1716385 -1928293 -1346088
2560 -1346088 -1217142 -611173 -1001881 -1926889 -1784659 -1727686 -1937350 -1169953 -1139403 -1430276
$$ packed form
2630h71946N61195n01129L08444L02053j07398M9468M24651j105910J19706N68709
2620b52157Q61250m79902j21165j3048l58420q9521l32282K58133n41432R000
2610a059544k33020O89216O56177m04153k62123l06073Q5067O21749k74783L17226
2600a70261o43731j5071M28868o80469j087403L28855Q68479j60360K03837M55324
2590d71932q95679P25460m73319o48546j75430J8254Q22384L68556J13717O1578
2580e54957q44161K72814K87599J66534k13472l27793N44361m31868N5357N18578
2570e27008n90860o0601O52443j18029r42316N059M36033n71106k11908N82205
2560a346088J28946O05969l90708r25008J42230N6973k09664P67397L0550k90873
$$ plain form
2550 -1430276 -2012884 -1741192 -997296 -956447 -941531 -961278 -602816 -879542 -927345 -1383864
2540 -1383864 -1319597 -892647 -1207499 -1487599 -1838477 -1975743 -1554422 -765544 -677474 -845958
2530 -845958 -1822651 -1953708 -1368647 -1196325 -1344905 -1069285 -1116937 -1116056 -167858 -294506
2520 -294506 -553681 -130468 -894344 -1134525 -1593709 -1692679 -1173200 -753190 -1324012 -1076897
2510 -1076897 -1047553 -836062 -357547 -769238 -1109641 -1201404 -1016772 -1306151 -1591060 -669612
2500 -669612 -372830 -1006782 -1141275 -1031188 -1119280 -943675 -904070 -992202 -389852 155748
2490 155748 -767631 -1461927 -1518432 -2248695 -1610094 -928693 -880694 -791587 -1604069 -2544910
2480 -2544910 -967163 -393325 -557290 -758068 -1302272 -1223847 -680507 -420052 -784791 -899612
$$ packed form
2550a430276n82608K71692P43896M0849J4916j9747L58462k76726m7803m56519
2540a383864O4267M26950l14852k80100l50878j37266M21321P88878Q8070j68484
2530h45958r76693j31057N85061J72322j48580K75620m7652Q81R48198j26648
2520b94506k59175M23213p63876k40181m59184r8970N19479M20010n70822K47115
2510a076897K9344K11491M78515m11691l40403r1763J84632k89379k84909R21448
2500f69612K96782o33952j34493J10087q8092J75605L9605q8132O02350N45600
2490A55748r23379o94296n6505p30263O38601O81401M7999Q9107q12482r40841
2480b544910J577747N73838j63965k00778n44204P8425N43340K60455l64739j14821
$$ plain form
2470 -899612 -866519 -1085907 -826285 -697235 -370130 -876344 -748903 -133022 -221867 -752161
2460 -752161 -81588 -263428 -67122 -768432 -660672 -1066963 -679632 -1030601 -1445295 -1154476
2450 -1154476 -1142380 -441287 -433746 -796595 -1243964 -120967 -487331 -1105291 -1113307 -1581006
2440 -1581006 -778933 -774099 -1403331 -2108925 -1846820 -1420624 -738327 -401330 -593442 -750862
2430 -750862 -443580 -869112 -1057679 -1466095 -1719048 -600889 -281954 -65963 -448750 -298344
2420 -298344 -545484 -894161 -460173 -305781 64774 -11624 220176 -106433 -778123 -130356
2410 -130356 -589512 -1114967 -375133 -433511 -350034 -53135 -626545 259984 64469 298812
2400 298812 944860 929363 1275333 1334308 1369911 1891397 1882033 2244302 2128411 1560496 1254073
$$ packed form
2470h99612L3093k19388K59622J29050L27105n06214J27441O15881q8845n30294
2460g52161O70573j81840J96306p01310J07760m06291L87331l50969m14694K90819
2450a154476J2096P01093P541l62849m47369J122997l66364o17960q016m67699
2440a581006Q02073M834o29232p05594K62105M26196O82297L36997j92112j57420
2430g50862L07282m25532j88567m08416k52953J118159L18935K15991l82787J50406
2420b98344k47140l48677M33988J54392L70555p6398K31800l26609o71690O47767
2410a30356m59156n25455P39834n8378Q3477K96899n73410Q86529j95515K34343
2400B98812O46048j5497L45970N8975L5603N21486r364L62269j15891n67915l06423
$$ plain form
2389 1254073 915763 258772 462287 39319 200185 -256582 -553774 247023 151630 -873078
2379 -873078 -112450 124555 133010 308141 -491363 -236210 -116406 -66830 153288 237819
2369 237819 -31247 -84739 -467179 -268671 379363 193119 -717608 -557005 -316612 -482180
2359 -482180 72135 -87947 -360375 -598025 -480436 -79980 25681 -378006 197019 -106103
2349 -106103 -284345 -759476 -368485 -41787 15386 123727 -804683 -793669 -262758 -590243
2339 -590243 -372183 -496167 -270561 -4624 -402698 -443662 147556 578991 -469909 -499670
2329 -499670 -372201 -342732 -187908 93442 -160652 -327802 -304107 -219220 -774237 -664367
2319 -664367 -485683 -286798 19329 471750 698257 1070270 692019 230650 -118953 160032
$$ packed form
2389A254073l38310o56991K03515m22968J60866m56767k97192Q00797r5393j024708
2379h73078P60628K37005Q455J75131p99504K55153J19804M9576K20118Q4531
2369B37819k69066n3492l82440J98508O48034j86244r10727J60603K40393j65568
2359d82180N54315j60082k72428k37650J17589M00456J05661m03687N75025l03122
2349a06103j78242m75131L90991L26698N7173J08341r28410J1014N30911l27485
2339e90243K18060j23984K25606K65937l98074m0964N91218M31435j048900k9761
2329d99670J27469K9469J54824K81350k54094j67150K3695Q4887n55017J09870
2319f64367J78684J98885L06127M52421K26507L72013l78251m61369l49603K78985
$$ plain form
2309 160032 882158 634697 -353840 -317781 -23970 649736 179355 -146498 -415104 -877694
2299 -877694 -562864 -690461 -960250 -253089 83143 568314 571075 -332572 56630 356759
2289 356759 109117 -166125 201293 541826 -138766 -371022 -257420 204957 435682 47354
2279 47354 373089 126658 64330 52858 -312723 -945070 -627138 105702 -309696 -433780
2269 -433780 -266032 -416715 -128358 343971 515622 576167 548526 142641 -523525 156479
2259 156479 955947 1638512 1069913 626328 1130286 1394022 1295316 967698 1595634 1145876
2249 1145876 1486355 1817278 983997 1391228 1953281 1712507 1713610 1125302 1350813 2314856
2239 2314856 2499886 2454728 2075829 1486318 1225042 1665921 1853793 2096138 2810259 2762704
$$ packed form
2309A60032P22126k47461r88537L6059K93811O73706m70381l25853k68606m62590
2299h77694L14830j27597k69789P07161L36232M85171K761r03647L89202L00129
2289C56759k47642k75242L67418L40533o80592k32256J13602M62377K30725l88328
2279D7354L25735k46431o2328j1472l65581o32347L17932P32840m15398j24084
2269d33780J67748j50683K88357M72329J71651O0545k7641m05885o66166O80004
2259A56479P99468O82565n68599m43585N03958K63736r8706l27618O27936m49758
2249A145876L40479L30923q33281M07231N62053k40774J103n88308K25511R64043
2239B314856J85030m5158l78899n89511k61276M40879J87872K42345P14121m7555
$$ plain form
2229 2762704 2605139 3049817 3220574 2043132 2926758 3507168 3610879 3457684 3034880
2220 3034880 2936710 3230971 3607036 3512540 3825458 4167203 4290036 5448605 5435735 5278622
2210 5278622 5726744 5978605 5904428 5701428 5470781 5662345 6044405 6622369 7011143 6809894
2200 6809894 7904883 8391570 7545863 7580407 8173603 8151630 8235156 7573687 8481161 9541846
2190 9541846 9420736 9571902 10713318 10739368 10962673 10874054 10898789 12404527 12396089 11780659
2180 11780659 12784271 13348556 14108052 13892920 14907194 15352509 15199448 15629861 15773770
2171 15773770 16052838 16068100 16762208 17535458 18285609 19093779 19504202 20769153 21632509
2162 21632509 21735238 23224176 24815465 26198628 26297009 27710150 29984489 31455023 32452346
$$ packed form
2229B762704j57565M44678J70757j177442Q83626N80410J03711j53195m22804
2220C034880r8170K94261L76065r4496L12918L41745J22833J158569j2870j57113
2210E278622M48122K51861p4177k03000k30647J91564L82060N77964L88774k01249
2200F809894J094989M86687q45707L4544N93196k1973Q3526o61469R07474J060685
2190I541846j21110J51166J141416K6050K23305q8619K4735J505738q438o15430
2180A1780659J003612N64285P59496k15132J014274M45315j53061M30413J43909
2171A5773770K79068J5262O94108P73250P50151Q08170M10423J264951Q63356
2162B1632509J02729J488938J591289J383163R8381J413141K274339J470534R97323
$$ plain form
2153 32452346 34048996 36078100 37858165 41175881 44035396 46870314 51953435 56838646
2145 56838646 61207931 67208976 74081594 81713176 89407136 96341630 104323078 115497792
2137 115497792 129134184 144838143 165373329 190348833 218759902 250513938 286532545
2130 286532545 327027790 380371111 446507600 506277182 497638804 422894298 338446307
2123 338446307 266427562 216707816 181145951 155361318 135162996 121163955 110269239
2116 110269239 101068919 93543273 87302814 82889569 80040761 75542588 70149070 63989182
2108 63989182 57849602 53511826 49578803 46521541 43796363 41767306 40324002 38563547
2100 38563547 36788366 34887099 33406528 31980113 30920677 29211270 28073057 26815602
$$ packed form
2153C2452346J596650K029104J780065L317716K859515K834918N083121M885211
2145E6838646M369285O001045O872618P631582P693960O934494P981448J1174714
2137A15497792J3636392J5703959K0535186K4975504K8411069L1754036L6018607
2130B86532545M0495245N3343321O6136489N9769582q638378p4744506q4447991
2123C38446307p2018745m9719746l5561865k5784633k0198322j3999041j0894716
2116A10269239r200320p525646o240459m413245k848808m498173n393518o159888
2108F3989182o139580m337776l933023l057262k725178k029057j443304j760455
2100C8563547j775181j901267j480571j426415j059436j709407j138213j257455
$$ plain form
2092 26815602 25867374 24850801 23857747 23178813 22404501 22394771 22016899 21208234 20029724
2083 20029724 19431153 18776131 18545445 16632252 15959872 16016945 15375990 15330015 15315516 15127872
2073 15127872 13279683 12657792 12621513 12553406 11649256 11307809 10538599 10351013 10581687 9818611
2063 9818611 9413432 9244676 9441845 9760134 9934913 9065411 9008632 8660971 8857969 8406952
2053 8406952 7112342 6700520 7642209 7756357 7481283 7153853 6417307 6796390 7137994
2044 7137994 6303814 6358951 5913226 5962717 5810097 6174145 5768017 6133643 5239391 4511788
2034 4511788 5183207 4763901 5576331 5559403 5148737 4671502 4520616 3928968 3590490 3669315
2024 3669315 4467312 3978490 3740488 3191234 3309663 3357925 3283046 3000689 2506053 3257496
$$ packed form
2092B6815602r48228j016573r93054o78934p74312r730l77872q08665j178510
2083B0029724n98571o55022k30686j913193o72380N7073o40955m5975j4499j87644
2073A5127872j848189o21891l6279o8107r04150l41447p69210j87586K30674p63076
2063I818611m05179j68756J97169L18289J74779q69502n6779l47661J96998m51017
2053H406952j294610m11822R41689J14148k75074l27430p36546L79083L41604
2044G137994q34180N5137m45725M9491j52620L64048m06128L65626q94252p27603
2034D511788O71419m19306Q12430j6928m10666m77235j50886n91648l38478P8825
2024C669315P97997m88822k38002n49254J18429M8262p4879k82357m94636P51443
$$ plain form
2014 3257496 3256748 2827479 2251230 2443237 2321145 2432066 2717335 2502596 2281273 2383081
2004 2383081 2797687 2241574 1671702 1544017 2132717 2737709 2535494 2450233 2437864 2384113
1994 2384113 2365321 2233962 2433842 1872217 1498096 1558855 1345999 1949900 1472267 1661600
1984 1661600 1463153 777075 1113965 677987 651727 1926007 1612493 824754 1281480 1432537
1974 1432537 1216320 869937 1261438 1287965 2040612 1351969 614484 640900 1136619 539680
1964 539680 791184 1273653 1142807 975390 754892 539451 293533 234772 572333 999280
$$ packed form
2014C257496p48m29269n76249J92007j22092J10921K85269k14739k21323J01808
2004B383081M14606n56113n69872j27685N88700O04992k02215q5261j2369n3751
1994B384113j8792j31359J99880n61625l74121O0759k12856O03901m77633J89333
1984A661600j98447o86078L36890m35978k6260J274280l13514p87739M56726J51057
1974A432537k16217l46383L91501K6527P52647o88643p37485K6416M95719n96939
1964E39680K51504M82469j30846j67417k20498k15441k45918n8761L37561M26947
$$ [...]
##END NTUPLES=NMR SPECTRUM
##END=
