##TITLE=1H_CA-8951-1
 CDCl3
 8 sc, 
 19.11.2021
##JCAMPDX= 6.0         $$ Bruker NMR JCAMP-DX V2.0
##DATA TYPE= NMR SPECTRUM
##DATA CLASS= NTUPLES
##ORIGIN= UXNMR, Bruker Analytische Messtechnik GmbH
##OWNER= root
$$ XWIN-NMR		Version 3.5
$$ Fri Nov 19 11:56:45 2021 Russian Standard Time (UT+4h)  she@DPX200
##.OBSERVE FREQUENCY= 200.131346
##.OBSERVE NUCLEUS= ^1H
##.ACQUISITION MODE= SIMULTANEOUS
##.ACQUISITION SCHEME= undefined
##.AVERAGES= 8
##.DIGITISER RES= 18
##SPECTROMETER/DATA SYSTEM= spect
##.PULSE SEQUENCE= zg30
##.SOLVENT NAME= D2O
##.SHIFT REFERENCE= (INTERNAL, D2O, 0, 15.7436)
##AUDIT TRAIL= $$ (NUMBER, WHEN, WHO, WHERE, WHAT)
$$ ##TITLE= Audit trail, XWIN-NMR		Version 3.5
$$ ##JCAMPDX= 5.01
$$ ##ORIGIN= Bruker BioSpin GmbH
$$ ##OWNER= she
$$ F:/spectra/data/she/nmr/H-F/1/pdata/1/auditp.txt
$$ ##AUDIT TRAIL=  $$ (NUMBER, WHEN, WHO, WHERE, WHAT)
(   1,<2021-11-19 11:54:55.17 +0400>,<she>,<DPX200>,
      <created by zg, POWCHK disabled, PULCHK disabled
       configuration hash MD5:
       00 E9 B6 7A A2 85 ED C7 34 08 36 98 17 FE 4E 26
       data hash MD5: 16K
       A8 84 61 82 53 2E F9 1B C8 F5 10 28 B9 40 9A 64>)
(   2,<2021-11-19 11:54:58.01 +0400>,<she>,<DPX200>,
      <Start of raw data processing
       efp BC_mod = 2 LB = 0.24 FT_mod = 6 PKNL = 1 PHC0 = -15517.6 PHC1 = 14.60081 SI = 16K 
       data hash MD5: 16K
       21 94 CC 2B 31 7E D5 23 11 B5 93 26 E3 E3 79 6C>)
(   3,<2021-11-19 11:55:25.90 +0400>,<she>,<DPX200>,
      <pk PHC0 = -2.921109 PHC1 = 7.800002 
       data hash MD5: 16K
       FD 45 39 E2 3C 1D 2D 4D CE BD 01 08 A3 80 F9 11>)
(   4,<2021-11-19 11:55:29.40 +0400>,<she>,<DPX200>,
      <abs ABSG = 5 
       data hash MD5: 16K
       A9 B2 44 EE 2B 1B 52 B3 D1 CA 32 44 9A EC 23 B2>)
$$ ##END=
$$ 
$$ hash MD5
$$ 97 62 3F B1 97 13 0F E4 FC 23 C9 B4 8E 18 C0 0F
##$RELAX= 
##$RELAX= 
##$RELAX= 
##$RELAX= 
##$RELAX= 
##$RELAX= 
$$ Bruker specific parameters
$$ --------------------------
##$DU= <F:/spectra>
##$EXPNO= 1
##$NAME= <H-F>
##$PROCNO= 1
##$TYPE= <nmr>
##$USER= <she>
##$AMP= (0..31)
100 100 100 100 100 100 100 100 100 100 100 100 100 100 100 100 100 100 
100 100 100 100 100 100 100 100 100 100 100 100 100 100 
##$AQSEQ= 0
##$AQ_mod= 1
##$AUNM= <au_zg>
##$AUTOPOS= <>
##$BF1= 200.13
##$BF2= 200.13
##$BF3= 200.13
##$BF4= 200.13
##$BF5= 200.13
##$BF6= 200.13
##$BF7= 200.13
##$BF8= 200.13
##$BYTORDA= 1
##$CFDGTYP= 0
##$CFRGTYP= 5
##$CHEMSTR= <none>
##$CNST= (0..31)
1 1 145 1 1 1 1 1 1 1 1 1 1 1 1 1 1 1 1 1 1 1 1 1 1 1 1 1 1 1 1 1 
##$CPDPRG= <>
##$CPDPRG1= <>
##$CPDPRG2= <>
##$CPDPRG3= <>
##$CPDPRG4= <mlev>
##$CPDPRG5= <mlev>
##$CPDPRG6= <mlev>
##$CPDPRG7= <mlev>
##$CPDPRG8= <mlev>
##$CPDPRGB= <>
##$CPDPRGT= <>
##$D= (0..31)
0 1.2 0 0 0 0 0 0 0 0.06 0 0.03 0 0 0 0 0.0002 0 0 0 0 0 0 0 0 0 0 0 0 
0 0 0 
##$DATE= 1637308494
##$DBL= (0..7)
120 120 120 120 120 120 120 120 
##$DBP= (0..7)
150 150 150 150 150 150 150 150 
##$DBP07= 0
##$DBPNAM0= <>
##$DBPNAM1= <>
##$DBPNAM2= <>
##$DBPNAM3= <>
##$DBPNAM4= <>
$$ [...]
##$SUBNAM2= <"">
##$SUBNAM3= <"">
##$SUBNAM4= <"">
##$SUBNAM5= <"">
##$SUBNAM6= <"">
##$SUBNAM7= <"">
##$SUBNAM8= <"">
##$SUBNAM9= <"">
##$SW= 18.0517287032376
##$SWIBOX= (0..15)
0 0 2 0 0 0 0 0 0 0 0 0 0 0 0 0 
##$SW_h= 3612.71676300578
##$TD= 16384
##$TD0= 1
##$TE= 0
##$TE2= 300
##$TE3= 300
##$TEG= 300
##$TL= (0..7)
0 120 120 120 120 120 120 120 
##$TP= (0..7)
150 150 150 150 150 150 150 150 
##$TP07= 0
##$TPNAME0= <>
##$TPNAME1= <>
##$TPNAME2= <>
##$TPNAME3= <>
##$TPNAME4= <>
##$TPNAME5= <>
##$TPNAME6= <>
##$TPNAME7= <>
##$TPOAL= (0..7)
0.5 0.5 0.5 0.5 0.5 0.5 0.5 0.5 
##$TPOFFS= (0..7)
0 0 0 0 0 0 0 0 
##$TUNHIN= 0
##$TUNHOUT= 0
##$TUNXOUT= 0
##$USERA1= <user>
##$USERA2= <user>
##$USERA3= <user>
##$USERA4= <user>
##$USERA5= <user>
##$V9= 5
##$VALIST= <valist>
##$VCLIST= <CCCCCCCCCCCCCCC>
##$VD= 0
##$VDLIST= <DDDDDDDDDDDDDDD>
##$VPLIST= <PPPPPPPPPPPPPPP>
##$VTLIST= <TTTTTTTTTTTTTTT>
##$WBST= 1024
##$WBSW= 4
##$XGAIN= (0..3)
0 0 0 0 
##$XL= 0
##$YL= 0
##$YMAX_a= 317446
##$YMIN_a= -466460
##$ZGOPTNS= <>
##$ZL1= 120
##$ZL2= 120
##$ZL3= 120
##$ZL4= 120
##$ABSF1= 15.88241
##$ABSF2= -2.169443
##$ABSG= 5
##$ABSL= 3
##$ALPHA= 0
##$AQORDER= 0
##$ASSFAC= 0
##$ASSFACI= 0
##$ASSFACX= 0
##$ASSWID= 0
##$AUNMP= <proc_1d>
##$AZFE= 0.1
##$AZFW= 0.1
##$BCFW= 0
##$BC_mod= 2
##$BYTORDP= 0
##$COROFFS= 0
##$CY= -3
##$DATMOD= 1
##$DC= 0
##$DFILT= <>
##$DTYPP= 0
##$F1P= 0
##$F2P= 0
##$FCOR= 1
##$FTSIZE= 16384
##$FT_mod= 6
##$GAMMA= 0
##$GB= 0
##$INTBC= 1
##$INTSCL= 0
##$ISEN= 128
##$LB= 0.24
##$LEV0= 0
##$LPBIN= 0
##$MAXI= 10000
##$MC2= 0
##$MEAN= 0
##$ME_mod= 0
##$MI= 1.114404
##$NCOEF= 0
##$NC_proc= -6
##$NLEV= 6
##$NOISF1= 3.799351
##$NOISF2= 2.8
##$NSP= 0
##$NTH_PI= 0
##$NZP= 0
##$OFFSET= 15.74358
##$PC= 1
##$PHC0= -15520.52
##$PHC1= 22.40081
##$PH_mod= 1
##$PKNL= yes
##$PPARMOD= 0
##$PSCAL= 0
##$PSIGN= 0
##$REVERSE= no
##$SF= 200.13000159442
##$SI= 16384
##$SIGF1= 3
##$SIGF2= 2
##$SINO= 5.538805
##$SIOLD= 16384
##$SREGLST= <1H.CDCl3>
##$SSB= 0
##$STSI= 16384
##$STSR= 0
##$SW_p= 3612.71676300578
##$SYMM= 0
##$S_DEV= 0
##$TDeff= 16384
##$TDoff= 0
##$TI= <>
##$TILT= no
##$TM1= 0
##$TM2= 0
##$TOPLEV= 0
##$USERP1= <user>
##$USERP2= <user>
##$USERP3= <user>
##$USERP4= <user>
##$USERP5= <user>
##$WDW= 1
##$XDIM= 16384
##$YMAX_p= 318156959
##$YMIN_p= -244203
$$ End of Bruker specific parameters
$$ ---------------------------------
##NTUPLES= NMR SPECTRUM
##VAR_NAME=  FREQUENCY,     SPECTRUM/REAL,   SPECTRUM/IMAG
##SYMBOL=    X,             R,               I
##VAR_TYPE=  INDEPENDENT,   DEPENDENT,       DEPENDENT
##VAR_FORM=  AFFN,          ASDF,            ASDF
##VAR_DIM=   16384,         16384,           16384
##UNITS=     HZ,            ARBITRARY UNITS, ARBITRARY UNITS
##FACTOR=    0.220516191357247, 1,           1
##FIRST=     3150.76266338465, 0,            0
##LAST=      -461.954099621125, 0,           0
##MIN=       -461.954099621125, -244203,     0
##MAX=       3150.76266338465, 318156959,    0
$$ Real data points
##PAGE= N=1
##DATA TABLE= (X++(R..R)), XYDATA
$$ [...]
8327E88163P557p0606n6098N7580L6409p5046O602p1832l3718O2192J0187K8637
8315D90027n5164N1552Q219K4312M328Q7650P8132L6252o6664o8568o623R5440
8303F78893k5359k6481l953L1013l209J10967l2708k0855M9998m0540l2346n9091
8291F26329J3708k6511L8012l4152J048k5224K0514n2433K1403l8448l0594O4361
8279E78013j4971j0406O3169J4673m090j9922l9937N9794O18n9575L4231L2454
8267F34051m3852j7554K027o981J94N4209N4432n3610K3326M723j18057O2547
8255E95455k6039L7751R2556M1130M496j2677l2709o3299P4197N5952M146J2171
8243G83130k4930M4169k3357J1223N6790J78608L5303j89727j30502N8664N5706
$$ plain form
8327 588163 595720 525114 469016 526596 563005 487959 494561 422729 389011 451203 461390 490027
8315 490027 434863 486415 494634 518946 523274 610924 689056 725308 658644 590076 583453 678893
8303 678893 653534 627053 623100 654113 650904 761871 729163 708308 758306 717766 685420 626329
8291 626329 640037 613526 651538 617386 618434 593210 613724 561291 582694 544246 513652 578013
8279 578013 563042 552636 615805 630478 626388 606466 566529 626323 626941 567366 601597 634051
8267 634051 590199 572645 574672 567691 567885 622094 676526 622916 646242 650965 532908 595455
8255 595455 569416 607167 699723 740853 745349 732672 699963 636664 710861 766813 770959 783130
8243 783130 758200 802369 779012 790235 847025 1025633 1060936 871209 740707 799371 855077
8232H55077q7939j01704L6052l594M6615q9117m9412N5392k9233R4346M6665J3815
8220G86963j8557Q6821j06123k3158l1993P7228J8399j3714M1109J1547p9972
8209G48550k5122R7015M0120M6171p2217m624j3215J04857K590j19321o680M5298
8197H43422l4743L632P7062q4833j2691K41393k406j26350R0949p0853q889J32081
8185A047774o8968L1225O5209N2769J3031Q4438r2536j5123R7238M946J28355
8174A348358N0288K6616M2198Q251l7702Q0133J4149P0901Q1183k2027M8247P0033
8162A780628K2307K9718l5736R855m2572N5898K0137p6105N2592P1614k9526J25140
8150A983950J9299L2065Q4293N4834J58407K22132M0699P8591J40135q364k9n1941
$$ plain form
8232 855077 767138 665434 701486 697892 744507 655390 605978 661370 632137 726483 773148 786963
8220 786963 768406 855227 749104 725946 693953 771181 789580 775866 816975 828522 748550
8209 748550 723428 820443 860563 906734 834517 829893 816678 921535 924125 804804 798124 843422
8197 843422 808679 812311 889373 804540 791849 1033242 1030836 904486 995435 924582 915693 1047774
8185 1047774 978806 1010031 1075240 1128009 1141040 1225478 1132942 1117819 1215057 1220003 1348358
8174 1348358 1398646 1425262 1467460 1475711 1438009 1518142 1532291 1603192 1684375 1662348 1710595 1780628
8162 1780628 1802935 1832653 1796917 1806772 1764200 1820098 1840235 1764130 1816722 1888336 1858810 1983950
8150 1983950 2003249 2035314 2119607 2174441 2332848 2554980 2595679 2674270 2814405 2806041 2806012 2754071
8138B754071J0806K5334r898K2422K705q5865L0610j9473o3119J0038p7472q5984
8126B514175k1276j36392o2144m4780o5511j30841j9666R4104r5751l5400Q7193
8115B083711o706p9734p0547J18031N5035p4729k6071p872L5627Q696k5170j9574
8103A990697J87594l2736J9063o9679j96800J9911M3882L2525j3389q9584k8345
8092A863139M0669M4463j3330J5028l435N2809M559n344p6217k5929j0921P8064
8080A963555K8483j45185L495n1839o2044k4147M3352o6115r2321m9840J00598
8069A647992J1887P9951P589j03689l2539k0210N9771K8395j46251J701k6999
8058A507598k9169R7533N0656J5993p2820m2717R444l4889k1024n9066K5044k0194
$$ plain form
8138 2754071 2764877 2790211 2780313 2802735 2805440 2719575 2750185 2730712 2667593 2677631 2600159 2514175
8126 2514175 2492899 2356507 2294363 2249583 2184072 2053231 2033565 2127669 2031918 1996518 2083711
8115 2083711 2077005 1997271 1926724 2044755 2099790 2025061 1998990 1991118 2026745 2035441 2010271 1990697
8103 1990697 2178291 2145555 2164618 2094939 1898139 1918050 1961932 1994457 1981068 1891484 1863139
8092 1863139 1903808 1948271 1934941 1949969 1946534 1999343 2003902 1998558 1922341 1896412 1885491 1963555
8080 1963555 1992038 1846853 1850348 1798509 1736465 1712318 1755670 1689555 1597234 1547394 1647992
8069 1647992 1659879 1739830 1747419 1643730 1611191 1590981 1650752 1679147 1532896 1534597 1507598
8058 1507598 1478429 1575962 1626618 1642611 1569791 1527074 1536518 1501629 1480605 1421539 1446583 1426389
8046A426389l0782Q7519J21317l7144j08600Q7736j31935p0185J22458m646k576
8035A459551n2908J9695l8383N6597k2668k45n8622M0456m9927j39598N6057K2202
8023A292207N0281m2196n2526M0840Q65q2514O438n0522l5551K7898l820J9037
8011A170437n2886j573P5686k6018M1208N2275n4059M9249J6429o2119L8328O385
7999A253342m9897L7644Q9076O33o7037j08467K2157J1413K1180N8119P9030l4848
7987A312345j06053l1283R6307l4471K2308J1282m0005l1019q099P1483K2620
7976A285415N5608J6616n4622N1871J17812p650o0993j5444O5408K1321p7958
7965A397384L8751O0355j45968M6270j00417o0326N4290l736j0601J6648k4120
$$ plain form
8046 1426389 1395607 1483126 1604443 1567299 1458699 1546435 1414500 1344315 1466773 1462127 1459551
8035 1459551 1406643 1426338 1387955 1444552 1421884 1421639 1363017 1403473 1353546 1213948 1270005 1292207
8023 1292207 1342488 1300292 1247766 1288606 1289471 1206957 1213395 1162873 1127322 1155220 1151400 1170437
8011 1170437 1117551 1115978 1191664 1165646 1206854 1259129 1205070 1254319 1270748 1208629 1246957 1253342
7999 1253342 1203445 1241089 1330165 1330798 1263761 1155294 1177451 1188864 1210044 1268163 1347193 1312345
7987 1312345 1206292 1175009 1271316 1236845 1259153 1270435 1230430 1199411 1191312 1262795 1285415
7976 1285415 1341023 1357639 1303017 1354888 1472700 1465050 1404057 1388613 1454021 1475342 1397384
7965 1397384 1436135 1496490 1350522 1396792 1296375 1236049 1290339 1286603 1276002 1292650 1268530
7954A268530k01053p5120J68028M256j84295o090l829Q4880P2553J7313n7723
7943A087450L164N2992k4305o4976M744o0797J2211m1423o0816K9432M0276q2493
7931H95459m5547N2663J6929n1244l0624M8919N8434m4165o0481m0027j3871k1745
7919G64700Q3272K5439j05100M5617J350M0518j7461j18950O4042o166m3912L833
7907G37182k747J7354q3399l0137L4128Q0208K9538L638j2289p3056K7879P9306
7895H07605l6914j13284O4922K1721n4071M6157n6644o7525n1149J12079k2423
7884F50474k8898J14568j35159J29374L8609O657M3354j05434k8003O771k786
7873F89527q2058l071N5621j2990m1394j9078o1800P1563p896L6161k9040L492
$$ plain form
7954 1268530 1067477 992357 1160385 1164641 980346 974256 970427 1055307 1127860 1145173 1087450
7943 1087450 1090614 1143606 1119301 1054325 1059069 998272 1010483 969060 908244 937676 977952 895459
7931 895459 849912 902575 919504 868260 837636 886555 944989 900824 840343 800316 786445 764700
7919 764700 847972 873411 768311 813928 815278 855796 838335 719385 783427 777261 733349 737182
7907 737182 734435 751789 668390 638253 672381 752589 782127 785765 773476 700420 728299 807605
7895 807605 770691 657407 722329 744050 689979 736136 679492 611967 560818 672897 650474
7884 650474 621576 736144 600985 730359 768968 775625 818979 713545 685542 692313 689527
7873 689527 607469 604398 660019 647029 605635 586557 524757 596320 588424 624585 595545 599037
7861E99037L9853j8761l4519K1097j7023M2654j45006m460N2921M2243J19031
7850F97067J0294q5190o2253m2793L4389R4038q1081P44m4205l2304Q2541l2165
7838E39082l898k9l9020j2789J0616J21207j128j02118m0619l9060n8817O9073
7826D42500o113p6067R3243j5886j4393j10561k6924N5411L7892L5316J2650p333
7814D19735j2406n7145Q6208J27379j01047p7574l4179J4721K3647K1411m1630
7803C69120P5493n5806q9145M1278J30502l3883j07582r3170K3467O3384L6907
7792C60565l0018P768J0954o3571o267l4597Q5647J20546j14144p9702m661N8310
7780C10830m0400n1021L5668r699O0442l6113q0588P7234N0274p1083m3932k9379
$$ plain form
7861 599037 638890 620129 585610 606707 589684 632338 487332 482872 535793 578036 697067
7850 697067 707361 622171 559918 517125 551514 645552 564471 565215 521010 488706 571247 539082
7838 539082 535184 535155 496135 483346 493962 615169 614041 511923 471304 432244 373427 442500
7826 442500 436387 360320 453563 437677 423284 312723 285799 341210 379102 414418 427068 419735
7814 419735 407329 350184 436392 563771 462724 385150 350971 365692 389339 410750 369120
7803 369120 444613 388807 299662 340940 471442 437559 329977 236807 260274 323658 360565
7792 360565 330547 338315 349269 285698 279431 244834 330481 451027 336883 257181 252520 310830
7780 310830 270430 219409 255077 245378 305820 269707 189119 266353 316627 245544 201612 172233
7768A72233O7461L29j7200K0980r7998o1966M068J07413N6369l9755J7053j12670
7756A16317K7552O3952M044j1563P2017j6259R1067m0331j62622K5153p6155L8452
7744A31624q7591R8447O1101n9570k3419N8067j22570N6530P8429r5262J9878
7733A15664n728R953n4943j3656o8979K2458M3273M0936K0502j04832N4799K2218
7721H1665L0826n4400L0623o0505K163P3721j2714O6284j12j15944o6048R2317
7709F7876n124J44585k8045l3713j3785n128r0727K0439J7757P73J1018r2057
7697f131o0459P5250Q7284L8572N7612o2125j36523O2470k314m4074J46873r2678
7685F3757q1225j44330Q6781J30434P5826j7755m5162O988m8226K3285p6869P7184
$$ plain form
7768 172233 239694 240023 222823 243803 145805 83839 87907 195320 251689 211934 228987 116317
7756 116317 143869 207821 211865 200302 272319 256060 347127 306796 144174 169327 93172 131624
7744 131624 44033 142480 203581 144011 120592 178659 56089 112619 191048 95786 115664
7733 115664 109936 119889 64946 51290 -17689 4769 48042 88978 109480 4648 59447 81665
7721 81665 112491 58091 88714 28209 30372 104093 91379 157663 157551 41607 -24441 67876
7709 67876 62752 207337 179292 145579 131794 126666 35939 56378 74135 74908 85926 -6131
7697 -6131 -66590 8660 95944 134516 192128 130003 -6520 55950 53636 9562 156435 63757
7685 63757 -17468 -161798 -75017 55417 131243 113488 68326 75314 27088 50373 -26496 50688
7673E0688M8057o3511J4964O8437o241j5835K427j6518l3310l8755N2833M1192
7661A04428l486j7954K3173l2867K5337M9836q9028J6502o9226p720n754M4279
7649C7520j1880n0182J20550P328j6553J685J8170N2981n9857p6541k4097j0924
7637a1800k3924K7333L7610l3010L6032J7356k3574K5248q462L9241J0854r2717
7625A87k0238j1769L7400J2950R8675l6129q9953R4961q3751m3065K6675J1761
7613b296K4180M7641j9892n1293k4831m6801P8745j2096m1809J9134m7333M4143
7601c2508l3829L2545l5138M4237N3221k0761m3945J30080K7562j00626l4169
7590a3331m1377m2289R5649P3745J2678o9303m5033m7489k705J81682r898j38979
$$ plain form
7673 50688 98745 35234 50198 118635 112394 96559 98986 82468 49158 10403 63236 104428
7661 104428 100942 82988 106161 73294 98631 148467 59439 75941 6715 -1005 -6759 37520
7649 37520 25640 -24542 96008 103336 86783 88468 106638 159619 99762 23221 -876 -11800
7637 -11800 -35724 -8391 29219 -3791 32241 49597 26023 51271 42809 82050 92904 187
7625 187 -20051 -31820 5580 18530 117205 81076 -8877 86084 2333 -40732 -14057 -2296
7613 -2296 21884 69525 49633 -1660 -26491 -73292 5453 -6643 -48452 -29318 -76651 -32508
7601 -32508 -66337 -33792 -68930 -24693 28528 7767 -36178 93902 121464 20838 -13331
7590 -13331 -54708 -96997 -1348 72397 85075 15772 -29261 -76750 -79455 102227 92329 -46650
7578d6650m0462N1997l7987J4855J8753Q5981P9703k8989n5361k371J9802n8784
7566D87p1974R1997K9449R6851r6941k5399K3341n0490N1779j2077l2545p062
7554b584o3931O0670j9634J922j53650K7699Q6696r1503j89J76656K1481P288
7542E0921L152j44016N9996J54072l9659j02941K473L0302o5650o53L4247M1787
7530B4031N0232l4738N4107k5269j183J1895J8292o2849L4632m4943q7233K2880
7518d0146k0299k6311P8805Q7609n5750j10013J06036J75074j24481j07357p3472
7507a10305K5105O7496k7344N1162M9957K2735r3582l6261Q2780Q787l9136q4868
7495h3474K0251N6353n948J0407m5318Q0098N1948p2685r7061P0694K1623k4203
$$ plain form
7578 -46650 -87112 -35115 -73102 -58247 -39494 46487 126190 97201 41840 39469 59271 487
7566 487 -71487 20510 49959 146810 49869 24470 47811 -2679 49100 37023 4478 -2584
7554 -2584 -66515 -5845 -25479 -23557 -177207 -149508 -62812 -154315 -154504 22152 43633 50921
7542 50921 54073 -89943 -29947 124125 84466 -18475 -16002 14300 -51350 -52003 -17756 24031
7530 24031 74263 39525 93632 68363 67180 79075 97367 34518 69150 24207 -63026 -40146
7518 -40146 -60445 -86756 -7951 79658 23908 -86105 19931 195005 70524 -36833 -110305
7507 -110305 -85200 -17704 -45048 6114 56071 78806 -14776 -51037 31743 40530 1394 -83474
7495 -83474 -63223 -6870 -12818 -2411 -47729 32369 84317 11632 -85429 -14735 6888 -17315
7483a7315r7581K9360J52674J5606l8190R8265j9198n4400o9183p0548N6618J5704
7471A812O608l527n9257k5032K5985L7186J45395J3164L4289r0684j53837O978
7459f0920L9384N8888J2633k0964r991P487M4372m6438k4109R039l3446J46552
7447A22487l3041j27593m6060M4345R1351j5342j3093K0219M9945p6825l367n748
7435G278L0282l2920j32528p3627k3950N1281K4113L3922L552J00152k6880O0
7423c9265k7530J9942m8369L2096L485p972k2624O155J6725M8782M0310J4522
7411C6257N1810l3475n4984m2670Q6636K6039m6583M658L3686k1096j01143j7476
7399g8341Q3616r2670K1381l6287M4581K0707J1762L8262P677M6020p9933j1437
$$ plain form
7483 -17315 -114896 -85536 67138 82744 44554 142819 123621 69221 38 -70510 -13892 1812
7471 1812 8420 4893 -54364 -79396 -53411 -16225 129170 142334 176623 85939 -67898 -60920
7459 -60920 -21536 37352 49985 29021 19030 26517 70889 24451 342 9381 -24065 122487
7447 122487 89446 -38147 -84207 -39862 51489 36147 23054 43273 93218 16393 13026 7278
7435 7278 37560 4640 -127888 -201515 -225465 -174184 -150071 -116149 -112597 -12445 -39325 -39265
7423 -39265 -66795 -46853 -95222 -63126 -59641 -67613 -90237 -84082 -67357 -18575 21735 36257
7411 36257 88067 54592 -392 -43062 43574 69613 23030 27688 61374 40278 -60865 -78341
7399 -78341 5275 -87395 -66014 -102301 -57720 -37013 -25251 13011 20688 66708 -13225 -24662
7387b4662J56366m3210j7318n631q3673m731m0693M0559J37144n0010N392l162
7375F6371j69281J6852L7267k4048M825k4744J4395J5473O6429P0471p2455m2444
7363d0889P22O8756O2709n9082K9612p98P5823p3543P85j7271m6338k6836l5650
7350f2000Q8555k1295j4785J7123M2592j08753J892L8026m7346k2971M9398N1964
7338A2400Q7942P3095q6148l1712j4118j05595N2954O3513J7724q849k7225J092
7326C5073n3765L3384P671n8449j13735O2795Q0853L3978m3914q9416P0748J614
7314c3163o4503Q9264o6567L4576J7127N4609P610p4723l7300J6921l2308m5674
7302a34131J77309j43101Q9528L3287k4571j4398l5447p4066K9456N7759L1742
$$ plain form
7387 -24662 131704 88494 71176 65545 -18128 -22859 -63552 -22993 114151 64141 69533 66371
7375 66371 -102910 -86058 -48791 -72839 -68014 -92758 -78363 -62890 3539 74010 1555 -40889
7363 -40889 -40167 28589 91298 32216 61828 61030 136853 63310 64095 46824 486 -26350 -62000
7350 -62000 26555 5260 -9525 7598 50190 -58563 -56671 -18645 -65991 -88962 -39564 12400
7338 12400 100342 173437 87289 55577 41459 -64136 -11182 52331 70055 61206 33981 35073
7326 35073 -18692 14692 22363 -36086 -149821 -87026 -6173 27805 -16109 -105525 -34777 -33163
7314 -33163 -97666 -8402 -74969 -40393 -23266 31343 38953 -35770 -73070 -56149 -88457 -134131
7302 -134131 43178 -99923 -10395 22892 -1679 -16077 -51524 -125590 -96134 -38375 -6633
7291f633R588Q798m1429q8977R320R562O035Q8670l1633L8346L386j54905J07716
7278d2156N3324L398N0392O8188l3085O756p4827j12086O4354N3782L8527p7517
7266i50j0514J3055p1450j7288K8434m8109o6571O7571P5322M8075o4166k7054
7254g3645J03992K8024n1193m0481O6358J6022r6919J3999p6392K9700J1569j8434
7242h7400j9182K8516l1328j4049J6277M6805P3568M0076j3055j61960l8878R4301
7230f6309J4226k7112r796L3704l5712J5261J1098n1127J7951Q5536J4529j9274
7218a7025j13678l3497P3854L4862J7119Q648L2854o8348k4885l9413O8933m321
7206f4897N4820q7197p0543k2052P7853K9171O4179j08648o7381R8387P5262l0086
$$ plain form
7291 -6633 2955 11753 -29676 -118653 -109333 -99771 -93736 -5066 -36699 1647 5033 -149872 -42156
7278 -42156 11168 14566 64958 133146 100061 106817 31990 -80096 -15742 38040 76567 -950
7266 -950 -11464 1591 -69859 -87147 -58713 -106822 -173393 -105822 -30500 17575 -46591 -73645
7254 -73645 30347 58371 7178 -33303 33055 49077 -47842 -33843 -110235 -80535 -68966 -87400
7242 -87400 -106582 -78066 -109394 -123443 -107166 -60361 13207 53283 40228 -121732 -160610 -66309
7230 -66309 -52083 -79195 -88991 -55287 -90999 -75738 -64640 -115767 -97816 -12280 2249 -17025
7218 -17025 -130703 -164200 -90346 -55484 -38365 -29717 3137 -65211 -90096 -129509 -60576 -64897
7206 -64897 -10077 -97274 -167817 -189869 -112016 -82845 -18666 -127314 -194695 -96308 -21046 -51132
7194e1132P787J16040k5274m9281o1015n9982N6346J09001q2999n0335J0114L414
7182g7316P459K1859J583r7589L2822P1258j05659O8137K9910O1202Q0763j14762
7170b0333j41138o3066K9437l4159Q7759L665J21675R4963j59888k5275K540L5871
7158f7949l5882K6686K8219l0101R702n6632P205k8964l6548M4675m3269Q6230
7146i6628O0548r777n6511n3187Q8559L7418l9032q792m2489J00930m01q684N5986
7133B7940m3475L0268n2526m1466l5319R4229j6260j4870p0299K388q639P13M5776
7120h1540M2986L7150m4032J34490j17264l5310L9586L8442n9618L2051O34n682
7108a8107m2904n7889k5689o0115J29086N9867P162J02034q5347o7264m5933N4326
$$ plain form
7194 -51132 -43345 72695 47421 -1860 -62875 -122857 -66511 42490 -40509 -90844 -80730 -77316
7182 -77316 -69857 -47998 -46415 -144004 -111182 -39924 -145583 -77446 -47536 13666 94429 -20333
7170 -20333 -161471 -224537 -195100 -229259 -141500 -137835 -16160 78803 -81085 -106360 -103820 -67949
7158 -67949 -103831 -77145 -48926 -79027 -69325 -125957 -118752 -147716 -184264 -139589 -182858 -96628
7146 -96628 -36080 -45857 -102368 -155555 -66996 -29578 -68610 -77402 -119891 -18961 -19362 -28046 27940
7133 27940 -15535 14733 -37793 -79259 -114578 -20349 -36609 -51479 -121778 -119390 -128029 -127316 -81540
7120 -81540 -38554 -1404 -45436 89054 -28210 -63520 -23934 14508 -45110 -13059 -12425 -18107
7108 -18107 -61011 -118900 -144589 -204704 -75618 -15751 -8589 93445 8098 -59166 -105099 -50773
7096e0773P6417k072j26010n8823R4186K4957O353M2816p6165m355M605j2848
7084h1712K8085j5316J9021L3696n2119j4691l1322L5240P7958m0937k3876J3833
7072e2140o5752K3212M656l8689Q4163r933q8395j01325J71100Q6046l1851K2188
7060C280l320n8157r45M3577J7096j28574K7138k2699J9987O9256R0730r2510
7048c5141r3174J25618K9806q1181M3041O2863j03865q1310r6726K3465P1466
7037a35138l6107L7369j969J11251o5134m6811K170N6272M8281l7759J26338m4570
7025A4193n9555J3176k3495K5315K058l3508m0607j7341P9420N8160K1645j35898
7013i6437P5408K9112j30531N4995M7238N4131k1307p8495k9329O2251L5058k7590
$$ plain form
7096 -50773 25644 23572 -102438 -161261 -67075 -42118 -35765 7051 -69114 -73469 -68864 -81712
7084 -81712 -53627 -68943 -49922 -16226 -68345 -83036 -114358 -79118 -1160 -42097 -65973 -52140
7072 -52140 -117892 -94680 -90024 -128713 -44550 -54483 -142878 -244203 -73103 12943 -18908 3280
7060 3280 -40 -58197 -59142 -15565 1531 -127043 -99905 -122604 -102617 -33361 57369 -35141
7048 -35141 -128315 -2697 27109 -54072 -11031 51832 -52033 -133343 -230069 -206604 -135138
7037 -135138 -171245 -133876 -135845 -24594 -89728 -136539 -134369 -78097 -29816 -67575 58763 14193
7025 14193 -45362 -32186 -55681 -30366 -28308 -61816 -102423 -119764 -40344 17816 39461 -96437
7013 -96437 -21029 8083 -122448 -67453 -20215 33916 12609 -65886 -95215 -32964 2094 -25496
7001b5496n0554K0278m0701j00558P0485M9995O9324j1892o246o1928K0521N7351
6989i421k1511O5325j7627O824N0767l2951j3969L5725O5255j3787j30459L5689
6977A9860n7896J2745Q720K1399p564N0349L9980j58254M8945J30307j5708p5578
6965A7305n914M7862r5914K8029l8124j02902R0809M7338j6057R301N1258n8908
6953b5917K7455P0356j15802m1941N4552M0448P9201m1289p5405p0525Q2629m8160
6941f4398q9111M2466J6530J0162O7698q2079L740M3209P957J09435L714r8410
6929b9087j6836o8727l7621k1264J13810J4682p3625k623J49203J17924j22222
6918B3614o9479q7930J12132J23025p5744p4856Q6495O405M3598k1163j48184
$$ plain form
7001 -25496 -76050 -55772 -96473 -197031 -126546 -76551 -7227 -19119 -25365 -87293 -66772 -9421
6989 -9421 -30932 34393 16766 23590 74357 41406 27437 63162 128417 114630 -15829 19860
6977 19860 -38036 -25291 -16571 4828 -2736 47613 87593 -70661 -21716 108591 92883 17305
6965 17305 11391 59253 -36661 -8632 -46756 -149658 -58849 -11511 -27568 -18267 32991 -25917
6953 -25917 1538 71894 -43908 -85849 -31297 9151 88352 47063 -28342 -98867 -16238 -64398
6941 -64398 -153509 -111043 -94513 -84351 -16653 -98732 -94992 -51783 -43826 65609 69323 -29087
6929 -29087 -45923 -114650 -152271 -173535 -59725 -45043 -118668 -121291 27912 145836 23614
6918 23614 -45865 -133795 -21663 101362 25618 -49238 37257 43662 87260 66097 -82087
6907h2087J01410N1923L5979K0511l4021m8783j9613L6590l9453j02588L7149
6896d2983j7949R4898q989q9895P1258l7403o0414J1092l4215L3242K8591K3898
6884b8869k4847M1798Q7891j30597J9367m076K3422k5793K5599M8981Q3780j3161
6872A03495j32649l7402K5740J0636J97294o5346j79191L0877K9196k588R952
6861i986p8584Q3693J6566k2543r4481P882L0475o6786P3631L1264j2609Q257
6849c3221N3215p2997L6007m6862J6848R5161o5173k7865J0373n923M2299N1630
6837E3492M2755n0667k9830k2899p6516O9534J35265k1379K6008J7458k5255r0177
6825B7789n8832k3895Q9949o9316J12788n928o4170R2715p2839M0724j6952n8461
$$ plain form
6907 -82087 19323 71246 107225 127736 93715 44932 25319 61909 22456 -80132 -42983
6896 -42983 -60932 33966 24977 -64918 6340 -31063 -91477 -80385 -114600 -81358 -52767 -28869
6884 -28869 -53716 -11918 75973 -54624 -35257 -39333 -15911 -41704 -16105 32876 116656 103495
6872 103495 -29154 -66556 -40816 -30180 167114 101768 -77423 -46546 -17350 -19938 -9986
6861 -9986 -88570 -4877 11689 -10854 -105335 -97453 -66978 -133764 -60133 -28869 -41478 -33221
6849 -33221 19994 -53003 -16996 -63858 -47010 48151 -17022 -44887 -34514 -40437 1862 53492
6837 53492 96247 45580 15750 -7149 -83665 -14131 121134 99755 125763 143221 117966 27789
6825 27789 -31043 -54938 35011 -34305 78483 72555 8385 101100 28261 68985 52033 -6428
6813f428k8659L2656N2748r4198N466N7210J21677m7557q8443r194k269n08L6434
6800B8935J35074n3501l80j4761N7649M1382j8741k0800p7343J4532R028o6711
6788C4363n3596N2461P4727L334l6190l3435m9990m4245O115N9629o920j2406
6776f153J679j2343r7827J00707J25189j00323L4874r8795P2424j2198k9875M3772
6764B1131n9333L9718J13219l1708o6336o1577m7235M8174j8546n7813L8620P8934
6752b752K4167J3045L4285q9667M075J2461M0349K5100j4190q9632M37K2993k7260
6739d6589j11182K1913J26116P4063l7695n0367J01743N1262j44200M6185p1372
6728d0123J6662l9035l6223P8980l172M2629l9751O880O351l719p5833K6971P7208
$$ plain form
6813 -6428 -35087 -2431 50317 -43881 -38415 18795 140472 92915 4472 -4722 -6991 -7499 28935
6800 28935 164009 110508 110128 95367 153016 194398 175657 154857 77514 92046 101074 34363
6788 34363 -19233 33228 107955 111289 75099 41664 -8326 -52571 -46456 13173 6253 -6153
6776 -6153 -4474 -16817 -114644 -13937 111252 10929 45803 -52992 19432 7234 -22641 21131
6764 21131 -38202 1516 114735 83027 16691 -44886 -92121 -43947 -62493 -120306 -81686 -2752
6752 -2752 21415 34460 68745 -20922 -16847 -4386 35963 61063 46873 -42759 -42322 -19329 -46589
6739 -46589 -157771 -135858 -9742 64321 26626 -23741 78002 129264 -14936 31249 -40123
6728 -40123 -23461 -62496 -98719 -19739 -22911 19718 -20033 -13153 -6802 -10521 -86354 -59383 17825
6715A7825L4248q4909l838o3212J09621o2829P5695j2695j18713J09635K15j02679
6703a01636m3295J07604L240m0928J07866p0725k6416O3303O1201k8775M2290
6692G3729k6061K1782M0732q4110O4237L2129r2090j33482J21340M6657j5396
6681D9467m4652o2564K9207O8676J28886o3040j04191j220O7309J3903l0658J269
6669E2392L6177J748m2564M2495J08819l6588o1234M3814Q73K9356j7301j19865
6657C8122L9290K1680l470J8971j3741J1274k6191k6110p4791r713R5641n3786
6645A7176L0286M327p629n7048r1297j8621J08251M3557r3759K9047l7800j0036
6633h3546O7680j4629K831M205l435j1578m8387Q7568O0510R633K5549o3724k2855
$$ plain form
6715 17825 52073 -32836 -36674 -99886 9735 -53094 22601 9906 -108807 828 1043 -101636
6703 -101636 -144931 -37327 -34087 -75015 32851 -37874 -64290 -987 60214 31439 73729
6692 73729 47668 69450 110182 26072 90309 122438 30348 -103134 18206 64863 49467
6681 49467 4815 -57749 -28542 40134 169020 105980 1789 569 67878 81781 51123 52392
6669 52392 88569 90317 47753 90248 199067 162479 101245 145059 145932 175288 157987 38122
6657 38122 77412 99092 95622 114593 100852 112126 85935 59825 -14966 -24679 70962 17176
6645 17176 47462 51789 44160 -12888 -104185 -122806 -14555 29002 -64757 -35710 -73510 -83546
6633 -83546 -15866 -30495 -27664 -23459 -26894 -38472 -86859 709 61219 70852 96401 32677 9822
6620I822j9930j5224p957M034M999R2954r094k9846o8604m8867M6679N4823k2498
6607h709p9996l5481L9366j4700n4016J7773L2320O2706o1616k4479R4888P0706
6595C8762l9026L9432q7801J2825j3328n5234J9451L2918n9411K9805L5419L1683
6583a4505L3149L2427m6859l5947l9010j1387J22153k5658n457K092j7540m7757
6571e4299o6937o0107P806J41750Q952N0719J02503o4691l8548O9391q2591l0887
6559a6939P3460L5069o8287n1953j8252L9883q8851L5457j0123L5274l6419j2451
6547h4132L6963N0419o9629m2555J72397j9788m3403Q5055l2634l5249J7213j7766
6535A6891P0265l7553n9364o4782L1396K1846o0348q222Q1120m9431M6728M8496
$$ plain form
6620 9822 -10108 -25332 -33289 -29255 -24256 68698 59604 29758 -38846 -87713 -41034 13789 -8709
6607 -8709 -88705 -124186 -84820 -99520 -153536 -135763 -103443 -40737 -102353 -126832 -31944 38762
6595 38762 -264 39168 -48633 -35808 -49136 -104370 -84919 -52001 -111412 -81607 -46188 -14505
6583 -14505 18644 51071 4212 -31735 -70745 -82132 40021 14363 8906 10998 -6542 -54299
6571 -54299 -121236 -181343 -173537 -31787 -22835 27884 130387 65696 27148 96539 13948 -16939
6559 -16939 56521 91590 23303 -28650 -46902 -7019 -95870 -60413 -70536 -35262 -71681 -84132
6547 -84132 -47169 3250 -66379 -108934 63463 43675 272 85327 52693 17444 34657 16891
6535 16891 87156 49603 -9761 -74543 -43147 -21301 -81649 -89871 -8751 -58182 -11454 37042
6523C7042m9511o0624m3557O2671J2033N6543K1988m0355O5484L2844q0676r491
6511D391K1977J5731l096j03207J24102J4267j1443n1902n77J616o4945L466J23445
6498G3825l4769l872l2236n9502P1446K6351j811k1489p0319R3996L4011J9768
6486I5399j6146j20528j9155j31721J11310M4070J26944o6366p6108P0874k9759
6475a1186K2966J07522j2263j0631j8390l9396J0717r9040L2133k8849L6354j00180
6463a10243P3273L4174j08451R1118J5876M2137L4697q9641q9068K9667Q8791
6452A2330l9932O9197n0156N3545O8983o4083n893k551L6832o8233o5482k135
6440e7578m91R9121N7229q6311K2127O3704o0720j3720M5222j6777k0687J0382
$$ plain form
6523 37042 -12469 -73093 -116650 -53979 -41946 14597 36585 -3770 61714 94558 13882 4391
6511 4391 26368 42099 39003 -64204 59898 74165 62722 10820 10243 11859 -53086 -49620 73825
6498 73825 39056 35184 2948 -56554 14892 41243 39432 17943 -52376 41620 75631 95399
6486 95399 79253 -41275 -60430 -192151 -80841 -36771 90173 23807 -52301 18573 -11186
6475 -11186 11780 119302 107039 96408 78018 38622 49339 -49701 -17568 -46417 -10063 -110243
6463 -110243 -36970 -2796 -111247 -20129 -4253 37884 72581 -17060 -106128 -76461 12330
6452 12330 -27602 41595 -8561 44984 113967 49884 43991 41440 78272 10039 -55443 -57578
6440 -57578 -58069 41052 98281 11970 34097 97801 37081 23361 68583 51806 31119 41501
6428D1501q2366K5708m7985N7050M9979L9994K7561O8226N2336o5733m3452l6430
6416H6389L8595M1912K5001o903m6589r932j22004l9915Q8863m961k5793J6061
6404D0724M7950n4262P691M2284M1195m0395R0209m1792O9487J2328q9995k6884
6392I8540j11167J2496J05094l4308P6220K0810o7407l7953m4946n7940Q0005
6381C9444R4116j4707k6082l0675l1555O1274m6629K0511n4962K6827P6524k6603
6369H7483R351q846M0739R944J1400p6108j1609L7483L2644N665j2492j3528r1140
6356B0986J433N165n8151N8629K6453n3873N3366l7768j1173R1287J7604J3377
6344A27335k7706K5955j8744k4799K3475j3765m6927Q0967m5751m5910N8932l1086
$$ plain form
6428 41501 -40865 -15157 -63142 -6092 43887 83881 111442 179668 232004 166271 122819 86389
6416 86389 124984 166896 191897 184994 138405 128473 6469 -33446 55417 50456 24663 40724
6404 40724 88674 34412 42103 84387 125582 85187 175396 133604 203091 215419 125424 98540
6392 98540 -12627 -131 104963 70655 146875 167685 100278 62325 17379 -40561 39444
6381 39444 133560 118853 92771 62096 30541 91815 45186 65697 10735 37562 114086 87483
6369 87483 96834 87988 128727 138671 150071 73963 62354 99837 132481 138146 125654 112126 20986
6356 20986 22419 27584 -30567 28062 54515 642 54008 16240 5067 96354 113958 127335
6344 127335 99629 125584 106840 82041 105516 91751 44824 125791 80040 34130 93062 61976
6332F1976J2086N742k876n2307L899O6459M2489j5720J0831r755j3638m9470M8755
6319A08471N4686q4645p6503Q955O5913J428M0145J1027j15222Q2642l3912p0601
6307g616p4969M8474O4354n9809R9973j3585k2609P9523P8752r8939l4427l7097
6295B2025Q644Q5017p812j02607j2233N7602M9910L1059K0288p3747n0532n6128
6283b8514O1947Q0673j1346r3024J12366o5120o0582J4068L10P6882n2797R9926
6271A34789r8039l9833j7440O9727K3563j1089O4412O227n8509n6850R4921m860
6259A07019n7090p0421L9998R124N6268N0755j21976O3931J24276L3604j01294
6248A34194o2764k224K4476p9837O3232J45048j6523q9735n1247k983P2522P6846
$$ plain form
6332 61976 74062 79804 76928 24621 28520 94979 137468 121748 132579 122824 109186 59716 108471
6319 108471 163157 78512 2009 10964 76877 78305 118450 129477 14255 96897 62985 -7616
6307 -7616 -82585 -34111 30243 -29566 70407 56822 34213 113736 192488 93549 59122 22025
6295 22025 30669 115686 107874 5267 -6966 50636 100546 131605 151893 78146 27614 -28514
6283 -28514 33433 114106 102760 9736 122102 56982 -3600 10468 10778 87660 34863 134789
6271 134789 36750 -3083 -20523 49204 72767 61678 126090 132317 73808 16958 111879 107019
6259 107019 49929 -20492 19506 28630 84898 135653 13677 77608 201884 235488 134194
6248 134194 71430 69206 93682 13845 77077 222125 205602 115867 64620 61637 134159 211005
6236B11005N7139m6082l4944L8775p6927o5466j7446O6062k0692M61j527O0876
6224A71234p1495k5987K365M4991m4961L2775P2209j6017j00400j8643J7998L0046
6212I4115J1554m4731M1193L9139q9325l3980k4078K4522j1167k7200M4595O1204
6200H5841o3941O3515n972K5626j5175l7520j6000n2305P9762R897O4333o4351
6188G3710K8061p9249n772L006l6229O0920n5313K9657O9197j06614J5086q724
6176a2264J24766r479o1843N2809k2888o4263M5232N6394O4304j23422m5393P0585
6164G4538O7609o8751j0835Q4838J3282p8617K4095j0184p7246L3482j2009p2907
6152c2705K101J09906p1472L939Q9283L1112l7428q3298K1796R1053R022m1347
$$ plain form
6236 211005 268144 222062 187118 225893 148966 83500 66054 132116 111424 111885 110358 171234
6224 171234 99739 73752 76117 121108 76147 108922 181131 165114 64714 46071 64069 94115
6212 94115 105669 60938 102131 141270 51945 17965 -6113 18409 7242 -19958 24637 85841
6200 85841 21900 85415 79443 105069 89894 52374 36374 -15931 63831 73728 138061 73710
6188 73710 101771 22522 16750 19756 -16473 44447 -10866 18791 87988 -18626 -3540 -12264
6176 -12264 112502 103023 41180 93989 71101 6838 52070 108464 172768 49346 3953 74538
6164 74538 142147 73396 62561 147399 160681 82064 106159 95975 18729 52211 40202 -32705
6152 -32705 -30604 79302 7830 11769 101052 132164 94736 11438 33234 124287 133309 91962
6140I1962M0744k927n1640m395k1367J27892P4929o6831N1342j4620j32594l4426
6128E8069L8016M3013p8238Q3688N6089L098j8364J3504n2015n3967q7672p4849
6116f9628J08165J36410O2819q7498l2321K9376M046N7768J1210l7425p4445L4288
6104A42765l4550l2246M5650r2260k0335L608J68289j52516j9950j1422R9885
6093I6918P4445o2944m9516K7929J44486m1984j03601N8573k6428n7213J28037
6082A88702N6111n4847L2362K0002q5311R5901m2589m6247j3316j08312J8356
6071F0812L9120K4376R8756J1321q6964K2482l5819N9322J25837j38296m1530
6060A39417J14338m9262l0020k6108p4009O4012K8414l4033O97K5163p822L6871
$$ plain form
6140 91962 132706 129779 78139 73744 52377 180269 255198 188367 239709 225089 92495 58069
6128 58069 96085 139098 60860 144548 200637 203735 185371 198875 146860 92893 5221 -69628
6116 -69628 38537 174947 237766 150268 117947 147323 151369 209137 220347 182922 108477 142765
6104 142765 108215 75969 121619 29359 9024 12632 180921 28405 8455 -2967 96918
6093 96918 171363 108419 58903 86832 231318 189334 85733 144306 117878 60665 188702
6082 188702 244813 189966 222328 242330 157019 252920 210331 164084 150768 42456 60812
6071 60812 99932 124308 223064 234385 147421 169903 134084 193406 319243 180947 139417
6060 139417 253755 204493 174473 148365 74356 138368 166782 132749 133446 158609 150787 187658
6048A87658k5479K4461Q7824l0074j8683K2327K785O9832L1494m3570k0389R010
6036B97196j9381p0402j00985L3163M1456P015O9848o6696j3711Q9530j58150
6025A08883n0631Q1594k2674J3730J31825N8790m7726p3254m7114k5559L9234
6014A67098M3789m4588l0753J05485o8824o254J7766K0371l8032K1772j9125L859
6002A72564L713K5167k9306M3111J7631j4048q712o495K6307q818j2360K5201
5990B33955J516O3138K2561J550P8567o1407j6155m8415j6678M8884M5668L3004
5978C86188p1706j3881K675q1336k238p3m3417l1469J13412m6222k6389J5946
5966B01490M109k7593P2658J05871j31652o3287J10050N6656j0812l4943P0364
$$ plain form
6048 187658 162179 186640 274464 244390 225707 248034 250819 320651 352145 308575 288186 297196
6036 297196 277815 207413 106428 139591 181047 188062 257910 191214 177503 267033 108883
6025 108883 58252 139846 117172 130902 262727 321517 273791 200537 153423 127864 167098
6014 167098 210887 166299 135546 241031 172207 165953 183719 204090 166058 187830 168705 172564
6002 172564 176277 201444 172138 215249 232880 218832 210120 203625 229932 221114 208754 233955
5990 233955 235471 298609 321170 322720 401287 339880 323725 275310 258632 307516 353184 386188
5978 386188 314482 300601 303276 221940 219702 219629 176212 144743 258155 211933 185544 201490
5966 201490 205599 178006 250664 356535 224883 161596 271646 328302 317490 282547 352911
5955C52911J9056N0735o6010L3932J12480j21689K3700q5368j15193l3654l9219
5944A31681J26493q2686Q1197R8131J12162J8645o3884p6790o8649m8962K7141
5933B54479J24473n649j3322n1828L8079Q0253l0471n7895m710L0222R016M8245
5921D20892k4124m0264P539m7959o7937J6093R9665m1733p5379Q8327M5980k6302
5909C54798J64279p8440j26785k2389R4450R1056r1150m7846m4595Q8625k9369
5898C52634l2454K9345N8016k60l9190j21474J10143K4843p175k2521j7784M6861
5886C80984K0655o0398J7696K9390q6829l1089Q6895P9759l0026r4897J5948Q8783
5874D16871r682l2672J00452o2493q3327L2703j04827N3187Q664k8184L214Q6734
$$ plain form
5955 352911 371967 422702 356692 390624 503104 381415 405115 319747 204554 170900 131681
5944 131681 258174 175488 256685 354816 466978 485623 421739 344949 276300 227338 254479
5933 254479 378952 373303 359981 308153 346232 426485 396014 338119 333409 363631 372647 420892
5921 420892 396768 356504 364043 316084 248147 264240 363905 322172 246793 335120 381100 354798
5909 354798 519077 440637 313852 291463 385913 476969 385819 337973 293378 382003 352634
5898 352634 320180 349525 407541 407281 368091 246617 356760 381603 374428 351907 334123 380984
5886 380984 401639 341241 358937 388327 301498 270409 357304 437063 407037 312140 328088 416871
5874 416871 407189 374517 474969 412476 329149 361852 257025 310212 318876 290692 293906 380640
5862C80640m2642j6368j06369L8275Q7436P8117k2527j5040j7070O6725n4710
5851C76467Q0749L7397p8570L2746r5817m6496M0244J0158M3911N177k8244K9225
5839D06947Q3779k0992n7490M4172r5280M8209L7980k2161M3940k3486k2876k101
5827D20641R8626m6362j08743k6941M5844O7127k686k9551m4832m6758M6544N3496
5815D26405K4272r6133O2851Q59k1683J25453n7406m2248n6556j4590l9635J28820
5803D40409n858j08022j9711N7188O5478Q7420j00651j07215P4716N5958J8357
5792D58069J3209P7033l9337q5269L9416R3947l7357j10412K927n3779L7628L9069
5780D35144l7209J29128r5590n3293N6765K1088m3454L4166L853k9219p7884N2797
$$ plain form
5862 380640 337998 321630 215261 253536 340972 419089 396562 381522 364452 431177 376467
5851 376467 457216 494613 416043 448789 352972 306476 346720 356878 400789 405966 377722 406947
5839 406947 490726 469734 412244 456416 361136 409345 447325 425164 469104 445618 422742 420641
5827 420641 519267 472905 364162 337221 383065 450192 447506 417955 373123 326365 372909 426405
5815 426405 450677 354544 417395 418254 396571 522024 464618 422370 365814 351224 311589 440409
5803 440409 434551 326529 306818 364006 429484 516904 416253 309038 383754 439712 458069
5792 458069 471278 548311 508974 423705 463121 557068 519711 409299 412226 358447 396075 435144
5780 435144 397935 527063 431473 378180 434945 456033 412579 446745 450598 421379 343495 396292
5768C96292M5406r4399K3310L8380K2694p8378L5715P179j3096M9705j275J4491
5756D46024k9118L4792m7060K6131j3628k6627m096k297J07243K4497n4133L2628
5744D94356L9661p2160L164o2695R3597N2196l65p2890l6900J38039P343p1112
5732E12234n9443o0626J19898N5921j4835k9632q5083k9226L8799Q1738L439L0384
5720E63568K7129o5797l8014J25483l296o6461J1834l058P792l2908k3303l8042
5708D64927J4367M4300k2091Q6610O2076q6511n0400k8166N8870j3351K7662r1091
5696D67202J2628J9394O0751j7321l4161O2009M2211K301q0658m338j1795p6978
5684D41245o2830O1000K3470R8621m8201L073O4061O8014m7165j04522J4782R3035
$$ plain form
5768 396292 441698 347299 370609 408989 431683 353305 389020 396199 383103 432808 431533 446024
5756 446024 416906 451698 404638 430769 417141 390514 386418 384121 491364 515861 461728 494356
5744 494356 534017 461857 465021 402326 495923 548119 547754 474864 437964 576003 583346 512234
5732 512234 452791 392165 512063 567984 553149 523517 438434 409208 448007 529745 533184 563568
5720 563568 590697 524900 486886 612369 609073 542612 554446 551388 559180 526272 502969 464927
5708 464927 479294 523594 501503 588113 650189 563678 513278 485112 543982 530631 558293 467202
5696 467202 479830 499224 559975 542654 508493 570502 612713 615014 534356 530018 518223 441245
5684 441245 378415 439415 462885 561506 513305 516378 580439 648453 601288 496766 511548 604583
5672F04583j3553m2039O3924p1281l3157R581J1338J1838P8597m1551j5346j8683
5660E44251L0187j9922j9850M0179l5284L7512l3363J6996l8102k8975P6294P8848
5648F48771m2993K4881J0063J3993m3667j33237R6360o9564L5205J4145p0979
5637D82978L7649J27214N7254L5252K2641l3788q3570j7059R0495J11860M0339
5626H71265o4285j32485j31132M5244R6145K9889l4456L3992j6437Q5039J3084
5615G95863K3480n3102K3582o0109m4664R9616L2512K0008L0196k5188M5298n1612
5603H35880R3440O6657l0870p4499K7068M5531l2487R340j40368J16902j7306
5592H99288J5199L5990O4896M7884j27006o9359M0466P0823k2938J5483K6440
$$ plain form
5672 604583 591030 548991 612915 541634 508477 518058 529396 541234 619831 578280 562934 544251
5660 544251 574438 554516 534666 574845 539561 577073 543710 560706 522604 493629 569923 648771
5648 648771 605778 630659 640722 654715 611048 477811 574171 504607 539812 553957 482978
5637 482978 520627 647841 705095 740347 762988 729200 645630 628571 719066 830926 871265
5626 871265 806980 674495 543363 588607 684752 714641 680185 714177 697740 782779 795863
5615 795863 819343 766241 789823 729714 685050 784666 817178 837186 867382 842194 887492 835880
5603 835880 929320 995977 965107 890608 917676 963207 930720 940060 799692 916594 899288
5592 899288 914487 950477 1015373 1063257 936251 866892 907358 978181 955243 970726 997166
5581I97166L0728J7371J946K3839j5232L1062j30426k1271Q8722J5846J8163m403
5569A053511K1568K8235L5940l0214R8829l420K1420l3398O2415p7370Q168R9869
5557A285553L2151n652l120J2365M30M0204L8967L7883l0547M1071K7386j01702
5545A374989L4242O5067K5878N2959M6268O4828k0590N0037J17515L2418M6503
5534A890114k9697O7720J21662J23453N5201N2429J21754J0814M0650J38177K16762
5523B809039m5605J65697J74787r5198n9789O9989l1082O2293m1783M5180o120
5512C047408L7660L2650J18407J34189L9134R9750J05754J17561N3298L7867J09515
5501C933193L4743J398J73362J43740J48871J30731J17937K63727M6142K43129
$$ plain form
5581 997166 1027894 1045265 1047211 1071050 1055818 1086880 956454 935183 1023905 1039751 1057914 1053511
5569 1053511 1075079 1103314 1139254 1109040 1207869 1204449 1225869 1192471 1254886 1177516 1185684 1285553
5557 1285553 1317704 1312052 1308932 1321297 1321727 1361931 1400898 1438781 1408234 1449305 1476691 1374989
5545 1374989 1409231 1474298 1500176 1553135 1599403 1664231 1643641 1693678 1811193 1843611 1890114
5534 1890114 1860417 1928137 2049799 2173252 2228453 2280882 2402636 2413450 2454100 2592277 2809039
5523 2809039 2763434 2929131 3103918 3008720 2948931 3018920 2987838 3050131 3008348 3053528 3047408
5512 3047408 3085068 3117718 3236125 3370314 3409448 3509198 3614952 3732513 3785811 3823678 3933193
5501 3933193 3967936 3969334 4142696 4286436 4435307 4566038 4683975 4947702 4993844 5236973
5491E236973R9958p6075j27556j72449j84416l10151j57930q5249p7221j89586
5481C956298J2340K2094p1330j35501j11574K8240p5940j17433M7808L0785k1990
5470C563797p4460k0462N8847M2525J63754O6398L1510O0957p0904L5166p3125
5459C784003q3162j13101j34614q7240k4191p9055j32314n859Q0989j9799Q3804
5448C269461Q706l437k5588j7760k4001j25049j15756l914N862j1665j66513o2035
5436B728311O0173j45138L722R784K4602m6739p4064n4256o2480L5865j7603O7765
5424B529942j1029m4184J09980n7672Q8423J02845j28061l3116p4033o9085K2307
5413B436317l1217p3424j6060L9030R280j08356l7034J94413J4944Q0494J12300
$$ plain form
5491 5236973 5336931 5260856 5133300 4960851 4776435 4466284 4308354 4223105 4145884 3956298
5481 3956298 3968638 3990732 3919402 3783901 3672327 3700567 3624627 3507194 3555002 3585787 3563797
5470 3563797 3489337 3468875 3527722 3570247 3734001 3800399 3831909 3892866 3821962 3857128 3784003
5459 3784003 3700841 3587740 3453126 3365886 3341695 3262640 3130326 3124467 3205456 3185657 3269461
5448 3269461 3278167 3274730 3249142 3231382 3207381 3082332 2966576 2962662 2968524 2956859 2790346 2728311
5436 2728311 2788484 2643346 2647068 2656852 2681454 2634715 2560651 2506395 2443915 2479780 2462177 2529942
5424 2529942 2518913 2474729 2584709 2527037 2615460 2718305 2590244 2557128 2483095 2414010 2436317
5413 2436317 2405100 2331676 2315616 2354646 2363926 2255570 2218536 2412949 2427893 2508387 2620687
5402B620687n693R0252q2859j00189J1390l5775q9365r1175j06250j9592K3040
5391B214471n8211O1575R0480Q1063M6759R5941P3382j1330j02428k7052J80777
5380B645427O4895P5383J25829K5075m7618Q8209J23304J64234R6448r5322J391
5369C267255M4949J27596K646J50779Q0105J25044L24289K90583L22768Q6282
5359D822296R4790q6155j47580j04382k52644k14672p8083j20144K0038j0937
5349C922527m4982j6853k3754j2265P7328M6358Q3908K25159J21537K10695L00035
5338D889693K97705K94504K41463L2875k5900j03685k26745l15783k54605j62218
5328D667304j02755k16990q7760j25800j03263p1565j11442o9831n4418J3496
$$ plain form
5402 2620687 2614994 2705246 2622387 2522198 2533588 2497813 2408448 2317273 2211023 2191431 2214471
5391 2214471 2156260 2217835 2308315 2389378 2436137 2532078 2605460 2594130 2491702 2464650 2645427
5380 2645427 2710322 2785705 2911534 2936609 2888991 2977200 3100504 3264738 3361186 3265864 3267255
5369 3267255 3312204 3439800 3442446 3593225 3673330 3798374 4122663 4413246 4736014 4822296
5359 4822296 4917086 4830931 4683351 4578969 4326325 4111653 4033570 3913426 3933464 3922527
5349 3922527 3877545 3860692 3836938 3824673 3902001 3948359 4032267 4257426 4378963 4589658 4889693
5338 4889693 5187398 5481902 5723365 5756240 5730340 5626655 5399910 5084127 4829522 4667304
5328 4667304 4564549 4347559 4259799 4133999 4030736 3959171 3847729 3777898 3723480 3736976
5318C736976l0165k2208j8781o8920p7366n5262K8448M0587M8176N6881K0164
5307C658530R5283M0440K4490n269m2998P5280n338l2313o6602p4625j12588j7404
5295C536886l319j38732j3618n9460l1886k7093L1959R8948o9880J4788Q4902
5284C423495m226p5121J9003J27432m5064j00321n1805J2796L9639J09983o7914
5273C387897k0499m6522q657R186J40015J9495K0946j18787j8413J06784m7846
5262C423599J7314O5277R3152J43712O81R0048R1104R1859J9518j27713j21255
5251C787296k1912L0306J4361n9256Q6971K21657K0200K6013j2177L0513J19918
5240D243890j8122l0137P0171J15246J75413P8520K7081J4431J92018J45187R2181
$$ plain form
5318 3736976 3706811 3684603 3665822 3596902 3519536 3464274 3492722 3533309 3581485 3638366 3658530
5307 3658530 3753813 3794253 3818743 3813474 3770476 3845756 3840418 3808105 3741503 3666878 3554290 3536886
5295 3536886 3533567 3394835 3381217 3321757 3289871 3262778 3294737 3393685 3323805 3338593 3423495
5284 3423495 3419269 3344148 3363151 3490583 3445519 3345198 3293393 3306189 3345828 3455811 3387897
5273 3387897 3367398 3320876 3312219 3321405 3461420 3480915 3501861 3383074 3364661 3471445 3423599
5262 3423599 3440913 3506190 3599342 3743054 3743735 3833783 3924887 4016746 4036264 3908551 3787296
5251 3787296 3765384 3795690 3810051 3750795 3837766 4059423 4079623 4105636 4093459 4123972 4243890
5240 4243890 4225768 4195631 4265802 4381048 4556461 4634981 4662062 4676493 4868511 5013698 5105879
5229E105879J31258K18673K19914K21333R9537m6626j20828J91102Q9703O4947
5219F174892m0065J18435J50704J60293N0220P2146K64011J97524J37510J90708
5209G476378J28648J60804K97464K03900L51682L42820M55652N71528O71020P03423
5199A1363319O70762Q12776Q30172Q34946J112534J322269J375437J325953P64657
5190B0412825j12716r49595j270494j345331j199351q92743p44336n00847l26606
5181A3070806j11679r7049l0767K7506J87120K00394J68442M45985M95522O16766
5171A4973046O40835O78282N27355K65428Q3198j55531o18069o79903o85823o91884
5161A4336934n63568n77414l96911m32743l10774o8141k03203o6216r4840o2616
$$ plain form
5229 5105879 5237137 5455810 5675724 5897057 5996594 5949968 5829140 6020242 6109945 6174892
5219 6174892 6134827 6253262 6403966 6564259 6614479 6686625 6950636 7148160 7285670 7476378
5209 7476378 7605026 7765830 8063294 8267194 8618876 8961696 9417348 9988876 10659896 11363319
5199 11363319 12034081 12846857 13677029 14511975 15624509 16946778 18322215 19648168 20412825
5190 20412825 20300109 19350514 18080020 16734689 15535338 14642595 13898259 13397412 13070806
5181 13070806 12959127 12862078 12831311 12858817 13045937 13246331 13414773 13860758 14356280 14973046
5171 14973046 15613881 16292163 16819518 17084946 17168144 17012613 16394544 15714641 15028818 14336934
5161 14336934 13773366 13195952 12799041 12366298 12055524 11987383 11784180 11717964 11623124 11560508
5151A1560508J11331O4154J13057J13067J75008O9829J17749J36399K40248J88810
5141A2890160J96815L14793K77358K97165K96407L56487K97959M25934L54539
5132A5707617K71826N63100O23830N54782N31203N50802M82697O66808P28325
5123B0680990O77426Q65248R38111R96261J189971J137234J315132J543692J706808
5114C1050873J842999K175166K572442K765783L070406L473481L955148M700156
5106E5606454N010068M495249K445666R01479J188503J075031p09215l078327
5098F6934908l485670k575391j917135j281731l52139O01845J386626K093044
5090F1404357K808042L482911M014302M445542M980895N956268O684065Q202666
$$ plain form
5151 11560508 11671839 11735993 11849050 11962117 12137125 12206954 12324703 12461102 12701350 12890160
5141 12890160 13086975 13401768 13679126 13976291 14272698 14629185 14927144 15353078 15707617
5132 15707617 15979443 16542543 17166373 17721155 18252358 18803160 19285857 19952665 20680990
5123 20680990 21358416 22223664 23161775 24158036 25348007 26485241 27800373 29344065 31050873
5114 31050873 32893872 35069038 37641480 40407263 43477669 46951150 50906298 55606454
5106 55606454 60616522 65111771 67557437 68458916 69647419 70722450 70013235 66934908
5098 66934908 63449238 60873847 58956712 57674981 57322842 57924687 59311313 61404357
5090 61404357 64212399 67695310 71709612 76155154 81136049 87092317 93776382 101979048
5082A01979048R720190J1039407J0735260O888982K192583J121689J346572k145119
5074A42878612p035032q604362o580601m766143l203402r71358J012042K958666
5066A15688422M908869O889965Q029910Q780683N810693L017063M491782O497119
5058A64114506Q531431J1708850J4632131J6435275J3552739J2328429J6893375
5051B58196736K0928792K2463785J6237588L30058j1334706q980765n531855l706819
5043B88602814m794266r059019j1272518q472921o225058r846496j7357394j8254144
5035B03320998j4200739j1351054q348821n245880n119918q094659o392818m428396
5027A40138713k921757p92793J535686K597562K059784l91884j648504m486534
$$ plain form
5082 101979048 111699238 122738645 133473905 140362887 142555470 143677159 145023731 142878612
5074 142878612 135843580 127239218 120658617 115892474 112689072 111717714 112729756 115688422
5066 115688422 120597291 127487256 135517166 144297849 150108542 153125605 157617387 164114506
5058 164114506 172645937 184354787 198986918 215422193 228974932 241303361 258196736
5051 258196736 279125528 301589313 317826901 318156959 306822253 297841488 292309633 288602814
5043 288602814 283808548 274749529 263477011 255004090 248779032 238932536 221575142 203320998
5035 203320998 189120259 177769205 169420384 164174504 159054586 150959927 144567109 140138713
5027 140138713 137216956 136424163 137959849 140557411 142617195 142225311 140576807 136090273
5019A36090273q701789p823548o570523n679868l859804j893177o00604j299419
5011I9661541l711951l270937j893307j184737o65776j353880m307137m702203
5003G8571613l676220l348988k657985j618099l26711Q08918J239576J195449
4995G0187553j473702n030460m936439m585841m413163l806112l124658k381882
4987D0435296j809160j604006j387784j238860r77355q08777p74916p45738p26867
4978C0361833o56134m66130n26702m11907m91780m60559m33897k63276k45797
4969B6405651k36345k04133k09396k28043p156p8075j62552j19359l0921m0846
4959B5088825L3552M9356J47820J60515K41775K42958K07950K41381L19862M73576
$$ plain form
5019 136090273 127388484 119564936 112994413 107314545 103454741 101561564 100960960 99661541
5011 99661541 95949590 92678653 90785346 89600609 88934833 87580953 83273816 78571613
5003 78571613 74895393 71546405 68888420 67270321 66943610 67752528 68992104 70187553
4995 70187553 68713851 63683391 58746952 54161111 49747948 45941836 42817178 40435296
4987 40435296 38626136 37022130 35634346 34395486 33418131 32609354 31834438 31088700 30361833
4978 30361833 29705699 29239569 28712867 28300960 27809180 27348621 26914724 26651448 26405651
4969 26405651 26169306 25965173 25755777 25527734 25520578 25442503 25279951 25160592 25129671 25088825
4959 25088825 25122377 25171733 25319553 25480068 25721843 25964801 26172751 26414132 26733994 27207570
4949B7207570M85511M35206N18254O49665O30547Q18564R24204J206327J320734
4940C4196582J599247J782238K095306K569227K756461L290347L755269M487382
4932E6532059N463719O280083O298444M681242L240799M148829N270862O075258
4924I7991295M366682j067494m484508n472635q527690r622313p914048o296776
4916E8972513m396170l098522j961233j293029o17666j18476M01303O82564J137019
4907D9708303J469541J810763K168429K468090L275041M123854M729141N015573
4899G4768735K911561J78308L47106J328249K576018M320118N385470M051412
4891I5866977J042842K81248J513444L201322M817232O698390R032924J1855179
$$ plain form
4949 27207570 27693081 28128287 28646541 29296206 29926753 30745317 31669521 32875848 34196582
4940 34196582 35795829 37578067 39673373 42242600 44999061 48289408 52044677 56532059
4932 56532059 61995778 68275861 74574305 79255547 82496346 86645175 91916037 97991295
4924 97991295 102357977 101290483 96805975 91333340 82805650 73183337 65269289 58972513
4916 58972513 54576343 51477821 49516588 48223559 47605893 47487417 47888720 48571284 49708303
4907 49708303 51177844 52988607 55157036 57625126 60900167 65024021 69753162 74768735
4899 74768735 77680296 77858604 78205710 79533959 82109977 86430095 91815565 95866977
4891 95866977 96909819 97191067 98704511 101905833 106723065 113421455 122454379 134309558
4883A34309558J3927738J2101996J124418j2766625j6015463j3467557j0159037
4876A09055028n788514k248986L54866K323310L733584N437124P814292J0549325
4868A31230029J2149170Q354240m237169j4153387j5496036j3834441j0645846
4861I3366560p113231m288334k316161p33682k29439j055439k723310l413342
4853G1493622l048915k138126j267186o21711j231449k449613k512517k006562
4845E6217543j777688j332989q71599m93792k536L05926O19131J030975J408080
4836E5103051J852351K247326K817697L270400L938668M599958N486192O434178
4828H5749821P341412Q092684P248076O664996O479385O650675P079161O694397
$$ plain form
4883 134309558 148237296 160339292 161463710 148697085 132681622 119214065 109055028
4876 109055028 103266514 101017528 101372394 103695704 107429288 112866412 120680704 131230029
4868 131230029 143379199 151733439 147496270 133342883 117846847 104012406 93366560
4861 93366560 86253329 81964995 79648834 78915152 78685713 77630274 74906964 71493622
4853 71493622 68444707 66306581 65039395 64417684 63186235 60736622 58224105 56217543
4845 56217543 54439855 53106866 52235267 51741475 51738939 52044865 52663996 53694971 55103051
4836 55103051 56955402 59202728 62020425 65290825 69229493 73829451 79315643 85749821
4828 85749821 93091233 101183917 108431993 115096989 121576374 128227049 135306210 142000607
4820A42000607L86876l157228j401743q20543j161929k980968j541210j850058
4812A29473804l042424j251684J102055L088200N416985O337922N251532N790018
4804A52166408P125976N689715O541540R245563R724112L351302q491389j0645636
4796A74707591p664492p048031p479703q102172m780688j803552J70003M85474
4788A38484430j356216l841938n188798l714789j965756p02322P32444o38139
4780A21808916j355584R4031p60300p296390j1588049r677470r062124q461154
4772G3701876o921587n108633l904447k908550k478893k087904k077561j953294
4764D6261007j854775j634873j450045j293322j178723j016151q69170j026478
$$ plain form
4820 142000607 142387483 139230255 137828512 137007969 135846040 132865072 131323862 129473804
4812 129473804 126431380 125179696 126281751 129369951 134786936 141124858 146376390 152166408
4804 152166408 159292384 164982099 171523639 180769202 190493314 193844616 185353227 174707591
4796 174707591 167043099 159995068 152515365 144413193 139632505 137828953 137998956 138484430
4788 138484430 137128214 133286276 128097478 124382689 122416933 121714611 122447055 121808916
4780 121808916 120453332 120547363 119787063 112490673 100902624 91225154 82163030 73701876
4772 73701876 66780289 61671656 57767209 54858659 52379766 50291862 48214301 46261007
4764 46261007 44406232 42771359 41321314 40027992 38849269 37833118 36963948 35937470
4756C5937470j148329j122746j069890j002543r16792q99117r15230q11333p95045
4747B7256445p95197q57892o77025o24514p54418o09408m57131n53908n30108
4738B1396844n08290l66330m43950k88868k79019k48408k53379k32494j34928
4729A8641178j24321k89976m39502l48112l97600l48338l02284k66555k93977
4720A5830513k45079k10744k30199j26889n6422j80119j32949J9497k9049o2989
4710A4575571L1443p8151K143j20041j54613j08489p2421j13541j35803j17346
4700A3708752p0813M4102J27281K66055J12499J00262J94909K81277L32317L04706
4690A5401347L38132L91496K56600L8956o1924k45211j71587k64704l39817m93104
$$ plain form
4756 35937470 34789141 33666395 32596505 31593962 30677170 29778053 28862823 28051490 27256445
4747 27256445 26461248 25603356 24926331 24301817 23547399 22937991 22480860 21926952 21396844
4738 21396844 20888554 20522224 20078274 19789406 19510387 19261979 19008600 18776106 18641178
4729 18641178 18516857 18226881 17787379 17439267 17041667 16693329 16391045 16124490 15830513
4720 15830513 15585434 15374690 15144491 15017602 14961180 14781061 14648112 14667609 14638560 14575571
4710 14575571 14607014 14528863 14531006 14410965 14256352 14147863 14075442 13961901 13826098 13708752
4700 13708752 13637939 13682041 13809322 14075377 14187876 14288138 14483047 14764324 15096641 15401347
4690 15401347 15739479 16130975 16387575 16426531 16364607 16119396 15947809 15683105 15343288 14850184
4680A4850184m13285m36665m79907l95914k70567j38007j58046p2680j38966p7597
4670A2268550j81902j87845j79108k30426q8562j38409j61793q5818k14440j84912
4660A0615335j16329j62656j62824j91533p9619k18147j08184M2294j20643k17759
4650I279935j31517r5062k10937l3666q8290p8561L4472p7032m1772j05358j44567
4639H307645j70408o3529j16335j53452j63606j81340j46558p2553o3325n9538
4629G117001k9542k1986o6038j14378o3292j35585M6277p0679q9714m8924n1852
4618F471288p1689q9922r237Q6632K0672o9780j39268R444L2106o5587o0689j02040
4606F011930n9342o3307Q9239L221j19869k767m5046k6635M574o3123R5365o7914
$$ plain form
4680 14850184 14436899 14000234 13520327 13124413 12853846 12715839 12557793 12485113 12346147 12268550
4670 12268550 12086648 11898803 11719695 11489269 11400707 11262298 11100505 11014687 10800247 10615335
4660 10615335 10499006 10336350 10173526 9981993 9902374 9684227 9576043 9618337 9497694 9279935
4650 9279935 9148418 9053356 8842419 8808753 8720463 8641902 8676374 8599342 8557570 8452212 8307645
4639 8307645 8137237 8073708 7957373 7803921 7640315 7458975 7312417 7239864 7176539 7117001
4629 7117001 7087459 7065473 6999435 6885057 6821765 6686180 6732457 6661778 6572064 6523140 6471288
4618 6471288 6399599 6309677 6300440 6387072 6407744 6337964 6198696 6208140 6240246 6174659 6113970 6011930
4606 6011930 5952588 5889281 5978520 5981741 5861872 5859105 5814059 5787424 5791998 5728875 5824240 5756326
4594E756326K9855O9999K3413J5391m3401j3350R5745L0224O1557k5590N1173
4583F051342J05484J44373k9173m7442J90251J38720Q8171P7026N0947J28721
4573F898420J63910J89299K45477K88899J60859J02681R8372J1451R5728J40489
4563H395585K22014J08190J16724K30706K95840J72132J88062J31374J09222J14860
4553A0084709K11827K31854J68622J57844K81896L07101K61606K43047K50462
4544A2198968K16822L27518J75137J81391L06646M53259M17582L16586K14978
4535A4808887J82514J83799K77343K52960L06974L88293M18441N22846N85827
4526A7927884P31717O92694O87508O98487O41957N58497N25654N78835N36278
$$ plain form
4594 5756326 5786181 5856180 5879593 5894984 5851583 5838233 5933978 5964202 6025759 6000169 6051342
4583 6051342 6156826 6301199 6272026 6224584 6414835 6553555 6641726 6718752 6769699 6898420
4573 6898420 7062330 7251629 7497106 7786005 7946864 8049545 8147917 8159368 8255096 8395585
4563 8395585 8617599 8725789 8842513 9073219 9369059 9541191 9729253 9860627 9969849 10084709
4553 10084709 10296536 10528390 10697012 10854856 11136752 11443853 11705459 11948506 12198968
4544 12198968 12415790 12743308 12918445 13099836 13406482 13859741 14277323 14593909 14808887
4535 14808887 14991401 15175200 15452543 15705503 16012477 16400770 16819211 17342057 17927884
4526 17927884 18659601 19352295 20039803 20738290 21380247 21938744 22464398 23043233 23579511
4517B3579511P54615R52574R32434J087330J361761J484322J637444J751554J979600
4508C5521145K271738K589192K947685L537098M229394M837986N562453O412372
4500F7909063P398743Q333441R336701J0756627J2613909J4528280J5582100J2723267
4492A59182131O370017K89104l588328n769248m648153j230574K629642O726777
4484A59961368R105087N691974m539554j2413170j2610486j0444145q141400m551535
4476A22058139p62980K347339N406810Q045197R208842O700379J819658k586486
4468A52236898l225585j530920n47306j179620j650507k348418j732777j980797
4460A38040968q284441j4722336j4798244j2909626j1475166r279886p142488
$$ plain form
4517 23579511 24334126 25286700 26219134 27306464 28668225 30152547 31789991 33541545 35521145
4508 35521145 37792883 40382075 43329760 46866858 51096252 55934238 61496691 67909063
4500 67909063 75307806 83641247 92977948 103734575 116348484 130876764 146458864 159182131
4492 159182131 165552148 165841252 162252924 156483676 151835523 150604949 153234591 159961368
4484 159961368 169066455 174758429 170218875 157805705 145195219 134751074 126609674 122058139
4476 122058139 121295159 123642498 129049308 137094505 146303347 153003726 154823384 152236898
4468 152236898 149011313 147480393 146933087 145753467 144102960 141754542 140021765 138040968
4460 138040968 129756527 115034191 100235947 87326321 75851155 66571269 59428781
4453E9428781n397743m575654l692863l198060k729421k376319j959583j867287
4445C3631851j566746j478824j355173j254232j092232j045259q45748q00256
4437B4193381o28518p09635o46112o32149p24026q01058o02951o41059o08912
4428A8198961o12100n56260l52668l86562m51585m87001l79786l69447l63808
4419A4239744j86712k98651m24869l57563l10471k82987l37232l58979k36462
4410A1445818k21608k31472k88570l04167j48644k67483q3999q9307j41735k53339
4400I415494j83460p6905o1996q7321j31465j97929j51150k68357k13007k35104
4390G808800j68849p1771r1273q9874k04155j24548o6323o9188q7196k12729k24222
$$ plain form
4453 59428781 54031038 49455384 45762521 42564461 39835040 37458721 35499138 33631851
4445 33631851 32065105 30586281 29231108 27976876 26884644 25839385 24993637 24193381
4437 24193381 23564863 22855228 22209116 21576967 20852941 20051883 19448932 18807873 18198961
4428 18198961 17586861 17030601 16677933 16291371 15839786 15352785 14972999 14603552 14239744
4419 14239744 14053032 13754381 13329512 12971949 12661478 12378491 12041259 11682280 11445818
4410 11445818 11224210 10992738 10704168 10400001 10251357 9983874 9899875 9810568 9668833 9415494
4400 9415494 9232034 9155129 9093133 9005812 8874347 8676418 8525268 8256911 8043904 7808800
4390 7808800 7639951 7568180 7476907 7387033 7182878 7058330 6992007 6922819 6835623 6622894 6398672
4379F398672j62026j3403q4473k05967l8448j02615j89900j32175k16035r0962
4369E162668q4353j44459j37367j89991o9155n5080j48270m6463q2702j48604
4359D056224p4334m1465o3918j03652j72167M4294P337r4248j82989n9734j8072
4348C297276j26087l7768o3286p5649n2404p6768J22523j26159n8149M6334k6425
4337B823438N173j02792N4824n6080m8219J337j28697q5917r4839r7610o3813
4326B206805k551k3570o2061j821n3414P7432l333k5058j7995l107j79048n40
4314A911739p6799j25378P6971L0636p442j3263n8474m8445M5529m3336n9284
4303A632454Q430J9171j16189m4631j0921j00535k174R387j07831j9910J54163
$$ plain form
4379 6398672 6236646 6223243 6138770 5932803 5894355 5791740 5601840 5469665 5253630 5162668
4369 5162668 5078315 4933856 4796489 4606498 4537343 4482263 4333993 4287530 4204828 4056224
4359 4056224 3981890 3940425 3876507 3772855 3600688 3644982 3652319 3558071 3375082 3315348 3297276
4348 3297276 3171189 3133421 3070135 2994486 2942082 2865314 2987837 2861678 2803529 2849863 2823438
4337 2823438 2828611 2725819 2780643 2724563 2676344 2677681 2548984 2463067 2368228 2270618 2206805
4326 2206805 2204254 2180684 2118623 2116802 2063388 2140820 2137487 2112429 2094434 2091327 1912279 1911739
4314 1911739 1834940 1709562 1786533 1817169 1809727 1796464 1737990 1689545 1735074 1691738 1632454
4303 1632454 1640884 1660055 1543866 1499235 1488314 1387779 1385605 1394992 1287161 1267251 1421414
4292A421414j992l297j31337k6941R2017k5420J7570k5034k1130J8723j3719n8087
4280A242767k8798l3006k2936K7493R1275m4618j47744k6792p5460M4571m5649
4269I81103K0497l2680l2374Q1138K1508j04983n9640R0020N3778j07765M8165
4258I58767p0477j09251R2308p0850L2802j7030M2035K8947l4109L3624M2917
4247I29683o4747k3453j4754K1366K8267L2349j47159J8489L3790k4245k8746
4236G60840p5861j9625M6620O2868L4312j7304M8687J4015q7028r9128q4818n3139
4224E30439Q05J2755k1585J09899q8209m4363j4112N0359P6711R0856n1330j16230
4212E35995Q105J466k5933Q256k3201N7712O4923j03809n5924p4257K1602K6903
$$ plain form
4292 1421414 1419422 1416125 1284788 1257847 1349864 1324444 1342014 1316980 1295850 1314573 1300854 1242767
4280 1242767 1213969 1180963 1158027 1185520 1276795 1232177 1084433 1057641 982181 1026752 981103
4269 981103 1001600 968920 936546 1017684 1039192 934209 874569 964589 1018367 910602 958767
4258 958767 888290 779039 871347 800497 833299 816269 858304 887251 853142 886766 929683
4247 929683 864936 841483 826729 848095 876362 908711 761552 780041 813831 789586 760840
4236 760840 684979 665354 711974 774842 809154 791850 840537 854552 767524 668396 583578 530439
4224 530439 531244 543999 522414 632313 544104 499741 485629 535988 612699 703555 652225 535995
4212 535995 544100 545566 519633 527889 504688 562400 627323 523514 467590 393333 414935 441838
4200D41838K9685J4086q7398J24640M0705n6865j4052k6346J04143k05981k5254
4189C39201M5849K5148k1205M6880q488p6807P9337N6942N0126o3391K0048n6873
4177D36767l3078O8916K2847k1473j01094K944r955m904M0139j5534m1191r4701
4165B49683N6575O9036N7179k801N6697Q3838K0685l7803m1184J0477N2326J26542
4153G01250L9553J71522O2914O6137J42428n4833j59060o6528j17742j88756q8006
4142E08879K6529O6841m7207r0999O8898M7756j03513J1697j18167L2802L337
4131D06853k9189k5088l6674O7865j7494j862J25389j10596L593N9892q1364n2853
4119C08472P500o300J29098L2049m6474q8300n8820N2425L6081j5008m5023R7695
$$ plain form
4200 441838 471523 485609 398211 522851 563556 506691 492639 466293 570436 364455 339201
4189 339201 385050 410198 388993 435873 427385 350578 429915 486857 536983 473592 493640 436767
4177 436767 403689 472605 495452 473979 372885 375829 365874 360970 401109 385575 344384 249683
4165 249683 306258 375294 432473 429672 486369 570207 590892 553089 511905 522382 574708 701250
4153 701250 740803 912325 975239 1041376 1183804 1128971 969911 903383 785641 596885 508879
4142 508879 535408 602249 555042 464043 532941 580697 477184 488881 370714 403516 406853
4131 406853 377664 352576 315902 383767 366273 364411 489800 379204 382797 442689 361325 308472
4119 308472 315972 309672 438770 470819 424345 336045 277225 329650 365731 350723 305700 403395
4107D03395Q9944N2069N387n5219M2346P9701N3745P3687j02840J07521J40494
4096H90230M4261n1435J61228P8414j5307O254K6836q0738J893o73L2578L7740
4084A131281n322N1004L4185j02396N7520r0880q0262N4644K1536P4752O1433
4073A207495J31855M5141J76300L5964J09568l8893K9264k5737j78907j26014
4063A366036j38320k8221j1041k23539j21842J30874r1066j79104j16962k1941
4053E64874L1695l1263p4503j03614n5172N0551K9499j21903k826N0495N3475
4042C91308k8797q5941J7505J4227j19854K2959O6947M0688M7216r0625r1222
4031A84411k330k8800J04801k642r8858l3842O9841P8106j13176J02528j03528
$$ plain form
4107 403395 493339 545408 550795 495576 537922 617623 671368 745055 642215 749736 890230
4096 890230 934491 883056 1044284 1122698 1107391 1113645 1140481 1059743 1061636 1060963 1093541 1131281
4084 1131281 1125959 1176963 1211148 1108752 1166272 1075392 995130 1049774 1071310 1146062 1207495
4073 1207495 1339350 1384491 1560791 1596755 1706323 1667430 1696694 1670957 1492050 1366036
4063 1366036 1227716 1199495 1188454 964915 843073 973947 882881 703777 586815 564874
4053 564874 596569 565306 490803 387189 332017 382568 412067 290164 287338 337833 391308
4042 391308 362511 276570 294075 308302 188448 211407 278354 319042 366258 275633 184411
4031 184411 182081 153281 258082 255440 156582 122740 192581 270687 157511 260039 156511
4020A56511n618N5991Q6350q239j13655j9062n3745J59549l8580m1754P4355O1383
4008C13486o3222O515k9540O49L9600P3601k2012l3275L6397m6563L7553q7016
3996B26173L0764J26453j0746K2981L654j1561m7335m7841R7196n0718K0822J0701
3984C70543O8331j4876p9185l3444j3950J0073L8054K4428k0761j0612o6341P0138
3972C42398O2944j24286M3997P7870l3701Q0130r0045K4686K7660k4382N2601
3961D39872P397p585l6900M9832O8925M0725l5958m0349k4983l063r5672q870
3949C53371L8488j12499J8537L7803p753R8616N2879l4689N1625J2944j3141k3296
3937D72885p0067J45620Q2102p9177m7237m601L5807l2688m5236k9899L3233P7300
$$ plain form
4020 156511 150893 206884 293234 284995 171340 152278 98533 258082 219502 177748 252103 313486
4008 313486 250264 256779 227239 227888 267488 341089 319077 285802 322199 275636 313189 226173
3996 226173 256937 383390 372644 395625 399279 387718 340383 292542 389738 339020 359842 370543
3984 370543 438874 423998 344813 311369 297419 307492 345546 369974 349213 338601 272260 342398
3972 342398 405342 281056 325053 402923 369222 449352 359307 383993 411653 387271 439872
3961 439872 447269 439684 402784 452616 521541 562266 526308 485959 460976 457913 362241 353371
3949 353371 391859 279360 297897 335700 327947 426563 479442 444753 496378 509322 496181 472885
3937 472885 402818 548438 630540 551363 504126 499525 535332 502644 457408 427509 460742 538042
3925E38042J12733J7239j01839m0559m8928L2048N7645m1849m8835Q3876J9113
3914E78686k6346K2769M8812J470n7439l0126M2768L9820j2668K783O2038M4143
3902G16710j00901K0588L8799j536P3369j55414M1372J06110l5994K1754j5163
3891G09694m6963j3376P0642K608O1600L4062r7585J7549J54512k9983K2023K4695
3879I09478J03021p7299m4894p0320n1814Q3786O5722J0725m9073o5198Q4437
3868H98571P1772m0804N7541L2492q9941l9153M6282q4734R3748O7665L0632M812
3856A048883K5333O315l3384N4946O3582m1821J1912J15832Q906r6832n4141J9458
3844A128989J37517n3182J7824k7924k0123L1746O1486J09893N2701L2441M148
$$ plain form
3925 538042 650775 668014 566175 525616 476688 508736 566381 524532 475697 559573 578686
3914 578686 552340 575109 623921 625391 567952 537826 580594 620414 607746 610529 672567 716710
3902 716710 615809 636397 675196 673660 747029 591615 632987 739097 703103 724857 709694
3891 709694 662731 649355 719997 722605 784205 818267 720682 738231 892743 862760 884783 909478
3879 909478 1012499 935200 890306 819986 768172 851958 917680 928405 879332 814134 898571
3868 898571 970343 929539 987080 1019572 929631 890478 936760 852026 945774 1013439 1044071 1048883
3856 1048883 1074216 1080531 1047147 1102093 1165675 1123854 1135766 1251598 1260504 1163672 1109531 1128989
3844 1128989 1266506 1213324 1231148 1203224 1183101 1214847 1276333 1386226 1438927 1471368 1475516
3833A475516J1416m8399j7281M2096J5482q5232J03731q503N4723J00213N0622
3822A694384N1658q082K2714J52728J05109j9766Q7152J38999l5284J6617J33537
3811B339766Q0154R7601J85742J35931Q2710K38219Q3821l8800N4344m0198j05477
3800C113813j9718k8917M6646J88600J08994J03185Q1941K50199J34608J42185
3790D121536m4148p8982O6642R0437q704K1291J36105R5714J25066Q4079K72039
3779D881075K24362L47789L26751K03005j82951l32203l09828k26118k49449j59124
3769D523309j64621l2774J9729o1457j3135M5033k602m1781j6767L982p7889n2623
3757D128404p1464r5419p9514n6834p0944j08728R0371P6617P6742J03046Q388
$$ plain form
3833 1475516 1486932 1438533 1421252 1463348 1478830 1393598 1497329 1488826 1543549 1643762 1694384
3822 1694384 1746042 1737960 1760674 1913402 2018511 1998745 2085897 2224896 2189612 2206229 2339766
3811 2339766 2419920 2517521 2703263 2839194 2921904 3160123 3243944 3205144 3259488 3219290 3113813
3800 3113813 3094095 3065178 3111824 3300424 3409418 3512603 3594544 3844743 3979351 4121536
3790 4121536 4077388 3998406 4065048 4155485 4146781 4168072 4304177 4399891 4524957 4609036 4881075
3779 4881075 5105437 5453226 5779977 5982982 5800031 5467828 5158000 4931882 4682433 4523309
3769 4523309 4358688 4325914 4345643 4284186 4271051 4316084 4313482 4271701 4254934 4258916 4181027 4128404
3757 4128404 4056940 3961521 3882007 3825173 3754229 3645501 3735872 3812489 3889231 3992277 4000665
3746D000665M6945N0866j44668k05136j37082j07142r1113j8702k2712M667m5684
3735C330904r9125O7800m7854J3060j3689J48732O2655p2398Q8689J38850N8269
3724C675893j6682j7663j04100N9381Q8093J45877M2169M6006J5125L8338n9479
3713C912958k8825L4822J92443p9370l4538N7730L3309o2852k6944J07583J03596
3702D209912O0067L4523j4747n6561q510J37335J9156l261q1736K5304O6884q69
3690D387497o558p3038k351K1095O0941m3696Q158O0487j55684q7500n682O207
3678D169876K047q3279Q6770l0804J48852k165j48086j74258Q4400O2398l7199
3667D078552j9813q2096K5720j4068j15234O1646k7312J9072N0004j7008o0297
$$ plain form
3746 4000665 4047610 4098476 3953808 3748672 3611590 3504448 3413335 3394633 3371921 3376588 3330904
3735 3330904 3231779 3299579 3251725 3264785 3251096 3399828 3462483 3390085 3478774 3617624 3675893
3724 3675893 3659211 3641548 3537448 3596829 3684922 3830799 3872968 3918974 3934099 3972437 3912958
3713 3912958 3884133 3918955 4111398 4032028 3997490 4055220 4088529 4025677 3998733 4106316 4209912
3702 4209912 4269979 4304502 4289755 4233194 4224684 4362019 4381175 4377914 4296178 4321482 4388366 4387497
3690 4387497 4380939 4307901 4305550 4326645 4387586 4343890 4352048 4412535 4256851 4169351 4163669 4169876
3678 4169876 4171923 4088644 4175414 4144610 4293462 4291297 4143211 3968953 4053353 4115751 4078552
3667 4078552 4058739 3976643 4002363 3988295 3873061 3934707 3907395 3926467 3976471 3959463 3899166
3656C899166l5283n0263n3095N1425p6751n2578o0340O8978J5486l431l3560Q3196
3644C752950n6360k7667O2240r8606j4560o1978k95R632j9267L8857j5546j7774
3632C551626J04349n6660q9832p698m42Q5573k8439O4520p2907r7650Q3987o6440
3620C469987P5256l1017J3589k6535o4937K7879L574K8629J5051L3144k1698n2407
3608C470515k3820j6103P5925L6004k6145K8272k5974p5634Q8063m439m7287L6200
3596C515577L4500q7460R7361K6331o0583k1204l9513N6281j56096j6994O8610
3585C416810o223p8830o0772l3219R3545O059m0538r4111l5036r818L6853n7267
3573C137453J07291O6457o8805K819N4934R4591j49567k8457M0941L5994o031
$$ plain form
3656 3899166 3863883 3813620 3760525 3811950 3735199 3682621 3622281 3691259 3706745 3703314 3669754 3752950
3644 3752950 3696590 3668923 3731163 3632557 3617997 3556019 3555724 3565356 3546089 3584946 3569400 3551626
3632 3551626 3655975 3599315 3509483 3501785 3501343 3586916 3558477 3622997 3550090 3452440 3536427 3469987
3620 3469987 3545243 3514226 3527815 3501280 3436343 3464222 3467796 3496425 3511476 3544620 3522922 3470515
3608 3470515 3446695 3430592 3506517 3542521 3516376 3544648 3518674 3443040 3531103 3526664 3479377 3515577
3596 3515577 3550077 3462617 3559978 3586309 3525726 3504522 3465009 3521290 3365194 3348200 3416810
3585 3416810 3410587 3331757 3270985 3237766 3331311 3337370 3296832 3202721 3167685 3157867 3194720 3137453
3573 3137453 3244744 3311201 3242396 3245215 3300149 3394740 3245173 3216716 3257657 3293651 3287620
3562C287620j8457k6300n875l7719N4232n7472j2914j7042K0480K3401J7310j7037
3550C210227J8818M6400l2134J5814j8100K2504J0578K7158k1073P989m0787K2257
3538C269651q850J2150N4205l486J26536M600J7629K4767n2642R4452p3069j7781
3526C448162L5094K128q252O0110j22754J1957O8016j9902k9126P9966M3284K7534
3514C596217L0258K4253l1109J3317K1242j524L4751p2964j2357N5764Q3437K3729
3502C765014k665l6460J9977l0833L4693L6142o3561L4393J12597o1745j36843
3491C670709Q696O2862J54173m3246M1427O0161p6566K0638j0839P4082J2761
3480C974858J3096M1217j6248k4308q495o0463P0889m925l3363K8660L3610p0014
$$ plain form
3562 3287620 3269163 3242863 3236988 3199269 3253501 3196029 3183115 3166073 3186553 3209954 3227264 3210227
3550 3210227 3229045 3275445 3243311 3259125 3241025 3263529 3274107 3301265 3280192 3288181 3247394 3269651
3538 3269651 3260801 3272951 3327156 3323670 3450206 3454806 3472435 3497202 3444560 3539012 3465943 3448162
3526 3448162 3483256 3485384 3477132 3537242 3414488 3426445 3494461 3474559 3445433 3525399 3568683 3596217
3514 3596217 3626475 3650728 3619619 3632936 3654178 3652654 3687405 3614441 3602084 3657848 3741285 3765014
3502 3765014 3762349 3725889 3745866 3715033 3749726 3785868 3722307 3756700 3869297 3807552 3670709
3491 3670709 3679405 3742267 3896440 3853194 3894621 3954782 3878216 3898854 3888015 3962097 3974858
3480 3974858 3987954 4029171 4012923 3988615 3980120 3919657 3990546 3985621 3952258 3980918 4014528 3944514
3468C944514l1761k6115K3826J00104n1720p32J7078l8905l2195K7116P2105q8529
3456C914786Q1881Q5035K2190m8075j392J0806m2013j6835K9686J00912N5q4381
3444D052655J7485L9169R831L07J381L7588Q258j6012Q6696l1603L63N9846n7929
3431D208035Q999J01931J19220p7798p7861o8416k766o0450J18251L5286m5672
3420D258759J13680J6192k5731P4155K3295k4185M8860k8001L4142P5955k5257
3409D541864j04491N9015K8284L8961M6229N251K3542O161K1306J00748P5108
3398D841978p8288j10477L7201J16480L8146j2079R870J66485k5300M3943J51691
3387E179650j09693L3893Q36K967L5934m1429Q2435L2090o2010R445J02339L5155
$$ plain form
3468 3944514 3912753 3886638 3910464 4010568 3958848 3958116 3975194 3936289 3904094 3931210 4003315 3914786
3456 3914786 3996667 4081702 4103892 4055817 4054425 4065231 4023218 4006383 4036069 4136981 4137036 4052655
3444 4052655 4070140 4109309 4119140 4119447 4120828 4158416 4166674 4150662 4237358 4205755 4206118 4265964 4208035
3431 4208035 4217034 4318965 4438185 4360387 4282526 4214110 4211344 4150894 4269145 4304431 4258759
3420 4258759 4372439 4388631 4362900 4437055 4460350 4436165 4485025 4457024 4491166 4567121 4541864
3409 4541864 4437373 4496388 4524672 4563633 4609862 4615113 4638655 4644816 4666122 4766870 4841978
3398 4841978 4763690 4653213 4690414 4806894 4845040 4832961 4842831 5009316 4984016 5027959 5179650
3387 5179650 5069957 5103850 5104686 5107653 5143587 5102158 5184593 5216683 5154673 5164118 5266457 5301612
3375E301612n8974O1452O6847J7871R0418N1296K0241p910P3958P8749R4109P1213
3363E860882R1332K0071N3409n0522Q7953R9265O6366p2132K9319J02360l7160
3352F251143J30341K8088Q1746N733M815N6061K07382J62701m7891p4386O6501
3341F872234J84163J06518P5907R1174J07895K38M4016J15929P1797J2807O7086
3330G749764J55316Q9391J70119R7175K2347J67729J49739K1506M1003Q6913J27289
3319H878291J03966J25487K14072K14147J67060N6057J36285N7838P8139K04494
3309A0235836K02529J02219J03936K17670K05099J00601J96728J91298J79194
3300A1735110K27774K00274K22275J87507J94782K55090K47888K18736J94697
$$ plain form
3375 5301612 5242638 5304090 5370937 5388808 5479226 5530522 5550763 5542853 5616811 5695560 5789669 5860882
3363 5860882 5952214 5972285 6025694 5975172 6063125 6162390 6228756 6156624 6185943 6288303 6251143
3352 6251143 6381484 6409572 6491318 6497051 6501866 6557927 6765309 6928010 6880119 6805733 6872234
3341 6872234 7056397 7162915 7238822 7329996 7437891 7438129 7482145 7598074 7669871 7682678 7749764
3330 7749764 7905080 7994471 8164590 8261765 8284112 8451841 8601580 8623086 8664089 8751002 8878291
3319 8878291 8982257 9107744 9321816 9535963 9703023 9759080 9895365 9953203 10031342 10235836
3309 10235836 10438365 10540584 10644520 10862190 11067289 11167890 11364618 11555916 11735110
3300 11735110 11962884 12163158 12385433 12572940 12767722 13022812 13270700 13489436 13684133
3291A3684133K62529K40123K76654L38688K94091K50119K24191K98462K88234
3282A6157224K83772K58685J53915L15891L97557K26536L13665K88402L64589
3273A8760236M31635M52186M13543L09741M15510N30379O04946M22685N97512
3264B2938373N65924N78067P95544P06553P39594P11169P17140R41024R55798
3255B9649186R85603J222703J252391J452944J558555J722454J760880J921485
3247D1526201K083936K250615K393069K642581K637453K618190K860740K787974
3239F1800759K659126K586277K226915J791435R75725K14121p65832j687914k600716
3230F7199896l019001l083237l162320k977619k697139k367935k107563j886771
$$ plain form
3291 13684133 13946662 14186785 14463439 14802127 15096218 15346337 15570528 15868990 16157224
3282 16157224 16440996 16699681 16853596 17169487 17567044 17793580 18107245 18395647 18760236
3273 18760236 19191871 19644057 20057600 20367341 20782851 21313230 21918176 22340861 22938373
3264 22938373 23504297 24082364 24877908 25584461 26324055 27035224 27752364 28693388 29649186
3255 29649186 30634789 31857492 33109883 34562827 36121382 37843836 39604716 41526201
3247 41526201 43610137 45860752 48253821 50896402 53533855 56152045 59012785 61800759
3239 61800759 64459885 67046162 69273077 71064512 72040237 72254358 71488526 69800612 67199896
3230 67199896 64180895 61097658 57935338 54957719 52260580 49892645 47785082 45898311
3222D5898311j793872j488517j322186j318194j068146j060913r43846p02916
3214C6199721p21353o97407n79593n37764n24334o20005n13323m01546l97578
3205C1206818k98524n26920m51030m68837m90388n62292n21882m97030m76073
3196B6913842m57328n48207n32709n22474m70192m35583l97376m95393m65791
3187B2588789m12426n13636l79935l76710l81942m56007l73674j12514k65093
3178A9316852l74824k88100l73802k60948j67499k10778k88684k24451l09942
3169A6817824k37668k74137j68147k22375k69080k82506j06448r3222k52329j57505
3159A4754407j98000j43662n1682p3768k25478k05627j48872j66505p6753j26800
$$ plain form
3222 45898311 44104439 42615922 41293736 39975542 38907396 37846483 36902637 36199721
3214 36199721 35478368 34780961 34201368 33663604 33139270 32519265 32005942 31604396 31206818
3205 31206818 30908294 30381374 29930344 29461507 28971119 28408827 27886945 27389915 26913842
3196 26913842 26456514 25908307 25375598 24853124 24382932 23947349 23549973 23054580 22588789
3187 22588789 22176363 21662727 21282792 20906082 20524140 20068133 19694459 19581945 19316852
3178 19316852 18942028 18653928 18280126 18019178 17851679 17640901 17352217 17127766 16817824
3169 16817824 16580156 16306019 16137872 15915497 15646417 15363911 15257463 15164241 14911912 14754407
3159 14754407 14556407 14412745 14361063 14287295 14061817 13856190 13707318 13540813 13464060 13337260
3149A3337260j29089j34058j55712j00539r6208j34129j87527j86368q6176k2883
3139A2104571j26430j24411r1341m2078r2857j34911j37550n1384k10490j41168
3129A0951951r0774j17920n6823p2168j57606j00535n2191j01316l1889j18787
3119A0051942q9766p0898r9964o6946k3916m8696p9254m9147j39670n8691p2357
3108I252637n9830q1919o6815r9883j7921o475j40356P586r1149j39180o197k2326
3096H528172j41475o1436o8188p8704J030N7994l4020o5089P5410m2744j42747
3085H028203m2179l84j27858o4235N2739n4692N6872J3454k0640j31776r081m9512
3073G650911j22540p4803p5255J30679J0914j03939j10974n7666m6528K4391N3379
$$ plain form
3149 13337260 13208171 13074113 12918401 12817862 12721654 12587525 12399998 12213630 12127454 12104571
3139 12104571 11978141 11853730 11762389 11720311 11627454 11492543 11354993 11303609 11093119 10951951
3129 10951951 10861177 10743257 10686434 10614266 10456660 10356125 10303934 10202618 10170729 10051942
3119 10051942 9962176 9891278 9791314 9724368 9700452 9651756 9572502 9523355 9383685 9324994 9252637
3108 9252637 9192807 9110888 9044073 8944190 8926269 8919794 8779438 8787024 8695875 8556695 8550498 8528172
3096 8528172 8386697 8325261 8257073 8178369 8179399 8237393 8203373 8138284 8213694 8170950 8028203
3085 8028203 7986024 7985640 7857782 7793547 7846286 7791594 7848466 7861920 7841280 7709504 7700423 7650911
3073 7650911 7528371 7453568 7378313 7508992 7519906 7415967 7304993 7247327 7200799 7225190 7278569
3062G278569m6310n2779r7519j16800n7169k4449m4194m6437l9436q6217M7914
3051F715173p5700L7845o9656K926J1825r8486J008N0590k4838l445o8160K8563
3039F507645j31003j02852K284P623K847p2520n5872j27224K746L1549J6774j8995
3027F063002j16361j34119N0845L6530p7908j45326J100p8652J2840M0851J2941
3016E665743K5250j488k6828K4029o6510k9768M4148L587l3376L4632J05337N8493
3004E803249r1730n1959k1488j7700L6770R2354m4196M1713P6540j05491R4656
2993E812718J04104J8855M3428k8017m0464J20790P8175L930L4623K7112p6920
2982F098334L1223O8372L6919J21795J62975m4987R6235j2346J32054L1368R5419
$$ plain form
3062 7278569 7232259 7179480 7081961 6965161 6907992 6883543 6839349 6792912 6753476 6667259 6715173
3051 6715173 6639473 6677318 6607662 6610588 6622413 6523927 6524935 6575525 6550687 6547242 6479082 6507645
3039 6507645 6376642 6273790 6276074 6283697 6286544 6214024 6158152 6030928 6033674 6065223 6081997 6063002
3027 6063002 5946641 5812522 5863367 5899897 5821989 5676663 5677763 5599111 5611951 5652802 5665743
3016 5665743 5690993 5689505 5662677 5686706 5620196 5590428 5634576 5638163 5604787 5639419 5744756 5803249
3004 5803249 5711519 5659560 5638072 5620372 5657142 5749496 5705300 5747013 5823553 5718062 5812718
2993 5812718 5916822 5935677 5979105 5951088 5910624 6031414 6109589 6113519 6148142 6175254 6098334
2982 6098334 6129557 6197929 6234848 6356643 6519618 6474631 6570866 6558520 6690574 6721942 6817361
2971F817361N1668O4246Q3128O4798J10648L3452J75430p453l880N8734N9508
2960G507640j9285J25276M3484J7231K9876O0615K00850J31582R8363L1468J15705
2949H342805J27595M7841J42724J64388R1983J73824L05536J66693J99468J67053
2939I929910K09614J17710K63816K39014K39887K41043L01132L11595L34040L34693
2929A2522454L22372K85373M25185L30228L25028L54722L08650K93825K75797
2920A5443634J58502P9443K76828K14669J74317K98957K42594K32736K72138K65224
2910A7659042K88108M60413L93491L92656N27889N97903P36680O52650P29070
2901B2437902Q89228Q55088Q56113P82021P82285P44556P01221M15467J12764
$$ plain form
2971 6817361 6869029 6933275 7016403 7081201 7191849 7225301 7400731 7393278 7389398 7448132 7507640
2960 7507640 7488355 7613631 7657115 7674346 7704222 7764837 7965687 8097269 8195632 8227100 8342805
2949 8342805 8470400 8518241 8660965 8825353 8917336 9091160 9396696 9563389 9762857 9929910
2939 9929910 10139524 10257234 10521050 10760064 10999951 11240994 11542126 11853721 12187761 12522454
2929 12522454 12844826 13130199 13555384 13885612 14210640 14565362 14874012 15167837 15443634
2920 15443634 15602136 15681579 15958407 16173076 16347393 16646350 16888944 17121680 17393818 17659042
2910 17659042 17947150 18407563 18801054 19193710 19721599 20319502 21056182 21708832 22437902
2901 22437902 23327130 24182218 25038331 25820352 26602637 27347193 28048414 28463881 28576645
2892B8576645l6880m35525n82376q02450o80190n36779m54771n40242j88615J6456
2882B4335273L6331J45940K09902K37837L10874L19241M72897M81755L84032M51050
2872B7385132N38865O28444N38317L99711K52679R7839k0002j31169l26267n54860
2862B8808689o77584q01507p87767q19180r39587p12425n95875o73415m10735
2853B2390614l40943k79760j90957j89828k5210r6017j20918m3971M996o6217
2843B1041789j79026k16920m17302k92836m40792m61176n37532p49326o49624
2834A7097255o46743o01520n91635m35510n35932n61286m39918l40257k76116
2825A2668338l46185l18900l45089j83821k56423l94996j73881j56975k66121
$$ plain form
2892 28576645 28539765 28104240 27521864 26719414 26039224 25502445 25047674 24507432 24318817 24335273
2882 24335273 24371604 24517544 24727446 24965283 25276157 25595398 26068295 26550050 26934082 27385132
2872 27385132 27923997 28552441 29090758 29490469 29743148 29840987 29820985 29689816 29363549 28808689
2862 28808689 28131105 27329598 26541831 25722651 24783064 24070639 23474764 22801349 22390614
2853 22390614 22049671 21769911 21578954 21389126 21363916 21267899 21146981 21103010 21108006 21041789
2843 21041789 20862763 20645843 20228541 19935705 19494913 19033737 18496205 17746879 17097255
2834 17097255 16450512 15848992 15257357 14821847 14285915 13724629 13284711 12944454 12668338
2825 12668338 12322153 12003253 11658164 11474343 11217920 10822924 10649043 10492068 10225947
2816A0225947j19799j00201j89478k45522k45245k29153j72796k49433k21330
2807H452990k04087k53815j26752j84435k00021o4010k12544k36160j32570r2664
2797F745932n0711k23908n0773k3646p1321k87025j41401k3632j41107o8733k7693
2786E635982o4164o5167j46927j15040m8883n7711j15411o1375J0011r1450l6667
2775D843198p4595q9606j06620j00856q1590j12179K4051l0553o7614j27794j57536
2764C918306r3492k3430j4306m0407j14947j13751k3966Q20j08708K6411N4436
2753C466966j23160j11163o1392L6930M9902p903p9199n7859j13885p6802k6125
2742B896310k5645o7345O780p2785j1081j6159j96017l4625Q997J0794k8962k8380
$$ plain form
2816 10225947 10106148 10005947 9816469 9570947 9325702 9096549 8923753 8674320 8452990
2807 8452990 8248903 7995088 7868336 7683901 7483880 7419870 7207326 6971166 6838596 6745932
2797 6745932 6695221 6471313 6420540 6396894 6325573 6038548 5897147 5873515 5732408 5663675 5635982
2786 5635982 5571818 5506651 5359724 5244684 5195801 5138090 5022679 4961304 4971315 4879865 4843198
2775 4843198 4768603 4678997 4572377 4471521 4389931 4277752 4301803 4271250 4203636 4075842 3918306
2764 3918306 3824814 3801384 3787078 3746671 3631724 3517973 3494007 3494827 3386119 3412530 3466966
2753 3466966 3343806 3232643 3171251 3208181 3258083 3250180 3170981 3113122 2999237 2922435 2896310
2742 2896310 2870665 2803320 2810100 2737315 2726234 2710075 2514058 2479433 2488430 2499224 2470262 2441882
2730B441882N4724o1053p5206q6669q6505m8065J3424q7932P2597K0665o5572
2719B092290J547n9472j7968k3251q1340k5677j9756P4399k6732r9885O2613o5825
2707A810943J8524l9682j03559K5704Q7698j4479k3432j00576l1868m8775L924
2696A584422n6670L6866L5251j3466n7180K6208M6415p3439m6720Q820k992n0548
2684A436967Q6678M2137p0788r6773k6399k1360J100M7673q261j10745o2181J04858
2672A322906k4240M9106J363q5952O0313j25806L120Q6294j19716l122l9234P0957
2660A195989K1988J7327K5469r0175j4115Q5317M9344l8734p8989k1755q984j5787
2648A126895N6358o6353N9947k1526j5124m0605K0867j34005M0619M6721N2473
$$ plain form
2730 2441882 2496606 2435553 2360347 2273678 2187173 2139108 2152532 2064600 2137197 2157862 2092290
2719 2092290 2093837 2034365 2016397 1993146 1911806 1886129 1866373 1940772 1914040 1814155 1876768 1810943
2707 1810943 1829467 1789785 1686226 1711930 1799628 1785149 1761717 1661141 1629273 1580498 1584422
2696 1584422 1527752 1564618 1599869 1586403 1529223 1555431 1601846 1528407 1481687 1490507 1487515 1436967
2684 1436967 1523645 1565782 1494994 1398221 1371822 1350462 1351562 1399235 1390974 1280229 1218048 1322906
2672 1322906 1298666 1347772 1349135 1263183 1323496 1197690 1200810 1287104 1167388 1164266 1125032 1195989
2660 1195989 1217977 1235304 1260773 1170598 1156483 1241800 1291144 1252410 1173421 1151666 1142682 1126895
2648 1126895 1183253 1116900 1176847 1155321 1140197 1099592 1120459 986454 1027073 1073794 1126267
2637A126267j21006j26785N7057O5901k3000m0554O6889k9438N7389j5142j36400
2626H81178J0400j627Q201O3946p8726J1233J1069P561j14360N2846P3463j1647
2614I13537j9148o0457K5033q0920Q0891M6066q981o2581M7380K9673N7904j1433
2602I56964j02356n9541J03644K8626p4273k5067k6486m1266J18955m1305N7032
2591H94927K5213j33566l6269O2472J14570o417K3522p3924P95K1598p1669j16576
2579G04676n3138P028Q7148o0110M7731r7270P1143l1079j9888J21869J4928r1539
2567G01499p6483k7165P0125p0761K8979R8157l7709j49215R093R162J9823j0299
2555E65206k1519M442k2717j8192J049j5376M2927N5500j01381o0950n283J41735
$$ plain form
2637 1126267 1005261 878476 935533 1001434 978434 937880 1004769 975331 1032720 1017578 881178
2626 881178 891578 889951 898152 962098 883372 894605 905674 913235 798875 851721 925184 913537
2614 913537 894389 833932 858965 778045 858936 905002 896021 833440 880820 910493 968397 956964
2602 956964 854608 795067 898711 927337 853064 827997 801511 760245 879200 837895 894927
2591 894927 920140 786574 750305 812777 927347 920930 944452 870528 871323 892921 821252 704676
2579 704676 651538 658566 745714 685604 733335 636065 707208 676129 656241 778110 793038 701499
2567 701499 625016 597851 667976 597215 626194 724351 686642 537427 546520 555682 575505 565206
2555 565206 543687 548129 525412 507220 508269 492893 535820 591320 489939 428989 423706 565441
2543E65441p2935o327k4401L5736m9546m3252K4262N4795l8724r8906L8120p605
2531C76658M5014J76131q9700j07251L4837Q9383o2301o5184N9145J23984o565
2520E74151j8307m3957n1471p4130P1031k1219l6656J21262N7918p2788j61625
2509C44209J31987K4169n3003j07187R7880K6843k2993r3434m7351R9913P0114
2498D71147o2393J7362k6138k5644k0185J18019J442j12316m8635k6313p869P3147
2486C51624l2093q7510q995M2350O8081J6217l9400k9599Q2844j08479n4380L7230
2474B37890k1978J12298M4109j0556j0482M44l2558k4052L3875j35768P1200p2198
2462A92224j06555J20568P2086K7217K1920l7265m2876p4002l8221P2899q451
$$ plain form
2543 565441 492506 486179 461778 497514 447968 404716 428978 483773 445049 346143 384263 376658
2531 376658 421672 597803 508103 400852 435689 525072 462771 397587 456732 580716 574151
2520 574151 555844 511887 460416 386286 457317 436098 399442 520704 578622 505834 344209
2509 344209 476196 500365 447362 340175 438055 464898 441905 348471 301120 401033 471147
2498 471147 408754 426116 399978 374334 354149 472168 473610 361294 312659 286346 278477 351624
2486 351624 319531 232021 223026 265376 333457 349674 310274 280675 363519 255040 200660 237890
2474 237890 215912 328210 372319 361763 351281 351725 319167 295115 328990 193222 264422 192224
2462 192224 85669 206237 278323 305540 327460 290195 247319 173317 135096 207995 199544
2451A99544m6020Q623J3929M1924L6024k4929K2240k0309o0876J6812Q4420j906
2439B69476l4551M963n6845Q5461L9106r7244k6934M7335Q6141o8947o5082J08658
2427B91537J8462R963q7149r1549Q172l2337k7072Q8936L0431r130K07k3991o4600
2414A11880n9584O5190L0904L8458J9837m4651k842r2560j0705M3487J46234o5170
2402A80478p3683K5995k518Q8635l2549r7096J3763N0531Q970o5559R2693j7385
2390A72275J4508j9980k1249j7173L2145M4694k4988L451n6497m0913K0722R7437
2378B04432N0050n4074K775k6503m3868J2129Q4574K8793J6603l1603o2992O0794
2366B41110J2050R7236j0724k1345P3465L2582K546p254n0546r9000j28310N1827
$$ plain form
2451 199544 153524 162147 176076 218000 254024 229095 251335 231026 170150 186962 271382 269476
2439 269476 234925 239888 183043 268504 307610 210366 183432 230767 316908 247961 182879 291537
2427 291537 309999 319962 232813 141264 149436 117099 90027 178963 209394 200264 200471 176480 111880
2414 111880 52296 117486 148390 186848 206685 162034 159192 66632 55927 99414 245648 180478
2402 180478 106795 132790 130272 218907 186358 89262 103025 153556 162526 96967 189660 172275
2390 172275 186783 166803 145554 128381 160526 205220 180232 183683 127186 86273 106995 204432
2378 204432 254482 200408 203183 176680 132812 144941 229515 258308 274911 243308 180316 241110
2366 241110 253160 350396 339672 318327 391792 424374 426920 419666 369120 270120 141810 193637
2354A93637m9529m9337J05563p5528j02518J42269n5305J2069l9577j7670M9032
2343A13106k075Q6664k8306o3588o701o4585J11264n9159l2363l1861p812P9502
2331I4086m4111L5009J2757K7268p6193K6287N0263M0366n2045K4389n8699L8227
2319A17604M5545j28120P1719m3097R4358k3549o9625r8199J9942N3114j9259
2308B0433j08172K3976O9125J62822r2971j8384M8835j7953N556K0969K8169j1301
2296A31104M85n6716L6364l5263O7331r6541O3100J0829k9182L3415l7721l5598
2284E1607L397O0795Q6911p3755k1484N1686m6979r2430j3622M8665N3343K5751
2272A33885j13090l2259j8416o8703P2755R6290Q451o6414P5829Q550n5121O8585
$$ plain form
2354 193637 144108 94771 200334 124806 22288 164557 109252 121321 81744 64074 113106
2343 113106 111031 197695 169389 105801 99100 34515 145779 86620 54257 22396 14584 94086
2331 94086 49975 84984 97741 125009 48816 75103 125366 165732 113687 138076 79377 117604
2319 117604 163149 35029 106748 63651 158009 134460 64835 -33364 -13422 39692 20433
2308 20433 -87739 -63763 5362 168184 75213 56829 105664 87711 93267 114236 142405 131104
2296 131104 131589 74873 111237 75974 143305 46764 109864 120693 91511 124926 87205 51607
2284 51607 55004 115799 202710 128955 107471 159157 112178 19748 6126 54791 108134 133885
2272 133885 20795 -11464 -29880 -98583 -25828 70462 78913 12499 88328 96878 41757 110342
2260A10342j9852n3672N8761N478J5061N8227k613j7786p2049m4318J32556j29296
2248D0839j3319J7687Q6803P639Q474N6873k9303o1176K087K2608k7789M6044
2236A57467j3460L4550k2919k3035j8444j3922M1267L2232n4589J6574l694n7047
2224G4980m5589R5920P1907j32982m8968J09292P643J1824P7864o431J11952r1285
2212B36127o5471J0140N2221J576n2869l3312k0825M9599n243o15o7552L7700
2200A41476J0576J20928n0200M7906k2796R2567l8628p7246J32103k4994r9840
2189B31852J03310J37413o365J1297k9202L3493m632l7615j3716M6002N3281r3813
2177D31305J3123M0590L5333R0616j2696M4688J20331M9357k6272j103J7666M6728
$$ plain form
2260 110342 90490 36818 95579 101057 116118 174345 171732 153946 81897 37579 170135 40839
2248 40839 27520 45207 132010 139649 148123 204996 175693 114517 116604 139212 111423 157467
2236 157467 144007 178557 155638 132603 114159 100237 141504 173736 119147 135721 132027 74980
2224 74980 29391 125311 197218 64236 15268 124560 132203 144027 221891 215460 327412 236127
2212 236127 170656 180796 233017 234593 181724 148412 127587 177186 171943 171328 103776 141476
2200 141476 152052 272980 222780 270686 247890 340457 301829 224583 356686 331692 231852
2189 231852 335162 472575 466210 477507 448305 481798 477166 439551 425835 471837 525118 431305
2177 431305 444428 485018 520351 610967 598271 642959 763290 812647 786375 785272 802938 849666
2165H49666M5272J13602p0496R32J01197J3099P2606K9335K9358R407l686L930
2153A194222J38364j3910M9119L9390R19J00187N1392R8551M2001N5613K8989
2142A784837J0951J12210J4453l374J09247l0512R2133N0204J14312J55488J36203
2131B546152K39510J24870J07356J55148J45876K90777J25028J18435L00042K96623
2121D449817K08585L43732L49479L68750L53305N38649N24744O46691O62316Q57216
2111I303284Q51998J030077R24295J030751J314202J749904J976303K425808K662783
2102B3269405L362064L629847M108025M947219O432655P165527P573005Q07903
2094F1295650q834110p863635p204594o940725n529786l946719k966362k125125
$$ plain form
2165 849666 894938 1008540 938044 938976 1040173 1053272 1125878 1155213 1184571 1193978 1190292 1194222
2153 1194222 1332586 1318676 1367795 1407185 1408104 1508291 1559683 1658234 1700235 1755848 1784837
2142 1784837 1795788 1907998 1922451 1919077 2028324 1997812 2089945 2140149 2254461 2409949 2546152
2131 2546152 2785662 2910532 3017888 3173036 3318912 3609689 3734717 3853152 4153194 4449817
2121 4449817 4658402 5002134 5351613 5720363 6073668 6612317 7137061 7783752 8446068 9303284
2111 9303284 10155282 11185359 12109654 13140405 14454607 16204511 18180814 20606622 23269405
2102 23269405 26631469 30261316 34369341 39316560 45749215 52914742 60487747 61295650
2094 61295650 52461540 44597905 37393311 30452586 24922800 20976081 18009719 15884594
2086A5884594j734807j316569j075908p47773n48997m88570n54682q00743o09988
2077H006557n60603n39788m60642m13728l31824k85653k50685k40375j80475k02374
2067D540410j20261j03488j96961k26304r6125j57972j89227k0859j28985j14078
$$ plain form
2086 15884594 14149787 12833218 11757310 11009537 10460540 9971970 9417288 8616545 8006557
2077 8006557 7445954 6906166 6445524 6031796 5699972 5414319 5163634 4923259 4742784 4540410
2067 4540410 4420149 4316661 4119700 3893396 3797271 3639299 3450072 3429213 3300228 3186150
$$ [...]
##END NTUPLES=NMR SPECTRUM
##END=
