##TITLE=1H_CA-8949-5
 CDCl3
 8 sc, 
 19.11.2021
##JCAMPDX= 6.0         $$ Bruker NMR JCAMP-DX V2.0
##DATA TYPE= NMR SPECTRUM
##DATA CLASS= NTUPLES
##ORIGIN= UXNMR, Bruker Analytische Messtechnik GmbH
##OWNER= root
$$ XWIN-NMR		Version 3.5
$$ Fri Nov 19 12:09:09 2021 Russian Standard Time (UT+4h)  she@DPX200
##.OBSERVE FREQUENCY= 200.131346
##.OBSERVE NUCLEUS= ^1H
##.ACQUISITION MODE= SIMULTANEOUS
##.ACQUISITION SCHEME= undefined
##.AVERAGES= 8
##.DIGITISER RES= 18
##SPECTROMETER/DATA SYSTEM= spect
##.PULSE SEQUENCE= zg30
##.SOLVENT NAME= D2O
##.SHIFT REFERENCE= (INTERNAL, D2O, 0, 15.7017)
##AUDIT TRAIL= $$ (NUMBER, WHEN, WHO, WHERE, WHAT)
$$ ##TITLE= Audit trail, XWIN-NMR		Version 3.5
$$ ##JCAMPDX= 5.01
$$ ##ORIGIN= Bruker BioSpin GmbH
$$ ##OWNER= she
$$ F:/spectra/data/she/nmr/H-F/1/pdata/1/auditp.txt
$$ ##AUDIT TRAIL=  $$ (NUMBER, WHEN, WHO, WHERE, WHAT)
(   1,<2021-11-19 12:07:45.73 +0400>,<she>,<DPX200>,
      <created by zg, POWCHK disabled, PULCHK disabled
       configuration hash MD5:
       00 E9 B6 7A A2 85 ED C7 34 08 36 98 17 FE 4E 26
       data hash MD5: 16K
       65 D2 30 47 AA A0 A1 58 D8 E0 B6 C5 D5 F7 F3 38>)
(   2,<2021-11-19 12:07:48.29 +0400>,<she>,<DPX200>,
      <Start of raw data processing
       efp BC_mod = 2 LB = 0.24 FT_mod = 6 PKNL = 1 PHC0 = -15525.16 PHC1 = 25.80081 SI = 16K 
       data hash MD5: 16K
       17 F1 1E 5F C0 E1 1D 07 C4 64 D5 5B 62 C8 87 4C>)
(   3,<2021-11-19 12:08:11.60 +0400>,<she>,<DPX200>,
      <pk PHC0 = 15.80346 PHC1 = -19.2 
       data hash MD5: 16K
       5C 6C AE 25 94 3C D2 66 44 EF 6A 55 50 67 CC 05>)
(   4,<2021-11-19 12:08:15.26 +0400>,<she>,<DPX200>,
      <abs ABSG = 5 
       data hash MD5: 16K
       7A 25 37 95 FE 18 50 A2 D0 13 0F 87 26 0A 88 9A>)
$$ ##END=
$$ 
$$ hash MD5
$$ 0A 02 5F 7B 7C B3 D1 DA 4F 8B F5 C6 6F 93 13 C8
##$RELAX= 
##$RELAX= 
##$RELAX= 
##$RELAX= 
##$RELAX= 
##$RELAX= 
$$ Bruker specific parameters
$$ --------------------------
##$DU= <F:/spectra>
##$EXPNO= 1
##$NAME= <H-F>
##$PROCNO= 1
##$TYPE= <nmr>
##$USER= <she>
##$AMP= (0..31)
100 100 100 100 100 100 100 100 100 100 100 100 100 100 100 100 100 100 
100 100 100 100 100 100 100 100 100 100 100 100 100 100 
##$AQSEQ= 0
##$AQ_mod= 1
##$AUNM= <au_zg>
##$AUTOPOS= <>
##$BF1= 200.13
##$BF2= 200.13
##$BF3= 200.13
##$BF4= 200.13
##$BF5= 200.13
##$BF6= 200.13
##$BF7= 200.13
##$BF8= 200.13
##$BYTORDA= 1
##$CFDGTYP= 0
##$CFRGTYP= 5
##$CHEMSTR= <none>
##$CNST= (0..31)
1 1 145 1 1 1 1 1 1 1 1 1 1 1 1 1 1 1 1 1 1 1 1 1 1 1 1 1 1 1 1 1 
##$CPDPRG= <>
##$CPDPRG1= <>
##$CPDPRG2= <>
##$CPDPRG3= <>
##$CPDPRG4= <mlev>
##$CPDPRG5= <mlev>
##$CPDPRG6= <mlev>
##$CPDPRG7= <mlev>
##$CPDPRG8= <mlev>
##$CPDPRGB= <>
##$CPDPRGT= <>
##$D= (0..31)
0 1.2 0 0 0 0 0 0 0 0.06 0 0.03 0 0 0 0 0.0002 0 0 0 0 0 0 0 0 0 0 0 0 
0 0 0 
##$DATE= 1637309265
##$DBL= (0..7)
120 120 120 120 120 120 120 120 
##$DBP= (0..7)
150 150 150 150 150 150 150 150 
##$DBP07= 0
##$DBPNAM0= <>
##$DBPNAM1= <>
##$DBPNAM2= <>
##$DBPNAM3= <>
##$DBPNAM4= <>
$$ [...]
##$SUBNAM2= <"">
##$SUBNAM3= <"">
##$SUBNAM4= <"">
##$SUBNAM5= <"">
##$SUBNAM6= <"">
##$SUBNAM7= <"">
##$SUBNAM8= <"">
##$SUBNAM9= <"">
##$SW= 18.0517287032376
##$SWIBOX= (0..15)
0 0 2 0 0 0 0 0 0 0 0 0 0 0 0 0 
##$SW_h= 3612.71676300578
##$TD= 16384
##$TD0= 1
##$TE= 0
##$TE2= 300
##$TE3= 300
##$TEG= 300
##$TL= (0..7)
0 120 120 120 120 120 120 120 
##$TP= (0..7)
150 150 150 150 150 150 150 150 
##$TP07= 0
##$TPNAME0= <>
##$TPNAME1= <>
##$TPNAME2= <>
##$TPNAME3= <>
##$TPNAME4= <>
##$TPNAME5= <>
##$TPNAME6= <>
##$TPNAME7= <>
##$TPOAL= (0..7)
0.5 0.5 0.5 0.5 0.5 0.5 0.5 0.5 
##$TPOFFS= (0..7)
0 0 0 0 0 0 0 0 
##$TUNHIN= 0
##$TUNHOUT= 0
##$TUNXOUT= 0
##$USERA1= <user>
##$USERA2= <user>
##$USERA3= <user>
##$USERA4= <user>
##$USERA5= <user>
##$V9= 5
##$VALIST= <valist>
##$VCLIST= <CCCCCCCCCCCCCCC>
##$VD= 0
##$VDLIST= <DDDDDDDDDDDDDDD>
##$VPLIST= <PPPPPPPPPPPPPPP>
##$VTLIST= <TTTTTTTTTTTTTTT>
##$WBST= 1024
##$WBSW= 4
##$XGAIN= (0..3)
0 0 0 0 
##$XL= 0
##$YL= 0
##$YMAX_a= 129176
##$YMIN_a= -148758
##$ZGOPTNS= <>
##$ZL1= 120
##$ZL2= 120
##$ZL3= 120
##$ZL4= 120
##$ABSF1= 15.70832
##$ABSF2= -2.34353
##$ABSG= 5
##$ABSL= 3
##$ALPHA= 0
##$AQORDER= 0
##$ASSFAC= 0
##$ASSFACI= 0
##$ASSFACX= 0
##$ASSWID= 0
##$AUNMP= <proc_1d>
##$AZFE= 0.1
##$AZFW= 0.1
##$BCFW= 0
##$BC_mod= 2
##$BYTORDP= 0
##$COROFFS= 0
##$CY= -3
##$DATMOD= 1
##$DC= 0
##$DFILT= <>
##$DTYPP= 0
##$F1P= 0
##$F2P= 0
##$FCOR= 1
##$FTSIZE= 16384
##$FT_mod= 6
##$GAMMA= 0
##$GB= 0
##$INTBC= 1
##$INTSCL= 0
##$ISEN= 128
##$LB= 0.24
##$LEV0= 0
##$LPBIN= 0
##$MAXI= 10000
##$MC2= 0
##$MEAN= 0
##$ME_mod= 0
##$MI= 1.114404
##$NCOEF= 0
##$NC_proc= -7
##$NLEV= 6
##$NOISF1= 3.799351
##$NOISF2= 2.8
##$NSP= 0
##$NTH_PI= 0
##$NZP= 0
##$OFFSET= 15.70172
##$PC= 1
##$PHC0= -15509.36
##$PHC1= 6.600809
##$PH_mod= 1
##$PKNL= yes
##$PPARMOD= 0
##$PSCAL= 0
##$PSIGN= 0
##$REVERSE= no
##$SF= 200.130009973446
##$SI= 16384
##$SIGF1= 3
##$SIGF2= 2
##$SINO= 5.538805
##$SIOLD= 16384
##$SREGLST= <1H.CDCl3>
##$SSB= 0
##$STSI= 16384
##$STSR= 0
##$SW_p= 3612.71676300578
##$SYMM= 0
##$S_DEV= 0
##$TDeff= 16384
##$TDoff= 0
##$TI= <>
##$TILT= no
##$TM1= 0
##$TM2= 0
##$TOPLEV= 0
##$USERP1= <user>
##$USERP2= <user>
##$USERP3= <user>
##$USERP4= <user>
##$USERP5= <user>
##$WDW= 1
##$XDIM= 16384
##$YMAX_p= 437855933
##$YMIN_p= -522681
$$ End of Bruker specific parameters
$$ ---------------------------------
##NTUPLES= NMR SPECTRUM
##VAR_NAME=  FREQUENCY,     SPECTRUM/REAL,   SPECTRUM/IMAG
##SYMBOL=    X,             R,               I
##VAR_TYPE=  INDEPENDENT,   DEPENDENT,       DEPENDENT
##VAR_FORM=  AFFN,          ASDF,            ASDF
##VAR_DIM=   16384,         16384,           16384
##UNITS=     HZ,            ARBITRARY UNITS, ARBITRARY UNITS
##FACTOR=    0.220516191357247, 1,           1
##FIRST=     3142.38542777755, 0,            0
##LAST=      -470.331335228229, 0,           0
##MIN=       -470.331335228229, -522681,     0
##MAX=       3142.38542777755, 437855933,    0
$$ Real data points
##PAGE= N=1
##DATA TABLE= (X++(R..R)), XYDATA
$$ [...]
9900 677809 624400 857069 985240 910029 881310 946765 950985 911127 734061 797803 902861
9889 902861 720746 700251 800592 670214 609909 678465 969199 1007544 955136 968487 977632
9878 977632 791086 1033806 1029000 902996 945362 1038437 745799 789254 853484 781611 657024
9867 657024 623821 725457 447782 514449 585449 711514 838736 765509 700610 591677 530416
9856 530416 581708 581908 686676 448611 554887 561521 462446 519598 433616 465032 539329 457777
9844 457777 524519 542582 507181 517018 607698 723049 704189 532657 453802 581793 486817
9833 486817 360585 401039 408378 378028 455422 430625 253297 428303 389707 376861 298932
9822 298932 290918 437284 424586 455489 632405 527041 275392 355495 520244 385874 433544
9811 433544 657541 625406 477594 277621 403060 244366 213311 307405 522233 327095
9801 327095 212817 118284 295345 243920 425663 460066 164692 204183 237372 147599 222245
9790 222245 257769 340329 91749 209686 266700 31522 346517 264121 269114 231120 169751
9779 169751 197016 173631 213426 304689 383570 204337 155974 47108 -27207 136002 207825
9768 207825 118453 96534 88919 163149 265843 231589 256091 248509 160098 209008 216507 149089
9756 149089 93476 48405 143988 114050 240046 47048 197471 272575 244486 268546 244048
9745 244048 34118 58605 88202 143563 228454 272158 369228 168283 -30421 -82274 -7156
9734 -7156 62628 90014 39513 21485 187854 256498 187115 350910 285049 113215 210416
9723 210416 152335 76215 -17539 -41303 -50839 121194 -305 2510 55899 -134296 -258351
9712 -258351 -59916 98316 101700 48471 45835 -108133 -71295 -134440 -218764 -222707 -40322
9701 -40322 218412 98324 110637 178713 256894 52929 -96280 30503 -30356 55694 150478
9690 150478 257291 265612 373513 310499 -2186 -53429 87365 235796 164712 190014 145070
9679 145070 169011 111670 270692 121600 -18577 184454 49711 166723 130073 245392
9669 245392 274298 135867 225303 -89482 -15562 -136696 -103040 -40858 28824 70554 -24261
9658 -24261 -20586 117508 7788 -42147 7024 436 -14113 -69423 -35844 109740 196149 236077
9646 236077 208415 235554 -42137 5242 171822 82536 -31516 112996 211392 200725 240502
9635 240502 195125 242277 137511 51495 91826 126979 130132 73495 -23926 88492 -14184
9624 -14184 128287 205420 199069 253475 232571 360894 254874 103943 -98192 -295879 -290106
9613 -290106 -33140 125052 120497 60513 -5619 -26865 -51625 -170592 -154694 -91491 -4079
9602 -4079 -59974 -169469 -96985 -15884 -118421 -212245 -132441 -151819 3487 67358 -85443
9591 -85443 20089 69715 -151305 -170434 -198980 -130971 -71850 -54022 -28265 163860 -9049
9580 -9049 -69349 27832 47114 26362 9668 53203 36667 149169 79114 131567 -44291 46405
9568 46405 -70240 -39025 -2647 -46270 -31232 107550 249873 1601 29206 172794 64527
9557 64527 -130562 127582 122850 62077 -100380 -51241 -50182 139259 146281 52363 20504 139998
9545 139998 -73617 8160 133721 31716 -16661 -196936 -319274 -83814 73706 53612
9535 53612 -40573 -35512 -28510 -68210 -12083 -174215 -257799 -131118 5764 122789 163867
9524 163867 139010 8909 -273811 -60502 42024 10156 -53687 12769 140176 46438 3458
9513 3458 -38301 124891 106786 -43292 -5859 47980 70178 101253 178783 171588 94121 54843
9501 54843 47168 -65728 26783 90632 41253 94317 62930 -34363 -26466 81056 151211 54895
9489 54895 54183 35369 120560 801 -88200 -91308 145026 108326 96975 112852 93740 54237
9477 54237 43050 -20001 -128836 -170402 -52145 -245065 -192858 85325 212387 13547 -12364
9466 -12364 -10044 130562 70434 7555 -90818 -83322 -150439 -235683 -138853 -100480 -19509 79488
9454 79488 -11780 -31754 106905 -144802 -273306 -199431 -74490 -73917 -12074 -157284 -104421
9443 -104421 -383326 -305743 -195179 -19876 -22250 -165964 -61054 -61635 -60841 120668 99775
9432 99775 48608 -153414 -254341 -140524 43687 33826 -216467 -244205 12282 157422 309684
9421 309684 91479 -19372 -61841 6877 -91769 14965 24597 13503 -24936 -24577 -10212 -19862
9409 -19862 145639 -49170 -124772 123162 81123 -33907 -2833 -30808 -9165 120760 -26874
9398 -26874 -144002 20967 49401 -166476 -215859 -26416 -135465 -177974 -276132 -96798 30165
9387 30165 -100012 26058 227063 264898 308869 159182 -11108 -131795 -25120 34210
9377 34210 -22102 2895 211159 194373 136723 25795 35178 -2524 213404 214945 50955
9366 50955 18740 -17464 21246 242410 57311 -203879 -166069 -77355 27561 43476 126240
9355 126240 161488 21396 14123 -188804 -247994 -346238 -158557 -15745 -96812 124530 200494
9344 200494 90883 24345 299063 387068 323841 119453 115863 117316 91228 -92327 -156651
9333 -156651 -157403 9627 182726 149150 -82214 -131084 -281640 -261111 -19303 -44076 -61983
9322 -61983 -237680 -137569 -64276 -20707 101007 189291 30196 -98789 -228434 -210869 -184586
9311 -184586 -119587 -241 -285048 -179220 -12470 -96805 -78299 -40799 60071 101219 89864
9300 89864 51619 47266 2217 -56028 -60308 92211 200252 199528 123657 322786 305544 234599
9288 234599 289943 324138 294176 437999 477654 53374 -10381 222141 238889 120845 -35144
9277 -35144 35227 204766 70772 178077 89236 152779 181485 224317 195768 69181 216603
9266 216603 195258 187179 248098 132597 -10735 70092 189456 131453 96863 -17927 226037
9255 226037 258536 225499 243087 231011 250671 194444 205551 76851 -36526 130046 324106
9244 324106 198312 91131 37687 108109 205996 113158 101958 -65767 -121011 -114424 -40840
9233 -40840 79919 133422 196961 159418 25728 132294 199529 18502 138647 172809 203945
9222 203945 168730 77118 43191 74536 267932 195392 133911 113076 224398 188926 341659
9211 341659 477064 612817 584917 403955 313831 282725 315693 310494 240719 205238 58630
9200 58630 186152 403957 128580 40038 183842 271144 22094 79215 175110 220228 284096
9189 284096 206312 209857 241619 313930 128579 299029 407744 455157 466243 379494 217472
9178 217472 304393 332271 169609 323728 192970 169943 414379 491895 399009 365354 357361
9167 357361 105901 54968 213100 192094 404004 56834 -74233 187805 340946 199791
9157 199791 261531 279748 217708 -32804 208753 244206 26994 239250 289809 -41405 109150
9146 109150 98482 -93455 31785 263510 378371 344595 280461 75430 -94602 -11438
9136 -11438 57498 58281 -30125 -67813 64162 203081 209636 257061 93165 -8901 9943 120410
9124 120410 174459 170542 143667 281777 301669 162006 58944 186103 368981 308680 146075
9113 146075 180225 236182 234065 251479 -140286 -11797 183764 118333 169332 313285 233095
9102 233095 406128 556841 446632 402038 313823 182600 155726 162530 172994 -37273 -22266
9091 -22266 -68600 -50970 120108 182893 161255 269834 32775 -11409 -5075 102630 12559
9080 12559 190472 360940 239900 214579 222619 267580 59318 171905 215168 208139 199243
9069 199243 280706 357181 432198 518139 288634 360061 339758 159599 55754 290841 260081
9058 260081 254993 155768 70643 158360 374645 415089 484026 438010 372187 360536 413282 306276
9046 306276 92551 243879 261576 217883 238372 95473 129789 93454 53597 132129 303062
9035 303062 249973 -13280 232858 169641 299226 215220 102344 129665 150667 48175 150405
9024 150405 361445 385305 121133 192968 369895 418417 291209 151387 139629 158448 54698
9013 54698 149759 93346 -48610 125011 99524 121595 278356 190128 -26038 15577 225470
9002 225470 438780 187417 80689 264502 48065 107651 232041 234098 127905 134900 248542
8991 248542 237605 153050 6328 45738 298295 442008 381905 189471 156620 127558 63623
8980 63623 181306 86472 89446 -43841 28202 277597 384877 283616 289376 246795 342834
8969 342834 471506 211817 202684 354493 309917 202640 263414 380968 307010 407204 398365
8958 398365 253459 71705 139151 89795 127063 137121 189801 282711 282620 307298 418899 406127
8946 406127 372755 599848 474143 447022 370524 375538 354898 413457 451867 220658 304688
8935 304688 443363 502557 553188 465902 462124 566959 534025 418025 573795 535646 636440
8924 636440 488817 336575 69247 194376 305880 357014 286064 247272 344083 543895
8914 543895 537146 340860 475927 415647 386793 520758 569556 408868 379835 586206 561440
8903 561440 534307 537280 496682 586006 730749 851487 685055 624594 618497 390355 487117
8892 487117 450268 584341 785479 758059 815944 796589 616860 766285 825680 672340 808876
8881 808876 782144 658271 701979 736293 605057 678579 798972 738797 502341 671043 561337
8870 561337 527519 649799 849781 758227 765253 879231 842452 807417 713474 898454 1014676
8859 1014676 797033 765564 829019 756251 753025 838354 840462 864782 1051799 1104317 1115512
8848 1115512 1222589 913586 941800 1153360 1041695 903167 786597 1007084 1109576 858665
8838 858665 967214 1098044 1059624 1003984 1009939 973228 887041 826673 1029923 1101425 1046470
8827 1046470 1091121 1082540 899218 862869 1057226 948411 725374 845182 954310 866181
8817 866181 828648 1074633 1215099 1408907 1371201 1315692 1063021 1136461 1202068 1220558 1271908
8806 1271908 1206259 1280604 1115115 926487 864156 1058643 1054038 1034394 1181915 1198046 1112541
8795 1112541 1237472 1107711 940812 916065 960360 875841 1075610 1054925 1057181 1041248 1091419
8784 1091419 1000236 1140766 1334353 1209632 1209990 1288237 1276440 1475203 1465445 1686922 1593030
8773 1593030 1594535 1553330 1451489 1681540 1692012 1661399 1745987 1698393 1703235 1676513 1825223
8762 1825223 1728386 1578471 1533880 1504026 1737087 1750990 1680512 1961666 2032512 1976755 2019198
8751 2019198 1858916 1990201 2017827 2191507 2290240 2451572 2524787 2839726 2864176 2753357
8741 2753357 2831737 3062097 3270151 3192685 3400795 3605227 3652256 3845627 4056269 4331373
8731 4331373 4515724 4818404 5015665 5447349 6172675 6724415 7383156 8291027 9171064 10431917
8721 10431917 11826581 13579863 15846116 18589445 22234334 26125499 28596035 26438924
8713 26438924 21149698 16578640 13211955 10924024 9256270 8235426 7260447 6485722
8705 6485722 5951842 5632323 5405882 4941789 4655474 4309212 4043971 3794150 3713548 3625023
8695 3625023 3333529 3261146 3278925 3203368 3227012 3261650 3085905 2979173 3026431 3006602 2868697
8684 2868697 2981423 2988542 2765777 2741950 2752515 2891913 2781271 2622405 2640379 2379156
8674 2379156 2328033 2255025 2477799 2612446 2554212 2517285 2581059 2611061 2523847 2718949 2519625
8663 2519625 2519473 2537170 2611556 2613960 2628862 2700404 2774854 2709412 2613183 2560982 2731428 2759512
8651 2759512 2869787 2757449 2731890 2846306 2901189 2937922 2928219 2806246 2973422 2959842 2884901
8640 2884901 2982000 3095780 2987029 2976254 3083403 2840700 2961813 2928464 3136267 3303880
8630 3303880 3214467 3163631 3097705 3125502 3070883 3271470 3303283 3030459 3008822 3191022 3345306
8619 3345306 3255033 3350524 3434628 3351220 3390323 3426339 3506346 3569659 3515286 3549559 3691224
8608 3691224 3847827 3793607 3716872 3882893 4010139 4012618 4120897 4223853 4302755 4327078 4430664
8597 4430664 4456765 4530098 4349087 4503614 4529523 4730065 4756334 4856271 4881368 5107927 5463817
8586 5463817 5412424 5454928 5604234 5489705 5695537 5878737 5997028 6170812 6287112 6560669
8576 6560669 6734122 6985800 6909774 7087397 7346722 7454973 7528667 7666325 7882228 8034603
8566 8034603 8062240 8226846 8466363 8738612 9027307 9198119 9171658 9438790 9810231 10066354
8556 10066354 10322818 10737661 11080275 11350819 11725362 12164017 13011837 13538911 13976893
8547 13976893 14497783 15089329 15743251 16830937 18038746 18766025 19733601 20785567 22237505
8538 22237505 23767887 25461387 27491405 29771760 32522873 35716280 39264164 43141721
8530 43141721 47330098 51479137 54753533 56669041 56911198 55756833 54484465 53488930
8522 53488930 53438920 54512161 56410363 58999778 62009197 64614498 66108766 65839187 64045247
8513 64045247 61569086 59461545 57866176 57414496 57650811 57706062 57113838 55487680 53420737
8504 53420737 50676652 48052895 46072134 44685491 43693123 43352216 43443535 44085208 45180608
8495 45180608 46871600 49143412 52197567 55431240 59511997 64331676 69883260 75505379
8487 75505379 80917943 85407389 87678221 86892733 83981271 79941574 76007052 73195881
8479 73195881 71194992 70938805 72121923 74616125 77933079 81385495 84574544 86329646
8471 86329646 86374148 85732617 84373179 81846572 78332429 73925446 68319875 62652920 57407025
8462 57407025 52710735 49036314 46118933 44213940 43104010 42252249 41809411 42106005 43108820
8453 43108820 44470179 46105673 48200529 50849714 53289841 54609407 54458498 52494364
8445 52494364 49169103 44678086 39928828 35909806 32240259 29296286 26925681 24924894
8437 24924894 23323612 21965776 20635233 19389437 18377516 17694187 16871068 16087964 15431465
8428 15431465 14970140 14496652 13853304 13269793 13064383 12704177 12231864 11847471 11381995
8419 11381995 11151188 10969070 10645848 10282813 10288586 10040380 9708185 9565826 9201657 9145688
8409 9145688 8999104 8899538 8589465 8557527 8524977 8179916 8143250 8001575 7931182 7723129
8399 7723129 7615597 7576910 7486045 7370855 7191858 7199989 7392342 7261744 7253471 7171301 6981164
8388 6981164 6936759 6585785 6459309 6537676 6514009 6541023 6606307 6591451 6643280 6611968 6555292
8377 6555292 6345492 6457171 6665329 6613670 6665161 6610344 6459465 6393344 6419124 6510208 6702166
8366 6702166 6569861 6506995 6690514 6788448 6904895 6833452 6959412 7054143 7129611 7207154 7475302
8355 7475302 7626112 7813740 7953698 7995643 8365402 8445738 8567847 8778539 9125910 9515652
8345 9515652 9932954 10258838 10690489 11007922 11361835 11935241 12650626 13775502 14723355
8336 14723355 15619413 16740964 17878667 19396768 21381496 23275790 25800933 28499619
8328 28499619 31325854 33431293 34039089 33544832 32040605 30446954 29122497 28575721 28609969
8319 28609969 29417362 30722894 31905545 32936508 33045985 31830361 29601225 26940692
8311 26940692 24658244 22767429 21459530 20423879 19447806 19061824 18909199 18815277 18885803
8302 18885803 18959342 19282584 19629053 19944886 20575044 21498176 22529119 23985477 25471977
8293 25471977 27115535 29182755 31730215 34708600 38240016 41854034 45397494 48237399
8285 48237399 49801342 49877577 48882843 46866281 44574003 42987460 42385732 42569288 43501603
8276 43501603 44705436 45123118 44860605 43543336 40980284 37482146 33706881 30270318
8268 30270318 27048196 24722369 22864654 21231585 20034210 18950179 18156426 17428206
8260 17428206 17012518 16625637 16321742 16170815 16224823 16252478 16468744 16785267 17120388 17641017
8250 17641017 18575859 19599041 20876563 22007712 23283031 24654492 25350060 25063338 24022919
8241 24022919 22631437 21400687 20642999 20246057 20382770 20682691 21094340 21732131 21762792
8232 21762792 20832860 19221196 17191041 15107349 13286580 11954427 10948915 10117640
8224 10117640 9509446 8789999 8160648 7696018 7416738 7078263 6690855 6087382 5761300
8215 5761300 5641726 5357731 5291831 5222703 4976574 4848839 4834842 4664143 4611622 4596072
8205 4596072 4383921 4222720 4167211 4187295 3929718 3741028 3873200 3665181 3617725 3583875
8195 3583875 3483731 3369095 3500372 1496874 1363013 2330630 1944753 2098902 1948619
8186 1948619 2095233 1849696 1960288 2028635 2174811 2114339 1882171 2031508 2291790 2218324
8176 2218324 2041785 1838404 1750011 1762933 1802670 1871618 1764953 1731562 1615346 1754150
8166 1754150 1691268 1943998 1943170 1827205 1594544 1663169 1712505 1508339 1589977 1689537 1584605
8155 1584605 1385132 1525393 1443905 1471369 1523965 1567103 1414563 1306278 1211580 1379925
8145 1379925 1300771 1474987 1453055 1373283 1327761 1161883 1071472 1180279 1308943 1026819
8135 1026819 1019704 1031638 1102059 1137055 1134708 1204362 1344172 1305514 1304016 1215211 1256265 1283845
8123 1283845 1165752 1088895 1043719 1176116 1188364 1152263 1260979 1170404 1151544 1151700 1011492
8112 1011492 966959 825627 865035 647166 646716 790121 705952 825391 932158 881215 881858
8101 881858 764348 911525 814852 671726 735095 591754 697978 723470 774361 769353 765852
8090 765852 657986 565968 546531 580722 589222 615981 708446 557401 524173 566318 534368
8079 534368 569010 770869 909081 757548 629496 523596 405979 442253 514370 468782
8069 468782 485932 519392 384226 382877 479565 373611 560544 531763 459564 396761 323441
8058 323441 406261 311353 323937 483962 434542 332148 221552 268715 524923 504660 387484
8047 387484 266229 178461 137724 88113 135074 194748 130064 22054 124611 159042 -32124
8036 -32124 77592 365006 354011 310070 297734 163579 226196 311224 58396 37536 156784
8025 156784 176358 162765 260115 239089 136665 212153 370420 358678 210454 308324 273566
8014 273566 140649 65245 -35837 69490 138894 159302 172895 813 -64711 168169 254043
8003 254043 64676 361901 305335 262158 132048 -31642 108340 268322 197989 77126
7993 77126 88300 240804 293220 210386 289802 132949 193264 155911 64944 156435 31935
7982 31935 231745 261222 262855 38482 -15847 79071 -72711 112956 21852 -88621 -6997
7971 -6997 104078 40743 -41923 199193 242045 -12258 50989 195156 237332 372524 245098
7960 245098 144426 214154 154454 243739 324908 275144 306894 364057 365680 330987 216483
7949 216483 235222 262268 309273 229479 255278 72569 191802 50018 -30983 -60859 -92134
7938 -92134 22304 89900 132522 45995 -47560 55716 49743 210727 233002 134522 -2602
7927 -2602 14331 90374 -76848 10143 70565 178279 204661 228354 174811 192365 133094 173720
7915 173720 87296 136716 147762 124663 85004 333221 415685 362949 473308 375271 252943
7904 252943 283551 95936 96125 111096 -55422 -46136 127463 96417 28880 36565 -192050 -48224
7892 -48224 148686 154423 228000 413395 290397 174308 281178 205267 195235 227201 23757
7881 23757 207061 330882 96491 -47846 -2783 9839 -89125 -106875 -45248 166034 220756
7870 220756 125637 173871 126935 7075 51026 32841 164418 246776 60352 -67384 8948
7859 8948 -31920 99076 57398 -54672 -248649 -207398 -189971 -274199 -168300 -84162 224952
7848 224952 221657 -12828 54269 -92227 -170190 -174498 7579 -39821 -66609 65278 83869
7837 83869 -123634 -120756 -59939 -160325 -64380 -49211 -49209 -100668 -117655 -101811 -169791 -124857
7825 -124857 -96414 -159392 -123283 -12060 57833 131019 157044 98914 284274 169652 -20308
7814 -20308 -100580 85748 -105374 48979 156578 27304 -13213 107018 103339 -65736 -8384
7803 -8384 59447 4976 188735 56216 203885 62942 -273289 -306353 -269978 -156261 -144674
7792 -144674 -169785 -213741 -253691 -178917 54446 -51242 -135064 -63768 -15099 207603 104690
7781 104690 175 -119932 -131107 -156594 -167377 -283762 -357297 -193993 -17556 228360
7771 228360 -44745 -167018 -85889 -78249 -149890 -140544 -100815 -248885 -262336 -89850 -49639
7760 -49639 40299 -60081 -143714 -131968 28825 -131916 -169544 -30722 96661 24425 67610
7749 67610 -114606 -160373 9495 -24032 -204621 -78603 70248 153427 -160812 -119304 106702
7738 106702 -136798 -189591 -9384 -110170 -267293 -45653 57619 136213 73876 -100074
7728 -100074 -25469 -108575 -111183 10561 -56815 -23426 -117335 -81590 -31800 -234309 -98389
7717 -98389 10327 -56961 -24222 -110386 -169976 -6397 -15098 -270282 -128494 -122441 -168816
7706 -168816 -343720 -260071 -93854 -112491 -72938 39428 -101277 -237378 -44738 79424
7696 79424 -124133 -115482 -212289 1169 -13091 -23797 -18436 -65097 -145353 -45551 -67009 -115735
7684 -115735 -169386 -133002 -19675 -171785 -352265 -218950 -258743 -322869 -147017 -217994 -41202
7673 -41202 -1703 -808 -6144 -88742 -90113 -27212 -10388 -108684 -216819 -294953 -261560 -210147
7661 -210147 -156840 -202367 -315139 -235383 -180927 -136960 -357061 -176845 -105300 -140483 -155405
7650 -155405 -12455 -38874 -139413 6794 17736 -35174 67490 41150 -90445 -196130
7640 -196130 5635 -61476 -123878 -170388 -208675 -132815 39551 -144202 -228094 -240340 -216163
7629 -216163 -190900 -271442 -102979 45448 -17826 -47396 -138852 62332 -118322 -215074 -165641
7618 -165641 -189118 -36853 -140177 -163732 -330574 -199407 -84065 -134681 -192787 37948
7608 37948 -17156 50770 61138 -33841 56592 -68396 -182342 -182140 -364395 -209281 -73547
7597 -73547 -17482 75222 -14129 -194455 -293461 -265245 -145890 -93891 -122208 -181932 -88999
7586 -88999 -156096 -51165 -142544 -208833 -202056 -268658 -193458 -92764 13579 -51412 78253
7575 78253 198052 -81205 -88013 -73834 -54325 -169129 -173952 -9122 -194775 -48686 -8029
7564 -8029 -52597 -250983 -373471 -339909 -338710 -297437 -17736 -45098 -95186 -160895 33280
7553 33280 10674 12921 10962 33716 71938 -198879 -276658 -68653 -54501 -110718 44318 -99171
7541 -99171 -223286 -354994 -362089 -446044 -64888 -7408 -21873 -179693 -220259 -118525 -23476
7530 -23476 -163236 -280721 -222607 -231622 -80848 -104018 -170841 -271565 -162413 -140658 -172810
7519 -172810 -96873 -18862 -190571 -84926 -219128 -245246 -154628 -221011 -89460 -212680 -97863
7508 -97863 -30688 -241706 -465015 -367535 95164 22122 -151121 -20033 -71090 -55226 -132136
7497 -132136 30896 99412 -98424 149170 105873 221501 164564 38877 -67777 -119425
7487 -119425 193817 1082 38085 108995 -102638 -177727 82309 160402 -9052 -1692 5680
7476 5680 -48267 13805 45969 -132002 -85921 -18037 -74095 66203 -13261 -138809 -312535
7465 -312535 -365638 -285861 -71739 -170223 -221285 -327973 -207301 -126163 9911 -1988 -272254
7454 -272254 -217900 -262533 -63834 69611 -55259 -67913 110854 36785 -164626 -8898
7444 -8898 -43058 -231673 -217004 -244299 -158064 -249483 -284927 -294153 -289504 -115476 -176358 -298862
7432 -298862 -268796 -374250 -36088 47479 217739 -3507 -70394 -62997 -222330 -276558 -193890
7421 -193890 -106869 -100762 91613 -26038 -412818 -384309 -329563 -213985 -236416 -319423 -97470
7410 -97470 -42272 -114126 -192733 -295167 -233561 -71187 -129474 49075 79515 -55807 10655
7399 10655 -70144 61328 46805 63050 148316 85533 246398 75813 -93970 3348 23719
7388 23719 123196 8012 -18913 -129191 -178257 91671 -15659 19785 -149258 -188109 -86358
7377 -86358 57044 99832 -88369 22725 152175 8907 -162480 -26631 158957 72528
7367 72528 -8103 -62062 -47729 -54069 -208196 -308386 -182752 -181148 -158376 -70092 -122675 -120508
7355 -120508 -157058 -285024 -206401 -57243 -81887 -117834 -251163 -141919 -28869 -93588 -22204
7344 -22204 -210395 -242853 -143315 -19199 -20590 -115057 -150460 -88546 -51111 -78454 96460
7333 96460 155654 45991 52443 133644 -21941 -57263 40838 -6159 225738 135949 139643 -133549
7321 -133549 -429737 -211342 -261134 -165272 -15455 92154 -88872 -243301 -255332 -270147
7311 -270147 -112208 111060 77528 -22403 -99231 -167579 -36355 -201871 -276284 -234801 -188008
7300 -188008 -101728 -160225 -53771 47718 -17644 73600 -138312 -151976 -51391 -239740 -339991
7289 -339991 -309820 -444318 -151068 -64984 -174215 -114469 77876 72135 45990 17393 90323
7278 90323 243724 165164 8285 -355813 -194317 -257341 -411308 -176045 -172306 -92774 -33466
7267 -33466 -14475 2644 -92890 -211620 -129589 -148702 -101131 -7387 -69032 2759 -7772 -61120
7255 -61120 25388 242308 124382 118791 -82022 -160496 -189649 -248455 -375888 -255347 -116791
7244 -116791 -115909 -190544 -168719 -125375 -132179 -183249 -186960 -38570 -6891 29279 -25072 -34087
7232 -34087 -74162 -232560 -101303 -80209 -54757 -182163 -69100 82163 -15127 -81887 -29404
7221 -29404 -115052 -284672 -272675 -222123 -176591 -161501 -286219 -230667 -113061 -70218 -90859
7210 -90859 -12135 -156767 -347145 -299818 -160574 -87601 -173498 -20146 66299 56673 -32916
7199 -32916 -163909 -287398 -313321 -422222 -276655 -26941 -30403 -136005 -146788 -117333 -135406
7188 -135406 -103239 -145430 -10770 -9403 -144878 -212625 -304099 -156344 -45545 -71297 -18494
7177 -18494 -53930 -228716 -83197 67051 -28571 -168508 -86049 41887 -173744 -122362 -78330
7166 -78330 -338052 -283094 -303217 -263148 -89393 64300 -176723 -305854 -124658 -137079 53332
7155 53332 -38752 -64237 -51760 -75913 98316 29097 -101421 -113352 -81770 -97863 2485
7144 2485 1926 -219152 -390120 -287650 -60818 -132270 -112359 -156993 -404874 -271301 -94128
7133 -94128 -1595 -180673 -114806 -162070 -15283 37582 -114509 -230850 -96967 -22324 -145994
7122 -145994 -5433 -42156 65781 133783 35478 61688 -145770 -57995 -104351 -221415 -257349
7111 -257349 -291900 -238931 -176517 5740 144753 10424 -117892 -3102 13231 -87197
7101 -87197 -214948 -133447 -54660 -81318 -198816 -155520 -127926 -25062 -93263 -522681 -432479
7090 -432479 -180250 -18416 24250 12318 -18491 -108359 -40419 -44374 43649 -18397 115444
7079 115444 -6194 -148915 -241258 -257645 -172036 -242047 -119317 -102622 -104859 -154834 -244247
7068 -244247 -234165 -175822 -49795 -50433 -68419 -84195 -3317 -123532 -7723 130775 -12587
7057 -12587 12311 -60091 -84630 84809 -39678 -125151 1006 -84205 128381 146133 -48471
7046 -48471 -140762 -91488 -53035 -114272 -104064 -6134 35346 25537 -65268 -107364 47579 70426
7034 70426 217164 -125679 -310323 -133279 -74655 55084 128453 -11373 145744 142974 -27438
7023 -27438 -135579 -115005 -1460 94376 -227141 -173891 -67620 -302496 -127148 -91853 -227124
7012 -227124 -287753 -330305 -377753 -62164 -168215 -113706 -312833 -287815 -54666 -2331 -18709
7001 -18709 -196968 -41635 166507 -246763 -269974 -170709 -198840 -60375 -66666 51549 -59347
6990 -59347 -19913 -51937 -59872 -32413 -9678 -31990 -40646 66818 -62727 -338622 -210742
6979 -210742 -74972 -215206 -78177 -82589 -296429 -229409 -45303 48311 -24683 -137148 -182716
6968 -182716 -103901 -101666 -28160 -1141 72103 28503 -113557 -192808 -28318 -12582 -96544
6957 -96544 1935 -47548 128161 -70679 -112662 157382 162141 139616 -45586 28939 130307
6946 130307 42100 28912 -40253 -84334 98039 175567 -60466 -78870 4927 -62363 -40226
6935 -40226 -6895 -12144 85508 14255 -1450 40623 27905 -96267 -215104 -63563 -50435
6924 -50435 -121492 -20993 -30794 12315 100369 51246 -172103 -175303 -113707 -201086 -173230 -71166
6912 -71166 60187 142917 -176853 -267480 -125441 -49964 -78270 -42494 -29254 -119066 17999
6901 17999 2128 -111244 37514 -40683 195139 225600 2428 -50116 -98641 -15466 -133597
6890 -133597 44812 -33871 -223307 -248968 -128776 -33454 182685 50602 1437 19283 7519
6879 7519 82304 -115932 -149165 47749 53438 163774 85866 77912 166879 -2231 -123731
6868 -123731 -98353 -8580 11857 57465 215417 214234 -41487 -10536 15602 -37274 21271
6857 21271 59882 139346 4670 -79691 -229736 -184608 53613 -5357 -44035 71133 -204298
6846 -204298 -156492 36152 -256465 -206072 -34933 52389 -80575 -28710 -38728 -30655 -100526
6835 -100526 -54993 -186182 -93345 -12205 -2900 -168893 -129674 -15502 -28199 20399 3051
6824 3051 69263 -38398 -176314 -14492 15850 135062 -133244 -153904 18432 107301 34657
6813 34657 -143264 -284808 -372410 -124706 -22781 165961 49989 39070 -86697 101754
6803 101754 44318 65045 -127270 -149787 -56707 -97763 -71587 79095 95437 -7070 -117243
6792 -117243 -14359 78769 234525 230013 -14733 11109 104271 203708 154662 129639 192319
6781 192319 -12491 -145687 56646 72615 16116 29440 43825 9853 -20471 -21493 85495
6770 85495 146039 108130 -72385 19998 -90905 -100156 -212049 -277766 -232033 481 122772
6759 122772 180674 90038 -20219 -113400 -195159 -135946 -162860 -150056 -90098 -4410 -85901
6748 -85901 -328613 -12056 55646 -116469 -63847 -146586 -135008 -131539 -41821 -46781 -106947 -336224
6736 -336224 -185041 -112940 -178958 -124978 -39907 71902 125297 -38163 -49995 -113782 64111
6725 64111 74290 -119089 -254056 -264275 -71716 1350 -107554 -59665 -109486 -217548 -189511
6714 -189511 -33445 2505 -102330 -141722 -115863 -70475 -134166 -89315 -178495 637 8673
6703 8673 -26417 -130303 -92887 87772 35168 -18590 -156881 -132397 -39805 -122552 -228161
6692 -228161 -64416 31856 -101645 -249918 -224327 -257367 -237268 -174324 -254687 -106461 -148545
6681 -148545 -141633 56370 -40876 26107 49477 -99659 -139803 -166008 -122584 41566 -6973
6670 -6973 -170446 -173183 -24936 32911 -189839 -180443 -93542 -87637 -60005 -85835 -40829 192853
6658 192853 355195 223127 2499 -62601 -142567 -108802 147621 162305 -72005 -333284
6648 -333284 -270910 -155172 -133150 -73516 72827 -34149 -89211 64570 -113743 -112351 -142758
6637 -142758 -104064 -43145 73312 -21298 -192410 -208829 -144320 78676 30606 5661 -111380
6626 -111380 -68120 3247 -172909 -36850 -3711 -54921 -3631 46689 -65814 -38286 33164
6615 33164 66474 20807 -12104 -65743 -140210 49402 151759 211005 207547 116829 102804 164214
6603 164214 -101216 -57121 -98793 85497 153368 15297 -129476 -57904 32459 -111451 -54256
6592 -54256 -107498 -157657 -20092 -71655 75895 128894 -47929 22152 1931 -52935 651
6581 651 -6809 -108473 -196817 -238636 -49105 -77548 325812 122875 21343 156816 29688
6570 29688 -66917 15284 153626 295946 250060 256707 203936 270687 -126441 -110865 118382
6559 118382 75186 -60490 -190881 -258603 -311829 -116311 54421 103596 22889 54242 -136456
6548 -136456 -203043 -130066 94102 -134097 -231058 -105411 -114621 -269669 -244225 -82169 -392773
6537 -392773 -379226 -50795 172723 234244 211623 197949 -32235 -188692 87149 186985 292446
6526 292446 240577 -63092 -117472 -21707 -317191 -396646 -75236 -158426 -83157 26851 -53796
6515 -53796 -158166 31227 -56161 -36499 -30383 21686 -141361 -234679 -43763 111496 -99162
6504 -99162 -143598 70408 106523 -1492 -26581 100098 80441 -99223 -23566 -74896 15341
6493 15341 -584 -64486 -188997 -121353 -32846 -174333 -212592 -39874 -38671 -91428 -170722
6482 -170722 -110272 184097 114696 -38666 -90519 130086 191233 103401 26783 -60151 29843
6471 29843 -162177 -233884 -118805 -116891 -138987 -35716 -97372 18369 122661 -54815 -28210
6460 -28210 68063 52667 15595 -114237 -127468 41397 -24559 -36524 42421 29302 -4282
6449 -4282 21133 -18243 -169475 -150643 -104539 -77383 73485 55312 115230 174509 309613
6438 309613 199027 -68451 -256278 -167954 13086 179203 -33143 -65477 147434 176816
6428 176816 167920 -98383 -205707 -80357 -21057 -34770 -147771 -77316 66891 213001 179518
6417 179518 161375 177081 190386 236064 49073 -43887 314798 351556 244374 150287 46706
6406 46706 -161710 -235959 -211218 -83805 4103 31911 -87258 31976 79116 39709 157086
6395 157086 -175022 -222432 51405 16277 31900 74258 182949 70920 118588 -63458 -95379
6384 -95379 -121225 12178 82473 4084 318 71182 223950 203841 83640 -32983 -2404
6373 -2404 -71649 71975 242515 466299 304102 79007 254096 252311 307270 375536 242733
6362 242733 5111 -99089 -17916 -115951 -28126 145875 344691 398198 240044 166224 186155
6351 186155 336376 190555 68270 131600 -105862 -3158 166923 218989 139334 136451 66787
6340 66787 62145 107411 73399 130656 220018 212761 49654 -107039 142492 28077 -16313
6329 -16313 76058 51306 124487 52425 198062 125310 76651 177471 -58299 -584 187319
6318 187319 240996 188975 77089 -6272 108820 123413 -50043 -63668 -26957 -48950 16790
6307 16790 -275112 -277624 -284262 -159764 121566 130982 3481 198332 139852 160392 47818
6296 47818 -34801 -50709 117889 29321 -45251 87778 32372 -66541 -110770 92838 122689
6285 122689 202468 161939 4477 29658 159429 219094 253557 61948 -59160 -98528 -67841
6274 -67841 43269 41229 -83552 50556 169767 291796 294413 168499 -11140 99362 264009
6263 264009 299267 82725 199920 305954 138363 119214 46843 134307 206514 270950 278310
6252 278310 315992 199614 114568 168599 206002 332842 308787 273791 237077 228021 238851
6241 238851 222539 177888 210789 127738 194573 329975 450509 439513 385157 146778 41785
6230 41785 170881 155978 21074 87427 228229 406767 115870 70987 126881 73671 216503
6219 216503 331088 121468 6901 2981 124692 150301 121698 165689 209258 363446 133170
6208 133170 113461 142697 294777 230732 157772 343254 383309 273301 367452 411307 236517
6197 236517 226525 261645 62730 -69704 145220 152537 175142 183946 201493 353912 224106
6186 224106 131017 115754 100537 183152 148902 12573 -164309 -51376 -95708 35596 -27131
6175 -27131 -56116 -85222 51778 186292 138081 271126 247203 303921 264301 465695 149389
6164 149389 -21077 95664 196290 155685 27776 -46127 46516 43193 -63935 278661 365362
6153 365362 233641 35335 -101380 34207 41685 166741 337817 281497 97338 90875 81152
6142 81152 244105 217532 165706 197636 -97454 -126946 51210 123862 52383 157360 307963
6131 307963 225010 168741 127447 266058 3034 -101260 192533 274387 195659 -63165 -102505
6120 -102505 -14333 89201 47852 -74512 95198 40250 55860 134475 102331 133528 151675
6109 151675 210431 333433 127858 124985 319829 249243 136449 145984 289922 194767 108402
6098 108402 141083 127386 20294 78490 86892 140877 154692 117885 7974 107780 210890
6087 210890 -34041 -48472 74795 -13846 3545 167974 87049 232462 201294 199411 218484
6076 218484 216570 69444 -69828 -27741 76118 103247 28135 7621 -2990 58741 45192
6065 45192 -51726 144854 358007 103566 117353 -106753 -69780 150919 41235 216692
6055 216692 45209 -57451 6228 -84551 55403 94496 124349 25022 86980 -61209 35886
6044 35886 361089 388939 162795 35099 -11443 -72932 -11254 98554 108579 72388 7328
6033 7328 28790 -36852 -27637 179466 244443 146326 67710 109863 77514 184140 237830 209742
6021 209742 97636 -120565 104550 185575 -33479 144334 208324 205604 262628 163883 266392
6010 266392 329458 98043 177533 223634 129792 25485 -689 157257 57507 134717 -34769
5999 -34769 -167059 -2854 639 83343 130073 93228 34108 190445 96277 91460 150038 232054
5987 232054 161805 97280 145400 17697 -22725 76937 75140 85244 195330 248791 171762
5976 171762 133003 -103112 102892 64486 85063 344303 238215 118802 132343 199456 217091
5965 217091 -47155 -36459 169044 191244 107817 55824 241133 272110 338128 187006 223707
5954 223707 253245 199766 169359 -194591 -111575 -27868 72172 287625 406051 276202 38186
5943 38186 172056 -2894 -9556 6168 171596 -36780 90022 93353 100575 170562 75430
5932 75430 38605 34580 112542 140340 -63815 132115 249034 251795 199786 172517 204065 151296
5920 151296 67710 69991 3210 51064 158124 -93008 41613 51276 42446 104664 -106562
5909 -106562 -16611 196183 -34099 28450 339330 265582 174812 365778 297715 284286 430693
5898 430693 282876 318549 295402 276209 341318 117792 79366 2527 76924 128852 -65284
5887 -65284 -99211 48862 -972 -69655 136389 223137 337393 347622 187894 385743 164594
5876 164594 56616 46270 79543 72439 61245 170311 115174 186623 314535 282695 499453
5865 499453 444488 355799 303629 210172 239697 333973 222957 119602 102289 65526 52794
5854 52794 221066 222840 302823 227013 155481 332757 365157 230492 265141 167050 56321
5843 56321 144511 124438 220592 294732 418531 276170 381891 440496 320591 263932 423211
5832 423211 274259 203501 142890 199643 341852 319949 282822 354700 469455 494834 586385
5821 586385 519789 286305 475238 732331 577551 350117 458164 539206 475139 539057
5811 539057 527545 497519 487856 459149 560203 617435 631218 583101 524124 555643 390015
5800 390015 540879 548831 619366 633247 506753 629605 418761 478071 515441 602077 593739
5789 593739 355924 441418 418861 280509 398850 487676 688520 774125 563039 411840
5779 411840 441567 507831 385399 407783 457865 523179 734928 712980 638531 640862 505544
5768 505544 465667 457187 432092 427520 518511 651254 825991 674410 417244 699433 813746
5757 813746 769494 716219 601624 483967 448733 573819 520911 693233 780385 909181 814795
5746 814795 863857 734532 632535 754819 909135 1010036 757871 796214 792299 960470
5736 960470 975176 1042746 1060979 1055416 1097096 1118975 1309129 1531359 1462711 1114211 1263136
5725 1263136 1493329 1280133 1447428 1539766 1283322 1201713 1254759 1293148 1179241 1152737
5715 1152737 983471 1020433 1261408 1262631 1113471 945351 1030551 998748 1014182 1001746 766584
5704 766584 844293 839245 745142 908721 1060609 919761 652199 796375 865523 690062 765926
5693 765926 691949 741854 878903 728958 651231 895468 902631 838158 835123 689408 696778
5682 696778 718311 563024 447987 600398 415610 326486 416555 448829 638310 513672
5672 513672 435294 514529 709321 705011 643314 699717 785533 724470 527460 413386 385494
5661 385494 519078 566827 733980 934344 756312 493199 770526 647072 715441 965511
5651 965511 958228 839748 967663 960800 924076 990236 994796 939637 824946 933466 1053906
5640 1053906 1005782 905858 914896 1108561 999351 934653 1109772 914632 866990 774901 887340
5629 887340 801222 919942 885861 727926 971580 1147152 1052257 945101 1064376 1015533
5619 1015533 1093539 1166569 1052826 1018943 1143679 1256092 1058793 1111242 1289013 1337453
5609 1337453 1447146 1390255 1339897 1294764 1261304 1548412 1578240 1476957 1605532 1493749
5599 1493749 1337956 1227729 1157269 1193874 1204204 1341945 1445965 1474113 1333926 1390414
5589 1390414 1743527 1797736 1696769 1726891 1629077 1664329 1893052 1769905 1697187 1580067
5579 1580067 1462735 1756151 1815982 1934557 1899586 2048440 2127884 1863506 1807533 1832904
5569 1832904 1940333 2063352 2131135 2093824 2076041 2133434 2187337 2301788 2293057 2422063 2469734
5558 2469734 2453595 2487571 2668209 2673672 2508261 2435370 2400474 2406795 2451039 2545267 2594753
5547 2594753 2777515 2824311 2756364 2835236 2893042 2919511 2876690 2878881 2922177 2877922 2941659
5536 2941659 3069293 3068223 3115097 3173666 3182532 3457075 3460947 3463319 3532944 3589561 3620568 3774374
5524 3774374 3732052 3799839 3716856 3783698 4031841 4390054 4603257 4720693 4714435 4729332 4662053
5513 4662053 4636949 4743685 5002377 5146233 5229133 5327504 5472476 5494038 5577293 5734722
5503 5734722 5783481 6055602 6245997 6359459 6420234 6538826 6683581 6798321 6918922 7272116
5493 7272116 7644023 7864249 7922738 8334790 8759033 9007995 9331655 9698176 9862045 9886931
5483 9886931 10115070 10419365 10617534 10804222 11070436 11408488 11606286 11879792 12383721 12744030
5473 12744030 12928935 13280411 13562005 13777572 14156389 14424475 14819759 15183073 15367227
5464 15367227 15905461 16418651 16987839 17397925 18096789 18804816 19598779 20328938 20938518
5455 20938518 21938705 23057853 24010936 25021911 25863882 26998699 28093309 29583428
5447 29583428 31265075 33045655 35088790 37023306 39354066 41904345 44637110 47470212
5439 47470212 50923724 54784477 59300148 64012980 69454739 75821216 83034049 91167502
5431 91167502 100183916 110059211 120728032 131720460 142478300 152250752 161290368 169711282
5423 169711282 177737193 185751723 192768894 197176134 197060702 191850653 182957347 172487418
5415 172487418 162107627 152060449 141813602 131134549 119868844 108266488 96930890
5408 96930890 86739754 77772295 69937915 63307300 58172438 53465849 49248239 45433966
5400 45433966 42263773 39577708 36921441 34784310 32670074 30818302 29247623 28058996
5392 28058996 26588081 25130582 23940492 23009303 22188500 21308121 20613832 20056704 19129536
5383 19129536 18402115 17835191 17302173 16704216 16300809 15805347 15347227 14892751 14352931
5374 14352931 13887368 13415014 13054823 12634220 12095624 11820163 11687959 11287131 11024848
5365 11024848 10658630 10528533 10324091 10156367 9776800 9450069 9338030 9222910 8983950
5356 8983950 8612351 8403815 8493801 8312095 8107659 7978564 7754499 7659001 7714455 7539708
5346 7539708 7414454 7304348 7212750 6944924 6646736 6404976 6471408 6445600 6292856 6227968
5336 6227968 6074947 5785539 5663682 5503958 5277047 5177877 5094145 5115215 5012530 4888284
5326 4888284 4884473 4478359 4189542 4217262 4235289 4178297 3961385 3859776 3932485 3895415 3644025
5315 3644025 3562050 3538591 3448640 3468249 3364700 3426865 3291643 3209355 3472211 3388310 3412604
5304 3412604 3262776 3324375 3007749 2902069 2839376 3055755 3005362 2700099 2792663 2801500 2802522
5293 2802522 2762737 2529347 2544582 2371774 2397375 2210972 2271321 2552258 2402143 2409144 2341735
5282 2341735 2414138 2433945 2258161 2055316 2098474 2261064 2063807 1966678 1960923 1901996 2026218
5271 2026218 2042217 1986241 1979017 1939306 1879035 1932830 1793301 1946462 2050648 1937060 2070578
5260 2070578 2066853 2047038 2043131 1875763 1712237 1760319 1775583 1909956 1953709 1793135 1990148
5249 1990148 1708772 1605268 1649081 1527041 1567820 1587200 1476359 1520083 1542877 1515689 1487756
5238 1487756 1617234 1847603 1757250 1691042 1798202 1628561 1566385 1555777 1817047 1856787
5228 1856787 1771506 1716906 1753464 1603562 1680721 1729859 1560761 1572068 1277415 1400559 1315381
5217 1315381 1437504 1635533 1465777 1377446 1388329 1490738 1584068 1592940 1490906 1486457 1668827
5206 1668827 1499339 1493844 1522546 1439200 1386403 1583092 1575219 1367491 1321449 1460653 1477208
5195 1477208 1504475 1659006 1587452 1512665 1339083 1328046 1270906 1330543 1322014 1397995 1398903 1277001
5183 1277001 1263495 1263986 1283337 1446354 1386724 1350930 1516427 1403101 1293215 1273344 1437325
5172 1437325 1313777 1256540 1405998 1629761 1599028 1435356 1567560 1665424 1548111 1581908
5162 1581908 1637044 1637574 1736305 1855645 1764984 1721471 1701334 1731894 1654009 1862435 1815022
5151 1815022 1673200 1695366 1685934 1642099 1665050 1454883 1540946 1591510 1396466 1572724 1527336
5140 1527336 1450944 1339236 1227346 1155540 1318812 1584218 1837307 1801829 1716445 1665435
5130 1665435 1559743 1599196 1665625 1435481 1611465 1793344 1781510 1960740 2039765 2082965
5120 2082965 2089652 2250747 2361047 2359550 2517873 2350853 2237220 2341380 2383050 2437446 2708949
5109 2708949 2567709 2503463 2313902 2295499 2413911 2438219 2458725 2306844 2386307 2563544
5099 2563544 2386635 2294195 2600205 2518643 2353165 2358103 2294645 2318437 2393876 2234449 1953960
5088 1953960 1944829 1730693 1695770 1719617 1681788 1489693 1460033 1437117 1201343 1141826 1343181
5077 1343181 1491495 1448806 1363177 1233085 1116038 1015771 1228663 1182765 1123054 1008716
5067 1008716 982276 996098 988922 937264 1018662 928861 859212 921398 971486 997977 1065943 935198
5055 935198 970556 1059139 945239 1044170 1080002 1328050 1146528 1016866 1214626 1038537
5045 1038537 920708 948693 983572 1110378 1026903 1132585 925546 757698 727360 866313
5035 866313 910072 932072 906212 1022245 1038539 841983 911412 1009644 975473 1064681 1133129
5024 1133129 929876 935179 921867 1164002 1150226 1090012 932613 960245 1026159 859350 959045
5013 959045 940000 953408 996591 854035 1009027 1017912 815909 872065 1043417 1024825 1185979
5002 1185979 1153852 1068621 1152616 1178365 1093293 1159842 911726 896161 959919 1002434 828569
4991 828569 773228 1023292 945715 958096 1130363 1213103 1222322 1194803 1248058 1077811 1136521
4980 1136521 1248086 1210314 1139142 1432357 1231750 1354684 1496642 1412306 1489711 1464704
4970 1464704 1398952 1385211 1479352 1478050 1367271 1306872 1529192 1680860 1567516 1554236 1551956
4959 1551956 1411564 1595045 1574409 1511940 1417887 1384948 1462861 1559638 1736204 1873001 1788720
4948 1788720 1703662 1902054 2100668 2028578 2006883 1719179 1839680 1745105 1652222 1641361 1767851
4937 1767851 1773612 1916400 1883919 1891507 1746362 1516117 1595379 1656937 1602116 1605262 1600803 1697953
4925 1697953 1765245 1711559 1747013 1780563 1604258 1645526 1682405 1702907 1747474 1579428 1489393
4914 1489393 1462441 1458916 1486901 1394473 1385875 1439025 1400574 1223389 1467294 1600086 1745466
4903 1745466 1699179 1416673 1590143 1506953 1406608 1324597 1489715 1417799 1473404 1476730 1336333
4892 1336333 1515628 1775880 1755247 1810049 1848913 1581287 1156121 1032992 1237656 1371262
4882 1371262 1357212 1267482 1368587 1410267 1376020 1304085 1385656 1580622 1504008 1226494 1270495
4871 1270495 1417267 1516228 1730034 1747622 1787347 1761077 1772314 1630369 1471498 1650644
4861 1650644 1632998 1692888 1837835 1614678 1639730 1801776 1805214 1792689 1583417 1690974 1844681
4850 1844681 1917477 2003397 2166736 1949684 2039774 2004639 1946109 1972565 1873674 1894999 1920967
4839 1920967 2237443 2319373 2216204 2159016 2345252 2460237 2569848 2644481 2427286 2294332
4829 2294332 2303359 2296622 2511633 2498358 2416117 2611417 2658719 2652506 2823383 2670653 2562275
4818 2562275 2630363 2869633 2928674 2927118 2726384 3023293 3254663 2965375 2897536 3126897
4808 3126897 3337385 3244443 3151077 3127820 3255147 3177060 3014211 3300732 3486281 3465831
4798 3465831 3618932 3639586 3671643 3858568 3766292 3645623 3426133 3573114 3559656 3571288
4788 3571288 3556494 3422936 3636875 3767669 3921047 4050257 3908149 4132788 4275392 4269237
4778 4269237 4384952 4452683 4418637 4438285 4407103 4509140 4665944 4802305 4969202 5089293
4768 5089293 5046473 4969592 5227365 5524415 5624487 5667463 5821288 6068184 6429968 6606929
4758 6606929 6725472 6807271 6725742 6600152 6521643 6360531 6378259 6089873 5960907 6010292
4748 6010292 6197617 6219930 6295910 6317001 6268073 6382130 6523177 6601799 6739337 6697911 6764731
4737 6764731 6893543 6744853 6841477 7122307 7261333 7497424 7719072 7668253 7689166 7895262
4727 7895262 8142050 8300270 8222968 8409837 8726925 8803593 8946413 8910903 9167234 9331016
4717 9331016 9606764 9978376 10175110 10577859 10835644 10972692 11258923 11712396 11900862 12044145
4707 12044145 12327223 12665916 12945806 13225944 13590208 14167488 14688322 14883545 15339035
4698 15339035 15951420 16262933 16974305 17873241 18420892 19199001 20183648 20705003 21342568
4689 21342568 22096293 23129110 24242203 25450063 26960540 28411358 30094385 31989404
4681 31989404 34072827 36381889 38722122 41428735 44444838 47290004 49980470 52777775
4673 52777775 54898601 56430539 57596513 58211222 58698927 58911928 58713979 57849043 57122778
4664 57122778 56678963 56572331 56997695 57761372 58663663 60231700 62388657 64638778 67738795
4655 67738795 71395180 75544557 80258990 85374256 90811046 96505614 101968174 107295876
4647 107295876 112207078 116703182 120479947 122890107 122615900 119303681 112807986 104552019
4639 104552019 96885132 89971759 84480173 80115599 76863377 74512006 72845786 72107391
4631 72107391 72137008 72702644 73844030 75406121 77797134 80604594 83760359 87566197 91406103
4622 91406103 94385403 96408567 96941972 95600043 92910654 88917026 83722729 77901787
4614 77901787 72221091 66646877 61340715 56591718 52477937 48944410 45932898 43421626
4606 43421626 41419800 39373185 37591331 36170167 34585816 33336113 32272734 31507500
4598 31507500 30538320 29618271 29022272 28663384 28079999 27452156 26986927 26692301 26365786
4589 26365786 25972951 25527104 25411221 25373641 25091686 24987000 24912321 24890233 24859033 24888489
4579 24888489 24871682 25024637 25123466 24938852 24993431 25028932 25402163 25680641 25756617 26080808
4569 26080808 26522144 26861489 27291463 27590159 28063481 28589419 29190179 29860157 30325477
4560 30325477 31043112 31853177 32779457 33510497 34535878 35783698 36883090 38062971 39407886
4551 39407886 41001831 42472458 44078135 46073682 48520426 50953526 53519339 56665300
4543 56665300 60043425 63604213 66896870 70418517 74099080 77578761 80977343 84088417
4535 84088417 87106035 89833010 92031971 93800194 94795536 95465923 95763834 95401128 94713689
4526 94713689 94054937 93503057 92999293 92664983 92632196 93142300 93897591 94967044 96475173
4517 96475173 98298159 100469927 102956468 105691461 108243821 110788911 113416630 116112252
4509 116112252 118656538 120807491 122031695 122286661 121565219 120281888 118341684 116158099
4501 116158099 113963973 111215134 108038036 105138566 102241449 99464779 97077047 95032268
4493 95032268 93446177 92121572 91468044 91166739 91300559 91800910 92799392 93960478 95138554
4484 95138554 96776815 98755155 100648984 102398158 104480085 106644924 108948583 111212416
4476 111212416 113625599 116391851 119512367 123114931 127298372 132199985 138406719 146062499
4468 146062499 155067529 165372317 177970871 193068290 211456181 233800913 260077026
4461 260077026 290901892 326560733 366354604 406079733 435186091 437855933 407447714
4454 407447714 357095628 304931226 259613333 223066229 194134395 171141275 152753076
4447 152753076 137958693 125776438 115477618 106776796 98956661 91850869 85475408 79563417
4439 79563417 74321830 69647332 65647698 62086730 59232142 56505028 53847716 51544620
4431 51544620 49437688 47353198 45159448 43427051 42013251 40637872 39369582 38039867
4423 38039867 36831976 35633270 34717556 33729646 32517495 31584931 30748050 29767032 28945275
4414 28945275 27958843 27093066 26232126 25674282 24914599 24101696 23589541 23020554 22220166
4405 22220166 21528980 21255707 20862252 20311728 19578167 19112335 18572806 18319664 17682955
4396 17682955 17389191 17136154 16788931 16580119 16414106 15914861 15503509 15290766 15095736
4387 15095736 15216656 14941480 14569788 14304122 14218517 14027113 13834753 13621229 13387510 13288980
4377 13288980 13025349 12872971 12605042 12316493 11786063 11623304 11494252 11169581 11051197
4368 11051197 10766658 10598949 9967334 9629437 9562995 9313824 9277527 9273767 9091744 8928654
4358 8928654 8850854 8745956 8347571 8191593 8304749 7930526 7655367 7725126 7781551 7672911
4348 7672911 7682491 7890025 7743687 7544831 7376033 7350257 7086311 7028159 6791960 6808088
4338 6808088 6718703 6507060 6438962 6551707 6476988 6282379 6226851 6185122 6108187 6081997 6060612
4327 6060612 5784400 5833416 5771430 5722792 5554917 5420245 5389117 5392142 5110449 5036638 5023815
4316 5023815 5059281 5286077 5493721 5641179 5696923 6032247 6093689 5761844 5525669 5166016
4306 5166016 4849444 4612953 4434281 4375292 4156013 4060599 4213535 3931992 3841549 3776405
4296 3776405 3706021 3850381 3676444 3516922 3298536 3313885 3214976 3147414 3132733 3036936 3102096
4285 3102096 3094706 2916902 2801763 2780887 2820209 2653784 2727664 2757555 2649656 2754821 2786360
4274 2786360 2769825 2639312 2771670 2907476 2805746 2654257 2668433 2723861 2698113 2823526
4264 2823526 2697032 2631290 2748541 2681701 2549199 2453383 2413267 2454883 2616101 2664672 2664766
4253 2664766 2599581 2402845 2499208 2501311 2408120 2347556 2073882 2179610 2385871 2435589 2216494
4242 2216494 2202163 2246643 2203501 2338277 2483549 2438899 2493117 2399575 2448956 2220190 2123826
4231 2123826 2188119 1976283 1941640 1985235 1913846 1945109 1982839 2020674 1891236 1899986 1936082
4220 1936082 1935436 2016990 1895388 1926468 1957576 2011489 1984218 1989634 2083493 2151679 2049981 2102522
4208 2102522 2079301 1987400 1835160 1598807 1600158 1737089 1819128 1602784 1633168 1623966 1586389
4197 1586389 1517095 1455167 1469446 1629259 1625255 1413616 1590322 1628620 1657956 1672256 1567601
4186 1567601 1606141 1582729 1427169 1538192 1454226 1463969 1318283 1283559 1407159 1477220 1535834
4175 1535834 1333138 1137734 1147389 1399354 1197080 1183529 1190195 1199144 1491875 1535168 1771976
4164 1771976 1740576 1691820 1641054 1798459 1894957 1790425 1766500 1945830 2327904 2487308
4154 2487308 2673772 2723738 2669126 2668756 2620681 2469363 2176243 1773222 1674952 1567811 1504679
4143 1504679 1457639 1561549 1494046 1236397 1147857 894643 863232 787202 694219 443277 292259
4132 292259 579721 777566 796106 694896 665973 675008 727575 808306 829668 678552 518029
4121 518029 495946 502213 486493 437643 488696 606205 833199 813761 751995 624451 829185
4110 829185 1041392 943003 812103 661553 824179 644142 431802 439952 419224 293789
4100 293789 425990 459789 527201 572580 508849 666368 454439 352006 318208 318036 352128
4089 352128 370716 187926 20929 204391 447845 456645 431497 279704 429820 311709
4079 311709 133953 154328 135479 276915 341509 320281 292702 68163 161474 165251 260684
4068 260684 292426 404010 282400 254605 374913 155760 98541 61619 139447 30960 117984
4057 117984 202569 351459 261558 369485 214161 100109 31023 50926 47287 127583 268415
4046 268415 148648 70580 149430 169541 189819 46104 -180039 -200733 -62825 83003 36584
4035 36584 -116954 -6426 31970 223108 203851 106289 167213 81092 292789 207080 258887
4024 258887 379513 301061 322829 401194 407306 328713 136435 278625 453776 395657 277100
4013 277100 250333 88015 120726 435797 441998 333450 197106 211734 114923 75840 145100
4002 145100 16393 79271 185619 192879 96210 129684 176906 -13786 129114 162364 139511
3991 139511 208174 66177 143959 173463 412891 468134 311407 312476 457080 488084 291921
3980 291921 6092 -51048 145063 179026 243152 279206 218106 261273 317402 36850 137247
3969 137247 144283 -14534 99430 125142 127306 -16159 -159611 -14621 -117032 -110733 28717
3958 28717 236512 163632 28158 46489 277325 275326 124892 90173 127030 141948 372754
3947 372754 269213 142438 26871 116836 148943 48657 19573 106688 200975 44364 20629
3936 20629 62671 110878 157605 101853 64984 18671 94941 37414 -194297 -165450 -95295 31457
3924 31457 -73955 -19057 -31047 -22395 -73531 -30829 61584 99085 125390 220833 33275 98186
3912 98186 246290 194609 165968 61614 -16459 15402 88617 243806 225152 32793 -172051
3901 -172051 -172740 -118046 -157367 -32960 35398 30811 -7954 -270272 -37664 -7197 13727 55364
3889 55364 114410 -133057 -54612 -62006 -34328 111326 60867 160011 -21260 -105872 -93962
3878 -93962 72829 -52998 -59000 66983 -15206 85697 -87799 -280971 -281591 -129795 -173939
3867 -173939 -12370 77703 17838 -58813 -58682 -120164 -73726 -74498 -37170 -66798 -131143 -34508
3855 -34508 -73772 -162575 -169955 131122 -30109 -74474 -105837 -120203 -138060 -175841 -292172
3844 -292172 -287335 -388619 -384816 -184478 -154005 -254923 -212349 -354120 -251851 15731 113244
3833 113244 -2846 -101135 63153 202695 -8675 -129316 -132683 -88339 -108885 -226117 -227699
3822 -227699 52062 -74934 -264737 -159205 -185814 -158369 -262797 -131048 982 -136552
3812 -136552 -221819 -110865 -204308 -182190 -172365 -22766 -100557 -28899 -31568 -32329 137166 219782
3800 219782 278289 48519 -153054 -108684 -51272 50245 42159 -34371 -23126 23885 -16943
3789 -16943 -77888 22557 -49973 -94600 32687 139543 -126090 -134012 -175209 -37708 -22274
3778 -22274 -154160 -163102 -204283 11378 14114 -12695 97183 63263 -81572 -232182 -34910
3767 -34910 21783 83193 61618 38025 -23866 -13923 -59420 -2951 55143 122429 63260 -79576
3755 -79576 -26365 -61208 -91368 -45512 74679 10192 -106015 207301 140478 -99455 -146903
3744 -146903 -103117 -254669 -37464 -20363 -83690 -131007 -206135 -155409 -104536 -31881 -36523
3733 -36523 -183908 -48632 -169371 -270426 -233905 -1848 61876 64043 -118683 -240629 -232692
3722 -232692 -221601 -240299 -254228 -193294 -302606 -122857 -181695 39810 -57369 -32819 64707
3711 64707 165782 -6488 -100961 -107821 -155625 -279831 -108277 -108861 -91038 -225545 -204736
3700 -204736 -162601 23260 -35148 -27880 -158520 -114920 -50278 -144382 -18394 20659 48394
3689 48394 -8559 -85039 57648 166695 -39475 -85547 25329 -18267 -125079 -7969 118811
3678 118811 26289 62202 -52034 -242907 -222179 -83255 -29860 32096 85005 -35215 -146738
3667 -146738 -394299 -485149 41435 88989 -44710 -16914 -142865 -101413 37678 -13625 -60619
3656 -60619 16947 8812 -75948 4597 41989 90556 50549 6451 -181350 -79715 -297837
3645 -297837 -296609 -173239 -203813 -86270 -83800 -280753 -191944 -169879 -239731 -123785 -328569
3634 -328569 -400295 -195614 -61746 -32663 -163008 -140756 154565 141267 57736 -24762 -67268
3623 -67268 -109146 -129657 -136026 -162003 -265250 -66859 139494 211133 116970 151659 110984
3612 110984 73927 201197 64411 -124162 -44108 -206823 -132841 -122677 -107173 -286303 -185641
3601 -185641 -170128 -45928 -50289 30858 5206 -15535 -59542 -25391 -53260 -168367 -227125
3590 -227125 94510 32689 195560 329842 194161 156791 56211 101512 -1484 -133593
3580 -133593 20987 65163 103400 -30742 -197089 228491 364015 182616 41221 10420
3570 10420 -20345 -155423 -167672 -76300 1338 -18021 44194 33375 -11997 -22091 168139
3559 168139 119732 -29157 37257 150125 177305 -17638 -127699 21907 151899 95650
3549 95650 213073 244829 238907 -66342 -67703 95599 97026 38282 -49928 -129885 -54918 80611
3537 80611 253078 262620 13836 -96193 -55744 -196539 -227561 -88380 79902 118124 -117106
3526 -117106 -276602 -264281 -275265 -134623 -35307 -151399 -292715 -73198 -42777 -24874 -32039
3515 -32039 -112388 -139489 -37918 66176 32382 45215 76052 -53985 21220 153596 188412
3504 188412 85523 75138 127546 31006 -115953 -261715 -145983 -45137 -36874 -11778 -128361
3493 -128361 -134454 -139495 67182 127630 6258 25671 31179 45794 29200 15610 235889 172731
3481 172731 128455 28401 105496 68822 82141 55304 -51720 111672 -7001 -22339 -41260
3470 -41260 -34366 -70769 60609 120516 114306 71292 94983 161776 -26740 -22585 -67022 28012
3458 28012 79022 60827 -7488 59147 102671 6410 18985 -56516 -106754 -105761 -105217 -153783 -70372
3445 -70372 -16748 120242 47597 -68296 177958 -85063 -22846 -94815 -231609 -102120 -153350
3434 -153350 182111 114269 12922 -70613 -119607 51378 65450 164807 20110 -109445 -41814
3423 -41814 133020 194285 122868 39049 -132309 -200709 -143456 -253205 -373700 -99043 66722
3412 66722 -177568 -178200 28631 22570 -112702 -275374 -80751 -23756 -59117 10336 27537
3401 27537 31486 271923 91358 1296 -118339 -233824 -217161 -56303 -268491 -247677 -341516
3390 -341516 -248998 -130013 -94024 -112754 -157615 -18876 -8659 -131277 54854 434 -225620
3379 -225620 -191293 -64589 -125377 28625 140000 43371 215620 198553 173044 35091 -63235
3368 -63235 -5450 159344 84348 -43721 139538 272745 64784 1259 83635 278221 144691
3357 144691 93621 39957 70266 131037 129956 161292 316444 34380 32771 116420 111048 -74225
3345 -74225 -115666 -26798 146502 220496 56320 84944 73126 139275 12872 33066 22792
3334 22792 108305 -85816 -14477 10297 -31901 183146 339895 251945 -130977 -125219 -16594
3323 -16594 7788 -3840 -15507 243599 330021 305282 329774 151416 204272 311674 242792
3312 242792 287365 390466 403987 342293 248399 293019 194521 23664 193770 402301 382027
3301 382027 102041 133355 152109 195371 235708 204978 317568 324280 197392 258984 380388
3290 380388 359839 556983 442390 465838 409188 406818 473993 804927 1039125 1090079 952119
3279 952119 949153 1189870 1355423 1353155 1295299 1519694 1405220 1314309 1584854 1480484 1578915
3268 1578915 1696256 1449249 1462055 1354271 1284508 1457419 1426704 1468646 1485555 1215757
3258 1215757 1009469 961530 986822 889352 881067 669927 725884 727972 941380 781050 743951
3247 743951 733261 817187 882071 850442 802155 623313 685976 799529 918174 1179377 1392057
3236 1392057 1097595 1164036 1371237 1422850 1744296 2024160 1974966 1925902 1654152 1396500
3226 1396500 1077212 977471 919841 864414 746810 575073 521569 518702 470638 583316 542131
3215 542131 390230 377456 306466 414800 431207 312628 647555 735072 724594 518824 535901
3204 535901 433753 525041 452245 588357 656526 752835 956973 856726 714193 536351
3194 536351 739091 757283 566683 500075 611617 442908 266801 166433 122718 16393
3184 16393 106015 270525 201543 148453 390066 528585 265178 230038 341692 236100 309157
3173 309157 234681 230688 143859 -13831 -69902 46961 33413 173000 260824 99655 -42070
3162 -42070 -8303 -62657 -51834 82782 149968 11099 -140027 -47299 74111 33043 57228
3151 57228 36217 119905 116620 146434 189758 73148 10909 10834 -56634 3970 19022 23708 43791
3138 43791 29769 143285 -140036 -166908 73471 -5531 15053 6979 6476 -128303 -79374 1148
3126 1148 34056 84540 111154 37236 73760 46685 124560 55476 -211217 -43631 -42719 -14834
3114 -14834 -85354 -67203 19687 118163 10234 -126932 -169500 1499 175646 15410 -11374
3103 -11374 7213 228958 280416 81687 43435 -2681 -54729 -82795 11133 85079 2623
3092 2623 -49934 36175 274412 182361 138208 13311 31939 9324 -244255 -104557 -138857
3081 -138857 -118069 67090 114751 -18696 -46020 -320742 -408296 -202955 144021 47727 -9963
3070 -9963 18133 -260949 -177927 145872 -31778 -180095 -213025 -104322 -65999 -195798 -116601
3059 -116601 145902 112140 64296 -20335 66122 102343 -84979 99027 12754 -97409 -26064
3048 -26064 -38863 -216213 -316235 -133028 4183 -89137 4829 2839 245810 173878 -70860
3037 -70860 -29692 -162840 -86173 31244 139001 163755 123440 90191 -68780 82313 132977
3026 132977 -12926 55127 80029 264164 219426 80338 -135627 20932 156010 169537
3016 169537 299555 89312 187337 89242 -35965 48166 -49837 -162806 76321 -101909
3006 -101909 -306470 -504139 -394614 -296627 -202952 63370 -90843 -239889 -134534 -135275 56320
2995 56320 -54082 -48615 159636 167084 74969 -73116 -28511 10228 -40722 -81628 808 5118
2983 5118 -72702 -78344 -99964 -133316 67128 53724 -3058 62838 61951 -164118 54070 -109899
2971 -109899 -70505 180543 320388 180120 191410 52033 -109498 -63982 -82801 8081 49386
2960 49386 16701 39289 58218 -120118 -159899 -41419 111317 96693 -30740 -46682 -92728
2949 -92728 -77496 -48174 -113746 -33144 200157 93173 32584 4742 -187818 -203777 -133188
2938 -133188 -71618 123071 232337 249845 18283 -40489 100229 146385 165909 100477 16341
2927 16341 -158694 8095 130855 -2263 43595 82910 222932 127303 64606 141363 76921
2916 76921 183767 167788 175624 -107804 31181 44355 118165 59205 30200 110644 39099
2905 39099 -26602 42499 71888 -56771 -7093 89112 -106083 34293 135953 169815 152975
2894 152975 203578 348175 267674 230467 207303 41424 79235 91042 11487 -192603 -19060
2883 -19060 -124962 -72713 214719 213674 161063 71651 80313 -105535 46734 -15147 -13825 13439
2871 13439 -660 2704 129323 87880 -59421 -74234 -19220 -43980 73168 123750 76284
2860 76284 205079 25352 53988 -25415 -12869 -56496 -353490 -306553 -130962 -163576 -134493
2849 -134493 -81719 -136432 -195108 70500 155568 -88787 -107901 -106998 -46974 22415 92028 158068
2837 158068 269504 136820 -71261 249199 357462 126010 147219 113783 102933 91844
2827 91844 -160992 -160495 -157090 -208772 -141352 -113231 -31463 72533 209490 232101 107526 -11231
2815 -11231 152600 -36638 141814 221977 133028 79084 -17132 120628 -23932 -53620 95955
2804 95955 65948 157357 104457 310555 248341 134196 -3709 22621 -32180 -124969 -71478
2793 -71478 -22408 62743 -38564 -133551 -189939 -120026 -80850 -48932 -132996 -138334 -144781 -118038
2781 -118038 -142762 -203437 -118276 -47280 19026 16997 -86165 -186560 -139566 -270041 -180731
2770 -180731 -47184 3764 -7776 129504 186613 -139657 -301220 -45998 -110854 18620
2760 18620 79014 46187 -150863 -237929 -47215 -71736 31732 -39182 -57758 -137745 -130073
2749 -130073 -172332 1110 132783 4286 -122521 -137291 -42487 -71219 -37151 150673 318141
2738 318141 254168 126320 144570 -146598 -111599 33479 -39365 -96535 -150811 -45519 107015
2727 107015 -203182 -354308 -228069 -198229 -143993 -307613 -324759 -172068 -142581 -93969 -74199
2716 -74199 -92152 -100614 -277195 -344554 -161321 -91834 -52052 -248599 -121137 -134335 31025
2705 31025 73666 33743 218256 105888 -114995 -121716 -81338 -3165 41988 -224050 41815
2694 41815 58617 -178679 -259884 -176909 -115522 3380 42277 -191366 -216151 -244497 -88644
2683 -88644 -289246 -283569 -296918 -113002 107948 124448 244064 18821 -20967 -50464 -65684
2672 -65684 -71238 -102912 -78211 -157457 -17792 -99346 -30445 -74696 -126652 -195183 -129358 18632
2660 18632 181219 116461 -75617 4469 -132193 -201177 -84822 -57107 -35253 -87444 134981
2649 134981 59201 -44106 96555 113916 137924 -38028 -49816 42880 92972 139120 118716
2638 118716 -87532 -167471 -188216 -143930 -50919 -76969 46272 57187 -27389 281515 152045
2627 152045 -174409 -292481 -201155 -61840 87944 84101 -15433 -216192 -181022 -440416 -339611
2616 -339611 1799 -37593 127619 71796 -2951 -166194 -180193 -87632 -31165 -89323 -31299
2605 -31299 22654 35829 -230498 -180451 -10633 -85632 94968 159220 -56328 -327196 -308383
2594 -308383 -412773 -87216 -165547 -320870 -222399 -27517 -55122 -151935 -15010 -30365 -9859
2583 -9859 15918 -232013 -232939 -110467 9544 -104586 56413 84190 171910 148486 203540
2572 203540 206332 -40866 -82437 -70269 -135596 -159231 -269547 -219717 -253971 -46037 52599
2561 52599 85131 283677 252217 114296 56963 82608 -112681 172096 156548 35004 -193827
2550 -193827 -131444 -53791 -117592 -30433 -70604 -91527 -172680 -51109 -306107 -222009 -202559
2539 -202559 -108234 -166206 -167245 -27367 -201992 -136370 -15601 4977 -150778 -120446 -95612
2528 -95612 4357 195139 40078 -77263 -314320 -374660 -298247 -171459 12738 -6850 111322
2517 111322 -55213 16490 -43273 -126879 2796 191401 -107421 -61562 -220063 -239169 -163729
2506 -163729 -135082 40565 20909 228802 103228 -100169 -100998 -23668 179858 102506 4627
2495 4627 -228342 -83930 -139283 61815 53659 236789 256288 215454 317892 13020 -195119
2484 -195119 -96682 92090 177984 194763 193040 33638 40245 27238 104099 34273 22384 88917
2472 88917 129116 76378 -12505 -38732 61911 15252 44660 74602 99221 204160 161602
2461 161602 -14843 52627 136889 9260 53488 94707 93226 25599 -12597 50216 152393
2450 152393 -88819 -99066 -66438 -127205 -66175 -12999 -45837 -93572 -13354 180362 86615
2439 86615 275720 103260 41981 -105455 -45639 111371 31859 113367 194124 248166 374479
2428 374479 338670 200990 59321 230520 142622 155003 341517 235412 91657 151675
2418 151675 116925 206083 300426 251850 189264 348574 384724 325218 203240 170368 169937 136438
2406 136438 327748 328023 284245 582558 543302 592220 665907 483268 528451 420385 385726
2395 385726 410009 346614 445012 410523 357619 444219 535442 372000 255090 72392 107716
2384 107716 55075 200708 390132 160888 352166 195949 83864 54880 -176001 18619
2374 18619 128055 276960 376874 286751 203435 140699 198873 241412 117268 302536 325395
2363 325395 183781 187872 175390 392345 320169 176012 95785 -23775 -65835 161624 229215
2352 229215 124252 105121 38364 227030 399067 449751 498095 481449 465854 528351 610744
2341 610744 365637 79937 -196421 -41223 46229 190768 293085 266514 301157 145679
2331 145679 61866 289809 376522 399103 240797 30986 238349 370725 287849 365904 415769
2320 415769 414515 335289 341337 301578 313546 449888 521350 494448 554411 466126 432030 329590
2308 329590 355816 378017 411348 476328 425289 194664 -6560 199296 423658 539075 515412
2297 515412 445333 438985 510993 553831 430611 513259 499769 541582 612158 626191 789778
2286 789778 839447 916399 586776 620822 597573 455634 425365 615836 837204 629516 517534
2275 517534 616095 834609 797133 844891 823282 668782 619846 737000 842396 621135 559356
2264 559356 792579 792936 864805 809386 660701 729503 810313 969202 1059291 893284 912208
2253 912208 1076713 1074195 1041141 923879 837296 856664 937061 929841 1019846 1100597 1198969 1230837
2241 1230837 1094553 1131900 1000418 1149115 1263055 1156398 1222868 1281794 1399776 1478535
2231 1478535 1436652 1283940 1468483 1534287 1634008 1612640 1619009 1600316 1559627 1811016 1880763
2220 1880763 1885575 1834650 1775356 1842868 1925857 2054642 1986632 1848625 1964575 2103358 2065108
2209 2065108 2219937 2315043 2249430 2210987 2271978 2422869 2549731 2686932 2632781 2803607
2199 2803607 3084987 3312736 3316590 3402701 3588800 3803032 3858110 3652819 3784927 3812664
2189 3812664 3939593 4182010 4251101 4202686 4310811 4556438 4619441 4636747 4766218 5013932
2179 5013932 5047011 5123909 5233445 5554695 5826970 5793092 5890419 5767590 5974063 6368630
2169 6368630 6699333 7093438 7366781 7718642 8083822 8207285 8596423 9177285 9777020 10262798
2159 10262798 10942966 11491879 12124448 13015867 13780527 14984138 15914584 16951716 18463659
2150 18463659 19746269 21254529 22976123 24452143 25651297 27506521 30169500 33109434
2142 33109434 36570533 41122728 46760357 53579473 61494397 71024730 82659395 98191934
2134 98191934 117360372 131968021 125907038 101857798 78725813 62506050 51097264
2127 51097264 43161601 36982518 32162837 28626449 25702026 23616516 21854832 20551433
2119 20551433 19646041 18760369 17378092 15830348 14266356 12873580 11913722 11328087 10600645
2110 10600645 10197323 9620390 8941089 8506528 8206518 7722787 7384385 7240502 7020989
2101 7020989 6680623 6369681 6148072 5990095 5727979 5580067 5277224 5140450 5164180 4922443
2091 4922443 5044965 4681967 4528473 4253930 3941492 3966516 3542530 3377457 3587810 3645554
2081 3645554 3297795 3188189 2956817 2967862 3111783 3093337 2939643 2750162 2636982 2735192
2071 2735192 2655408 2390964 2445357 2493854 2608198 2411640 2355736 2339657 2151412 2073686 1997800
2060 1997800 2211728 2108158 2034440 2004691 2111511 2035207 2016932 1856345 1656558 1630175
2050 1630175 1570450 1511220 1487198 1685457 1641208 1510104 1475846 1601526 1547743 1503349 1365537
2039 1365537 1206625 1101708 1182334 1346112 1284498 1322197 1180796 1072119 1045534 1189683
2029 1189683 1110938 978792 906337 840757 884244 899050 843530 839002 955713 841975 761926
2018 761926 744621 690626 621789 430578 457894 654708 490156 318661 506849 655347
2008 655347 494545 383776 509469 549330 345843 533009 552123 477173 414691 386881 276226
1997 276226 277650 210851 444490 417837 338678 257313 298741 343763 431513 496075 480449 388736
1985 388736 468949 413503 331950 559789 492720 362297 252805 140247 251696 319995 436948
1974 436948 400577 280649 179507 -15483 40735 136641 103854 52927 262196 382727 334125
1963 334125 328317 331379 196921 129818 66235 -35680 69977 190081 153613 192880 243255
1952 243255 268963 108296 258524 349353 258012 259987 106309 -41926 307523 415052 279011
1941 279011 195320 195648 283927 259827 -6128 9373 62633 159302 91369 233368 323899 490585
1929 490585 307901 111931 169288 68519 180656 215664 150191 114965 219623 152651 118493
1918 118493 223297 227452 86778 301426 46850 212410 188296 150443 177859 139612 10579
1907 10579 67754 2643 24296 77045 147350 70569 53011 50906 13758 85060 80384 26042
1895 26042 44033 57612 -61433 36232 200976 77709 -132180 180077 61938 -6217 -171915
1884 -171915 -312243 -97167 35095 -19554 -4402 46099 215846 213220 5650 -60251 15083
1873 15083 81101 174445 314905 367584 264134 358955 438252 448276 824389 918939 693124
1862 693124 649537 497312 527512 418158 388186 211931 60218 -139028 -57763 129003
1852 129003 173820 109870 -7900 -183089 -86452 84568 127561 -97927 -177542 58181 83693
1841 83693 7229 -28613 49585 80127 100679 76759 -55963 82418 43636 88395 26568
1830 26568 -97208 -43741 -122147 33148 48568 128947 -35732 11140 168556 -203615 -286202
1819 -286202 -223819 -38160 44663 154316 98073 11990 -35425 -19984 -182924 -124794 -116843
1808 -116843 -93530 -93865 45046 13371 -121228 255942 224270 184219 77010 8944 -283696
1797 -283696 -107192 -77258 -68499 -171588 -263455 -178231 47153 88378 38095 -58356 108291
1786 108291 193861 383513 283286 151877 199924 218431 80047 23659 19659 108286 -69724
1775 -69724 -120227 49311 17153 136667 57153 35554 4300 -244125 -91961 217790 161752
1764 161752 100319 13473 -235222 -309348 -75235 144622 268460 174573 -1090 16303 80375
1753 80375 52448 -92559 -140811 -59896 115641 69108 -182623 -225655 -130454 -117159 -155136
1742 -155136 -142425 -30492 94131 152566 10710 -15391 -137245 -69902 -53827 -181604 -141513
1731 -141513 -78692 136565 18203 -56511 1532 -95513 -226414 -136849 87867 178279 37863
1720 37863 99727 -4056 -77593 -39515 69550 91868 59302 194610 25413 -27050 198814
1709 198814 25846 92290 122216 -36970 -258022 -245196 -60679 5163 -92921 35100 -25042
1698 -25042 90829 175322 63739 -86046 -79137 78816 -174950 -338033 -17043 -22619 -75790
1687 -75790 36994 -28388 -136944 -161540 -4887 -76009 -126567 -145743 -223548 -309597 -221965
1676 -221965 -196142 -19507 62320 28433 -69546 -99904 170949 44927 -16059 -140113 -128192
1665 -128192 29514 -98294 -130856 -83108 -121088 -203453 -30150 -100154 -197919 -289570 -167920
1654 -167920 -78266 75604 85460 -144262 -226446 -232136 -200790 -219011 -39250 -104636 -70899
1643 -70899 21023 -109326 -163929 -129110 -230748 59212 -154292 -79941 -33713 11314 -8691
1632 -8691 -146807 99010 -27564 -41621 -62732 -150544 -102912 -198158 -267481 -176159 -18892
1621 -18892 28483 48799 67392 -83328 -85193 -82169 138027 64629 29739 -106158 -203462 -216734
1609 -216734 -167685 -192107 -66027 -98446 -64373 606 1142 -160128 1701 -80994 -203947
1598 -203947 -14417 -65044 -129258 -184863 -73418 -34804 -59970 -15352 -17776 -558 25 22121
1586 22121 47143 8721 -65062 -13279 -155587 -159766 152375 46782 50870 33177 -9697 144626
1574 144626 239442 158707 -93179 -173746 -30167 -68397 100032 59281 -84783 21600 49726
1563 49726 -184949 -249089 -3712 104807 -36119 -196924 -157850 -157026 -187948 -173925 -86941
1552 -86941 -21457 -121125 -77640 -70630 193159 253056 142914 -57484 -231168 -210730 -10699
1541 -10699 -31554 -90843 7768 -8057 -94595 -224798 -257491 -355856 -399673 -248874 -132977
1530 -132977 -354319 -159922 -74083 -5644 -48656 -58087 122540 160006 121002 142481 140077
1519 140077 39428 70292 113570 137384 -52499 1979 -268372 -473927 -218637 -20734
1509 -20734 -179651 -270945 -218154 -383990 -283379 -125902 -122393 -186769 -43694 32149 60079
1498 60079 -41195 -693 51602 29804 132609 208818 173062 97468 -124586 -134320 6366
1487 6366 -66335 -113700 -2731 -88989 -139408 -58667 -28648 -36755 -66216 -47065 -99419 -267255
1475 -267255 -478556 -180115 -117404 -197346 -177249 24148 52466 -44605 185643 163235 230206
1464 230206 209789 179762 254543 181982 190305 -14230 -112500 41157 -18873 -82769 49684
1453 49684 -6547 114720 36077 -48017 -66293 75246 37924 -173108 -43004 10296 102225
1442 102225 -59529 -9690 52952 -10303 -81377 -45360 -54520 -49780 -120377 59951 126808 78099
1430 78099 267873 135198 128122 38682 -54645 -137055 -189856 -192277 -404368 -251643 -116269
1419 -116269 -181666 73932 152408 36482 38819 -177650 -188280 -246936 -225292 -50817 -13717
1408 -13717 81345 54925 -114355 72570 112568 -128128 86318 -3902 -147677 -148503 -167092
1397 -167092 -196991 -220523 -112749 -75463 -71986 72827 -34524 58878 185684 3913 -111646
1386 -111646 -56634 -28581 -54962 19505 -75006 -109699 9779 -48114 -48927 -152538 -83104 -103630
1374 -103630 17105 -54282 -6175 -19657 -121623 -251035 -223462 -151869 -112417 -184657 -146004
1363 -146004 -25095 -127699 -95960 -135061 -114635 -37821 -19679 -37772 -29981 199579 187141
1352 187141 36307 -14725 -241679 -143119 -43269 -78853 -5838 -62712 -51414 -63035 -134957
1341 -134957 -122649 -182543 -21659 4450 47556 -35247 -189959 -262266 520 -107739 -107197
1330 -107197 -143087 -160043 -170923 -179567 -43839 -50898 -99210 -77665 -317512 -171561 -67460
1319 -67460 -44097 -240770 -49425 -56447 -84822 34525 -4001 -149439 -149352 -112795 16049 263211
1307 263211 489358 359157 81347 19895 -199684 -126446 -158233 -149647 -199295 -218702 -32253
1296 -32253 3601 -1692 40697 -201875 -214586 -178231 5894 36834 -23516 4412 131654
1285 131654 75622 189413 45356 -111667 -14602 137826 -81222 -113087 68475 23565
1275 23565 -103242 -197862 33529 -68829 -112533 63291 8094 100522 40998 -142600 -311257
1264 -311257 -223195 -154673 -163250 -49500 -117003 4834 150756 -12111 -97859 -20157 133266
1253 133266 -20525 117563 251371 -45273 105961 121481 113798 -16466 183230 261680
1243 261680 7440 -4129 -162659 -236646 13625 8409 -166354 -91149 -17394 89180 44661
1232 44661 -64876 96673 151800 -44302 65555 91740 98899 17000 -37647 -113821 -113880 -162003
1220 -162003 -184294 4343 73693 104885 -65382 37089 -97767 -186192 -22633 -96580 -66811
1209 -66811 -5314 993 87804 -17559 -323740 -174231 -44278 -50055 6038 -56280 -155318
1198 -155318 -115363 -135782 -168898 -89834 -163545 -144050 102977 162078 150092 114721 272715
1187 272715 58632 118483 25751 70745 122366 14128 20396 -48993 113598 35672 12965
1176 12965 30131 -51227 178783 187096 140381 188193 126132 287491 312221 154195 215027
1165 215027 261031 47202 61670 -109317 -117290 -122937 44460 206048 42975 38036 39309
1154 39309 -53225 -2301 13386 -33246 1741 -22210 -210984 -180152 -8322 63535 -209390
1143 -209390 -332326 -216697 -11464 77362 90480 -82977 -171407 37645 1927 139862
1133 139862 137093 183584 268155 123421 61931 73631 173038 43652 -26247 -84861 -124767
1122 -124767 -50512 52270 32258 160295 113402 -50670 1023 164098 -73353 -96506 89006
1111 89006 94184 -7886 243494 156377 -71003 -60580 19923 -24574 -202411 -191102 35521
1100 35521 108239 -38820 -153289 68115 175967 29175 40392 134071 135632 155874 155518
1089 155518 13962 29053 178617 194907 223840 217300 10645 -103606 -137677 -43605 113267
1078 113267 124778 10528 -23576 27183 190629 311275 267498 84202 3344 -136507 -52127
1067 -52127 -24267 108321 -7012 -176689 -201034 -32093 -77111 -16693 28720 -37912 15789
1056 15789 40192 114345 90032 -214025 -61637 -93742 -98706 101152 73161 -25028 -74774
1045 -74774 -59672 -78845 96214 50122 -27339 -6167 -52695 -223973 -107480 11229 -88289
1034 -88289 -86885 -102138 -51027 -154817 71533 249430 107765 -89688 78082 10774 -171182
1023 -171182 -94815 -92063 -173531 -288512 -421464 -172705 -82293 -27370 -29803 12527 181066
1012 181066 58501 -33311 -38357 -35440 -91899 47856 128828 163020 -19230 -95177 -59201
1001 -59201 138636 -36852 -47068 -38063 -58900 121020 105899 68544 -18236 -133490 -176386
990 -176386 171843 86453 44228 30851 40209 -49714 -200982 -174897 49061 156383 210056
979 210056 38809 2999 120738 14630 105296 23275 -169907 -119886 54016 -120960 -127705
968 -127705 -275227 -134346 -291316 -130037 -74595 -95847 117883 119924 71397 11074 -10256
957 -10256 -30622 -19668 89760 129953 130795 -70783 -109403 -43187 -16230 -36811 54460 62256
945 62256 -20366 -48910 -55988 12355 109618 -16078 38554 20134 -67193 -188169 -129521 122776
933 122776 92017 -73667 -204576 -72218 204 -70167 -141350 -10682 192769 94917 23303
922 23303 17316 -160400 -216615 30590 139662 145024 94735 125127 122023 -45742 -49428 -30544
910 -30544 129900 65307 38873 142524 241168 182490 -1993 -234530 -125659 93153 40111
899 40111 -121794 -6736 25049 30872 -200681 -214672 -161383 -87669 -90426 -125008 29291 27721
887 27721 -263439 -112655 123999 -99665 -55985 -174861 -130996 24377 -118916 -73013 -111752
876 -111752 -104490 38827 51182 105415 -57737 -90386 -173271 -181039 -62079 -63523 51762 -88989
864 -88989 -72386 -68741 4153 76532 -16088 -22073 -88977 -100727 -149871 -63955 -130183 -182473
852 -182473 -133944 -264572 -96188 64603 163700 28064 25824 19134 -112737 -203132 -356707
841 -356707 -204869 -112459 -54933 50714 172906 -86091 13223 221657 127767 21731 -9284
830 -9284 85130 4437 -95836 35193 -37262 -118028 -169892 -122907 -150217 -239338 -182934 -58086
818 -58086 -2536 9943 102099 -1701 33804 101720 74627 29756 -69005 -57532 -110461 10548
806 10548 -18742 23734 104480 16138 45156 -129957 -78740 -109688 153510 208816 206509 128216
794 128216 100904 -80826 68924 67428 166021 126223 60907 116457 -173113 -93879 -163651
783 -163651 -261528 -193306 -270098 -520529 -370830 -148617 -171469 -139724 -230031 -136715 9422
772 9422 -35727 72431 173368 113991 184639 134225 -59420 6876 -88614 85542 54774
761 54774 -40207 -75431 -158958 -256332 -185392 -162617 -171074 3476 57893 -45615 17052 204313
749 204313 193803 27194 -108429 -208617 -46245 45702 -95637 -36674 221126 201674 99717
738 99717 157999 199148 -63070 -66396 -33384 -303638 -106390 64747 -4937 34019 -120567
727 -120567 -158146 -88782 -14080 188495 285469 32558 77460 213625 232169 99158 -84690
716 -84690 25953 152666 -34651 -111909 -133669 -339357 -248608 -44000 84846 240229 53963
705 53963 -17141 40875 40589 -100932 -53048 -25935 -186057 -123500 -13074 144482 178071 91837
693 91837 11571 31324 34193 -18808 4669 175190 -103419 -87473 203809 92120 -89901
682 -89901 -68608 -117704 14728 186561 -17661 -160827 -299694 -366546 -118693 34606 28070
671 28070 -99970 145400 183917 77807 69910 142803 112186 115238 10351 -190259 -131816
660 -131816 -96614 -90589 34110 40659 93296 159392 73660 12813 130806 95703 64595 178435
648 178435 176774 127412 180461 216447 221664 98419 -48793 -5239 -15517 202037 288069 105139
636 105139 -31899 116878 145499 87648 -22282 11431 12189 138176 250717 286124 19557
625 19557 113051 157844 54125 -85457 -57105 -203154 -90158 41550 85276 344576 110681
614 110681 86479 31852 204530 96120 115056 11689 -105203 -168826 -66901 -169843 -219372
603 -219372 -241050 -53587 -54492 80478 87040 -254853 -356427 -272537 -41652 -38573 -58113 -120988
591 -120988 -133333 -169818 -93421 -77364 -106797 -24741 -131319 -23458 107141 60729 272041
580 272041 429933 349198 114729 140538 128104 -5469 30104 66042 -7450 -107879 -76544
569 -76544 -199728 -253443 -149414 -153351 -69646 -101085 -95053 13128 -86578 -93487 136838 150114
557 150114 26913 7187 22977 63260 -46323 -124301 -72295 3188 78573 114488 128279
546 128279 169848 -33115 -71947 -4211 123345 58907 -68292 17018 141025 291538 37895
535 37895 94275 119675 131948 60478 -40683 -15005 81538 -17582 -30150 -32988 80182 125595
523 125595 87042 166784 22146 -49463 116741 67072 -102779 -112499 120564 121172 -14439
512 -14439 -47835 -148981 -150305 -118454 -90555 63788 115724 94950 -25808 173453 196708
501 196708 138265 61506 33012 56331 50967 124588 206899 228823 -17902 49186 78165 4538
489 4538 -47519 52681 25662 101723 21514 -106889 -128822 -259508 -34085 -55529 -52554 -55584
477 -55584 70902 167281 46226 -108219 32398 56609 -56807 251897 314735 462511 299810
466 299810 188981 75589 57186 -35954 -17170 145695 107936 241297 96573 -56251 39450
455 39450 262790 148059 80759 32942 107364 165786 99453 5601 -96552 -210806 -38627
444 -38627 -91720 -219239 -96536 -128100 56511 117292 165426 168136 122927 73777 18092 94964
432 94964 215289 234258 30948 -5425 114019 311637 364070 258257 257902 44052 40788
421 40788 33853 75566 -115819 -21277 -107458 -59823 -67569 93358 -47465 -25543 -75303 -240830
409 -240830 -224722 2054 199590 113369 76102 24061 111677 287636 273772 106186 126530
398 126530 209858 303915 330061 186420 203615 -53576 -101954 106123 160422 120298 135412
387 135412 119782 171453 175286 136503 88603 -17079 9385 102071 139769 -79422 -68224 82026
375 82026 309266 236931 174272 174113 199459 106783 -19384 41771 105265 217005 225371 173108
363 173108 201806 80564 213692 413595 370010 164182 61842 -37076 181680 249569 67790
352 67790 4421 111905 46712 113017 38483 201650 112802 110715 87598 182840 153862 85196
340 85196 39188 210504 236698 126602 62211 27416 25678 152576 29749 200686 373977
329 373977 300321 179289 30108 143537 145321 -51696 -3633 241485 247597 109768 55996
318 55996 -76613 -175853 104600 59291 46992 -1286 152452 251443 152781 62822 98113
307 98113 286435 77003 -71978 216636 115114 211418 -62727 -12281 36333 30806 131388
296 131388 58723 117467 385386 105665 109946 202661 153081 123293 54059 27660 208275
285 208275 293686 44044 84998 163351 210513 149952 162168 297974 316272 165252 190542
274 190542 166338 117768 161126 -32716 9547 130384 290946 456120 350988 272575 43941
263 43941 162094 17438 330298 218343 170724 257160 187809 359796 319593 326008 301065
252 301065 383436 294390 176817 -63749 -123125 -58705 43549 113632 47514 67317 223140
241 223140 236163 196478 250797 262568 246202 47539 17825 158416 -12144 -113155 -27689
230 -27689 -139107 128404 105958 -150114 -115561 65478 168124 -130990 29074 166014
220 166014 -43111 -152595 -7122 155010 136528 118378 183274 58740 20145 -30215 134239
209 134239 205471 121933 33452 54557 139150 217528 205221 181001 153281 -70819 -14550 56405
197 56405 104605 -12724 31648 74186 134049 340588 272760 189558 268137 295140 202578 208439
185 208439 359655 251892 154596 398355 258676 165698 107116 243916 344452 351623 264835
174 264835 293392 168601 215965 350658 410570 350055 189349 108091 -11894 49351 172760
163 172760 244340 194329 178806 81906 161503 196899 135246 144997 308248 279853 174692 261279
151 261279 186030 187347 113653 -70996 1626 28616 -78222 155047 188867 28811 135699
140 135699 100381 83281 287599 215831 58183 34256 8430 264242 280198 216056 121771
129 121771 167611 134596 33255 169649 178498 94769 -28898 -58289 64442 5877 29408
118 29408 102855 201531 190395 270945 195676 150373 230195 280237 206073 20071 -56780 -1226
106 -1226 77619 166889 57380 68003 98657 56067 68653 238321 73200 36280 128729 40920
94 40920 15106 247932 108792 77146 47757 155321 176564 196873 286125 259755 238944 162837
82 162837 312328 178668 77632 164902 129307 78317 217500 232967 229151 261607 216375
71 216375 89071 100062 87879 26025 -14744 249695 301690 181676 116102 140349 182771
60 182771 269250 154436 308852 270243 131724 142530 84692 -19628 173124 254427 173572
49 173572 209159 271235 214738 217493 56473 106512 119052 158839 264276 147904 161496 114598
37 114598 85113 109502 121818 -28843 123351 57334 111266 226711 170060 192256 179156
26 179156 263582 246152 290088 191616 127432 248447 325771 190271 211990 292816 90232
15 90232 131397 178324 216186 144188 139335 183555 250021 134066 103071 33102 -59431 20817
3 20817 33713 215224 211247
0 211247
$$ Imaginary data points
##PAGE= N=2
##DATA TABLE= (X++(I..I)), XYDATA
16383 -822584 -813308 -926347 -835511 -691626 -497924 -515542 -554212 -572571 -507290 -578885 -647353
16372 -647353 -629595 -591582 -537141 -503038 -557043 -569247 -574430 -393415 -524703 -483717 -342087
16361 -342087 -483954 -341755 -419666 -530836 -468994 -382469 -373354 -286999 -462065 -402395 -325407
16350 -325407 -332517 -365579 -236593 -207580 -153634 -167725 -164903 -232368 -254111 -160378 29955
16339 29955 -178543 -307414 -311271 -248645 -129282 308 113049 43121 120305 73749 3847
16328 3847 92491 142755 265970 184980 161025 47931 139943 282417 276534 184455 57835
16317 57835 85535 234106 271634 313088 267168 96266 265727 430433 331619 191861 287982
16306 287982 178707 242116 315009 369836 367066 489987 628894 583893 478891 427151 543671
16295 543671 617746 425941 511453 502765 432576 537884 566857 632411 550176 521841 577870
16284 577870 632267 513710 538500 612689 565591 573358 667110 640231 690227 899775 849362
16273 849362 904361 1008631 1096270 908626 927412 933194 774619 895958 921345 865372 870811
16262 870811 1040450 943851 882943 885511 897507 1006672 989530 980428 973763 977666 1027234 979498
16250 979498 983066 1099486 1215678 1107849 870867 1000008 1034490 954597 1024096 1265955
16240 1265955 1207325 1194104 1084825 1008300 1005777 1081348 1078993 1061148 1169042 1214707 1072977
16229 1072977 935046 897487 1074006 1211685 1298229 1275085 1191420 1216973 1191072 1377186
16219 1377186 1434475 1458577 1320238 1206133 1328811 1330976 1383164 1285340 1406566 1503920 1421611
16208 1421611 1430871 1436459 1628871 1797553 1595059 1374641 1362303 1449274 1359587 1377465 1375152
16197 1375152 1378373 1271398 1368344 1435741 1309176 1402761 1299211 1416344 1436419 1506406 1505673
16186 1505673 1404047 1288734 1406054 1577954 1712052 1634198 1676900 1731960 1914327 1675655
16176 1675655 1587936 1667354 1650536 1744991 1697960 1464664 1522101 1558868 1485682 1550587 1610842
16165 1610842 1668396 1605584 1555717 1634314 1575772 1669826 1706804 1618296 1770911 1747837 1715044
16154 1715044 1625379 1561494 1483348 1538074 1649167 1746148 1634354 1498502 1673642 1650461
16144 1650461 1713708 1655261 1605960 1687452 1733673 1782935 1457716 1534741 1590442 1689052 1448152
16133 1448152 1541947 1642376 1506726 1512747 1559963 1611424 1723880 1802927 1733340 1694280 1835408
16122 1835408 1856173 1651558 1466388 1510636 1635468 1725157 1768106 1786216 1878728 1776930
16112 1776930 1664459 1711739 1661826 1913212 1909057 1788070 1761150 1845131 1968043 1932014 1604057
16101 1604057 1424293 1592944 1610586 1834826 1780470 1642031 1488042 1616366 1708931 1761648
16091 1761648 1770188 1672255 1595208 1635835 1660955 1757187 1704172 1746179 1616920 1641162 1710870
16080 1710870 1772090 1700734 1742166 1663483 1487151 1728633 1740194 1765601 1930787 1823217
16070 1823217 1767472 1696593 1754791 1857213 1787029 1750815 1854138 1845008 1801203 1877215 1873773
16059 1873773 1865799 1863054 1699076 1750241 1591399 1501853 1481269 1425177 1465038 1588933 1759485
16048 1759485 1744838 1887886 2006564 1955917 1656365 1451224 1581898 1506393 1640070 1662626
16038 1662626 1470120 1670936 1858885 1879525 1758970 1731259 2029977 1867058 1752461 1865223
16028 1865223 2023522 2043242 1829082 1808338 1652010 1818351 1915139 1919326 1937683 1893023 1729011
16017 1729011 1814542 1786405 1922924 1803448 1893453 1820666 1725782 1661248 1782515 1899371
16007 1899371 1788139 1712178 1746607 1795396 1686398 1932436 1979375 1915947 1912949 1832848 1921343
15996 1921343 1845102 1725230 1673174 1785008 1876214 1886454 1851477 1805881 1822940 1644051 1656526
15985 1656526 1630051 1692020 1920630 1760249 1592297 1661213 1729389 1692989 1679024 1488981
15975 1488981 1665315 1694908 1789413 1733583 2041739 1988198 1727569 1649014 1801655 1878343
15965 1878343 1798709 1795417 1739104 1601786 1691867 1829404 1758170 1816304 1685816 1901646 1959154
15954 1959154 1800436 1637567 1591059 1626068 1721982 1809060 1916771 1695169 1681070 1735284
15944 1735284 1768640 1722340 1764812 1610378 1635899 1683031 1770174 1887354 1819818 1558558 1687050
15933 1687050 1668521 1806816 1668378 1915768 1796940 1622074 1811637 1730207 1934760 2051172
15923 2051172 1985537 1792899 1728885 1731126 1861685 1783517 1792729 1770547 1741400 1711612 1722284
15912 1722284 1629564 1758276 1953618 1894360 1832119 1836107 1724988 1720062 1881270 1795385 1708882
15901 1708882 1814247 1926851 1761463 1642834 1652057 1626189 1542014 1713683 1784816 1872544
15891 1872544 1791483 1753899 1794870 1835774 1928635 1948540 1902008 1644631 1711726 1940932 1930344
15880 1930344 2017616 1779840 1623731 1872482 1828202 1663771 1517942 1693574 1921406 1947767
15870 1947767 1650641 1558282 1532850 1604851 1624948 1653877 1862850 1817939 1722282 1675493 1782811
15859 1782811 1930150 1966457 2100274 2079982 1892128 1694449 1728079 1945190 1934277 1869403
15849 1869403 1950387 1917726 2054350 2009887 1915617 1894974 1912871 2040418 1968515 2008938 2050872
15838 2050872 2063614 1882087 1771527 1724018 1754975 1814092 1723699 1752329 1828669 1733984 1867279
15827 1867279 1949018 1790812 2015583 1917034 1743579 1477710 1535649 1892141 1833153 1753902
15817 1753902 1760524 1791678 1846879 1787883 1690247 1734113 1856119 1759332 1732179 1715413 1699672
15806 1699672 1502410 1646426 1680953 1676783 1763467 1923298 2029226 2000101 1813311 1877297
15796 1877297 1858246 1846738 1847675 1778814 1669871 1518032 1830579 1927187 1846203 1875122 1858355
15785 1858355 1723957 1665001 1648042 1904900 1743240 1781148 1744919 1777533 1593091 1676339
15775 1676339 1765876 1883255 1974789 1921739 1945954 2003765 1859122 1775794 1738572 1664036 1716344
15764 1716344 2008813 1943190 1652620 1704397 1762979 1812955 1868596 1848870 1774326 1757997 1710143
15753 1710143 1916292 1952309 2047172 1879316 1880580 1944027 1856873 1723426 1737264 1848916 1859511
15742 1859511 1868178 1848141 1946513 1896974 1840688 1712427 1749795 1827872 1675530 1602023 1764454
15731 1764454 1806121 1732765 1823956 1579327 1613802 1804037 1923626 1904113 1965250 1890494 1926213
15720 1926213 1934437 1841532 1731230 2011590 2008332 1820609 1803428 1816966 1734262 1783593 1981093
15709 1981093 1853460 1846570 1778677 1601473 1725401 1765616 1740913 1891745 1960941 1810339
15699 1810339 1909299 1852508 1895852 1873167 1831109 1796900 1661876 1813308 1684962 1825069
15689 1825069 1875180 2045595 1947345 2056955 2126284 1980140 1803116 1910939 1742397 1796241
15679 1796241 1878231 1776551 1728939 1820652 1830539 1706544 1589280 1656866 1722926 1816651 1929199
15668 1929199 1915036 2052175 1973796 1943410 1774960 1728294 1850574 1775908 1615956 1752785
15658 1752785 1784610 1804791 1842599 1914697 2008641 1983290 1909092 1659524 1953603 1909406 1809845
15647 1809845 1840805 1789530 1667833 1814091 1854418 1681797 1769418 1938438 1881194 1726173
15637 1726173 1924351 1971592 2063138 2036965 1906071 1883570 2062293 2058270 1961589 1858429 1796304
15626 1796304 1737520 1829925 1879079 2002712 1935309 1870211 1937482 1916148 1843645 1774620 2008288
15615 2008288 1799586 1850201 1828105 1791799 2001623 1992708 1822038 1801647 2026658 1809621
15605 1809621 1716148 1859370 1874134 1818192 1691370 1766380 1757679 1797600 1885329 1844970 1714001
15594 1714001 1825613 1799024 1813847 2042158 1902274 2169087 2069968 1786726 1665642 1892572
15584 1892572 1922620 1656485 1729141 1824372 1805162 2031105 1851112 1823710 2014913 2042374
15574 2042374 1759475 1964277 1909114 1895432 1922477 1934459 2037601 1920975 1982869 2017736
15564 2017736 2059171 2047697 2099515 2041413 1860264 1843177 2079875 2207577 2181427 1951941
15554 1951941 1842267 1900544 1918837 1811994 1802810 1809166 1936480 1827546 1726032 1852925
15544 1852925 1934557 1962790 2003947 1960653 2128975 2043659 1897725 1789548 1702231 1923499
15534 1923499 1911607 1867903 2009627 1973379 1830085 1828605 1828214 1637186 1813066 1696018 1618011
15523 1618011 1810310 1874066 1799760 1757342 1758140 1866684 2054111 1978136 1951629 1916516 1700873
15512 1700873 1661005 1819628 1798103 1975084 1914598 1699670 1840930 1818032 1663222 1879966
15502 1879966 1858462 1692422 1562387 1772491 1715762 1728807 1937412 1941468 1916304 1665444
15492 1665444 1700419 1710194 1820400 1792933 1878315 1881656 1870268 1953815 1946613 1950498 1960482 1680365
15480 1680365 1720110 1901603 1786556 1819863 1988998 1985824 1935280 1941247 2039282 1838700 1733319
15469 1733319 1796153 1953427 1776940 1864892 1999638 1905934 1904397 1874260 1952963 1820495 1865603
15458 1865603 1793740 1731484 1709235 1742593 1772958 1967862 2018038 1998688 1904864 1874581 1771922
15447 1771922 2150313 2010868 1732886 1889075 1695649 1568642 1892099 2044450 1727876
15438 1727876 1738432 1832134 1894577 1904202 1764195 1736460 1839766 1884312 1923749 2057484 2077306
15427 2077306 2067228 2116820 2172225 1926796 1599250 1790087 2078373 1972675 1921377 1912388
15417 1912388 1694142 1539490 1595557 1678592 1827968 1787428 1817135 1802824 1591534 1611954
15407 1611954 1713905 1752354 1847069 1719810 1836778 2033953 2047035 2065196 1977401 2155715
15397 2155715 1890437 1745506 1662519 1961769 2018883 1898089 1926270 1890584 2026863 1892143
15387 1892143 2021213 1905276 1812495 1953962 1790442 1798260 1902413 1945268 1853202 1852322 1931279
15376 1931279 2068603 2182253 2193846 1991058 2086098 1846347 1925590 2050256 1952092 2086696
15366 2086696 2079977 2136812 2150582 2023196 1907817 1786261 1717274 1735499 1857425 2056927
15356 2056927 1834926 1812700 1777891 1722719 1859027 1908428 1894822 1876882 1830108 1946704 2027261
15345 2027261 1971159 1946164 2018987 1940948 1961768 1882409 1946139 1824564 1610072 1785472 1742541
15334 1742541 1506468 1658543 1822397 1898016 2017299 2158759 1973520 1934943 2065391 2269251
15324 2269251 2009608 1783832 1976517 1879242 1874477 1946492 1860102 1862763 1793055 1777969 1942234
15313 1942234 1945656 1941885 1885479 2073166 2199407 1978955 1936206 2083025 2155998 2074038 1956503
15302 1956503 2124849 2036902 1852935 1911775 1917014 1894613 1971632 1992735 2040652 1930509 1782614
15291 1782614 1977077 1902349 1969760 1843591 1827662 1949579 1728729 1880615 1926548 1996686
15281 1996686 1995552 1930638 1986771 2039612 1922180 2019771 2116933 1915240 1777066 1818675 1901239
15270 1901239 1980681 2019197 1964166 1921288 2147323 2084436 1863127 1976387 1964997 1913163 2009125
15259 2009125 2042280 2068309 1946066 1875858 1988700 1978886 1777708 1649254 1783253 1780604 1736578
$$ [...]
##END NTUPLES=NMR SPECTRUM
##END=
