##TITLE=1H_CA-8949-4
 CDCl3
 8 sc, 
 18.11.2021
##JCAMPDX= 6.0         $$ Bruker NMR JCAMP-DX V2.0
##DATA TYPE= NMR SPECTRUM
##DATA CLASS= NTUPLES
##ORIGIN= UXNMR, Bruker Analytische Messtechnik GmbH
##OWNER= root
$$ XWIN-NMR		Version 3.5
$$ Thu Nov 18 11:44:08 2021 Russian Standard Time (UT+4h)  she@DPX200
##.OBSERVE FREQUENCY= 200.131346
##.OBSERVE NUCLEUS= ^1H
##.ACQUISITION MODE= SIMULTANEOUS
##.ACQUISITION SCHEME= undefined
##.AVERAGES= 8
##.DIGITISER RES= 18
##SPECTROMETER/DATA SYSTEM= spect
##.PULSE SEQUENCE= zg30
##.SOLVENT NAME= CDCl3
##.SHIFT REFERENCE= (INTERNAL, CDCl3, 0, 15.7006)
##AUDIT TRAIL= $$ (NUMBER, WHEN, WHO, WHERE, WHAT)
$$ ##TITLE= Audit trail, XWIN-NMR		Version 3.5
$$ ##JCAMPDX= 5.01
$$ ##ORIGIN= Bruker BioSpin GmbH
$$ ##OWNER= she
$$ F:/spectra/data/she/nmr/H-F/1/pdata/1/auditp.txt
$$ ##AUDIT TRAIL=  $$ (NUMBER, WHEN, WHO, WHERE, WHAT)
(   1,<2021-11-18 11:42:41.06 +0400>,<she>,<DPX200>,
      <created by zg, POWCHK disabled, PULCHK disabled
       configuration hash MD5:
       00 E9 B6 7A A2 85 ED C7 34 08 36 98 17 FE 4E 26
       data hash MD5: 16K
       3B 83 BC CA 2C B1 E0 10 4F AC 43 D8 7F 90 35 30>)
(   2,<2021-11-18 11:42:48.98 +0400>,<she>,<DPX200>,
      <Start of raw data processing
       efp BC_mod = 2 LB = 0.24 FT_mod = 6 PKNL = 1 PHC0 = -15513.08 PHC1 = 11.60081 SI = 16K 
       data hash MD5: 16K
       94 4A 7E FA 3A E4 6C 27 6A 2C 0F F2 0F 44 41 86>)
(   3,<2021-11-18 11:43:06.37 +0400>,<she>,<DPX200>,
      <pk PHC0 = -1.024674 PHC1 = 1.4 
       data hash MD5: 16K
       B7 56 C9 38 B7 75 BE 71 1E 55 14 23 2A 6F B9 5B>)
(   4,<2021-11-18 11:43:09.89 +0400>,<she>,<DPX200>,
      <abs ABSG = 5 
       data hash MD5: 16K
       96 38 02 A9 F1 DD 12 B6 33 E6 E2 AB 02 84 AC 74>)
(   5,<2021-11-18 11:43:40.29 +0400>,<she>,<DPX200>,
      <abs ABSG = 5 
       data hash MD5: 16K
       CD BF 14 21 8F E5 2E C4 51 53 01 F4 B9 A4 CA E4>)
$$ ##END=
$$ 
$$ hash MD5
$$ 9E A3 48 FB 72 22 F3 9C FC 00 9B C2 DD B3 9C 7A
##$RELAX= 
##$RELAX= 
##$RELAX= 
##$RELAX= 
##$RELAX= 
##$RELAX= 
$$ Bruker specific parameters
$$ --------------------------
##$DU= <F:/spectra>
##$EXPNO= 1
##$NAME= <H-F>
##$PROCNO= 1
##$TYPE= <nmr>
##$USER= <she>
##$AMP= (0..31)
100 100 100 100 100 100 100 100 100 100 100 100 100 100 100 100 100 100 
100 100 100 100 100 100 100 100 100 100 100 100 100 100 
##$AQSEQ= 0
##$AQ_mod= 1
##$AUNM= <au_zg>
##$AUTOPOS= <>
##$BF1= 200.13
##$BF2= 200.13
##$BF3= 200.13
##$BF4= 200.13
##$BF5= 200.13
##$BF6= 200.13
##$BF7= 200.13
##$BF8= 200.13
##$BYTORDA= 1
##$CFDGTYP= 0
##$CFRGTYP= 5
##$CHEMSTR= <none>
##$CNST= (0..31)
1 1 145 1 1 1 1 1 1 1 1 1 1 1 1 1 1 1 1 1 1 1 1 1 1 1 1 1 1 1 1 1 
##$CPDPRG= <>
##$CPDPRG1= <>
##$CPDPRG2= <>
##$CPDPRG3= <>
##$CPDPRG4= <mlev>
##$CPDPRG5= <mlev>
##$CPDPRG6= <mlev>
##$CPDPRG7= <mlev>
##$CPDPRG8= <mlev>
##$CPDPRGB= <>
##$CPDPRGT= <>
##$D= (0..31)
0 1.2 0 0 0 0 0 0 0 0.06 0 0.03 0 0 0 0 0.0002 0 0 0 0 0 0 0 0 0 0 0 0 
0 0 0 
##$DATE= 1637221360
##$DBL= (0..7)
$$ [...]
##$SUBNAM2= <"">
##$SUBNAM3= <"">
##$SUBNAM4= <"">
##$SUBNAM5= <"">
##$SUBNAM6= <"">
##$SUBNAM7= <"">
##$SUBNAM8= <"">
##$SUBNAM9= <"">
##$SW= 18.0517287032376
##$SWIBOX= (0..15)
0 0 2 0 0 0 0 0 0 0 0 0 0 0 0 0 
##$SW_h= 3612.71676300578
##$TD= 16384
##$TD0= 1
##$TE= 0
##$TE2= 300
##$TE3= 300
##$TEG= 300
##$TL= (0..7)
0 120 120 120 120 120 120 120 
##$TP= (0..7)
150 150 150 150 150 150 150 150 
##$TP07= 0
##$TPNAME0= <>
##$TPNAME1= <>
##$TPNAME2= <>
##$TPNAME3= <>
##$TPNAME4= <>
##$TPNAME5= <>
##$TPNAME6= <>
##$TPNAME7= <>
##$TPOAL= (0..7)
0.5 0.5 0.5 0.5 0.5 0.5 0.5 0.5 
##$TPOFFS= (0..7)
0 0 0 0 0 0 0 0 
##$TUNHIN= 0
##$TUNHOUT= 0
##$TUNXOUT= 0
##$USERA1= <user>
##$USERA2= <user>
##$USERA3= <user>
##$USERA4= <user>
##$USERA5= <user>
##$V9= 5
##$VALIST= <valist>
##$VCLIST= <CCCCCCCCCCCCCCC>
##$VD= 0
##$VDLIST= <DDDDDDDDDDDDDDD>
##$VPLIST= <PPPPPPPPPPPPPPP>
##$VTLIST= <TTTTTTTTTTTTTTT>
##$WBST= 1024
##$WBSW= 4
##$XGAIN= (0..3)
0 0 0 0 
##$XL= 0
##$YL= 0
##$YMAX_a= 125693
##$YMIN_a= -148302
##$ZGOPTNS= <>
##$ZL1= 120
##$ZL2= 120
##$ZL3= 120
##$ZL4= 120
##$ABSF1= 15.70061
##$ABSF2= -2.351239
##$ABSG= 5
##$ABSL= 3
##$ALPHA= 0
##$AQORDER= 0
##$ASSFAC= 0
##$ASSFACI= 0
##$ASSFACX= 0
##$ASSWID= 0
##$AUNMP= <proc_1d>
##$AZFE= 0.1
##$AZFW= 0.1
##$BCFW= 0
##$BC_mod= 2
##$BYTORDP= 0
##$COROFFS= 0
##$CY= -3
##$DATMOD= 1
##$DC= 0
##$DFILT= <>
##$DTYPP= 0
##$F1P= 0
##$F2P= 0
##$FCOR= 1
##$FTSIZE= 16384
##$FT_mod= 6
##$GAMMA= 0
##$GB= 0
##$INTBC= 1
##$INTSCL= 0
##$ISEN= 128
##$LB= 0.24
##$LEV0= 0
##$LPBIN= 0
##$MAXI= 10000
##$MC2= 0
##$MEAN= 0
##$ME_mod= 0
##$MI= 1.114404
##$NCOEF= 0
##$NC_proc= -7
##$NLEV= 6
##$NOISF1= 3.799351
##$NOISF2= 2.8
##$NSP= 0
##$NTH_PI= 0
##$NZP= 0
##$OFFSET= 15.70061
##$PC= 1
##$PHC0= -15514.1
##$PHC1= 13.00081
##$PH_mod= 1
##$PKNL= yes
##$PPARMOD= 0
##$PSCAL= 0
##$PSIGN= 0
##$REVERSE= no
##$SF= 200.130010194992
##$SI= 16384
##$SIGF1= 3
##$SIGF2= 2
##$SINO= 5.538805
##$SIOLD= 16384
##$SREGLST= <1H.CDCl3>
##$SSB= 0
##$STSI= 16384
##$STSR= 0
##$SW_p= 3612.71676300578
##$SYMM= 0
##$S_DEV= 0
##$TDeff= 16384
##$TDoff= 0
##$TI= <>
##$TILT= no
##$TM1= 0
##$TM2= 0
##$TOPLEV= 0
##$USERP1= <user>
##$USERP2= <user>
##$USERP3= <user>
##$USERP4= <user>
##$USERP5= <user>
##$WDW= 1
##$XDIM= 16384
##$YMAX_p= 283016997
##$YMIN_p= -575226
$$ End of Bruker specific parameters
$$ ---------------------------------
##NTUPLES= NMR SPECTRUM
##VAR_NAME=  FREQUENCY,     SPECTRUM/REAL,   SPECTRUM/IMAG
##SYMBOL=    X,             R,               I
##VAR_TYPE=  INDEPENDENT,   DEPENDENT,       DEPENDENT
##VAR_FORM=  AFFN,          ASDF,            ASDF
##VAR_DIM=   16384,         16384,           16384
##UNITS=     HZ,            ARBITRARY UNITS, ARBITRARY UNITS
##FACTOR=    0.220516191357247, 1,           1
##FIRST=     3142.16327155403, 0,            0
##LAST=      -470.55349145175, 0,            0
##MIN=       -470.55349145175, -575226,      0
##MAX=       3142.16327155403, 283016997,    0
$$ Real data points
##PAGE= N=1
##DATA TABLE= (X++(R..R)), XYDATA
$$ [...]
7536b43144L7533J74292r5004j04149L7498J7625N6009R29o6674J15283o6536
7525a36338N2836J35256M7295p5298j58635J27856p6112J08395k08778m4761O9854
7514a58430K81092K8619j78909n8415j84669J93708o3340m6473J8066O2225p416
7503a13942J42151r0562J18248P1809J3215k01592N7796J61071M4779k80226n1564
7492a28817m1991R862R1560K2958Q2483N2484P7215m9107m2397k08319O1238O4346
7480h485j7907L6022j46916J27926m1241j86671j45275K10225J89091j15083N179
7469i3135K13518N9232j41745K7192k36165J28735m0383m1305j79142J26371N3361
7458a23466J48461j21281O6881p7974K7595j5018o4706K6646J65275l417o3447
$$ plain form
7536 -243144 -205611 -31319 -126323 -230472 -192974 -175349 -119340 -118411 -185085 -69802 -136338
7525 -136338 -83502 51754 99049 23751 -134884 -7028 -83140 25255 -183523 -228284 -158430
7514 -158430 122662 151281 -27628 -86043 -270712 -77004 -140344 -186817 -168751 -106526 -113942
7503 -113942 28209 -62353 55895 127704 140919 -60673 -2877 158194 202973 -77253 -128817
7492 -128817 -170808 -160946 -69386 -46428 36055 88539 165754 116647 74250 -134069 -72831 -8485
7480 -8485 -26392 9630 -137286 -9360 -50601 -237272 -382547 -172322 16769 -98314 -93135
7469 -93135 120383 179615 37870 65062 -171103 -42368 -82751 -124056 -303198 -176827 -123466
7458 -123466 24995 -96286 -29405 -107379 -79784 -94802 -159508 -132862 32413 28996 -34451
7447c4451r5053P0726j6951j46345O6384J92963n8697l10194m4916p1969q406
7436d56909k8286K11558J10707O1366m8629n9401n090R680j09125M2130K69567
7425b432j57874j18744l6493J87873L9894J7723Q453J19352J51717k87900l5705
7414a14136k50852J48941k927J61856k439p5215M6692O3589L8302J65724P9577
7403B59112k23609k18281R2289j52747K26897L8235j36090k3211k7058j57543
7393c22006J47460k3669J1714K21043Q806J31822l08295j93752M3282J29243R3130
7382f1222q802l2464K9790J00015k23605N8417K8231J65562J08139o5869r7796
7371C96l6693j95237K30949O5221j6133q1638j59673J46517P7739K323j48255
$$ plain form
7447 -34451 -129504 -58778 -75729 -222074 -155690 37273 -21424 -331618 -376534 -448503 -456909
7436 -456909 -485195 -273637 -162930 -101564 -150193 -209594 -214684 -205004 -314129 -271999 -2432
7425 -2432 -160306 -279050 -315543 -127670 -87776 -70053 -61600 57752 209469 -78431 -114136
7414 -114136 -364988 -216047 -218974 -57118 -59557 -134772 -88080 -24491 13811 179535 259112
7403 259112 35503 -182778 -90489 -243236 -16339 21896 -114194 -137405 -164463 -322006
7393 -322006 -174546 -198215 -186501 34542 43348 175170 -133125 -326877 -283595 -154352 -61222
7382 -61222 -70024 -102488 -72698 27317 -196288 -137871 -109640 55922 164061 98192 396
7371 396 -36297 -231534 -585 64636 48503 -33135 -192808 -46291 31448 33771 -114484
7360a14484P3436q7317J86225L0628r8833j6906j36098j2907O0342P4523O0417
7349A9026K125k06192r1165K10566q4399j45033p94k9937j3766L23710q579n5250
7337g9688l111j05717K3151J8667K35617o2803k61591J70886r9137M4725j20784
7326b39785K13151j68065L2546O5512r3377J55266m3276O6035N400J03456L9174
7315A36037r742k24659j25902r8797R903K24846K16432j1573j41680l0310j34975
7304a90420K9321J17614q2317j14967K21153r1874j15879Q6603Q7334J68377P7831
7293A92776o1695o4212N0525j44035j25712J51188O688P1889j361r4216j40937
7282a59102K12696q3955l38887K20119K09635j06091p3322Q1186J15057q5967
$$ plain form
7360 -114484 -41048 -128365 57860 88488 -10345 -27251 -163349 -176256 -115914 -41391 19026
7349 19026 21151 -185041 -276206 -65640 -150039 -295072 -295866 -325803 -339569 -15859 -24438 -79688
7337 -79688 -82799 -188516 -165365 -146698 88919 26116 -235475 -64589 -163726 -119001 -239785
7326 -239785 -26634 -194699 -162153 -96641 -190018 -34752 -78028 -11993 -6593 96863 136037
7315 136037 126295 -98364 -224266 -323063 -313160 -88314 128118 116545 -25135 -55445 -190420
7304 -190420 -161099 -43485 -125802 -240769 -19616 -111490 -227369 -140766 -53432 114945 192776
7293 192776 131081 66869 117394 -26641 -152353 -1165 5523 77412 76051 -18165 -159102
7282 -159102 53594 -30361 -369248 -149129 60506 -45585 -118907 -37721 77336 -8631
7272h631P2118r3089j05538j10265J77493p5229K1991o0888j80996q6788J06152
7261c43670J21389j15024J90826J60087M3158j6406l8725n9701J0105P8392m7534
7250a7103N9255J64386j17624M6938J9277k0624k75570J2112r7289R0602m6574
7239a82214p5065j03324K17777j7422M0144M6866j72901r4137J15070L8355q2714
7228b69565J01763Q2210K7154l331r7895J78580K2583j59535j06430p7415Q9488
7217b12393L788N8286j6678Q2918l2784N963o9733j28420j14358q6412K05823
7206c04000J28198P0383J02309j44106l5351j58391J34411J30784P5903o6038
7196f5898j23464j07878J45118K75574k07097L5287j51149j09749K25697r5555
$$ plain form
7272 -8631 63487 -29602 -135140 -245405 -67912 -143141 -121150 -182038 -363034 -449822 -343670
7261 -343670 -222281 -337305 -146479 13608 56766 40360 1635 -58066 -47961 30431 -17103
7250 -17103 42152 206538 88914 135852 155129 134505 -141065 -128953 -226242 -135640 -182214
7239 -182214 -257279 -360603 -142826 -160248 -120104 -73238 -246139 -340276 -225206 -186851 -269565
7228 -269565 -167802 -85592 -58438 -61769 -159664 18916 41499 -118036 -224466 -301881 -212393
7217 -212393 -208605 -150319 -166997 -84079 -116863 -110900 -180633 -309053 -423411 -509823 -304000
7206 -304000 -175802 -105419 -3110 -147216 -182567 -340958 -206547 -75763 140 -65898
7196 -65898 -189362 -297240 -152122 123452 -83645 -48358 -199507 -309256 -83559 -179114
7186a79114K69J34194l49454j04279J59978J51759L3945j31888k5826l6593R8985
7175b48024J28677m8372Q822q583R6028j1907J9867n1360l9542O4999J05631o0458
7163d4222j34343K0932J38584l7036J14791q1590q5324n7093R0265N6074J3876
7152e086n0100j17952q9679K06979J49319j68397j3040j04885o645M7867K2245
7141a29374N5265k680j44686Q0276M7426M9970J1896O3319j98663j81591L5453
7130c13389J24044J84254q4613r0776Q2076n5225j25375P0434P3630J26955o5218
7119g3203p6297m5224K957m2191q1971M0336k4404J11750j4536M4632M6201j90777
7107c02727O0256m0967J11128J30632r5311k3472J6413O307n4435P540n7409K40834
$$ plain form
7186 -179114 -178845 -44651 -394105 -498384 -338406 -186647 -152702 -284590 -310416 -347009 -248024
7175 -248024 -119347 -167719 -158897 -167480 -71452 -83359 -63492 -114852 -154394 -89395 16236 -44222
7163 -44222 -178565 -157633 -19049 -56085 58706 -22884 -108208 -165301 -75036 -18962 -5086
7152 -5086 -55186 -173138 -262817 -55838 93481 -74916 -87956 -192841 -199486 -151619 -129374
7141 -129374 -74109 -76789 -221475 -141199 -93773 -43803 -31907 31412 -167251 -348842 -313389
7130 -313389 -189345 -5091 -89704 -180480 -98404 -153629 -279004 -208570 -134940 -7985 -73203
7119 -73203 -149500 -194724 -191767 -233958 -315929 -275593 -299997 -188247 -202783 -158151 -111950 -302727
7107 -302727 -242471 -283438 -172310 -41678 -136989 -160461 -144048 -137741 -192176 -184636 -242045 -1211
7095a211J34416o0559j4343q9561j72988J10660q0228j5565P0368J0708K5297
7084h3006Q4235m4242k3496j61470K15683j22820j31402l7179m8387R3091n3343
7073c12336K13981j703k8783j5798n0759p6316K4127K05866o8229R1719p512J6635
7061i108M0210J05877L8274q5776k1048q579j91340M4532j85419K96238O2689
7050H6550k4587j1481j42072J98174q7680k15855r3994M7934P8993R4789J60804
7039I1575q3115k29813k1387J60733J1569r3406j50631M4261J58516l6554L06031
7028A57779j54359j20827p4629n1733J7446p952j07550J82270J79165j01813j90215
7017b72418Q7457j19799J07049J52128J13328r7996N4283J02418k23062K4445
$$ plain form
7095 -1211 133205 72646 58303 -31258 -204246 -93586 -173814 -189379 -119011 -108303 -83006
7084 -83006 1229 -43013 -66509 -227979 -12296 -135116 -266518 -303697 -352084 -258993 -312336
7073 -312336 -98355 -100058 -128841 -144639 -195398 -271714 -247587 -41721 -109950 -18231 -25743 -9108
7061 -9108 31102 136979 175253 89477 68429 59850 -131490 -86958 -272377 23861 86550
7050 86550 61963 50482 -91590 106584 18904 -196951 -290945 -243011 -164018 -69229 91575
7039 91575 8460 -221353 -242740 -82007 -70438 -163844 -314475 -270214 -111698 -148252 157779
7028 157779 3420 -117407 -192036 -243769 -226323 -234275 -341825 -159555 19610 -82203 -272418
7017 -272418 -184961 -304760 -197711 -45583 67745 -30251 24032 126450 -96612 -72167
7007g2167q0482j20954K01616O0035J22682j15711r0920P9786l1351j54482J24283
6996g7665k6198O9060J3060O9268k1202r124P4829m1332q657j1851j82625m9774
6984b02211L0288j53251L25014l501o4195j46603j2845J07381p9852n8560J83578
6973g4757J19424j02786Q8459m7267r4965J36271M0923k65624j15144K25249K19916
6962A29699p1385J01335j14122m5411J06637Q663j23197q8527J7182j6727r0765
6951a86618l6783l7608R0682J20597J48515o1024j64521l7282K56148P4098j21183
6940D5021l9979j16197M7126p2888j1021j0319r3993K15914o5626p3731J21306
6929e4387J6236M3441k6501J06497k74635j12329j16618J00116K29388m9421k9285
$$ plain form
7007 -72167 -152649 -273603 -71987 -11952 110730 -4981 -95901 -16115 -47466 -201948 -77665
6996 -77665 -103863 -34803 -21743 47525 26323 17199 92028 50696 42039 30188 -152437 -202211
6984 -202211 -171923 -325174 -160 -3661 -67856 -214459 -227304 -119923 -199775 -258335 -74757
6973 -74757 44667 -58119 30340 -16927 -111892 24379 65302 -200322 -315466 -90217 129699
6962 129699 58314 159649 45527 116 106753 115416 -7781 -96308 -79126 -95853 -186618
6951 -186618 -223401 -261009 -170327 -49730 98785 37761 -126760 -164042 92106 166204 45021
6940 45021 5042 -111155 -64029 -136917 -147938 -158257 -252250 -36336 -101962 -175693 -54387
6929 -54387 -38151 5290 -21211 85286 -189349 -301678 -418296 -318180 -88792 -138213 -167498
6918a67498n0115M2822j2703j35784Q4295m0752l7446K53010j73338J8780L7278
6907a81451r6170J08235R4932P0573k82542J85901J73340J25102j35814l1p5557
6896a3482J250j02907R4536l2323l1196J19701r1909r6687j2068J3124N9952m6236
6884a38245n1181L3206J85003L9936j39853k79920K63103J50998o3587J27582
6874A27042M5672j29386k87189J21109J27221J0276j12374O4681j94348N0745
6864a76551Q6600j96750J28386j25514k3595J89193K08707o9395p606j05383k08873
6853c00781L9941N3266J57029j20640R7234J47890k2882N2176j15731K7140K21163
6842B35805j84547k49616R993J05627J09638J46232p4818j72653j00885J28722
$$ plain form
6918 -167498 -217613 -174791 -187494 -323278 -238983 -279735 -317181 -64171 -237509 -218729 -181451
6907 -181451 -277621 -169386 -74454 -3881 -286423 -100522 72818 197920 62106 62075 -13482
6896 -13482 -12232 -115139 -20603 -52926 -84122 35579 -56330 -153017 -165085 -151961 -92009 -138245
6884 -138245 -189426 -156220 28783 68719 -71134 -351054 -87951 63047 -540 127042
6874 127042 172714 43328 -243861 -122752 4469 14745 -97629 -32948 -227296 -176551
6864 -176551 -89951 -286701 -158315 -283829 -307424 -118231 90476 21081 13475 -91908 -300781
6853 -300781 -260840 -207574 -50545 -171185 -73951 73939 51057 103233 -12498 14642 235805
6842 235805 51258 -198358 -188365 -82738 26900 173132 98314 -74339 -175224 -46502
6832d6502k13168K12639J86822j05982m9259P9862k05694k00806L3968n475K60448
6821e3147L2959j03115J5979O0516j68466J44570j02030P3957R650j37137P2037
6810a54227R020k1769p6909P6118k900K13548j24935O352n3153m5806J45027M6921
6798A7287r1544k8478r034l4156L5202J04514J1343j8415j54686J21630j8823
6787f5160j7630M8050J34429J9358k61345M0955J79665p9327r6638p8941J17259
6776e9325o9281j37944J3595m7464K08014O1518O7987L5093O307J1128q0575P245
6764A6298P6123r6748r3469j80758J31374J12124j01995J04777l8204Q1572J32256
6753A43350j24652j21030j24900n1531O7821J16659j19063m5912r1117K09950
$$ plain form
6832 -46502 -259670 -47031 139791 33809 -15450 64412 -141282 -342088 -308120 -313595 -53147
6821 -53147 -20188 -123303 -107324 -46808 -215274 -70704 -172734 -98777 -89127 -226264 -154227
6810 -154227 -145207 -166976 -243885 -167767 -170667 42881 -82054 -75702 -128855 -174661 -29634 17287
6798 17287 -74257 -102735 -111769 -145925 -110723 -6209 5134 -13281 -167967 -46337 -65160
6787 -65160 -82790 -34740 99689 119047 -142298 -101343 78322 -1005 -97643 -176584 -59325
6776 -59325 -128606 -266550 -252955 -300419 -92405 -30887 37100 72193 78500 89628 9053 16298
6764 16298 92421 -4327 -97796 -278554 -147180 -35056 -137051 -32274 -70478 11094 143350
6753 143350 18698 -102332 -227232 -278763 -210942 -94283 -213346 -259258 -350375 -140425
6743a40425K27968J08343j23649o3951j46124j68476J09403p2525Q4901J02033
6733h2502k36427R1696L5243L5709J9576Q3240J7237k73653Q5567N5029J29597
6722c9688l0634K0586j63561O9097L0328r0269m6681P4213J10327j32667J17712
6711h1237k1709J14802L604j31968p9191j49988O6292K83062K5407j28638M5012
6700e4552J02278K4766j93836J6615j26698j43924K27996R1686o5075M0966l7065
6689a16843n7232K40571q4734j19287p0666M2555J15853k7317Q4626L9499p9998
6678c2973M5052J79089j57672l41632k032O1502L85J08259R1101N1316r2716j04561
6666a94882J50207k383j69127J75321Q4449j71985j95511n0045L28406N497j76667
$$ plain form
6743 -140425 87543 195886 72237 8286 -137838 -306314 -196911 -269436 -184535 -82502
6733 -82502 -318929 -227233 -191990 -156281 -136705 -53465 -36228 -309881 -224314 -169285 -39688
6722 -39688 -70322 -49736 -213297 -144200 -113872 -204141 -250822 -176609 -66282 -198949 -81237
6711 -81237 -102946 11856 15460 -116508 -195699 -345687 -279395 3667 29074 -99564 -54552
6700 -54552 47726 72492 -121344 -104729 -231427 -375351 -147355 -55669 -120744 -79778 -116843
6689 -116843 -174075 66496 -18238 -137525 -208191 -165636 -49783 -77100 7526 47025 -32973
6678 -32973 12079 191168 33496 -308136 -310168 -248666 -248281 -140022 -48921 2395 -90321 -194882
6666 -194882 -44675 -47058 -216185 -40864 43585 -128400 -323911 -373956 -45550 -40053 -216720
6655b16720J2569J46696J45750j3974k364p0726q0887O5314J39939k05820j43905
6644b24128N3482J56273N3823m22j9076r7172N4849L4950J1231n8354n9458p8292
6632a72294K279l1287o7396P1731K5291k4047L3953N656P2874J08181Q9953j4326
6620A00568j35427l0585k30400J48998J56275N7352P8141j9610J4916q5164n7143
6609b079L5536o4869O5357q8003j2064J68625p5896O8340k73350K8010Q0696r2070
6597a61767o7870N7199j33404m6581O3826m0590N8656k973j0172Q1832n3917P7614
6585a78147R3480j10143q5220R9512J38361r8383L9069J38394q9667P8999J7342
6574D3597j48155j14113J73324K00490j40157k6186j03908j01841R1865J06344
$$ plain form
6655 -216720 -204151 -57455 88295 74321 71957 1231 -79656 -14342 125597 -80223 -224128
6644 -224128 -170646 -14373 39450 39028 19952 -77220 -22371 12579 23810 -34544 -94002 -172294
6632 -172294 -170015 -201302 -268698 -196967 -171676 -195723 -161770 -156114 -83240 24941 114894 100568
6620 100568 -34859 -65444 -295844 -146846 9429 66781 144922 125312 140228 55064 -2079
6609 -2079 33457 -31412 33945 -54058 -66122 102503 26607 94947 -178403 -150393 -69697 -161767
6597 -161767 -229637 -172438 -305842 -352423 -288597 -329187 -270531 -273504 -283676 -201844 -255761 -178147
6585 -178147 -84667 -194810 -280030 -180518 -42157 -140540 -101471 36923 -52744 26255 43597
6574 43597 -104558 -218671 -45347 155143 14986 -11200 -115108 -216949 -125084 -18740
6564a8740j57699O7853O5072L6738j43459J38476O1598r3382j1805N5057J38542
6553A38251r8552o0516K0867o0941J39443j47244r1677n6360L116J28002j41065
6542b26676Q0118Q7108m7646j40164J92657q7363k4892L5793r3108K15608O9537
6531F0972k09824r4630O9343M415M7629P2021M0189M2193q1199K2516L3401O8466
6519G5492j05219j42789o5327j15589K71589n222M421O7703J34471P4452j48437
6508D5545m1733k6120q6244j07356j46925J47585L924J81798O2409m6760J31911
6497A18034l79297J41274K21915m7816J24012j74193j27255j33794J53392J33632
6487B9904J53125J02405o3231J54306k28259j75379p6885l1415r7327o7727J35964
$$ plain form
6564 -18740 -176439 -108586 -43514 -6776 -150235 -11759 49839 -43543 -55348 -291 138251
6553 138251 39699 -20817 50 -60891 78552 -68692 -160369 -216729 -213613 -85611 -226676
6542 -226676 -146558 -59450 -107096 -247260 -54603 -141966 -166858 -131065 -224173 -8565 60972
6531 60972 -148852 -243482 -174139 -169724 -122095 -50074 -9885 32308 -48891 -26375 7026 75492
6519 75492 -29727 -172516 -237843 -353432 -81843 -87065 -82644 -14941 119530 193982 45545
6508 45545 3812 -22308 -108552 -215908 -362833 -215248 -211324 -29526 32883 -13877 118034
6497 118034 -261263 -119989 101926 54110 178122 3929 -123326 -257120 -103728 29904
6487 29904 183029 285434 222203 376509 148250 -27129 -104014 -135429 -232756 -300483 -164519
6476a64519J40676J50062j1115l27085m1159J73959J00883j69352K2603O1031
6466f4016L0301J62928L7439o3156K1772L905j17978j1712k300P741k846L2217
6454C4295J23756j17453M6038j35294j3319n7907m824J82135p2066r329j1428
6443c5396o184q203R6321j52233J7190J09943j8491o7630r9605l2589J22816o898
6431h0959j45730L11106j54773J44806J2800l8377J89004N7754j93790j54260
6421e2419K01189j26572j84685R338J41330j83967J5702K18394J20003k02326
6411d4013K3243j49863J0075J61948l1625P6886n487k02444N5274J8345m9995
6400a37656J48628L0118J18582k77433j82174J21097P4713P5617n3473J0337l3668
$$ plain form
6476 -164519 -23843 126219 115104 -211981 -253140 -79181 21702 -147650 -125047 -64016
6466 -64016 -33715 129213 166652 103496 125268 129173 11195 -517 -2817 4924 2078 34295
6454 34295 158051 40598 86636 -48658 -61977 -119884 -124708 57427 -14639 -23968 -35396
6443 -35396 -41580 -49783 46538 -105695 -88505 21438 2947 -64683 -164288 -196877 -74061 -80959
6431 -80959 -226689 84417 -70356 74450 87250 48873 237877 295631 101841 -52419
6421 -52419 148770 22198 -162487 -153149 -11819 -195786 -180084 38310 158313 -44013
6411 -44013 -20770 -170633 -160558 1390 -30235 46651 41164 -161280 -106006 -87661 -137656
6400 -137656 10972 41090 159672 -117761 -299935 -178838 -104125 -28508 -81981 -71644 -105312
6389a05312K8028k36329J54303P563J74865L5112n986n6436O5027M394n9324p5735
6377f9830n3103J00641P788m4489j71297M4974O9695J93481K4363L483j63729
6366e8023M8152J42295j98598J01322J96435j09553j52325L4645l658m2404L0434
6355a1278l3547o9425l8483o5066Q3795O7501k28628o6514J71316L14265j99389
6344g5453R5387L8372j6557k66470K1516P2544J63951j32919j58138K6511J17469
6333a13787O6845J85006q5088r5400j26898K23907O9536q5646j3931j10505j2387
6322i8348J60826R9005j00408l6487j72148J0786l7755J85595P934m6850o0777
6311h8627K62746k03794k7516O3725K7503j61395j54259J66140P4153J74368j29058
$$ plain form
6389 -105312 -77284 -313613 -159310 -151747 23118 58230 52244 -4192 60835 65229 5905 -69830
6377 -69830 -122933 -22292 -14504 -58993 -230290 -185316 -115621 77860 102223 105706 -58023
6366 -58023 -9871 132424 -66174 35148 231583 122030 -30295 4350 692 -41712 -11278
6355 -11278 -44825 -114250 -152733 -217799 -134004 -66503 -295131 -361645 -190329 123936 -75453
6344 -75453 19934 58306 41749 -224721 -203205 -130661 33290 -99629 -257767 -231256 -113787
6333 -113787 -46942 138064 52976 -42424 -169322 54585 124121 38475 24544 -85961 -98348
6322 -98348 62478 161483 61075 24588 -147560 -136774 -174529 11066 19000 -27850 -88627
6311 -88627 174119 -29675 -57191 6534 34037 -127358 -281617 -115477 -41324 133044 3986
6300C986r5410J47391N3885j64037J141J50595J12301M029l08528N4816N6273
6289A6442j39385j10039J55625J89989r0505K3431n1300j41559O2308Q0368M1281
6278C6656p3238K337J25235L7589n0738K9287q1951J89707j06761q822L0510k47435
6266a17624J58513k5675q0375R4616R0301J4297j22259O7453j33962j44994R4249
6255a05460p411R2933K7207k11449m6554K40529J08744j45785m2317k3589J13274
6244A22r429R5372j61314M9622K22680m120j73295m9970J3825j86475J84287K76449
6232B57754j0746k01370k34708M875J51744J78131M430J13584N8903k97968K41000
6221B65629j08025k2502k024j67507o2723M3749n3110l6922K44484j17213Q5848
$$ plain form
6300 3986 -91424 55967 109852 -54185 -53044 97551 209852 213881 -94647 -39831 16442
6289 16442 -122943 -232982 -77357 112632 22127 45558 -5742 -147301 -84993 -4625 36656
6278 36656 -36582 -34245 90990 128579 77841 107128 25177 214884 108123 99301 129811 -117624
6266 -117624 40889 15214 -65161 29455 119756 134053 11794 79247 -54715 -199709 -105460
6255 -105460 -112871 -19938 7269 -204180 -250734 -10205 98539 -47246 -89563 -113152 122
6244 122 -9307 86065 -75249 -25627 197053 192933 19638 -30332 -16507 -202982 -18695 257754
6232 257754 247008 45638 -189070 -184195 -32451 145680 150110 263694 322597 24629 265629
6221 265629 157604 135102 133078 -34429 -97152 -53403 -106513 -143435 101049 -16164 69684
6210F9684J25968j33664n2196j95526R119l9550J28786P2069J1894J04120o5833
6199C4871j51519Q2543J83116L7713L2947n7477k7372j29482p6755P8535Q9988
6188I7108N8439N1174l1506j93191j89873M3014P4947J13955J54938k98085O5496
6177e3584K48176Q1044k5535j34582O2295k72211j37958J10951J26373n4992J07984
6166E7961N5285l21410j06597K38706L40803j70602n1982J06831j55980O886Q5774
6155H5675p6642j19235k084Q1352l8875Q0831M571j15908J36374J5947q9058k02050
6143b39102q0932K04148N7468J01408J77324J13280M9065k5785m0792o2974p9313
6132A73795L2848j84355j6314k9226l9622p2879O88l6970J91811J69220q6765
$$ plain form
6210 69684 195652 61988 9792 -185734 -176615 -216165 -87379 -15310 -3416 100704 34871
6199 34871 -116648 -34105 149011 186724 219671 162194 134822 5340 -71415 7120 97108
6188 97108 155547 206721 175215 -17976 -207849 -164835 -89888 24067 179005 -119080 -53584
6177 -53584 194592 275636 250101 115519 177814 -94397 -232355 -121404 4969 -50023 57961
6166 57961 113246 -208164 -314761 -76055 264748 94146 42164 148995 -6985 -99 85675
6155 85675 9033 -110202 -112286 -30934 -69809 11022 15593 -100315 36059 52006 -37052 -239102
6143 -239102 -320034 -115886 -58418 42990 220314 333594 382659 356874 316082 253108 173795
6132 173795 206643 22288 5974 -23252 -62874 -135753 -135065 -172035 19776 188996 102231
6121A02231q6613j8669l6683o5368k08349K09370J54223k688o7047O9367O0915
6110A10689L1438Q5718J1386m6762j29533n8642J04167n9052p6559L703J95271
6099A71824J95174k93092q8423p4095J59530l9076J2152M9836p3797j22354J589
6088a00732R4017n9377J14878J52187O552j08704j47140P6748n002M2078N428
6077G0933j6145J96657q2738j95340J27549j52850l2407j89653L9048o6498J64025
6066a37419O7764J23662J8060j60750j03117N4143K13746J43429J455j07394j27468
6055a3889q4674O7219k8233M8465L2237J30069j9087l3109N2751k11101k1714
6044h1066q5390n164O8187J47059o7022J373J00057n5990n081J69452k0587O4487
$$ plain form
6121 102231 15618 -3051 -39734 -105102 -313451 -104081 50142 47454 -19593 49774 110689
6110 110689 142127 227845 239231 192469 62936 4294 108461 49409 -27150 -23447 171824
6099 171824 366998 73906 -14517 -88612 70918 31842 43994 93830 20033 -102321 -100732
6088 -100732 -6715 -66092 48786 200973 207525 98821 -48319 28429 23427 65505 70933
6077 70933 54788 251445 168707 -26633 100916 -51934 -84341 -273994 -234946 -301444 -137419
6066 -137419 -69655 54007 72067 -88683 -191800 -137657 76089 219518 220973 113579 -13889
6055 -13889 -98563 -31344 -59577 -11112 21125 151194 132107 98998 151749 -59352 -81066
6044 -81066 -166456 -171620 -103433 43626 -23396 -22023 78034 22044 16963 186415 165828 230315
6032B30315k5742j93419J76963k02333r2827J88436j33103j06694k1704J78039
6022b069K4131k12690P1389P339O5474j0138j7147L6132j47340J08544J95122
6011A18747N3062l6867k2051k1062J02142M4858k09060l36q5992J14646l8727
6000A9360L4483n2402J09375q6016r4191M8913o5636L7472R9915m6803J43181
5989A47651j260J86413L641k61776Q4446Q7620J6579j07331k33169J24640r9800
5978e2346R6369q0164J2297J30356j15107N328J61959L520r4925N4991J08085
5967B30363k0338k68781j10757r390L67002j17219o1699J30648J76367j09330
5957B06866k8889k9534r109R1030j77437n127L9404J42609r4090J42909k7619
$$ plain form
6032 230315 204573 11154 188117 -14216 -107043 81393 -51710 -158404 -180108 -2069
6022 -2069 22062 -190628 -119239 -111900 -46426 -56564 -73711 -37579 -184919 -76375 118747
6011 118747 171809 134942 112891 91829 193971 238829 29769 29433 -56559 58087 19360
6000 19360 53843 1441 110816 24800 -69391 -20478 -86114 -48642 51273 4470 147651
5989 147651 146391 332804 336445 74669 159115 246735 263314 155983 -77186 47454 -52346
5978 -52346 44023 -36141 -23844 106512 -8595 -3267 158692 162212 67287 122278 230363
5967 230363 210025 -58756 -169513 -178903 188099 70880 9181 139829 316196 206866
5957 206866 177977 148443 139334 230364 52927 47800 87204 229813 135723 278632 251013
5946B51013O777R2078p6378n824R9106q96j48651r9997j01535J00732j1165k97353
5934a92093O8976J66744j15245P5988j81487R4627L27260K12278l1299k08693
5924B17056j07812N6098L4913J8254Q0263R2615k23656k01103m9658j18892N3079
5913a48843M164K1367P6512L1325L3999K0386J54990L4579j98078J10873o486
5902A34788n6756k441J42172J6549m5899q1246N4732o3540j51241L013L3672K22683
5890B06486o3488M8910o6658J9344J02682q5472l9095J40260n4282j93433O896
5879B2150J63070n1811m0699Q2544q8492R4722J27129r3446j0444N471l6674L8130
5867B11650K22092k46758j37894L0207p4116K12284J4894q4839M0670R8138Q8586
$$ plain form
5946 251013 257790 349868 273490 267666 366772 365876 217225 117228 15693 116425 105260 -192093
5934 -192093 -123117 43627 -71618 4370 -177117 -82490 244770 457048 425749 217056
5924 217056 109244 165342 200255 218509 298772 391387 167731 -33372 -83030 -201922 -148843
5913 -148843 -144679 -123312 -46800 -15475 18524 38910 193900 228479 30401 141274 134788
5902 134788 78032 75591 217763 234312 188413 107167 161899 98359 -52882 -49869 -16197 206486
5890 206486 142998 191908 125250 144594 247276 161804 122709 262969 208687 15254 22150
5879 22150 185220 133409 92710 175254 86762 181484 308613 215167 204723 210194 173520 211650
5867 211650 433742 186984 49090 79297 5181 217465 232359 147520 188190 286328 374914
5856C74914j59616j51602J48640J02658m5403o5609r9177j09442J29162j05070
5846A9455R0563M36162k9697q9500j86352J34904k4391n1397M4520j77713K4272
5835A90826J61965P5858j09280J46689k7235j51652Q903O091P2198R5853k6700
5824D43516O6646r219j44802j5027l6476j0270O4026J14774K8526n8555p6879
5813C66260J33225p800j58441p3350J11416K69900o7640k21006J17907q3539M8721
5802D35653J8498r0427K28695j68605k05185J40341Q9519j44490j64782J67985
5792C07202j0073J80911o8452J02050p1242j69805K01554l79083J96469L2943
5782C22474L4756J81025n2032p5492K8665j14924K2302J04908O4753r5955O9590
$$ plain form
5856 374914 215298 63696 212336 314994 269591 203982 104805 -4637 124525 19455
5846 19455 110018 546180 516483 426983 240631 375535 351144 299747 344267 166554 190826
5835 190826 352791 428649 319369 466058 438823 287171 296074 302165 374363 470216 443516
5824 443516 510162 500943 356141 341114 304638 294368 358394 473168 501694 443139 366260
5813 366260 499485 491685 333244 259894 371310 641210 573570 352564 470471 386932 435653
5802 435653 454151 363724 592419 423814 218629 358970 448489 303999 139217 307202
5792 307202 297129 478040 409588 511638 440396 270591 472145 93062 289531 322474
5782 322474 357230 538255 486223 410731 439396 324472 346774 451682 516435 420480 490070
5771D90070L2553j64529o7062R9767L2711k3918k78871P7876J7179L6839M3214
5760B95829J13199M1881j77722K31446p9005q2428L6731M5400K06861k1879m4152
5749E66161J41209j9632O1658p6654l9424n9544q902N2586r1543j6777J90756
5738F99894J20270p972Q5468k28152n7825K27227J42732j52787p6194L43309O5403
5727A161373o3172j71669J49275K57027j59270j29700o7723Q2732r8579l5187
5717I25107n5115J65458k2140k54528K08341P4702m5050q4608o2989J03192R4970
5706A047340k35897j20503o38m9183m2004J73714K1817j05760j00700J79254j07318
5695F60122n9435J4490j25140J00264n5980L205M4295k73041J68603J01449k344
$$ plain form
5771 490070 522623 358094 291032 390799 423510 399592 120721 198597 215776 252615 295829
5760 295829 409028 450909 273187 504633 425628 343200 379931 425331 632192 610313 566161
5749 566161 707370 687738 749396 672742 633318 573774 564872 617458 525915 509138 699894
5738 699894 820164 812192 897660 669508 611683 838910 981642 828855 752661 1095970 1161373
5727 1161373 1098201 926532 1075807 1332834 1173564 1043864 976141 1058873 960294 925107
5717 925107 869992 1035450 1013310 758782 967123 1041825 996775 912167 849178 952370 1047340
5706 1047340 811443 690940 690302 641119 599115 772829 794646 688886 588186 767440 660122
5695 660122 600687 615177 490037 590301 534321 537526 581821 308780 477383 578832 576488
5684E76488J86938N8107j53783m2249Q9584j12449J02411J9084j83242r3177J45768
5673E93480j12430o0505Q6060o2004l8923R8301N9846N6943P5617J68646J11432
5662I76463n184J6811j58698q7581j84876l0847J13746J1335k7312K7726J81203
5651H32786O5605j80798J7805q259K0167Q035k15650K42413J95033p6946n4996
5640H45195q5992j79077O3374J80671J84954O9032M8706n4350O2638k39425K3635
5629I19361N8883n542J32658L1311k71847o9382L41110j09337J68994j50348j10106
5618I35755R2222q9672R5665P5765j68231j0601J22125J53993o5477k17628O0218
5607I84134L4207K20r4235Q3717k015r9140J77141J73790j37990N3100N5041M5962
$$ plain form
5684 576488 763426 821533 667750 625501 715085 602636 705047 724131 540889 447712 593480
5673 593480 481050 420545 506605 444601 405678 503979 563825 620768 696385 865031 976463
5662 976463 971279 988090 829392 741811 556935 526088 639834 651169 623857 651583 832786
5651 832786 898391 717593 735398 727139 747306 755341 539691 782104 977137 900191 845195
5640 845195 759203 580126 643500 824171 1009125 1078157 1126863 1072513 1135151 895726 919361
5629 919361 978244 972702 1105360 1136671 864824 795442 1136552 1027215 1196209 1045861 935755
5618 935755 1027977 938305 1033970 1109735 941504 930903 1053028 1207021 1141544 923916 984134
5607 984134 1018341 1018561 924326 1008043 1006028 906888 1084029 1257819 1119829 1172929 1227970 1273932
5595A273932Q4483r394L9709J43937n3796n6816m1794r2344K85620k3659l7493
5584A512385n4396J11260p223J84208O7222q4105O7150K2917N1971j17293m7159
5573A706937J02254j47638L1237K46949j00828n6590j03604K2582K36678j6912
5563A921065j02165J64779k4526L5910R5004J09563J88954l0214R0400L0768l6182
5552B443356N7090j831J68618l9589j16125J03870J37026J89924k07142J34474
5542B869671J37186j41607J16126L88427k5746q5780Q7940q6560J9205K13487
5532C492349O8854L7719J79142N4897O9384O2521L30930M0973K0818M6326j37494
5521D266419J85962K46558l1979J57140M5715n501k9940Q7851K05822K26313O4373
$$ plain form
5595 1273932 1358415 1349021 1388730 1532667 1478871 1422055 1380261 1287917 1573537 1549878 1512385
5584 1512385 1457989 1569249 1562026 1746234 1813456 1729351 1796501 1819418 1871389 1754096 1706937
5573 1706937 1809191 1661553 1692790 1939739 1838911 1782321 1678717 1701299 1937977 1921065
5563 1921065 1818900 1983679 1959153 1995063 2090067 2199630 2388584 2358370 2448770 2479538 2443356
5552 2443356 2500446 2498615 2667233 2627644 2511519 2615389 2752415 2942339 2735197 2869671
5542 2869671 3006857 2865250 2981376 3369803 3344057 3258277 3346217 3259657 3278862 3492349
5532 3492349 3561203 3598922 3778064 3832961 3902345 3964866 4295796 4336769 4357587 4403913 4266419
5521 4266419 4452381 4698939 4666960 4824100 4869815 4864314 4834374 4922225 5128047 5354360 5418733
5510E418733J41446J40929L25466j7090Q0059K67892j80882J88686K65776L14348
5500F945363J49996K66131J80464J54506L81333L61498J16556J36817J82371M35977
5490I311012M20747N00477Q5977J79500L27547P2555L23294L38999J12071J44502
5480A1816681L17529K37703M94340J88485L39821M14786L92429L53596M84735
5471A5040105L09360N16598L07088K00191M13800N86116P92800M30762N75552
5462A9172372O42736O77815P90841J031018O98773P82500R04334R00262J047220
5453B6647871J099778J177436J111158J480106J308384J467075J688279J855155
5445C7835242J856783K086953K564785K757253K656849K879563L331443L740329
$$ plain form
5510 5418733 5560179 5701108 6026574 6009484 6089543 6357435 6176553 6365239 6631015 6945363
5500 6945363 7095359 7361490 7541954 7696460 8077793 8439291 8555847 8692664 8875035 9311012
5490 9311012 9731759 10232236 10318213 10497713 10825260 10897815 11221109 11560108 11672179 11816681
5480 11816681 12134210 12371913 12866253 13054738 13394559 13809345 14201774 14555370 15040105
5471 15040105 15349465 15866063 16173151 16373342 16787142 17373258 18166058 18596820 19172372
5462 19172372 19815108 20492923 21283764 22314782 23013555 23796055 24700389 25600651 26647871
5453 26647871 27747649 28925085 30036243 31516349 32824733 34291808 35980087 37835242
5445 37835242 39692025 41778978 44343763 47101016 49757865 52637428 55968871 59709200
5437E9709200M090546M328808M931746N117819N320327N780902O150970O230602
5429A01660920O250907O444858O449973O129700N628230N136281M265869L349430
5421A45316168K616815J331054n6816j412884k866660l837739m965064n650006
5413A30474868o180411o698218o649125o787593o700330o448827o233967o011657
5405G8764740n137620n027266m725458m194990l730644l421248l023167k884517
5397D6619830k650724k610109k371762j928494j819111j701679j533879j500734
5389C0503338j338171j068585j173326j106279q77992j195613r97516q61562q97386
5380B0986908o17497q73766o15305n28193p71730n12512o25705o68070o02718
$$ plain form
5437 59709200 63799746 68128554 73060300 78178119 83498446 89279348 95430318 101660920
5429 101660920 107911827 114356685 120806658 126936358 132564588 137700869 141966738 145316168
5421 145316168 147932983 149264037 149207221 147794337 144927677 141089938 136124874 130474868
5413 130474868 124294457 117596239 110947114 104159521 97459191 91010364 84776397 78764740
5405 78764740 73627120 68599854 63874396 59679406 55948762 52527514 49504347 46619830
5397 46619830 43969106 41358997 38987235 37058741 35239630 33537951 32004072 30503338
5389 30503338 29165167 28096582 26923256 25816977 24938985 23743372 22745856 21884294 20986908
5380 20986908 20369411 19495645 18880340 18352147 17580417 17067905 16442200 15774130 15171412
5371A5171412m79383k47979l58627m67550l38132l84852m56105m88133k44252
5362A1706399l73078k46015k52867l86212l26741j46712k60473m18105j40946
5353I155250l51987j85357l40726j06786j07015j53321n3699j75160r5566L2508
5343G618141j21114l51267l64187J08933k88792k29553k20408q198j62101j20606
5333E860848l4748k40671l06269j18659q0774k49881K4378J07084j43592q5914
5323D731802k87271r2420J8122k3293p5139j52238q2898R0330j33810l78528P6593
5312C691250J38420p2603k80140j04413P2067J49827j46366k52604n8656L0250
5302C167032m420l6352l41525J30192J47493j51478J13793k09167l02773o1605
$$ plain form
5371 15171412 14692029 14444050 14085423 13617873 13279741 12894889 12438784 11950651 11706399
5362 11706399 11333321 11087306 10834439 10448227 10121486 9974774 9714301 9296196 9155250
5353 9155250 8803263 8617906 8277180 8170394 8063379 7910058 7856359 7681199 7585633 7618141
5343 7618141 7497027 7145760 6781573 6890506 6601714 6372161 6151753 6143555 5981454 5860848
5333 5860848 5826100 5585429 5279160 5160501 5079727 4829846 4854224 4961308 4817716 4731802
5323 4731802 4444531 4352111 4370233 4346940 4271801 4119563 4036665 4126995 3993185 3614657 3691250
5312 3691250 3829670 3757067 3476927 3372514 3444581 3594408 3448042 3195438 3136782 3167032
5302 3167032 3162612 3126260 2784735 2914927 3062420 2910942 3024735 2815568 2512795 2451190
5292B451190J62383q1346j15287m6960P7090k5168j4265K01417j64922L056j57360
5281B289828j50767k2726P4796j83515N2871j2316O2515j69947j14877o086L14009
5270B133785r3400k22862J84520L9940k65979n4167o0594j06632J41956J06406
5260A802973j9959j00055K68912j81524k1375j17366K618n0736N3155J15781q6602
5249A665822p748l2529p8899M7165R3506r2607j53181O2748J26408r4214l20181
5238A216290L1278k8418k14219M01521L312p5106K7554m852l6493j10960J83655
5227A393562l5244k23646M3714P0946k1385j33876K46505j95285o8874J03404
5217A179821n5743J63871N4656o2105j78000p5306j88799J44442j0509k72730
$$ plain form
5292 2451190 2613573 2532227 2416940 2369980 2447070 2421902 2407637 2609054 2444132 2447188 2289828
5281 2289828 2139061 2116335 2191131 2007616 2060487 2048171 2110686 1940739 1825862 1819776 2133785
5270 2133785 2040385 1817523 2002043 2041983 1776004 1721837 1661243 1554611 1696567 1802973
5260 1802973 1783014 1682959 1951871 1770347 1748972 1631606 1634224 1583488 1636643 1752424 1665822
5249 1665822 1658074 1625545 1546646 1593811 1687317 1594710 1441529 1504277 1630685 1536471 1216290
5238 1216290 1247568 1219150 1004931 1406452 1409764 1334658 1362212 1357360 1320867 1209907 1393562
5227 1393562 1358318 1134672 1178386 1249332 1227947 1094071 1340576 1145291 1076417 1179821
5217 1179821 1124078 1287949 1342605 1280500 1102500 1027194 838395 982837 972328 699598
5207F99598j9707J02945J78444N8225p8814K0360j29510L844J49975K86933j14450
5196A157843P4244j10303k52365k9411J27573Q4755n4968j62025k12960J01214
5186G23597N8425J49104P4513o4744K7806j37721r575J20716P5635k7818r2784
5175H97154J7388K4638j17498J07626J7054p4337Q9070o6658j5597n3324J66326
5164I91842P9949j34251q8364J25299J07403j42669m7005q246M6139m3982j0501
5153H75614j54422J13972R7264r9650n5036j05346J41525K05806N6653L8718q5535
5142A029563r3140K97863J03394k08511j61096n1647n4055J63974j6073M5184
5132A055456J16780n527M7447J54586k1201j11513N5934J12689P650j3948K64329
$$ plain form
5207 699598 679891 782836 961280 1019505 940691 961051 831541 835385 985360 1272293 1157843
5196 1157843 1232087 1121784 869419 840008 967581 1052336 997368 835343 622383 723597
5186 723597 782022 931126 1005639 940895 968701 830980 821405 942121 1017756 989938 897154
5175 897154 914542 939180 821682 929308 946362 872025 961095 894437 878840 825516 991842
5164 991842 1071791 937540 849176 974475 1081878 939209 892204 883958 930097 886115 875614
5153 875614 721192 835164 932428 832778 777742 672396 813921 1019727 1076380 1115098 1029563
5142 1029563 936423 1234286 1337680 1129169 968073 916426 862371 1026345 1010272 1055456
5132 1055456 1172236 1166709 1214156 1368742 1347541 1236028 1291962 1404651 1412301 1398353 1662682
5121A662682o6722j69697Q7806M1560r6482N3812k994N6451J09119j15266J38602
5110A698871M014j4440j64172R7347j66166k17355J2401K57877k6664r8738r7676
5099A285299k13368J85944r8037k3524J85734o7593k02284J14578j72124J11808
5089A106433k9852m8248P4508j37150j40156j56614O8167J02796o852J44272K04641
5078A181945o8203n285k5027j37370l28443j83610L25118J74008J18463r3536
5068I58060k6631q233l2690P4374l5899q2771p4928J41034m0283j35894k6953
5057G09186o5116J19937J48326j32891J07589k73683J67399K1700j13445k21J307
5046F90088J19946j9521M8248j779j63560M1567k7330k19249J8343K51775N9800
$$ plain form
5121 1662682 1595960 1426263 1514069 1555629 1459147 1512959 1509965 1566416 1675535 1560269 1698871
5110 1698871 1702885 1688445 1524273 1621620 1455454 1238099 1250500 1508377 1481713 1382975 1285299
5099 1285299 1071931 1257875 1159838 1136314 1322048 1254455 1052171 1166749 994625 1106433
5089 1106433 1076581 1028333 1102841 965691 825535 668921 737088 839884 833032 977304 1181945
5078 1181945 1113742 1108457 1083430 946060 617617 434007 759125 933133 1051596 958060
5068 958060 931429 923196 890506 964880 928981 846210 771282 912316 872033 736139 709186
5057 709186 644070 764007 912333 779442 887031 613348 780747 802447 689002 688781 690088
5046 690088 810034 790513 838761 836982 673422 714989 687659 468410 486753 738528 798328
5035G98328J0044j07698n8375J12897j4414j95196n7099P7939J1290r2751M595
5024D89560K33411o4666p052l0377R1572R2553o45j67878P1290k802l9754J02323
5012G67535j99k2259k08589j9836J46786o4595M7346m6448K2153j42738O7946
5001E47102J75687N7013P8457j1964o2968j34659l1831K30417j28455l5004K7425
4990G11220J58456m8453m3500J37744p3268l0293J38435J79134j03990K1536k0833
4979A026188N0032J45856k56543K1962L7285k9909J04308Q6194k2452k172J97333
4968A358082j56232Q2820j51585k78671J16856K74169n463n9662o2073k10598
4958I07643J47366J30426k210L24427j70689j85568L069K07769J87728l3146j34720
$$ plain form
5035 798328 808372 700674 642299 755196 740782 545586 488487 566426 577716 484965 489560
5024 489560 722971 658305 651253 620876 712448 805001 804356 636478 707768 704966 665212 767535
5012 767535 767336 745077 536488 516652 663438 598843 646189 599741 621894 479156 547102
5001 547102 722789 779802 858259 846295 783327 648668 616837 847254 718799 683795 711220
4990 711220 869676 821223 777723 915467 842199 811906 950341 1129475 1025485 1047021 1026188
4979 1026188 1076220 1222076 965533 987495 1024780 994871 1099179 1185373 1162921 1160749 1358082
4968 1358082 1201850 1284670 1133085 854414 971270 1245439 1239976 1180314 1118241 907643
4958 907643 1055009 1185435 1183225 1507652 1336963 1151395 1154464 1362233 1549961 1516815 1382095
4947A382095j17923J63943j63435l4698n0586l1706J29095K9397j16919P410J36050
4936A332723j0310j73216l4883P5836M3430j07876Q3267J15057n9061O8749P5659
4925A409375j79313j003m6699n8191K14869n4758j12077q5912k9969R673O1249
4914A127244R1248l9183R285r2275L5247R7725P371O3438J58607m8515q6218j83377
4902A140597r2506K66290J1296J16099M9915k32504J315o556J92299j94581j55968
4891A095696J02945k7132K19667j54766j199L4560M4271j63302j50303L52069
4881A352506J86929j34302j46524L6701K03502J4347j83840j11666K38942l3905
4871A422690N8916J653j608Q6479k0680r156k42440O4528K63848m5966N2182q2109
$$ plain form
4947 1382095 1264172 1428115 1264680 1229982 1179396 1147690 1276785 1306182 1189263 1196673 1332723
4936 1332723 1322413 1149197 1114314 1190150 1233580 1125704 1208971 1324028 1264967 1333716 1409375
4925 1409375 1230062 1229059 1182360 1124169 1339038 1284280 1172203 1086291 1056322 1065995 1127244
4914 1127244 1218492 1179309 1188594 1096319 1131566 1229291 1236662 1300100 1458707 1410192 1323974 1140597
4902 1140597 1048091 1314381 1325677 1441776 1491691 1259187 1260502 1253946 1446245 1251664 1095696
4891 1095696 1198641 1171509 1391176 1236410 1235211 1269771 1314042 1150740 1000437 1352506
4881 1352506 1539435 1405133 1258609 1295310 1498812 1513159 1329319 1217653 1456595 1422690
4871 1422690 1481606 1483259 1481651 1568130 1547450 1538294 1295854 1360382 1624230 1578264 1630446 1548337
4859A548337N230p6103J44481M4442J96283j8718j13903P512L7313q4831Q8294
4848A778337J92700j30207J39200J08459j27739K5704j79626j19637J22383L1009
4838A840583P232o0164J53701K02090P5245j99913j5979K02158J46011L1101R49
4827B383014L7570j02540j69619K9060P2098N5461J08774p2618R6114J27200P5642
4816B640156r2108J5338O069R893J67740j16552O9492n7432J18829J26148m1660
4805B845913j15246N7310M3694j12825K15385K98682q3890J72354J82862l0488
4795C473751j2814K8856j67912J05951j8181j32200K70492M8591k4109N9082k6772
4784C604735J40963O559J56210J16021j89993j4760J44170o1561K83635o8034
$$ plain form
4859 1548337 1553567 1477464 1621945 1666387 1862670 1843952 1730049 1737561 1774874 1690043 1778337
4848 1778337 1971037 1840830 1980030 2088489 1960750 1986454 1806828 1687191 1809574 1840583
4838 1840583 1847815 1787651 1941352 2143442 2218687 2018774 2002795 2204953 2350964 2382065 2383014
4827 2383014 2420584 2318044 2148425 2177485 2249583 2305044 2413818 2341200 2437314 2564514 2640156
4816 2640156 2548048 2563386 2569455 2579348 2747088 2630536 2700028 2642596 2761425 2887573 2845913
4805 2845913 2730667 2787977 2831671 2718846 2934231 3232913 3149023 3321377 3504239 3473751
4795 3473751 3460937 3489793 3321881 3427832 3409651 3277451 3547943 3596534 3572425 3631507 3604735
4784 3604735 3745698 3752257 3908467 4024488 3834495 3819735 3963905 3902344 4185979 4117945
4774D117945J00076J34416j05854J28058J53801K21392K31504K06495Q2062n4503
4764E215392K49614L8688p1745J00646K42801J90707L3979K5615K33761J24082
4754F383540k11348j11757J00426M5060j31889k6340P1134J80086m9804M3451
4744F292559Q3540j07648p4777N8240K17899K52646K6499J39687N5367K8405N3888
4733G026305L00966M8733N9525M45287o0296J61751M55854K35312m8497J94441
4723H819381o007J79602J95241J00345L63433K80398K90178J39963L71362J92675
4713A0926571L20238K03245M02963J49372K29218M37977L74427K40068M93934
4704A3778013K91080L42616O51364L68707M65630M75677O63191N50851L43087
$$ plain form
4774 4117945 4218021 4352437 4246583 4374641 4528442 4749834 4981338 5187833 5269895 5215392
4764 5215392 5465006 5503694 5431949 5532595 5775396 5966103 6000082 6025697 6259458 6383540
4754 6383540 6172192 6060435 6160861 6205921 6074032 6047692 6118826 6298912 6249108 6292559
4744 6292559 6376099 6268451 6193674 6251914 6469813 6722459 6748958 6888645 6944012 6972417 7026305
4733 7026305 7327271 7376004 7435529 7880816 7820520 7982271 8438125 8673437 8624940 8819381
4723 8819381 8813374 8992976 9188217 9288562 9651995 9932393 10222571 10362534 10733896 10926571
4713 10926571 11246809 11450054 11853017 12002389 12231607 12669584 13044011 13284079 13778013
4704 13778013 14069093 14411709 15063073 15431780 15897410 16373087 17036278 17587129 17930216
4695A7930216N93287O94741P28674Q10101P55421R39923R51019J123686Q92646
4686B5419714R41073J188854J347816J276553J399553J639371J523397J797110
4678C6533441J612716J794375J810418J813153J853025J763560J438777J191139
4670D9810604J631423J134915R56719J108475R11138P18683O41529Q74569J014285
4661E8802340J152526J166750J416059J506704J632861J964903K237080K188219
4653G2067442K626061K748643K739022K689190K609235K424228K454960K021825
4645I2380606J700877J168064P15085j47072p11596j101177j694743k185020k335318
4636H7789706k259148k019223j639983j657403j221909p59737m62110k77523j56273
$$ plain form
4695 17930216 18523503 19218244 19946918 20757019 21512440 22452363 23403382 24527068 25419714
4686 25419714 26360787 27549641 28897457 30174010 31573563 33212934 34736331 36533441
4678 36533441 38146157 39940532 41750950 43564103 45417128 47180688 48619465 49810604
4670 49810604 51442027 52576942 53533661 54642136 55553274 56271957 56913486 57788055 58802340
4661 58802340 59954866 61121616 62537675 64044379 65677240 67642143 69879223 72067442
4653 72067442 74693503 77442146 80181168 82870358 85479593 87903821 90358781 92380606
4645 92380606 94081483 95249547 95964632 95817560 95105964 94004787 92310044 90125024 87789706
4636 87789706 85530558 83511335 81871352 80213949 78992040 78232303 77770193 77492670 77336397
4627G7336397j71340K63411M47878K57337J78232R9420o5040k44664p54188j121964
4617G6225479j610022k072529k277607k344612k673748k638514k928421k911874
4609E6768152k353528k465778k351902k069311k011700j807776j652531j460373
4601D0595253j594720j404277j337558j034107q14714q56395q77508o61638p36383
4592C1277953o30193n41473m58338m80966n01678k71006n79608l44817k41925
4583B7227949l10938r4502N6952j52778j73897q49n7506J86782m0227l5155k8364
4572B6577467p3776L28188K65319K20298J70720L94410J58517L86137M30800O73963
4562B9532043M27721K98757M89557N69437R42897P22384P48542O32670R10271
$$ plain form
4627 77336397 77165057 77428468 77876346 78133683 78311915 78411335 78346295 78101631 77347443 76225479
4617 76225479 74615457 72542928 70265321 67920709 65246961 62608447 59680026 56768152
4609 56768152 54414624 51948846 49596944 47527633 45515933 43708157 42055626 40595253
4601 40595253 39000533 37596256 36258698 35224591 34409877 33553482 32675974 32014336 31277953
4592 31277953 30647760 30106287 29647949 29166983 28665305 28394299 27814691 27469874 27227949
4583 27227949 26917011 26822509 26879461 26726683 26552786 26551937 26494431 26681213 26640986 26605831 26577467
4572 26577467 26503691 26831879 27097198 27317496 27488216 27882626 28041143 28427280 28858080 29532043
4562 29532043 29959764 30258521 30748078 31317515 32260412 32982796 33731338 34364008 35274279
4553C5274279J068425R88999J199693J153811J089322J503385J323553J562082
4545D5163549J668304J597990J739247J961657J958762K188793K123309K346304
4537F0747915K272809K439340J998394K248362K463064K286315J961356J878099
4529G8295654J901161J825396J431974J251456J168755R53344Q99523Q97717P95321
4520H9420301P60291R69361Q19370J121335R97514J022954R43729J076357J167617
4511I8298829J613498J490212J454546J410374J245545J350066J131838P07363
4503A08702271Q14864O26050K94995Q2735j07633m74909n19038o15589n81351
4494A08222395n41291p19529o36209n12341k55504j88174m8433K89338N34169
$$ plain form
4553 35274279 36342704 37331703 38531396 39685207 40774529 42277914 43601467 45163549
4545 45163549 46831853 48429843 50169090 52130747 54089509 56278302 58401611 60747915
4537 60747915 63020724 65460064 67458458 69706820 72169884 74456199 76417555 78295654
4529 78295654 80196815 82022211 83454185 84705641 85874396 86827740 87727263 88624980 89420301
4520 89420301 90180592 91149953 91969323 93090658 94088172 95111126 96054855 97131212 98298829
4511 98298829 99912327 101402539 102857085 104267459 105513004 106863070 107994908 108702271
4503 108702271 109517135 110143185 110438180 110520915 110413282 109938373 109419335 108803746 108222395
4494 108222395 107681104 106961575 106325366 105813025 105557521 105369347 105320914 105610252 106144421
4485A06144421O67719Q36812J469881J635910J856006K078480K110949K837240
4477A19637418L168558L406213M021217M226301M796902N438543O160996O914655
4469A57770803P561289Q529844R413349J0443146J1136753J1726288J2507837
4462B29089309J2615778J2221513J1117444R423865O199608K349480k476763p078732
4454B73461502j1085048j4192796j5778054j6476670j6007930j5026711j3998987
4447A70895306j2693019j1284590j0154729r129173q077553p537818o809045o151110
4439I9058269n802522n244288m862417m258497l843314l621559l356304l173295
4431F4896073k793521k593755k262609k370885k203726k047500j806013j749893
$$ plain form
4485 106144421 106812140 107648952 109118833 110754743 112610749 114689229 116800178 119637418
4477 119637418 122805976 126212189 130233406 134459707 139256609 144695152 150856148 157770803
4469 157770803 165332092 173861936 183275285 193718431 204855184 216581472 229089309
4462 229089309 241705087 253926600 265044044 274467909 280667517 283016997 280540234 273461502
4454 273461502 262376454 248183658 232405604 215928934 199921004 184894293 170895306
4447 170895306 158202287 146917697 136762968 127633795 119556242 112018424 105209379 99058269
4439 99058269 93255747 88011459 83149042 78890545 75047231 71425672 68069368 64896073
4431 64896073 62102552 59508797 57246188 54875303 52671577 50624077 48818064 47068171
4423D7068171j665906j840028j360335j246934j483136j173324j475193j003552
4415C5819763j163572j192178r90816r13034p66659r77779j145974o80594q35477
4406B7153680o90698q41847p59831m51513o24508p01319q65304j95411l86415
4397B1636834o61564m53335n38283k88884m81249m29664o10154j64440l84686
4388A7624575l80827l58117l67206j81051l43061k69895l81933k13281l85251
4379A4743953l55376l59713j89739j380k26288l55051k04946l44286l35916j67181
4369A2204077k88405j78004j95569q8430k53143k45262k63918R4784k9140k44555
4359A0512435o5702j63982l38381k37079n9069j30125j21026j57069m51791j22890
$$ plain form
4423 47068171 45402265 43562237 42201902 40954968 39471832 38298508 36823315 35819763
4415 35819763 34656191 33464013 32473197 31560163 30793504 29815725 28669751 27989157 27153680
4406 27153680 26462982 25621135 24861304 24409791 23785283 23083964 22218660 22023249 21636834
4397 21636834 20975270 20521935 19983652 19694768 19213519 18783855 18173701 18009261 17624575
4388 17624575 17243748 16885631 16518425 16337374 15994313 15724418 15342485 15129204 14743953
4379 14743953 14388577 14028864 13839125 13837745 13611457 13256406 13051460 12707174 12371258 12204077
4369 12204077 11915672 11737668 11542099 11453669 11200526 10955264 10691346 10786130 10756990 10512435
4359 10512435 10446733 10282751 9944370 9707291 9648222 9518097 9397071 9240002 8788211 8665321
4349H665321J2931j18420j21560n6319P4619j06723k80136q3112P6586j47269
4339G915918j26098j99154O133M8141j58009k66966n723j06611j3270n1987k47873
4328F794501j24715j45448j31996Q5208N792j03987l6911m19670k10402N5274
4318E767646J76419n7868k63244R1012j17192P0301N8603o6864l32119J5731k4787
4307E317638k39810J12791k04409L8647P0461o401k73865M4399J02816k2095n1316
4296D888856j89667J8461j00501k4453j09575n0958O6816l04095r7895J06230
4286D203219J77148j83839j06641Q8386o2097j85297J64980n8025j00343j48408
4276C789083k1949P5380p9383L4527K106M6887j00163J98842j53812j10580J30783
$$ plain form
4349 8665321 8678252 8559832 8438272 8381953 8456572 8349849 8069713 7986601 8063187 7915918
4339 7915918 7789820 7590666 7596799 7644940 7486931 7219965 7214242 7107631 7094361 7042374 6794501
4328 6794501 6669786 6524338 6392342 6477550 6483342 6379355 6342444 5922774 5712372 5767646
4318 5767646 5944065 5886197 5622953 5713965 5596773 5667074 5725677 5658813 5326694 5342425 5317638
4307 5317638 5077828 5190619 4986210 5024857 5095318 5088917 4815052 4859451 4962267 4940172 4888856
4296 4888856 4699189 4717650 4617149 4592696 4483121 4432163 4498979 4194884 4096989 4203219
4286 4203219 4380367 4196528 4089887 4178273 4116176 3930879 4095859 4037834 3937491 3789083
4276 3789083 3767134 3842514 3763131 3797658 3799764 3846651 3746488 3945330 3791518 3680938 3811721
4265C811721k0554K4662j55425j40818R1690j71588M5950P2423j634j54065J35368
4254C537730j10200k54864k2324n8050K09796j15612q6876P2055n1604k7716n2722
4243C039613J10447o0581k5184R8978j20047M4238o6131j8813J80401o6449M4131
4232C160603j28295p502J20136k4125q658n2278k27073L4647J9304q1765m7473
4221B757521J20346j7298j3705l2009R3037J19427k4092k28613n519k8451J6352
4210B756996L5523j71193O4978L9581j30391J28235R4541j30524l33473J11573
4200B465846J17183j13694L6886K4102j97334q4349K8825Q0926J61864N887J27464
4189B653606j56298P2152P2004P6769k48238j35813J41174J8791j94780j72105
$$ plain form
4265 3811721 3791167 3815829 3660404 3519586 3611276 3439688 3485638 3558061 3556427 3402362 3537730
4254 3537730 3427530 3172666 3150342 3092292 3302088 3186476 3099600 3171655 3120051 3092335 3039613
4243 3039613 3150060 3089479 3064295 3163273 3043226 3087464 3021333 3002520 3182921 3116472 3160603
4232 3160603 3032308 3024806 3144942 3120817 3112159 3059881 2832808 2867455 2886759 2804994 2757521
4221 2757521 2877867 2860569 2846864 2814855 2907892 3027319 3003227 2774614 2769095 2740644 2756996
4210 2756996 2792519 2621326 2686304 2725885 2595494 2723729 2818270 2687746 2354273 2465846
4200 2465846 2583029 2469335 2506221 2530323 2332989 2248640 2277465 2358391 2520255 2526142 2653606
4189 2653606 2497308 2569460 2641464 2718233 2469995 2334182 2475356 2494147 2299367 2127262
4179B127262J27643M351j526J2923k1804M0048K2188N5965J0130j4551j2517K9529
4167B379641j37446J01318J86015o703N6664J41129k9210K96o4505O9535m4827
4156B651907n8008J97398J9910j8091J52184j61657j9814j7207l4659k29219L2944
4145B515688O7163k05073r4996k41274k237m7395O2286p1456j26398j11572k3032
4134A721704j9685l0060o7472P1665J37374l34442m8419J2206J64728j3422j47382
4123A446795l2147l8116k44023j11956J37373L7740J9195L4550j09424Q8729K1329
4112A250045o0269J32973N4440q2677J03585N3135j82800n9015L181p8579j8523
4101A115496K8253P4681J73153o2795j67080q6580k10041J44035L1750o9436J36502
$$ plain form
4179 2127262 2254905 2259256 2257730 2270653 2248849 2288897 2311085 2367050 2377180 2362629 2350112 2379641
4167 2379641 2242195 2343513 2529528 2522825 2579489 2720618 2691408 2691704 2627199 2696734 2651907
4156 2651907 2593899 2791297 2811207 2793116 2945300 2783643 2763829 2746622 2711963 2482744 2515688
4145 2515688 2582851 2377778 2282782 2041508 2039271 1991876 2054162 1982706 1856308 1744736 1721704
4134 1721704 1702019 1671959 1604487 1676152 1813526 1479084 1430665 1442871 1607599 1594177 1446795
4123 1446795 1414648 1376532 1132509 1020553 1157926 1195666 1214861 1249411 1139987 1228716 1250045
4112 1250045 1189776 1322749 1377189 1294512 1398097 1451232 1268432 1209417 1212598 1134019 1115496
4101 1115496 1143749 1218430 1391583 1328788 1161708 1075128 865087 1009122 1040872 971436 1107938
4090A107938J57558m9010O5262r4409j88682Q5928l596j12564o7500K52416j85469
4079I67872k03488L5784L7694K36792K8708Q859K03218j92972o2630K2437j57940
4068I24334p9039j97000J44681K16324j30103M9124M2128J7356O7667m4567k39859
4057G71046p151J23104J14070Q7061K2252j83842k7666l7877n0535n6795K26099
4046I79766L6978j77311J19812o7263l6024N5130k17131j66423J78000L45316
4036A050850j91130M7625N1619j44198j2199J19405J42468j25018J6022J74048
4026A129492k52293J00589j7286j5289P3846j59758P2989N8871j62551Q5097O1736
4015I75443M8732p4623o1039j4862J53266j1055l28120J08833o8412K4556r8900
$$ plain form
4090 1107938 1265496 1216486 1281748 1187339 998657 1084585 1080989 968425 900925 1153341 967872
4079 967872 764384 800168 837862 1074654 1103362 1112221 1315439 1122467 1059837 1082274 924334
4068 924334 845295 648295 792976 1009300 879197 928321 970449 987805 1055472 1010905 771046
4057 771046 763895 886999 1001069 1088130 1110382 926540 898874 860997 810462 753667 979766
4046 979766 1016744 839433 959245 891982 855958 911088 693957 527534 705534 1050850
4036 1050850 859720 907345 958964 814766 802567 921972 1064440 939422 955444 1129492
4026 1129492 877199 977788 960502 945213 1019059 859301 932290 991161 828610 913707 975443
4015 975443 1024175 949552 888513 873651 1026917 1015862 687742 796575 728163 752719 653819
4004F53819J41503J26079j26515l1841k09130J64674J56909l673k34700K9623
3994F66748J15360M271K3361n6021M8170j79343J3913k6368J75217O9317R880
3983H64505j02164J49767j37477l19095J05821j15454p935O8408J0670J49771
3973F66817n0260j31483r7901J02958J95187q7686k10681m2902R4174K5523J01302
3962E65048k1525k20617K24486j7206j07896J4401P3560p1236P4295K9924L7276
3951E80510R444P808P0528k8167j86175k7884j2932o1876n7832Q4241p777l1702
3939C38186M6782r4652m7700J79298J33784j47686Q7738j80692p7221j33357j47275
3928d2795J08050P1942J86418J27604j24727k89518L7289Q7657N9597J24266j07710
$$ plain form
4004 653819 795322 921401 794886 763045 553915 718589 875498 871825 637125 666748
3994 666748 782108 786379 809740 753719 801889 622546 636459 610091 785308 854625 864505
3983 864505 762341 912108 774631 455536 561357 445903 437968 506376 517046 666817
3973 666817 616557 485074 387173 490131 685318 597632 386951 344049 438223 463746 565048
3962 565048 543523 322906 547392 530186 422290 436691 510251 439015 513310 543234 580510
3951 580510 589954 597762 668290 640123 453948 426064 413132 351256 293424 377665 369888 338186
3939 338186 384968 290316 242616 421914 555698 408012 495750 315058 237837 104480 -42795
3928 -42795 65255 137197 323615 451219 326492 36974 74263 161920 221517 345783 238073
3917B38073j577J87574o9526j19966M7844L13911l6287j12293L3233m3718M4308
3906D81576j67093K25006K3429r0508k50859r8108J21282m4143k1808j1134j17911
3895D9729R2570Q7375J56818m0126l8994j61832N4297m2391M3347L0102j55284
3884G5611O8336K2133R508J63904q1641n421J23754R8917j14931k0410Q791J846
3872C50397M8481n5649q6828r5553J63026j0069M0439R7600N042j13066J7311
3861C61131o025o3754j4438J33660j5249J55588L7474j51811r6245j1843k57771
3850G0717J72936J17873l0260r9546Q6298j06826J73783j25736j57027N3366j16095
3839C9483n8601m0291l0849l9135K04976K47481m2336j61564P4651O6692R4922
$$ plain form
3917 238073 236496 424070 354544 234578 282422 596333 560046 447753 480986 437268 481576
3906 481576 314483 539489 562918 472410 221551 123443 244725 200582 178774 167640 49729
3895 49729 142299 229674 386492 346366 307372 145540 199837 157446 200793 230895 75611
3884 75611 143947 166080 175588 339492 257851 252430 376184 475101 360170 339760 348551 350397
3872 350397 398878 343229 256401 160848 323874 313805 354244 451844 456886 343820 361131
3861 361131 355106 291352 276914 410574 395325 550913 588387 436576 340331 328488 70717
3850 70717 243653 361526 331266 231720 318018 211192 384975 259239 102212 155578 39483
3839 39483 -19118 -59409 -90258 -129393 75583 323064 280728 119164 193815 260507 355429
3828C55429L6695k6964j10912p1180r702k2518L0295j22132J17413O039n7313
3817A25150K5672m657j89687J32624J24122j50788k7479M3955J28827j4038p0958
3806A22743j78699J79268N4722M367j08901q2751P5894j09140q2299K00157J43012
3795B18373m1280r4511k2308n2389K06575j29285K3846N4304r426L7453p4379
3784A16973q8513K3572Q9813J19451j91880R315K36607o4916k06640j8841J78347
3773B03288q7886n4184J22288j13080Q4185P1850n0271k2774J11751j85916o9295
3762I956J23495L989j58279K15406L6824K1636j9389m6847j6050k3458q5103Q3793
3750A45973l505j3943q5808k04164P2202o7976K10019j2833J07187j56619j01013
$$ plain form
3828 355429 392124 365160 254248 183068 173366 150848 181143 59011 176424 182463 125150
3817 125150 150822 146165 -43522 89102 213224 62436 34957 78912 207739 193701 122743
3806 122743 -55956 123312 178034 182401 73500 -9251 66643 -42497 -124796 75361 218373
3795 218373 177093 82582 60274 7885 214460 85175 109021 163325 153899 191352 116973
3784 116973 28460 52032 141845 261296 69416 78731 315338 250422 43782 24941 203288
3773 203288 115402 61218 183506 70426 154611 226461 176190 153416 265167 79251 9956
3762 9956 133451 137440 -20839 194567 231391 253027 233638 186791 170741 147283 62180 145973
3750 145973 142468 128525 42717 -161447 -89245 -157221 52798 39965 147152 -9467 -110480
3739a10480j63355K03616J76875j90899j6922J5661r823p1935P6881P0537m2438
3728f2282N6700J18485j15821J07680L0063m1699K3638q0769o3906J02653j6506
3717E8236j17118K14844K17315M4108j08593j18296j82403l9731p4934J4718J52672
3706F0818L8293j24854J12554J4523Q0928N3514r1928O3459J3705k3038Q059J1495
3694B17528j9303j6386j823m8017M0886r3364j42105J49920Q0132r6509m8411
3683B2548J53162J56893m6622R639j81385J81795p929j41186k3464m4267n0916
3672B8268J08768n6039J5218J46875r3101p5736j08096k1535P1140J5278p7424
3661d6384j24396J78754q9783m6147j0139q063m5045K19746j151L6805J38410
$$ plain form
3739 -110480 -273835 -70219 106656 -84243 -101165 -85504 -95327 -167262 -90381 -19844 -62282
3728 -62282 -5582 112903 -2918 104762 134825 93126 116764 35995 -27911 74742 58236
3717 58236 -58882 155962 373277 417385 308792 190496 8093 -31638 -106572 -91854 60818
3706 60818 99111 -25743 86811 101334 182262 235776 143848 207307 221012 197974 206033 217528
3694 217528 198225 181839 180016 131999 172885 79521 -62584 87336 167468 70959 22548
3683 22548 175710 332603 285981 295620 114235 296030 288101 146915 123451 79184 28268
3672 28268 137036 80997 96215 243090 149989 74253 -33843 -55378 15762 31040 -46384
3661 -46384 -170780 7974 -81809 -127956 -138095 -146158 -191203 28543 27392 64197 202607
3650B02607Q105L339j88914J01437p0430L4802l6913k3597p1259M3258J46344
3639A48779p7587j78935J9185K78781Q8741j0791m3639o6084p2774N0690k5283
3628A11083j62045N9386K7032j6881R0305M9825l8607p0529J13033J59612k34838
3617H7376n1680J49846K32994p9430K735j05187M9631j28066j06478L9726l2962
3606E8505N7219p6654j22867M6263J55580O7265J4875j08417o3191r1121J23525
3595F0982P8444N2052L1565j34402K11409j03051q7070K7733r9801L3054J2164
3584H3079j28766n1277K76822O1506R2082j92342q4518L8095Q5005J80746p2067
3573B88365n4020K6183j64918j72916J88514p027l3225K7440q5886j2801J85407
$$ plain form
3650 202607 210712 214051 25137 126574 56144 90946 54033 30436 -40823 2435 148779
3639 148779 71192 -107743 -88558 190223 278964 268173 224534 158450 85676 136366 111083
3628 111083 -50962 8424 35456 18575 108880 158705 120098 49569 162602 322214 87376
3617 87376 35696 185542 418536 339106 341841 236654 286285 158219 51741 91467 58505
3606 58505 115724 39070 -83797 -37534 118046 185311 200186 91769 28578 -62543 60982
3595 60982 139426 191478 223043 88641 300050 196999 109929 137662 37861 70915 83079
3584 83079 -45687 -96964 179858 241364 333446 141104 56586 94681 179686 360432 288365
3573 288365 234345 260528 95610 -77306 111208 104181 70956 98396 12510 -291 185116
3562A85116m1409J92654k18307j18170o8421K23049O5779j81968K24623Q99r5180
3551A68665J29799M7311j5588j00336p2198p9900M3076r2867M4238J29281K38706
3540D40187j4748m25852J96406J66541j47042k73730p8638J54275J91361P5074
3530B83834J1464j27215l9447j23296L0357J00933r137m388J11739P4367J1034
3519C20245m2392m31439Q3315J81247j69853N7092J78441J42062r0596O1248M9017
3508C38387l227j2767J53824k17153j12042j14270o5761K34963j44621J9199j97910
3497a21378k4393K13260j01840J48056Q4258j25864L0857J39602M7241j89782
3487A00017J19535p7034l2018k3885K8545K08075j17950o8213m3853j31575n2304
$$ plain form
3562 185116 143707 336361 118054 -116 -68537 154512 220291 38323 262946 263845 168665
3551 168665 298464 345775 330187 229851 157653 77753 120829 27962 72200 201481 440187
3540 440187 425439 -413 195993 362534 215492 -58238 -136876 17399 208760 283834
3530 283834 295298 168083 128636 5340 35697 136630 127493 123105 234844 309211 320245
3519 320245 277853 -153586 -70271 110976 -58877 -1785 176656 318718 228122 289370 338387
3508 338387 335160 322393 476217 259064 147022 32752 -33009 201954 57333 76532 -121378
3497 -121378 -145771 67489 -34351 113705 197963 72099 102956 242558 289799 100017
3487 100017 219552 142518 110500 86615 115160 323235 205285 137072 93219 -38356 -90660
3476i0660m4841Q9955J68095m473n4606l8742R1682n9052R5951k20834k3074o6698
3464a57297K51908L1777J28370o5225j11456j78793r0909N1182J1512j41786L16424
3453D5707J89725N201j44650p8427k1699O2053j3487K01691K3481o1785J31864
3442C39674k04424J35238J8332N9815J8691q210J7194j0570j37219O7711q5624
3431B10608j41898j99567K66460P2614q3408J00892q154j31451j04594J51780
3421A33282J34272j20326L2113j70037J27807m2031k4572j19531O4504J59435
3411A74916j1884n7644J23132M6059j25934k02482O5606K07962o3698m3849j44703
3400c2519Q7577K7105q8597q350l0555L1507O1976R4609n1331m9050r661L6742
$$ plain form
3476 -90660 -135501 -45546 122549 118076 63470 24728 116410 57358 153309 -67525 -90599 -157297
3464 -157297 94611 126388 254758 189533 78077 -100716 -191625 -140443 -128931 -270717 45707
3453 45707 235432 240633 95983 17556 -4143 57910 44423 246114 269595 207810 339674
3442 339674 135250 270488 288820 348635 367326 359116 376310 365740 228521 296232 210608
3431 210608 68710 -130857 135603 208217 124809 225701 217547 86096 -18498 133282
3421 133282 267554 147228 179341 9304 137111 95080 70508 -49023 15481 174916
3411 174916 163032 105388 228520 274579 148645 -53837 11769 219731 156033 112184 -32519
3400 -32519 55058 82163 -6434 -14784 -45339 -13832 48144 142753 91422 42372 32711 69453
3388F9453n7514K3451P2062r1711l5187J89834K32918j37010k27893j71109K82412
3377A49706J50723k32070j2936N2047Q4663J34353r6027k83075j584J09667k129
3366E3338o2321o583Q1593o5179m7377J31681j38560K07986J65960J02161n3220
3355C69479l51690O3865J08457L184L5222k2767p8387J19680J37523o3132k01178
3344A20256L5624R492J01997m351o7269K4531M5730L15172J02868m1851k96900
3333C45299j67395L82647j18619j00501J67987P1867k68684k8545J44515R2638
3323E21209M7699K2678O061k96431m2668J56973K10870n1346p7568K5464J00199
3312F23140P6977J75631N5554J75434o3002k16347P760Q116j30630J38598K20424
$$ plain form
3388 69453 11939 35390 107452 15741 -19446 170388 403306 266296 38403 -132706 149706
3377 149706 300429 68359 55423 107470 192133 326486 230459 -52616 -54200 55467 53338
3366 53338 -8983 -15566 66027 848 -46529 85152 -53408 154578 320538 422699 369479
3355 369479 17789 81654 190111 193295 228517 205750 127363 247043 384566 321434 120256
3344 120256 155880 165372 267369 263018 195749 220280 266010 581182 684050 642199 345299
3333 345299 177904 560551 441932 341431 509418 581285 312601 284056 428571 521209
3323 521209 568908 591586 597647 301216 258548 415521 626391 575045 497477 522941 623140
3312 623140 700117 875748 931302 1106736 1043734 827387 835147 843263 712633 851231 1071655
3301A071655m3774J9491P7841J2492j84734J43021m1563O2564J98701J89682j20856
3290A384520j2144j4092J52466J36581J19585Q4162J28650J49252j07970O4887
3280B085897o1012J13449J04430K19141K44824R5612j00803J46548J40406P8969
3270C067461Q4107M3550l214J30472K2719o9724O3044j27465j05452o6227j6615
3259C022656l6927j47795k06311k64940j64575J03140J34293l0527l1293k4443
3249B353278o4798J06288J12904r6763k49862R6285J70905L0764O6107k7188N133
3238B503053p0628K28002K84398J36285J07541m2938Q7037j25864J88921J4943
3228C310750m2495j10992k01085m39597l6384k4072m2226n2306k19808n0457m1689
$$ plain form
3301 1071655 1027881 1047372 1125213 1137705 952971 1095992 1054429 1116993 1315694 1505376 1384520
3290 1384520 1372376 1358284 1510750 1647331 1766916 1851078 1979728 2128980 2021010 2085897
3280 2085897 2024885 2138334 2242764 2461905 2706729 2802341 2701538 2848086 2988492 3067461
3270 3067461 3151568 3195118 3191904 3322376 3345095 3275371 3338415 3210950 3105498 3039271 3022656
3259 3022656 2985729 2837934 2631623 2366683 2202108 2305248 2439541 2409014 2377721 2353278
3249 2353278 2288480 2394768 2507672 2410909 2161047 2257332 2428237 2459001 2525108 2497920 2503053
3238 2503053 2432425 2660427 2944825 3081110 3188651 3145713 3232750 3106886 3295807 3310750
3228 3310750 3268255 3157263 2956178 2516581 2480197 2456125 2413899 2361593 2141785 2091328 2049639
3217B049639r5883Q40J21204j95771j63848M6833L7824j30248J9566M4199r9719
3206A634636K4294R3932p5502J99745J79960j53773P2211O5092n0995l6017l38803
3195A614780l15649L7435K8390k07142o8494j64879J08289M9269j00088p4221
3185I07690m1061K344j68252j61707O6096Q5916r6320l936N3823m8457o6145J09539
3173F39530K11681p4373p4029j75837j79214K6779n7756r3159J15561m2104J37565
3162D34644J90953j800j17689j87360l0402P9551o5964K6153K94077N6199j53742
3151E24620j58123J58234n1366q5264K5133j7205j06003q4187J79336j3260P4734
3140D46649r5475J17932R0244j25859p9568Q390J3457l0153r6263j8089L095J7094
$$ plain form
3217 2049639 1953756 1954596 2075800 1880029 1716181 1763014 1800838 1670590 1690156 1734355 1634636
3206 1634636 1658930 1752862 1677360 1877105 2057065 1903292 1975503 2040595 1989600 1953583 1614780
3195 1614780 1299131 1336566 1364956 1157814 1089320 924441 1032730 1081999 981911 907690
3185 907690 866629 868973 700721 539014 605110 691026 594706 590770 644593 596136 529991 639530
3173 639530 851211 776838 702809 526972 347758 374537 316781 223622 339183 297079 434644
3162 434644 625597 623797 506108 318748 288346 367897 301933 328086 622163 678362 524620
3151 524620 366497 524731 473365 388101 413234 396029 290026 205839 385175 371915 446649
3140 446649 351174 469106 559350 433491 353923 362313 375770 345617 249354 231265 234360 251454
3128B51454K66379J265j38039M6762k1608J0942j10404j17334J35881J03806j32498
3117B96606m1466K54471J02334J5444N3490p5083j35376l6193j43107K250J61946
3106D55316j18167O4482j5016L6405R6947l19967J59822P3060L3678P775q8599
3095C85736n9633P5390N5443M9601O5418n0562q8721O2622m2695L6106K21458
3084G10163j19250N1363l0424p3568J88454Q0536k61587n8360J44451j88514J91061
3073F34325Q6640k8952J02057l8313K1278p1742p7088j60964J00371p1204J4566
3062E10974m6192k35977J30498J91795M5691J08229n972j28692j0051R8075J74725
3051H33103o6929r5788j12471p6775j8343J41827j02408j42867K10122p6992j4561
$$ plain form
3128 251454 517833 519098 381059 427821 406213 417155 306751 189417 325298 429104 296606
3117 296606 255140 509611 611945 627389 680879 605796 470420 434227 291120 293370 455316
3106 455316 337149 401631 386615 423020 519967 200000 359822 432882 466560 474335 385736
3095 385736 326103 401493 456936 506537 571955 521393 432672 495294 452599 488705 710163
3084 710163 590913 642276 611852 538284 726738 807274 545687 487327 631778 443264 634325
3073 634325 720965 692013 794070 755757 777035 705293 628205 467241 567612 496408 510974
3062 510974 464782 228805 359303 551098 596789 705018 699046 570354 560303 658378 833103
3051 833103 766174 670386 557915 481140 462797 604624 502216 359349 569471 492479 477918
3040D77918J17369j15723L1973K4442J76236J48576k32379m8990k26612L2013
3030C84823O2225J0985j2162n8673r1629p6859J26023N3620J34603L0388r395
3019E53949P300r4320j20837K72297q1545M7181p8174j04462o6194j94596R1978
3008B32577j5532P6319J58257q2960J32894n7145l30591n8309K09796K30442j22697
2997C73051j5469k06274N8261J79755j85588j5652N3550L7791o053o2992R6822
2986C07202j22614j39571K06323J3175j68356K9650P4392L7958P0832m241J2658
2975C17408q8274K5601J7735k3291l9170n1580P8505M1860m9013j18043O1422
2964A73160O6994k4539K04893J28107j76688k30731L8223J79155j01873L5995
$$ plain form
3040 477918 595287 479564 511537 535979 712215 860791 628412 579422 352810 384823
3030 384823 447048 458033 445871 387198 295569 218710 344733 398353 532956 563344 553949
3019 553949 561249 466929 346092 618389 536844 584025 505851 401389 335195 140599 232577
3008 232577 217045 293364 451621 368661 501555 444410 113819 55510 265306 495748 373051
2997 373051 357582 151308 209569 389324 203736 188084 241634 279425 273372 210380 307202
2986 307202 184588 45017 251340 264515 96159 125809 200201 238159 308991 304750 317408
2975 317408 229134 254735 272470 249179 210009 158429 236934 278794 229781 111738 173160
2964 173160 240154 215615 420508 548615 371927 141196 179419 358574 256701 292696
2954B92696O6975o2973j07203k1939j28609J26313J71j13658J19490J79902J04730
2943D55895k29944J01617k0690N085j52867K38845m0480j46842N4064L6331L8358
2932C39372r4209K710j11688o0570J27983J11190k0258J54249j01454R7362n8029
2921C86658n3302J01804p5526r5517K35146p3366j23317N3328L35970P0679j3954
2910G48603k95408j9182J91697K9740m7260l5029K03885l7819j53329J0619J34086
2899G30603J3729L0006k23601l139M8458L9331J89001l8465k94101k8015J98361
2888F62168j256J61694J01069l2039O521r0795Q4986J62328J6271k87362j3865
2877G69720P3399K18003j15226j48062J42578J97952L10808k5946k9249R5702
$$ plain form
2954 292696 359671 296698 189495 167556 38947 165260 165431 51773 171263 351165 455895
2943 455895 225951 327568 306878 311963 159096 397941 357461 210619 264683 301014 339372
2932 339372 245163 247873 136185 75615 203598 314788 294530 448779 347325 444687 386658
2921 386658 333356 435160 359634 264117 499263 425897 302580 355908 691878 762557 748603
2910 748603 453195 434013 625710 655450 608190 573161 777046 739227 585898 596517 730603
2899 730603 744332 774338 550737 547598 596056 635387 824388 785923 491822 463807 662168
2888 662168 660912 822606 923675 891636 898157 807362 892348 1054676 1070947 783585 769720
2877 769720 843119 1061122 945896 797834 940412 1138364 1449172 1423226 1393977 1489679
2867A489679Q1331L8230N0928J50761j16173L7919J09899j29809n2337o5009k86642
2856A308777p552J11630M4107k84976m9718j31854q8536l7373k5671m3179l11205
2845D84450Q7279j49234P35J746M691m1629k4606p3439L6908N4380j25854j02325
2833A53102j61631J81677N4153J60365O4213j70732J11786k03567p6998m2557
2823F9811m6337m875P0829l2376L4216p8015M8979J58663j06086m7439q8886N3231
2811C1715m1796j0435J90226j23129q436J33663j23473k46917J16766l1879K31410
2800A17715l9477O5862k7661k74375J47057q2710J5781R5011m5727L3029J67523
2789A72028j15094l1056n9575j18104R0020j18694k09873p068K26137l2183r2425
$$ plain form
2867 1489679 1571010 1609240 1660168 1810929 1694756 1732675 1842574 1712765 1660428 1595419 1308777
2856 1308777 1301225 1412855 1456962 1171986 1122268 990414 901878 864505 838834 795655 484450
2845 484450 571729 422495 423230 424976 429667 388038 363432 289993 326901 381281 255427 153102
2833 153102 -8529 173148 227301 387666 451879 281147 392933 189366 112368 69811
2823 69811 23474 18599 89428 57052 91268 13253 62232 220895 114809 67370 -21516 31715
2811 31715 -10081 -20516 169710 46581 38145 171808 48335 -198582 -81816 -113695 117715
2800 117715 78238 144100 116439 -157936 -10879 -93589 -77808 17203 -28524 4505 172028
2789 172028 56934 25878 -33697 -151801 -61781 -180475 -390348 -397416 -171279 -203462 -295887
2778b95887K41343J50024p3273l18207K41275J63677N075p1915k71577l3026J50027
2767a12464L2471j10801P5510J26652n0223m8173r4793K27602Q6555p0060j53551
2756i1275K5244j13330k40740K0851L44961J05846j15621R7973N8895J31823r1416
2745A33211j45336j73398R5148L14939l00779p9145J05990j34128O2610J19566
2735a322N8128m2452k33623J72344J30688j07803q9187L6010O2141L3415j6506
2724A833Q4705Q843R082R6469j49496j53664R1656l9704J4898J24313j94538K6376
2712g9227O3669K8966p707j29453O0557J62217j1511j03745j19373l5017R4543
2701g6081M1447j62465n121O8146j06133o3296J5822J30723J49974J45020k65931
$$ plain form
2778 -295887 -54544 95480 22207 -296000 -54725 108952 114027 42112 -229465 -262491 -112464
2767 -112464 -79993 -190794 -115284 11368 -38855 -87028 -181821 45781 132336 62276 -91275
2756 -91275 -66031 -179361 -420101 -399250 -54289 51557 -64064 33909 92804 224627 133211
2745 133211 -12125 -185523 -90375 224564 -76215 -155360 -49370 -183498 -120888 -1322
2735 -1322 56806 14354 -219269 -46925 83763 -24040 -113227 -77217 -15076 18339 1833
2724 1833 86538 95381 104463 200932 51436 -102228 -10572 -50276 -35378 88935 -105603 -79227
2712 -79227 -15558 13408 5701 -123752 -63195 99022 87511 -16234 -135607 -170624 -76081
2701 -76081 -34634 -197099 -202220 -134074 -240207 -303503 -287681 -156958 -6984 138036 -127895
2690a27895j21880Q6165j7390J30357l0548o6921J59416M5227r2719P7987j57053
2679a15254q0690j6444M3030R0938j42603q4533P3629J54006J52866l7237Q7427
2668A25135k44729j82007N0344O9698K10766N1903k67629P3080N7608p4559r9686
2657b30076J84343l1442J60395j76085j85179L9623l8661M9461P9483K30998n2817
2646C0043k372j15617l5137o6167q582J45054k8165M1325M7062L2964p6055k01336
2634b36983q4558J36576q2086J86007k880m2794K07678m3731j6983j30603k8962
2623a39319J33936m4708j71154j8039r7858J93045O5658k66368O0001j5233K97914
2612b125j39787j55930j08296l4989J36622J67105j25243r1488J88314N6708J54939
$$ plain form
2690 -127895 -249775 -163610 -181000 -50643 -81191 -148112 11304 56531 -36188 41799 -115254
2679 -115254 -195944 -212388 -169358 -78420 -221023 -305556 -231927 -77921 74945 37708 125135
2668 125135 -119594 -301601 -251257 -181559 29207 81110 -186519 -113439 -55831 -130390 -230076
2657 -230076 -45733 -77175 83220 -92865 -278044 -238421 -277082 -227621 -148138 82860 30043
2646 30043 27671 -87946 -123083 -189250 -197832 -52778 -80943 -39618 7444 40408 -35647 -236983
2634 -236983 -321541 -184965 -267051 -81044 -83924 -126718 80960 37229 20246 -110357 -139319
2623 -139319 -5383 -50091 -221245 -239284 -337142 -144097 -78439 -344807 -284806 -300039 -2125
2612 -2125 -141912 -297842 -406138 -441127 -304505 -137400 -262643 -354131 -165817 -109109 45830
2601D5830J10722j83851k75796p5447n1990J60195P1519K34544l4520k25356N1190
2590a72960L1375j01636K3060J60631j54676k0172J40884o9988N8326j63842J03874
2579a65124J7040k05950n0178K42152o621Q3628j31928l3572n2352q645J33997
2568a77553P5134N7762J10549q2327m3975j42888o6476J04696k6123p6654J46968
2557a20887j17739J45443j24820R555P058l5894o5649L8684P8580l891K04820
2546A5260k8748r0200N6751j44540o3761R6846r0559n9432K73215l0121r0131
2535a55420O7752j11195k7088J29107j14322j14725K82209n5402j36030J06630
2525a28484j00503k35178m5982K55935P7951O9553o4658q5747J20652q5763J34146
$$ plain form
2601 45830 156552 -27299 -303095 -378542 -430532 -270337 -198818 35726 1206 -224150 -172960
2590 -172960 -141585 -243221 -220161 -59530 -214206 -234378 -93494 -163482 -105156 -268998 -165124
2579 -165124 -148084 -354034 -404212 -162060 -168681 -85053 -216981 -250553 -302905 -311550 -177553
2568 -177553 -102419 -44657 65892 -16435 -60410 -203298 -269774 -165078 -191201 -267855 -120887
2557 -120887 -238626 -93183 -218003 -208448 -201390 -237284 -302933 -264249 -185669 -189560 15260
2546 15260 -13488 -103688 -46937 -191477 -255238 -158392 -248951 -308383 -35168 -65289 -155420
2535 -155420 -87668 -198863 -225951 -96844 -211166 -325891 -43682 -99084 -235114 -128484
2525 -128484 -228987 -464165 -510147 -254212 -176261 -106708 -171366 -257113 -136461 -222224 -88078
2514h8078K68896k9921p4456L9062k55824M2202k8630J21247q5282J20137O5969
2503I5322k4579k08811J08146P1379j50991J01013L2703q0484J45279k68637K8128
2492a51532J7963r9140r0941O8952K55480l49949j046J90438o4386R7182P9736
2481d7243o819l9588q612r3028J61303Q374o9504m8177J83458k43539k2058J0189
2469b15244J04776L6250p8710J56429P499m6154l1832J17023J52420m3632j86260
2458b7435n0062R1955o2614M8935m0397k8814K0705R8688N9479k42251o4748R2979
2446a03580j8876n7842N4793p5963M46M8953M95l2232J70596k899P1902l9084
2434A6709k31857P5180M2215n2408j0836j37048J33765J2862J0903j85195P1797
$$ plain form
2514 -88078 180818 150897 76441 115503 -140321 -98119 -126749 -5502 -90784 29353 95322
2503 95322 70743 -138068 -29922 41457 -109534 -8521 24182 -56302 88977 -179660 -151532
2492 -151532 -133569 -232709 -323650 -254698 782 -349167 -350213 -159775 -224161 -126979 -47243
2481 -47243 -54062 -93650 -102262 -195290 -33987 -25613 -95117 -143294 40164 -203375 -225433 -215244
2469 -215244 -110468 -74218 -152928 3501 11000 -35154 -66986 50037 202457 158825 -27435
2458 -27435 -77497 14458 -48156 779 -39618 -68432 -47727 50961 110440 -131811 -196559 -103580
2446 -103580 -122456 -180298 -125505 -201468 -201022 -152069 -151574 -183806 -13210 -16109 55793 16709
2434 16709 -215148 -139968 -97753 -150161 -160997 -298045 -164280 -151418 -140515 -325710 -253913
2423b53913J47489J03825n9033o675O2898L4036o2627J21186L9877r700n2528
2412F4835k09136k1028L34085J44649j75669P6527J36833J7365p2500R8514q6959
2401C07516o3651P1187j27272J17303k8090K42576n1958k74948o7424J62795o2848
2390B25186k44968J45638K17399P7511j95184q4907Q2066r3808j52833k3799Q7658
2379C9959J94066J57052k95520j27276J37890j82386j11309J37246j29046R6762
2369h2562J59499q1688j04430j12509J03162j94092J00168Q3286K24828J3084
2359A08746J83667O6226j31469j42850m2102Q0144r558J42533j02568p1189o4603
2348A6977J43752l9926o9218N777J5495r069l7584m1924J18137k2363k7292N4948
$$ plain form
2423 -253913 -106424 -2599 -61632 -68307 -5409 28627 -34000 87186 127063 117363 64835
2412 64835 -144301 -165329 168756 313405 137736 214263 351096 368461 295961 394475 307516
2401 307516 243865 315052 187780 305083 276993 519569 467611 192663 125239 288034 225186
2390 225186 -19782 125856 343255 420766 225582 140675 222741 128933 -23900 -47699 39959
2379 39959 234025 391077 95557 -31719 106171 -76215 -187524 -50278 -179324 -82562
2369 -82562 76937 -4751 -109181 -221690 -118528 -312620 -212452 -129166 95662 108746
2359 108746 292413 358639 227170 84320 42218 122362 112804 255337 152769 81580 16977
2348 16977 160729 120803 51585 57362 72857 63788 26204 -15720 102417 80054 52762 107710
2336A07710P4607K54172p9846j51875j39338m1177K69566o9264J17007j55068
2326A86494j08746R9459Q794L3964k29211n1087j080Q5646J2559r3560n597Q1394
2314A9029J2054J76298J08964J18463j62728q8376k6802N1758k0549j16249J9395
2303I1257L35348j15415m9003K0995j48397R0132R8894L9414J7966k23392K7396
2292A85195Q2530J1864j12988J74995J53705j81623R163L6178j32360J31333K28135
2281E86127k05466O1429O6688l0407O0804J105j79553Q5793P7184j62098j6784
2270C44822J70746O5834J08259j51087n6239J620J78483k28244j04227J08838
2260D38805K24866O6893k10675K3630J9489K95374n0596j34244J60753k0149N0944
$$ plain form
2336 107710 182317 436489 356643 204768 65430 24253 293819 224555 341562 186494
2326 186494 77748 177207 186001 219965 -9246 -60333 -61413 24233 36792 -56768 -62365 19029
2314 19029 31083 207381 316345 434808 272080 183704 156902 208660 188111 71862 91257
2303 91257 426605 311190 262187 283182 134785 224917 323811 363225 381191 157799 185195
2292 185195 267725 279589 166601 341596 495301 313678 322841 359019 226659 357992 586127
2281 586127 380661 442090 508778 478371 539175 540280 360727 446520 523704 361606 344822
2270 344822 515568 581402 689661 538574 482335 483955 662438 434194 329967 438805
2260 438805 663671 730564 519889 543519 563008 858382 807786 673542 834295 814146 865090
2249H65090O4149k6844r2864L0829L246M6882J28493r0614K1592j9155J4226K31347
2237A176377N2289R2866r2456l25564J32723M7936N488J77947j21962l582J04808
2226A246870J94112J35834m5322j04347Q4907P10j19590J38381K63251P14q6611
2215A708909R5981J83999j00340j21808J78097O3162J41741J30220J03486o2088
2205B321359J49346o5834j3303J58853M24573M7451J89688R9549o9853L7311J56100
2194C435240K11659p7662Q4648J38071K05828K46401J14082k8024K04652J36101
2184D670996L01830J34333R9061J48575M3694J24479J16182J97022L53450J64301
2174F353923M0147L26658K70066L99370L51211L15329J55322L20959K80386L13574
$$ plain form
2249 865090 929239 902395 809531 840360 843606 890488 1018981 928367 949959 930804 945030 1176377
2237 1176377 1228666 1321532 1229076 903512 1036235 1084171 1089659 1267606 1145644 1142062 1246870
2226 1246870 1440982 1576816 1531494 1427147 1512054 1512764 1393174 1531555 1794806 1795520 1708909
2215 1708909 1804890 1988889 1888549 1766741 1944838 2008000 2149741 2279961 2383447 2321359
2205 2321359 2470705 2404871 2391568 2550421 2974994 3022445 3212133 3311682 3241829 3279140 3435240
2194 3435240 3646899 3569237 3653885 3791956 3997784 4244185 4358267 4330243 4534895 4670996
2184 4670996 4972826 5107159 5206220 5354795 5398489 5522968 5639150 5836172 6189622 6353923
2174 6353923 6394070 6720728 6990794 7390164 7741375 8056704 8212026 8532985 8813371 9126945
2164I126945M46100O34333O98832O75159P43116N69132M72852M77667R10708J195071
2154A5949915J304644R69382J197730J322815J479212J571405J618379J961844
2146B7375326K152987K739684K926587L020977L464022M085632M497243M832529
2138E5094987N377543N357801N083168M188598L050768J055658j505755l878334
2130G3824434n574936o333471o265368n510937m901606m598501l694566l206900
2122C3738149k786918k285115k043131j877390j714557j340770j132300j394955
2114A9163013j366460j192661j046536p64652r37986q43746o49061n69105n41001
2105A1251805m81899n03692l42756m69189l88473k50899m00288m88870m19524
$$ plain form
2164 9126945 9573045 10207378 10906210 11581369 12324485 12893617 13366469 13844136 14754844 15949915
2154 15949915 17254559 18223941 19421671 20744486 22223698 23795103 25413482 27375326
2146 27375326 29528313 32267997 35194584 38215561 41679583 45765215 50262458 55094987
2138 55094987 60472530 65830331 70913499 75102097 78152865 79208523 77702768 73824434
2130 73824434 68249498 61916027 55650659 50139722 45238116 40639615 36945049 33738149
2122 33738149 30951231 28666116 26622985 24745595 23031038 21690268 20557968 19163013
2114 19163013 17796553 16603892 15557356 14792704 13854718 13010972 12361911 11792806 11251805
2105 11251805 10769906 10266214 9923458 9454269 9065796 8814897 8414609 7925739 7506215
2096G506215j99324k23765k45840o4116j67980k36794l46197l72292k07316k72424
2086E170167K6537o8260k48402k87708m3269k8574k04979l57564P1220j83035
2076C846133j14112p1389n7489m9743j53903m0403q6773q4822q0090K8429n2663
2065C083175j63047k45571J1394j56594L2545O6771q704j60431P703j37479m1853
2054B287909j25082r9830j62092q0625J55603p1335j44799Q2280j28812p5364
2044A637853k1170J53114l7213j26228l4396K2936j81622p1893j17405j60124
2034A063852M952j8508M0533J28552K34226k03731J97j34852j33940o522j4873
2023I59886m7030N2027j41747j22517J77816J9027j11457O2183R5523K0435j48968
$$ plain form
2096 7506215 7306891 7083126 6837286 6773170 6605190 6368396 6022199 5649907 5442591 5170167
2086 5170167 5196704 5128444 4880042 4592334 4549065 4520491 4315512 3957948 4029168 3846133
2076 3846133 3732021 3660632 3603143 3553400 3399497 3359094 3272321 3187499 3107409 3135838 3083175
2065 3083175 2920128 2674557 2685951 2529357 2561902 2628673 2619969 2459538 2467241 2329762 2287909
2054 2287909 2162827 2062997 1900905 1820280 1975883 1904548 1759749 1842029 1713217 1637853
2044 1637853 1616683 1769797 1732584 1606356 1571960 1594896 1413274 1341381 1223976 1063852
2034 1063852 1068804 1050296 1090829 1219381 1453607 1249876 1250073 1115221 981281 974759 959886
2023 959886 912856 964883 823136 700619 878435 897462 786005 848188 943711 964146 815178
2012H15178j83455n8510J06987k46207R8250J59272R5594Q6359j50247j23709
2002E99512r0805N6875M7510j74805p9589J8409K57606J34686k46953j23702J6259
1991D15003R1663j6708J6011N0421o1235l4073j989j98103J50247J92731P3751
1980F77719o1533l34360j2381J71441q0177O3914K45617L9863k73116j54819K06889
1969D89057M9279L8734j85024j46774L1174j88630L2122K41647l305j0869Q4762
1958D32173q4591J8933j41951J78243j39949R837J17814J07459j25373P3612o540
1947D39667k06851K0849J9571o2147P94J69596j55668L7909k8321k32414J00857
1936A03842L786K2475Q5379L1863K54453j11474j53032p0262o1660m6805K02176
$$ plain form
2012 815178 631723 573213 680200 433993 532243 691515 787109 873468 723221 599512
2002 599512 508707 565582 613092 438287 358698 377107 634713 769399 522446 398744 415003
1991 415003 506666 489958 505969 556390 495155 461082 459093 260990 411237 603968 677719
1980 677719 616186 281826 269445 440886 360709 424623 670240 710103 436987 282168 489057
1969 489057 538336 577070 392046 245272 276446 87816 119938 361585 358280 347411 432173
1958 432173 347582 366515 224564 402807 262858 272695 390509 497968 372595 446207 439667
1947 439667 232816 253665 273236 211089 211883 381479 225811 263720 235399 2985 103842
1936 103842 107628 130103 215482 247345 501798 390324 237292 167030 105370 58565 260741
1925B60741J93178o269n6022j14410j20422o0278Q7478l884j2119l4809J2593
1914A45777m8418j20814J12076q5674J14303p6792p1252J78107M9869R2710j16362
1903A73530j50647n3595k4823J30805M5658L4348j17303q5865J68297O7404l8379
1892A49430K4362p540P0844J10128K2523j97775P1067K47665P906k87195l37315
1881a25900J46715J64969J302L6791J20972m9856n7517j5054O2588K49282k56190
1870B78102M2444n650N3142M4750M1786O7447k27639J64086J16127N6580j34338
1859D96837J3443J14067k80724k30992J7743O8520o5391K0212N9942O2087j5762
1848B59982J42688j6312j31032q9050P1351j65770j4122L8382k23176J05033J8816
$$ plain form
1925 260741 453919 447650 391628 277218 156796 96518 183996 180112 167993 133184 145777
1914 145777 97359 -23455 88621 2947 117250 40458 -30794 147313 197182 289892 173530
1903 173530 22883 -30712 -55535 75270 120928 155276 37973 -47892 120405 187809 149430
1892 149430 173792 166252 237096 347224 369747 171972 243039 490704 498610 211415 -125900
1881 -125900 20815 185784 187086 223877 344849 294993 237476 222422 285010 534292 278102
1870 278102 320546 314896 368038 412788 454574 522021 294382 458468 574595 631175 496837
1859 496837 510280 624347 343623 112631 130374 198894 133503 153715 213657 275744 259982
1848 259982 402670 386358 255326 166276 237627 71857 57735 96117 -127059 -22026 -3210
1837c210M9598n4915k4746J25277l1299q2532J4124j26433k42770L4827K00807
1826a41272J63426j25331n7517K01905J77128q3953P2684J64057j54314l5872
1816A80941j7389q7075n3463J04011j00202r0329K01815r9739k30955K41746J9121
1805F8482k1546k78501J03582J62587j00656O7217j65125m3950J14736n0397M6031
1794i7540J51267q721j2875M9399k13298m8910j48865K72650j00156o5685p862
1783b30596R1776K63547j75869K8845N6103j57306o609J87636r4354J51137l9478
1772G4832r1168m289k63736j15171J77277K93758j6095q9611J74248O1057l3583
1761A67519o5528M7135j78406J36055j6243j33913O4255k0833j54505p0135L91664
$$ plain form
1837 -3210 46388 -8527 -33273 92004 60705 -21827 -7703 -134136 -376906 -342079 -141272
1826 -141272 22154 -103177 -160694 41211 218339 134386 207070 371127 216813 180941
1816 180941 163552 76477 23014 127025 26823 -63506 138309 38570 -192385 49361 68482
1805 68482 46936 -231565 -127983 34604 -66052 1165 -163960 -207910 -93174 -143571 -97540
1794 -97540 53727 45006 32131 81530 -131768 -180678 -329543 -56893 -157049 -222734 -230596
1783 -230596 -138820 124727 -51142 -22297 33806 -123500 -130109 57527 -36827 114310 74832
1772 74832 -16336 -20625 -284361 -399532 -222255 71503 55408 -34203 140045 201102 167519
1761 167519 101991 149126 -29280 106775 90532 -43381 20874 41 -154464 -224599 167065
1750A67065m2544k07197K6765l2526M3080o676Q4946M8096o0198j9914j11598
1739a10701J34707N1722j888j12399j41973j14373k1133J52545m8561K40596J17520
1728A46062j86731j68781J04811N9846R0400j31680k8725N6259j11793J04254
1718f6078j06924K1093j43096J95220M5798p3447N3653r7115p6363J16759J37112
1707F612O1624p2164m2869J84125j20624K8506J49749j58132j14516m7953j41275
1696b66917R8893J77096J53736k66164R717J00344m9823J14303j8915j01011q4872
1685a33613K14070k09599j65288K89912L8022k34250R9598K18166n0482K48453
1675C14989j70517j42276k14474R2845K29603k07019k2501R7489N4434j4977j15037
$$ plain form
1750 167065 124521 -82676 -55911 -88437 -45357 -52033 32913 81009 20811 897 -110701
1739 -110701 24006 75728 73840 -38559 -180532 -294905 -316038 -163493 -212054 28542 146062
1728 146062 -40669 -209450 -104639 -44793 45607 -86073 -114798 -58539 -170332 -66078
1718 -66078 -173002 -151909 -295005 -99785 -53987 -127434 -73781 -170896 -247259 -130500 6612
1707 6612 68236 -3928 -46797 137328 16704 45210 194959 36827 -77689 -125642 -266917
1696 -266917 -168024 9072 162808 -103356 -93639 6705 -43118 71185 52270 -48741 -133613
1685 -133613 80457 -129142 -294430 -4518 33504 -200746 -101148 117018 66536 314989
1675 314989 144472 2196 -212278 -119433 110170 -96849 -119350 -21861 32573 17596 -97441
1664i7441j56326J9995r1357O1016l8861J2960J14000j12443Q0835l2617Q5456
1653a54783o8812j4418K54730o042j9906L148k82731Q8904K2042J30568k2172
1642f9472j70944L1002J07906N201M8740R1341p0543N523R3143N928l5967k2272
1630A9586m7526j33414J38514p8424j1701q3845J03045Q2448k3434q9924q801
1619a33476K349j41081Q9676j8023k6158J74201J58349k02601p2431j59276J62327
1608a66144j3370K25903m9864n3798j40770L6461m3535N3831m892o7343J27622
1597i5899k132J3764l4737p3762J67882j24573j56339J42467J87077o9660j30891
1586a76803M7792k4237k39976l3849J77880J07162L842J8396j21764J24252l9401
$$ plain form
1664 -97441 -253767 -233772 -325129 -264113 -302974 -290014 -176014 -288457 -207622 -240239 -154783
1653 -154783 -223595 -238013 16717 10675 -9231 -6083 -288814 -199910 -177868 -47300 -69472
1642 -69472 -240416 -209414 -101508 -96307 -47567 43774 -26769 -21246 71897 77825 41858 19586
1630 19586 -27940 -161354 -22840 -101264 -112965 -196810 -93765 -11317 -34751 -124675 -133476
1619 -133476 -131127 -272208 -182532 -200555 -226713 -52512 105837 -96764 -169195 -328471 -166144
1608 -166144 -179514 46389 -3475 -57273 -198043 -161582 -205117 -151286 -156178 -223521 -95899
1597 -95899 -98031 -84267 -119004 -192766 -24884 -149457 -305796 -163329 23748 -45912 -176803
1586 -176803 -129011 -153248 -393224 -427073 -249193 -142031 -138189 -119793 -241557 -117305 -156706
1575a56706j59942O9742L04473p5898K8037k2860j99733J29814J44013L9218j06135
1564e977p5468R4236l0375O7077k056l55702K45740Q2165q361j04744N5825Q1893
1552D4253M3060P854J23504j03072p6130j88900m7770o646j5992J61995o1669
1541a19513K33056k6511j97843j2390N0694j38846L2990K25852R7147l332q2136
1530E9168k0492p3848m9356L5970q0278m3080K518o0132m7634N4163Q0331j01179
1518b43849J49308J75746J05782j88946j19539l338L6395J16340j7805j36995
1508a26901N1506O0485k4734j9511m2949O0121R169j87102J43169l6423m8712
1497a61882l4557J01974m4818j07554l987Q6300R6638J33530M708j17593n9128
$$ plain form
1575 -156706 -316648 -246906 57567 -18331 9706 -13154 -212887 -83073 60940 100158 -5977
1564 -5977 -81445 12791 -17584 49493 47437 -308265 -62525 19640 11279 -93465 -37640 44253
1552 44253 87313 95167 218671 115599 39469 -149431 -197201 -203847 -219839 -57844 -119513
1541 -119513 113543 87032 -110811 -123201 -72507 -211353 -178363 47489 144636 141304 59168
1530 59168 38676 -35172 -84528 -48558 -128836 -171916 -169398 -229530 -277164 -223001 -142670 -243849
1518 -243849 -94541 81205 186987 -1959 -121498 -124836 -88441 27899 10094 -126901
1508 -126901 -75395 -14910 -39644 -59155 -102104 -41983 -32814 -219916 -76747 -113170 -161882
1497 -161882 -196439 -94465 -139283 -246837 -250824 -164524 -67886 65644 70352 -47241 -106369
1486a06369K61786m614j53072O0617j49069k0532p4006J88049Q7850J010O6977
1475A58627r5711j61635k861N07o2985j00907J12582J31187J12609P8823j56439
1464A3797o4292J04208J11858J53894j29436K8565j39048O8944o7952j11041j43954
1453a74457N4197j52252J34493J11753P913j28889m7173J8060l466M4896j0306
1442a45231O2445J8444K28782K6418j51454j93004R4292j19960R3451n772L7375
1431e4214J35472K452k55918m3654O0523J4867J24440j8931j73704K35201r9053
1420g2519n2989n7153O0142M8152l944j01842n0289r9081n0435J41682Q786R1421
1408a38069p3185J27682J67339Q896N3581N9438m344N7039k43123N2797o4046
$$ plain form
1486 -106369 155417 150803 -2269 58348 -90721 -111253 -185259 2790 90640 91650 158627
1475 158627 62916 -98719 -101580 -101073 -164058 -264965 -152383 -21196 91413 170236 13797
1464 13797 -50495 53713 165571 319465 190029 218594 79546 148490 80538 -30503 -174457
1453 -174457 -120260 -272512 -138019 -26266 -18353 -147242 -194415 -176355 -179821 -134925 -145231
1442 -145231 -82786 -64342 164440 190858 39404 -153600 -59308 -179268 -85817 -91589 -54214
1431 -54214 81258 83710 -172208 -215862 -155339 -140472 -16032 -34963 -208667 26534 -72519
1420 -72519 -125508 -182661 -122519 -74367 -78311 -180153 -230442 -329523 -379958 -238276 -229490 -138069
1408 -138069 -211254 -83572 83767 92663 146244 205682 201338 258377 15254 68051 4005
1397D005K475J22693P4617l71267j03840L6700O6811J88671J1517J04487j24884
1386A1985m2892m7361m8379J61080l2843j81962m3560j4141R7720j06345m146
1375b50844O9898J74178J27853J49543k46072n1653J03l7494q595p2948l6673
1364a82704p359J33564J27718j553O024l8229k3423n86q2042j44121J37698q2349
1352a57362j89055K74918L6115O4131q8290L627O9912P5509J1113L0707P2054
1341B03379j83186K0732J44554r5024J12686j44794m1793p2099l9429N0372J05545
1330F0943j55172l4963M0958o600R4577q9089j6755j00626j78045J95911J94712
1319E851R7358m7513j53077q8523J31516j99862j6306J24990K06349N2466K3579
$$ plain form
1397 4005 6480 129173 203790 -167477 -271317 -234617 -167806 20865 32382 136869 11985
1386 11985 -30907 -78268 -126647 34433 1590 -180372 -223932 -238073 -140353 -246698 -250844
1375 -250844 -180946 -6768 121085 270628 24556 -27097 -26994 -64488 -73083 -146031 -182704
1364 -182704 -190063 -56499 71219 69666 75690 37461 14038 13452 -68590 -212711 -75013 -157362
1352 -157362 -346417 -71499 -35384 28747 -59543 -55916 13996 89505 100618 131325 203379
1341 203379 20193 40925 185479 90455 203141 58347 16554 -55545 -94974 -44602 60943
1330 60943 -94229 -129192 -88234 -94834 -257 -89346 -106101 -206727 -384772 -188861 5851
1319 5851 103209 55696 -97381 -185904 -54388 -254250 -270556 -145566 60783 113249 136828
1308A36828l6802k35002K68958P22k95693J22054J50604J7705q3322j74635P7511
$$ plain form
1308 136828 100026 -134976 133982 134704 -160989 -38935 111669 129374 46052 -128583 -51072
$$ [...]
##END NTUPLES=NMR SPECTRUM
##END=
