##TITLE=1H_CA-8949-3
 CDCl3
 8 sc, 
 18.11.2021
##JCAMPDX= 6.0         $$ Bruker NMR JCAMP-DX V2.0
##DATA TYPE= NMR SPECTRUM
##DATA CLASS= NTUPLES
##ORIGIN= UXNMR, Bruker Analytische Messtechnik GmbH
##OWNER= root
$$ XWIN-NMR		Version 3.5
$$ Thu Nov 18 11:38:26 2021 Russian Standard Time (UT+4h)  she@DPX200
##.OBSERVE FREQUENCY= 200.131346
##.OBSERVE NUCLEUS= ^1H
##.ACQUISITION MODE= SIMULTANEOUS
##.ACQUISITION SCHEME= undefined
##.AVERAGES= 8
##.DIGITISER RES= 18
##SPECTROMETER/DATA SYSTEM= spect
##.PULSE SEQUENCE= zg30
##.SOLVENT NAME= CDCl3
##.SHIFT REFERENCE= (INTERNAL, CDCl3, 0, 15.7028)
##AUDIT TRAIL= $$ (NUMBER, WHEN, WHO, WHERE, WHAT)
$$ ##TITLE= Audit trail, XWIN-NMR		Version 3.5
$$ ##JCAMPDX= 5.01
$$ ##ORIGIN= Bruker BioSpin GmbH
$$ ##OWNER= she
$$ F:/spectra/data/she/nmr/H-F/1/pdata/1/auditp.txt
$$ ##AUDIT TRAIL=  $$ (NUMBER, WHEN, WHO, WHERE, WHAT)
(   1,<2021-11-18 11:35:30.23 +0400>,<she>,<DPX200>,
      <created by zg, POWCHK disabled, PULCHK disabled
       configuration hash MD5:
       00 E9 B6 7A A2 85 ED C7 34 08 36 98 17 FE 4E 26
       data hash MD5: 16K
       F4 59 FB 74 A5 04 72 F1 CB AB 97 97 17 F6 D1 8E>)
(   2,<2021-11-18 11:35:39.68 +0400>,<she>,<DPX200>,
      <Start of raw data processing
       efp BC_mod = 2 LB = 0.24 FT_mod = 6 PKNL = 1 PHC0 = -15515.35 PHC1 = 10.20081 SI = 16K 
       data hash MD5: 16K
       09 78 0A 46 13 86 0C A9 93 C9 87 9D FE 6E 20 B7>)
(   3,<2021-11-18 11:35:57.85 +0400>,<she>,<DPX200>,
      <pk PHC0 = 2.274482 PHC1 = 1.4 
       data hash MD5: 16K
       FF C9 1A F5 FB 5C 5C 7C F8 5E 27 44 1E 60 EC A1>)
(   4,<2021-11-18 11:36:01.62 +0400>,<she>,<DPX200>,
      <abs ABSG = 5 
       data hash MD5: 16K
       C2 08 1D 3D 91 FC BA 86 0E 6A 97 8E 34 DF 4A B8>)
$$ ##END=
$$ 
$$ hash MD5
$$ 7F 23 D2 25 15 BA 96 A1 BB 02 D0 F0 2E EA 7C 1D
##$RELAX= 
##$RELAX= 
##$RELAX= 
##$RELAX= 
##$RELAX= 
##$RELAX= 
$$ Bruker specific parameters
$$ --------------------------
##$DU= <F:/spectra>
##$EXPNO= 1
##$NAME= <H-F>
##$PROCNO= 1
##$TYPE= <nmr>
##$USER= <she>
##$AMP= (0..31)
100 100 100 100 100 100 100 100 100 100 100 100 100 100 100 100 100 100 
100 100 100 100 100 100 100 100 100 100 100 100 100 100 
##$AQSEQ= 0
##$AQ_mod= 1
##$AUNM= <au_zg>
##$AUTOPOS= <>
##$BF1= 200.13
##$BF2= 200.13
##$BF3= 200.13
##$BF4= 200.13
##$BF5= 200.13
##$BF6= 200.13
##$BF7= 200.13
##$BF8= 200.13
##$BYTORDA= 1
##$CFDGTYP= 0
##$CFRGTYP= 5
##$CHEMSTR= <none>
##$CNST= (0..31)
1 1 145 1 1 1 1 1 1 1 1 1 1 1 1 1 1 1 1 1 1 1 1 1 1 1 1 1 1 1 1 1 
##$CPDPRG= <>
##$CPDPRG1= <>
##$CPDPRG2= <>
##$CPDPRG3= <>
##$CPDPRG4= <mlev>
##$CPDPRG5= <mlev>
##$CPDPRG6= <mlev>
##$CPDPRG7= <mlev>
##$CPDPRG8= <mlev>
##$CPDPRGB= <>
##$CPDPRGT= <>
##$D= (0..31)
0 1.2 0 0 0 0 0 0 0 0.06 0 0.03 0 0 0 0 0.0002 0 0 0 0 0 0 0 0 0 0 0 0 
0 0 0 
##$DATE= 1637220929
##$DBL= (0..7)
120 120 120 120 120 120 120 120 
##$DBP= (0..7)
150 150 150 150 150 150 150 150 
##$DBP07= 0
##$DBPNAM0= <>
##$DBPNAM1= <>
##$DBPNAM2= <>
##$DBPNAM3= <>
##$DBPNAM4= <>
$$ [...]
##$SUBNAM2= <"">
##$SUBNAM3= <"">
##$SUBNAM4= <"">
##$SUBNAM5= <"">
##$SUBNAM6= <"">
##$SUBNAM7= <"">
##$SUBNAM8= <"">
##$SUBNAM9= <"">
##$SW= 18.0517287032376
##$SWIBOX= (0..15)
0 0 2 0 0 0 0 0 0 0 0 0 0 0 0 0 
##$SW_h= 3612.71676300578
##$TD= 16384
##$TD0= 1
##$TE= 0
##$TE2= 300
##$TE3= 300
##$TEG= 300
##$TL= (0..7)
0 120 120 120 120 120 120 120 
##$TP= (0..7)
150 150 150 150 150 150 150 150 
##$TP07= 0
##$TPNAME0= <>
##$TPNAME1= <>
##$TPNAME2= <>
##$TPNAME3= <>
##$TPNAME4= <>
##$TPNAME5= <>
##$TPNAME6= <>
##$TPNAME7= <>
##$TPOAL= (0..7)
0.5 0.5 0.5 0.5 0.5 0.5 0.5 0.5 
##$TPOFFS= (0..7)
0 0 0 0 0 0 0 0 
##$TUNHIN= 0
##$TUNHOUT= 0
##$TUNXOUT= 0
##$USERA1= <user>
##$USERA2= <user>
##$USERA3= <user>
##$USERA4= <user>
##$USERA5= <user>
##$V9= 5
##$VALIST= <valist>
##$VCLIST= <CCCCCCCCCCCCCCC>
##$VD= 0
##$VDLIST= <DDDDDDDDDDDDDDD>
##$VPLIST= <PPPPPPPPPPPPPPP>
##$VTLIST= <TTTTTTTTTTTTTTT>
##$WBST= 1024
##$WBSW= 4
##$XGAIN= (0..3)
0 0 0 0 
##$XL= 0
##$YL= 0
##$YMAX_a= 119539
##$YMIN_a= -138596
##$ZGOPTNS= <>
##$ZL1= 120
##$ZL2= 120
##$ZL3= 120
##$ZL4= 120
##$ABSF1= 15.72706
##$ABSF2= -2.324789
##$ABSG= 5
##$ABSL= 3
##$ALPHA= 0
##$AQORDER= 0
##$ASSFAC= 0
##$ASSFACI= 0
##$ASSFACX= 0
##$ASSWID= 0
##$AUNMP= <proc_1d>
##$AZFE= 0.1
##$AZFW= 0.1
##$BCFW= 0
##$BC_mod= 2
##$BYTORDP= 0
##$COROFFS= 0
##$CY= -3
##$DATMOD= 1
##$DC= 0
##$DFILT= <>
##$DTYPP= 0
##$F1P= 0
##$F2P= 0
##$FCOR= 1
##$FTSIZE= 16384
##$FT_mod= 6
##$GAMMA= 0
##$GB= 0
##$INTBC= 1
##$INTSCL= 0
##$ISEN= 128
##$LB= 0.24
##$LEV0= 0
##$LPBIN= 0
##$MAXI= 10000
##$MC2= 0
##$MEAN= 0
##$ME_mod= 0
##$MI= 1.114404
##$NCOEF= 0
##$NC_proc= -7
##$NLEV= 6
##$NOISF1= 3.799351
##$NOISF2= 2.8
##$NSP= 0
##$NTH_PI= 0
##$NZP= 0
##$OFFSET= 15.70282
##$PC= 1
##$PHC0= -15513.08
##$PHC1= 11.60081
##$PH_mod= 1
##$PKNL= yes
##$PPARMOD= 0
##$PSCAL= 0
##$PSIGN= 0
##$REVERSE= no
##$SF= 200.13000975344
##$SI= 16384
##$SIGF1= 3
##$SIGF2= 2
##$SINO= 5.538805
##$SIOLD= 16384
##$SREGLST= <1H.CDCl3>
##$SSB= 0
##$STSI= 16384
##$STSR= 0
##$SW_p= 3612.71676300578
##$SYMM= 0
##$S_DEV= 0
##$TDeff= 16384
##$TDoff= 0
##$TI= <>
##$TILT= no
##$TM1= 0
##$TM2= 0
##$TOPLEV= 0
##$USERP1= <user>
##$USERP2= <user>
##$USERP3= <user>
##$USERP4= <user>
##$USERP5= <user>
##$WDW= 1
##$XDIM= 16384
##$YMAX_p= 291501760
##$YMIN_p= -535909
$$ End of Bruker specific parameters
$$ ---------------------------------
##NTUPLES= NMR SPECTRUM
##VAR_NAME=  FREQUENCY,     SPECTRUM/REAL,   SPECTRUM/IMAG
##SYMBOL=    X,             R,               I
##VAR_TYPE=  INDEPENDENT,   DEPENDENT,       DEPENDENT
##VAR_FORM=  AFFN,          ASDF,            ASDF
##VAR_DIM=   16384,         16384,           16384
##UNITS=     HZ,            ARBITRARY UNITS, ARBITRARY UNITS
##FACTOR=    0.220516191357247, 1,           1
##FIRST=     3142.60548457741, 0,            0
##LAST=      -470.111278428371, 0,           0
##MIN=       -470.111278428371, -535909,     0
##MAX=       3142.60548457741, 291501760,    0
$$ Real data points
##PAGE= N=1
##DATA TABLE= (X++(R..R)), XYDATA
$$ [...]
7544b04613O9272j78038o526J34716K8094L8210k5631K59430k35968j18566J20717
7533a18903N0258j85527J05129r8237l0983J9129R0386k4695L09484K6123j22781
7522A9383j01125J7307M1530m4510j8346j26045j02943p9157K33706J56533J57539
7511A53872l5368j2474M8409K7361o0437m3048j35945n3456M2539q3293n432J41732
7499a5540P7000n3843m2327O1151Q2632N9111k28613o6395K7254J05088J02699
7488A08217m8290M4444P282k78387J25743L8918j56277M2631j7921k5883j00045
7477b59568N1111J0217J10469j6089j5350J32422p3965j49105J38594L4842J27311
7466I0889p0870o5883j19558K21019j25872o5450J86682j57149R0498O5871j06316
$$ plain form
7544 -204613 -135341 -313379 -319905 -185189 -157095 -118885 -144516 114914 -121054 -239620 -118903
7533 -118903 -68645 -254172 -149043 -247280 -278263 -259134 -168748 -193443 116041 142164 19383
7522 19383 -81742 -64435 -22905 -67415 -85761 -211806 -314749 -393906 -160200 -3667 153872
7511 153872 118504 106030 154439 181800 121363 78315 -57630 -111086 -68547 -151840 -157272 -15540
7499 -15540 61460 7617 -34710 26441 109073 168184 -60429 -126824 -99570 5518 108217
7488 108217 59927 104371 111653 -166734 -40991 -2073 -158350 -115719 -133640 -159523 -259568
7477 -259568 -208457 -198240 -87771 -103860 -119210 13212 -60753 -209858 -71264 -36422 90889
7466 90889 20019 -45864 -165422 55597 -70275 -135725 50957 -106192 -15694 50177 -56139
7455e6139J2056l80259R546L22677m9494k11646N6242J48781n7835R4446R978
7444a01647j13380K2323J87028J63710J33098k50129k06736k860K12133j04037
7434f0497l0802M9321j26831n712O3578n380L8171j18351J43884l9584r36j50130
7422b43269R0013R9127J20338O4228J61393j61526k84017N9290P8938j46232j21015
7411b82732n595O2686l0875R6714j9910Q8231k1935n4920k847P77P2122L080J23190
7398B7986j06796j89071P2732K02880j28708k1605L4162N3064o5635M2172K2456
7387e6363J34073r3741k16215K08400j95241j34819K46985L4312P9484l7305j557
7376c1987J34479r3564k61762J94980q5989J10967J04140o938n8532N0436R1695
$$ plain form
7455 -56139 -44083 -424342 -414796 -92119 -141613 -353259 -297017 -148236 -206071 -111625 -101647
7444 -101647 -215027 -192704 -5676 158034 291132 41003 -165733 -168593 43540 -60497
7434 -60497 -91299 -41978 -168809 -174521 -110943 -116323 -78152 -196503 -52619 -92203 -93139 -243269
7422 -243269 -153256 -54129 66209 130437 291830 130304 -153713 -94423 -15485 -161717 -282732
7411 -282732 -288327 -225641 -256516 -159802 -179712 -91481 -113416 -168336 -171183 -170406 -98284 -95204 27986
7398 27986 -78810 -267881 -195149 7731 -120977 -142582 -108420 -55356 -120991 -78819 -56363
7387 -56363 77710 -16031 -232246 -23846 -219087 -353906 -106921 -72609 6875 -30430 -31987
7376 -31987 102492 8928 -252834 -57854 -143843 -32876 71264 64326 5794 56230 147925
7365A47925K6474j92908r6412j78587K02381J25530L0392o0233j43739Q7954J11549
7354F0326j04005j54286J07355j35708j0764K36717n981j53513M5053K670M1581
7343g0555j19343J11558j7312J87190q1982r7393K23477n9600j51052P2566j2850
7332a5296k7023o5273j34035o3239M4014J24596M2921J3858Q2002R7498k41916
7321a41893Q8639L5194j45589p0220r0952r3573K22900J64561L5288k6692j39050
7310a61387l3705J92111j79783j30624K59985K7627J28864p9476p4343j16734
7300a67465J20854J11920o9693J1333m6342p6377K8719p522L2010J21057j79960
7289a21466K2507K5092J12227j6068O4571O5115k73754N942j09648J05606j62832
$$ plain form
7365 147925 174399 -18509 -114921 -293508 -91127 34403 64795 4562 -139177 -51223 60326
7354 60326 -43679 -197965 -90610 -226318 -237082 -365 -6346 -159859 -114806 -112136 -70555
7343 -70555 -189898 -78340 -95652 91538 9556 -87837 135640 76040 -75012 -2446 -15296
7332 -15296 -42319 -107592 -241627 -304866 -260852 -136256 -93335 -79477 2525 100023 -141893
7321 -141893 -53254 -18060 -163649 -233869 -324821 -418394 -195494 -30933 4355 -22337 -161387
7310 -161387 -195092 -2981 -182764 -313388 -53403 -25776 103088 23612 -50731 -167465
7300 -167465 -46611 65309 -4384 6949 -39393 -115770 -87051 -94573 -62563 58494 -121466
7289 -121466 -98959 -73867 38360 22292 86863 151978 -121776 -115834 -225482 -119876 -282708
7278b82708l0224m8071J96763J705n7141M6018j10167J42814j5342J07972j83442
7267b31823N9008J60761L1566k16578R1295J18729n5658N9608O6544q6888J7122
7256A3686j14371j65530N6675l0135m3646L8464J63408M7396k9233R4360O5687
7245I6761j14588l1331j6246M2613J7582j22971p9883J41730k8860o7128J27046
7234c5275k8822j05483N3712Q979p3618o7504k7014Q7154J72375k3857j829j34269
7222a75451J9366j8034k8681K8626k8434M0368J07420K27484j67660j99528j35986
7211c30510p0993J73656J07625P6790L8071l9929j95521j34905K09921R2176p9741
7200a53360J7207m0959k73920l4756K28988J42169k13157J41662J80257k71845
$$ plain form
7278 -282708 -312932 -361003 -164240 -162535 -219676 -173658 -283825 -141011 -156353 -48381 -231823
7267 -231823 -172815 -12054 19512 -197066 -105771 12958 -42700 16908 83452 -3436 13686
7256 13686 -100685 -266215 -209540 -239675 -283321 -244857 -81449 -34053 -63286 31074 96761
7245 96761 -17827 -49158 -65404 -22791 -5209 -128180 -208063 -66333 -95193 -162321 -35275
7234 -35275 -64097 -169580 -115868 -106889 -180507 -248011 -275025 -187871 -15496 -39353 -41182 -175451
7222 -175451 -156085 -174119 -202800 -174174 -202608 -162240 -54820 172664 5004 -194524 -330510
7211 -330510 -401503 -227847 -120222 -43432 -5361 -45290 -240811 -375716 -165795 -73619 -153360
7200 -153360 -136153 -177112 -451032 -485788 -256800 -114631 -327788 -186126 -5869 -277714
7190b77714l2972o7773K21747j1196j8668k3422n5646P8754K4562p8136l7473
7179b77937K6230J38342J90986j13634p5032m1913k1951J59694Q2690m0944M3312
7168F9843j56388j44240O1735m3597o1751K91720o5039j08940J04318j1222r8453
7157a62014Q3472L01274j58742j0911r171k3508N4957j64818q9775P3421k3022
7146a28837P0531q9401j39904J43902k2051J6435K1272j05816l1129J93890j7728
7135h8836P4055o8577o8147r0678q4572L68190K4741j41871j68865K7847R3931
7124a22782j16896J91221j14194j81659q5090J60559J95285P3963K25213M9846
7114B75466q4672n8653j06379O5839j33048m127k18748k9902K61017j97715j3455
$$ plain form
7190 -277714 -310686 -378459 -156712 -167908 -186576 -209998 -265644 -186890 -162328 -240464 -277937
7179 -277937 -251707 -113365 77621 -36013 -111045 -152958 -174909 -15215 67475 26531 69843
7168 69843 -86545 -230785 -169050 -212647 -274398 17322 -47717 -156657 -52339 -63561 -162014
7157 -162014 -78542 222732 63990 53079 43908 20400 75357 -89461 -179236 -105815 -128837
7146 -128837 -58306 -147707 -287611 -143709 -165760 -149325 -128053 -233869 -264998 -71108 -88836
7135 -88836 -14781 -83358 -151505 -242183 -326755 41435 66176 -75695 -244560 -216713 -122782
7124 -122782 -239678 -48457 -162651 -344310 -429400 -268841 -73556 407 225620 275466
7114 275466 190794 132141 25762 91601 -41447 -45574 -264322 -294224 -33207 -230922 -244377
7103b44377r3944J89518r5550k7177J06604M9808J7862m0673N4588n5834K9222
7092a09953n1558Q0179O7300J69045j07157r6557k6405M8909j58803N8744J82305
7081E6049r3194J0448Q4305j20775P5626k3718n0869J33991J29396o0651j26398
7070A4210p988m0876j51762q9598K13473J46595J51118j97427k8039J4657l9093
7059a4730j67489K14738L8252j51960j69784J09331J40435j44483p0637p1706
7049b88033K87139J43416P87l33807m7116J51068o7513p373j41439K21113m3902
7038a25660P649L4050l5990j38861k3034J62852K5628k4758k9894J77812N3419
7027H3213m9944p4578n0400j11974N5715R7634l6931O5084o8206J41443J970p4606
$$ plain form
7103 -244377 -338321 -148803 -244353 -271530 -164926 -115118 -97256 -137929 -83341 -139175 -109953
7092 -109953 -161511 -81332 -14032 155013 47856 -48701 -75106 -26197 -185000 -126256 56049
7081 56049 -37145 -26697 57608 -63167 12459 -11259 -62128 71863 201259 140608 14210
7070 14210 6222 -34654 -186416 -276014 -62541 84054 235172 37745 9706 24363 -14730
7059 -14730 -182219 32519 70771 -81189 -250973 -141642 -1207 -145690 -216327 -288033
7049 -288033 -894 142522 143309 -190498 -237614 -86546 -154059 -161432 -302871 -81758 -125660
7038 -125660 -118011 -83961 -119951 -258812 -281846 -118994 -93366 -118124 -148018 29794 83213
7027 83213 33269 -41309 -91709 -203683 -147968 -50334 -87265 -22181 -90387 51056 53026 -21580
7015b1580k46381M2855J62316N7370R8318j39550m2820Q781k4135j33219m5975
7004b84020J3533K74557j49816P6502J20652p2031l3732q3681o9715J51722r595
6993f5624k36202J31761J0169O6032Q9470j9126M6341O1554k41M6293j50834k01363
6981b21770P9735P7932J35388q8759j10071L6867M414Q8853O4936O892j51640
6970g7223m3085j13562m7686J52511k6426o1083M8774P7396M8629p3626j1294
6959a26675q474O7952Q9422J82922j86347q6483j6981j10727J77560J9605n2880
6948e1106q8969k7790Q9787n3693Q6123J23821j63785M5063n6280k8174j28021
6937b53024j7036j63279J63672J70528k8256J805l1402m5320Q7463J17034q6997
$$ plain form
7015 -21580 -267961 -225106 -62790 -5420 92898 -46652 -89472 -80691 -104826 -238045 -284020
7004 -284020 -270487 4070 -145746 -69244 51408 -20623 -54355 -138036 -207751 -56029 -65624
6993 -65624 -301826 -170065 -159896 -93864 -4394 -23520 22821 84375 84134 130427 -20407 -221770
6981 -221770 -142035 -64103 71285 -17474 -127545 -90678 -86264 2589 67525 74417 -77223
6970 -77223 -120308 -233870 -281556 -129045 -155471 -216554 -167780 -90384 -41755 -115381 -126675
6959 -126675 -135149 -67197 22225 205147 18800 -67683 -84664 -195391 -17831 1774 -51106
6948 -51106 -140075 -167865 -78078 -131771 -45648 78173 -85612 -40549 -96829 -125003 -253024
6937 -253024 -270060 -433339 -269667 -99139 -127395 -125590 -156992 -202312 -114849 2185 -84812
6926h4812O2413p3148j81727Q2697J65856M9970j42453k62644K24522L2107j44620
6915b71839p0780n574l737J45814K5571J40319m0065J1251K57499j15492m640
6904F8327j29476n7202J84180P7277m3940q3244l3382k94378j8042L3673l7763
6893c33970J36194K68782J233j98085O7397o9220K8324l8565j1473j01760K54258
6882C115j9719m2499O4332j7928j6332j25075L1323q7175J06790j06254J37581
6871g1841K7579o2780l3009P5531J51646q0391J19174j32820o5135J12221l4812
6860E363o6649p9518M9193N6634j31525M1022K3249O4034J03225p341j60167j02368
6848b04848Q4142K67791j53114n5480N6516j3113j93880P1901N2050k3719j50030
$$ plain form
6926 -84812 -22399 -95547 -277274 -194577 -28721 21249 -121204 -383848 -159326 -127219 -271839
6915 -271839 -342619 -348193 -351930 -206116 -180545 -40226 -80291 -69040 188459 72967 68327
6904 68327 -61149 -118351 65829 143106 99166 15922 -17460 -311838 -329880 -296207 -333970
6893 -333970 -197776 71006 72239 -125846 -58449 -127669 -99345 -137910 -149383 -251143 3115
6882 3115 -16604 -59103 5229 -12699 -29031 -154106 -122783 -209958 -103168 -209422 -71841
6871 -71841 -44262 -107042 -140051 -64520 87126 6735 125909 -6911 -72046 40175 5363
6860 5363 -61286 -140804 -91611 -34977 -166502 -125480 -102231 -38197 65028 57687 -102480 -204848
6848 -204848 -120706 147085 -6029 -61509 -4993 -18106 -211986 -140085 -88035 -111754 -261784
6837b61784j052o0166m3203Q2375P1004L8739O5300J72500m0348J1688l7052L3703
6825C1704j36042J04398n4861k1894P1687r5381J09357k775j09127J25911M5295
6814F8272j21914r1984k40404J26158K13476n4912J22941o1616M2943l275p8890
6803g9205j06891M1892P1135K2829P9012Q5281n4272M8017p8553K7845k51077
6792a93987j49357J84695K54413n7442o2722j56948r4306N1406O1070m6427R353
6781b00252K27788L1354k79616Q1366k3705o3539K75723j37544l730J67243k3413
6770E1675Q2753l5868Q534j63102K8118J41886j64340J5437k45647m3703J65095
6759a59162K6120o0379k255J18928j22022J4402J73472J91802j45292j04582K17872
$$ plain form
6837 -261784 -262836 -323002 -366205 -283830 -212826 -174087 -108787 63713 23365 35053 -1999 31704
6825 31704 -104338 60 -54801 -76695 -5008 -100389 8968 6193 -102934 22977 68272
6814 68272 -53642 -145626 -386030 -259872 -46396 -101308 21633 -39983 2960 -315 -79205
6803 -79205 -186096 -144204 -73069 -50240 28772 114053 59781 107798 29245 57090 -193987
6792 -193987 -343344 -158649 95764 38322 -24400 -181348 -275654 -224248 -163178 -209605 -200252
6781 -200252 27536 58890 -220726 -139360 -163065 -226604 49119 -88425 -92155 75088 51675
6770 51675 134428 98560 107094 -56008 -27890 113996 -50344 -34907 -280554 -324257 -159162
6759 -159162 -133042 -193421 -195676 -76748 -198770 -184368 -10896 180906 35614 -68968 148904
6748A48904q7314j44509j09464o6154n6547J83106p8780J47319L7033m7957q5123
6737a59486O9911J33720J5975j4472j41573k48747J42555J0523m2759J16600J45784
6726B8031J46310j34726L7562j85589p2544j92876J32469K18557p8192O1372K0198
6715a9428l2236q8632Q4763o5743j1378j0029J35101k48222J5999J49524m5473
6704a35754M7867R8228J5209j47173K97421j27928p1506n6310J2108r3668Q626
6693a52880M9596j74552K12785o2352q7970P0414n3792N3735J02448K5105n9175
6682g6638o2871k4637j36774K48169L8581k34018P946O3925j42625J35930o8429
6671b51441J28528J9862L5422m7731q4058k8875o2364R4674Q2311P6424P4917
$$ plain form
6748 148904 61590 -82919 -192383 -258537 -315084 -131978 -210758 -63439 -26406 -74363 -159486
6737 -159486 -89575 44145 60120 45648 -95925 -344672 -202117 -191594 -234353 -117753 28031
6726 28031 174341 39615 77177 -108412 -180956 -373832 -241363 -22806 -100998 -39626 -19428
6715 -19428 -51664 -140296 -55533 -121276 -132654 -142683 -7582 -255804 -239805 -90281 -135754
6704 -135754 -87887 10341 25550 -121623 175798 47870 -23636 -79946 -67838 -161506 -152880
6693 -152880 -103284 -277836 -65051 -127403 -215373 -144959 -198751 -145016 -42568 -17463 -76638
6682 -76638 -139509 -164146 -300920 -52751 -14170 -248188 -240242 -176317 -318942 -183012 -251441
6671 -251441 -122913 -103051 -67629 -115360 -199418 -228293 -290657 -195983 -113672 -37248 37669
6660C7669n9048j78797L4658M4749j03400o1760K80255k49144P6613O7644k9594
6649a40155j06361R6102K35688j0996j31965R222M7787k78535Q8922P7644O2874
6638d9773J60394j16001n2769J9739K7576j2910L681o875j73719j15876O1699
6627b54834L11562P0509k12353J3896J27884k21580P4864P1623p0095J43152k15949
6616a61321J06693R7417K4127Q996M5250m676l2373j58669o1129J6075J18499
6605a111R7679k0942J60902j63633p8975p8125j00558J40028j34074n0605K25332
6594d082J62026M6405J2810k64045l9925R2267j20881j9162J17274j601j57581
6583a76495J18729R1178j99616q4055J42798m208j63657K8694J25437J33359M8592
$$ plain form
6660 37669 -21379 -200176 -165518 -120769 -224169 -285929 -5674 -254818 -178205 -110561 -140155
6649 -140155 -246516 -150414 85274 74278 -57687 -48465 -678 -279213 -190291 -112647 -49773
6638 -49773 110621 -5380 -58149 -38410 -10834 -23744 -20063 -26938 -200657 -316533 -254834
6627 -254834 56728 127237 -85116 -71220 56664 -164916 -90052 -18429 -88524 54628 -161321
6616 -161321 -54628 42789 66916 75912 121162 116486 84113 -74556 -135685 -119610 -1111
6605 -1111 96568 75626 236528 72895 -6080 -84205 -184763 -44735 -178809 -229414 -4082
6594 -4082 157944 204349 217159 -46886 -86811 5456 -115425 -134587 -17313 -18914 -176495
6583 -176495 -57766 33412 -166204 -250259 -107461 -111669 -275326 -246632 -121195 12164 60756
6572F0756o2336k61369L3121J88812k45563r0824J87713n0499J7529R2991Q1513
6561d8156j7664j353k834m6818J86036k1545K4876J43432l46517j52657l6380
6550c19580J15966K38015K6095j34872n9528k8929J23563N6820m2329J4855J4910
6539D986O8885j95217J05146j9676R9387j14296N4729O7147k5115m4755K23102
6528B24323m3009j95442M9907k12103j8325O3075p1528J10582J2830J66137K967
6517H9414o6929m7647M2534R5095j67838L2705k1760k16414P4695J75535j46934
6506a57544Q9403K1474j79898K0965Q3850r7749J33586n0474j81034j84710J89499
6495c12632N5636L9668J68870j63211M8447J48921M7220j8535J2764k09249K8998
$$ plain form
6572 60756 -1580 -262949 -229828 -41016 -286579 -377403 -189690 -240189 -222660 -129669 -48156
6561 -48156 -65820 -67173 -70007 -116825 69211 47666 72542 215974 -130543 -283200 -319580
6550 -319580 -203614 34401 60496 -74376 -133904 -162833 -39270 17550 -24779 -9924 4986
6539 4986 73871 -121346 -16200 -35876 63511 -50785 3944 71091 45976 1221 224323
6528 224323 181314 -14128 35779 -176324 -194649 -131574 -203102 -92520 -79690 86447 89414
6517 89414 22485 -25162 17372 112467 -55371 -22666 -44426 -260840 -186145 -10610 -157544
6506 -157544 -68141 -46667 -226565 -205600 -121750 -219499 -85913 -136387 -317421 -502131 -312632
6495 -312632 -256996 -217328 -48458 -211669 -163222 -14301 32919 14384 27148 -182101 -153103
6484a53103J10281N9917K7947J77594J1765j91968j28025k4618j13295J43121
6474h0384K12518l8254J2239m4834k04788k7661q9134P7179Q5264k9048Q2074
6463d4829j9797N5869J61191n9771J6861q3812j6002Q7314O2027k5034p3021N034
6451F6030M6627m5771k18349N6258J61732M0232l1819j83297K4699q931j05136
6440a97725J14682j31373J10481P4268K48662N0427j22295j35054J16788j36574
6430g713p736n5034J16286j80081m7760J07335l7571j46159J10727K15061r6047
6419b8692j27704R7726K79797j51257q7679R94j65110J03156M5841k1174q0182
6408a34284J09628R1775j72016p6285R4099j01857N0059j2872m0490L15603o2753
$$ plain form
6484 -153103 -42822 17095 45042 222636 234401 42433 -85592 -110210 -223505 -80384
6474 -80384 132134 93880 106119 61285 -143503 -171164 -260298 -183119 -97855 -126903 -44829
6463 -44829 -64626 -8757 152434 92663 109524 25712 9710 97024 159051 134017 60996 66030
6451 66030 112657 66886 -151463 -95205 66527 106759 74940 -108357 -83658 -92589 -197725
6440 -197725 -83043 -214416 -103935 -29667 218995 269422 147127 12073 128861 -7713
6430 -7713 -15449 -70483 45803 -134278 -182038 -74703 -112274 -258433 -147706 67355 -28692
6419 -28692 -156396 -58670 221127 69870 -17809 -16815 -181925 -78769 -32928 -54102 -134284
6408 -134284 -24656 67119 -104897 -181182 -87083 -188940 -138881 -151753 -192243 123360 60607
6397F0607J9404p9165O4093J86297j14186k09523N0591N6577j6320j06983R0903
6386B295O167J61556j02553j63025l0781J30402K4244l2370k7461J28958q8345
6375I087j10617R2454l1982R2530k1338k19o5727Q8M9024q6670j52047o6591J91972
6362a00036p7894o0410m2570J76967R4552N2411J09487j61980N8283P8044j30408
6351c554j04162Q4414m3978m0989J52910j4825O752P3117R0722j07328j53085
6340f0006n4851l4793J29293r2338l00989J63345L26590J22221k03640k78851
6330b84019K51503n2398n772K13194J122N3739l7956l09748j21483P4621P7862
6319a39335j36896J01820J03433K3239L0133J56843p979p1507J86101m5661K0010
$$ plain form
6397 60607 80011 846 64939 251236 137050 -72473 -21882 34695 18375 -88608 2295
6386 2295 8462 170018 67465 -95560 -126341 4061 28305 -4065 -31526 97432 9087
6375 9087 -101530 -9076 -41058 51472 30134 29915 -35812 -35724 13300 -73370 -225417 -292008 -100036
6362 -100036 -177930 -238340 -280910 -103943 -9391 43020 152507 -9473 48810 126854 -3554
6351 -3554 -107716 -23302 -67280 -108269 44641 29816 36568 109685 200407 93079 -60006
6340 -60006 -114857 -149650 -20357 -112695 -413684 -250339 76251 198472 -5168 -284019
6330 -284019 -32516 -84914 -90686 122508 123630 177369 139413 -170335 -291818 -217197 -139335
6319 -139335 -276231 -174411 -70978 -47739 -17606 139237 131258 59751 245852 200191 220201
6308B20201q1618q5037p5489o4946K86315k90898k34914L66393N3810j92379J00250
6297A688p738R2398l8236k66366L14644o1966j78525Q2428k43154J66733M5114
6286i2980q8058k4397J47449Q0078j36759r8468k7371K02724o0182q8473j4548
6275b00985K52589j8567j92547K2439M0961j04103k25031J57512L13493j431J8811
6264F3141j72706r4907O6759K1917l7109N6019r9451n007J72044K28231n5194
6253A43737j11645k1632R6542J77470j30268k713j4907j34638R5332j20183q8636
6242a11541J72935J16854m511l4935p6274K11582K02n30738J30652J77561J29908
6231A81695k7708j99111j70861R5943q1452r6547J35507J05971J48519J01560
$$ plain form
6308 220201 138583 53546 -21943 -86889 199426 -91472 -326386 40007 93817 -98562 1688
6297 1688 -6050 86348 48112 -218254 96390 34424 -144101 -61673 -304827 -138094 -92980
6286 -92980 -181038 -205435 -57986 22092 -114667 -213135 -240506 -37782 -97964 -186437 -200985
6275 -200985 51604 33037 -159510 -137071 -96110 -200213 -425244 -267732 45761 44330 63141
6264 63141 -109565 -204472 -137713 -115796 -152905 -96886 -196337 -201344 -29300 198931 143737
6253 143737 32092 10460 107002 284472 154204 151491 136584 1946 97278 -22905 -111541
6242 -111541 61394 178248 173737 138802 62528 274110 274312 -256426 -125774 51787 181695
6231 181695 153987 -45124 -215985 -120042 -201494 -298041 -162534 -56563 91956 193516
6221A93516j73402Q2675K18488k08801j26239L693j16534Q3566J52440j55980
6211d6578k69212O1444Q8268J20921L5193o4676J1902J5405n6083J08673M8168
6200E3425k4775K61968j22968N0257n9836k96865J05826R2185J06067j74467j30254
6189a39437J38611J69339Q1707k44880Q4620M5280j48528m7352J43523l5758P2392
6178A19517J1241j68498J58808n2896l3302Q2884l11120M9392k7465K5408K6146
6167a19885N142J26426O5417L3900R8085o7270J47699N8840j06456j20503l7297
6156H4098J20795n8853J60759o5298k53572O6376J94924j68407j50594K20862
6146A51090j75666L4920J33602q3541r9840L1112j9071J25466n2436j08683J91102
$$ plain form
6221 193516 20114 102789 321277 112476 -13763 -10070 -126604 -43038 109402 -46578
6211 -46578 -315790 -254346 -166078 -45157 -9964 -74640 -62738 -47333 -103416 5257 53425
6200 53425 28650 290618 167650 217907 158071 -138794 -32968 59217 165284 -9183 -139437
6189 -139437 -826 168513 250220 5340 89960 135240 -13288 -60640 82883 47125 119517
6178 119517 130758 -37740 121068 68172 34870 117754 -193366 -143974 -171439 -146031 -119885
6167 -119885 -114743 11683 77100 111000 209085 141815 289514 348354 241898 121395 84098
6156 84098 204893 146040 306799 241501 -12071 54305 249229 80822 -69772 151090
6146 151090 -24576 10344 143946 60405 -39435 -8323 -27394 98072 45636 -63047 128055
6135A28055j7378J65471K2612N2809l43114Q322k8048j6298M3438K21746k83353
6124d5738J38152l6335q8737Q9852j64828Q699O6170j0383M8538J05431L7202
6113A48023o5593K5835r5403K8413m5390j91238P4457q8082M088j69705K17984
6102a56611L0452M7782J01783O1360j24558o8205j87223R0902J75081J36850p1454
6091C6159o4502Q7315j04034L5410k8501j8810k09806K22560J43672M6761m2940
6080A03284o0939K4707J13978J17756l61116J80774J30303j15708J07998L7740
6070B78777J34964q6972k15367N0968R591j92768K47499N4502p655j17995r6747
6059E8797J12007j93240M084o5148j47267M4853K04035O3038j6249k91489J75127
$$ plain form
6135 128055 110677 276148 298760 351569 8455 16777 -11271 -27569 15869 237615 -45738
6124 -45738 92414 56079 -32658 57194 -107634 -98935 -32765 -43148 5390 110821 148023
6113 148023 82430 108265 12862 41275 -4115 -195353 -120896 -208978 -204890 -374595 -156611
6102 -156611 -126159 -78377 23406 84766 -39792 -107997 -295220 -204318 -29237 107613 36159
6091 36159 -28343 58972 -45062 -9652 -38153 -56963 -266769 -44209 99463 146224 103284
6080 103284 42345 67052 181030 298786 -62330 118444 248747 133039 241037 278777
6070 278777 413741 326769 111402 162370 171961 -20807 226692 281194 273539 155544 58797
6059 58797 170804 -22436 -18352 -83500 -230767 -185914 18121 81159 64910 -226579 -51452
6048e1452J06651q0814L6003N0921R7491Q0698j3922j12776Q8507R2601r4594
6037A99314J01832j75888r0030J32308k14566n8483K34105o7611j3606j16707
6027f9332k1121R0512J88409N621M9767M7652j55433j40972K06617R9068j30100
6016A70688j41141j35068J569k873J25970k319q947P5492J98415K6399o7646o0154
6004A80385q2143r5277k4289Q9587J19330m1861j54603J73132N7084l21093P4883
5993b4865R4344n803Q3423j50872m2428N3729k4991J19594k32713K15617K5855
5982A10890j50127o9109J64369R9318J2779Q3040M516n0822p0372m882j40948
5971a1348j93880K92702k2501m9877r580M2316J36501p6724j9754r4697R2908
$$ plain form
6048 -51452 55199 -25615 10388 61309 158800 239498 225576 112800 201307 293908 199314
6037 199314 301146 125258 35228 167536 -47030 -105513 128592 60981 47375 -69332
6027 -69332 -90453 59 188468 194089 243856 291508 136075 -4897 201720 300788 170688
6016 170688 29547 -105521 -103952 -106825 19145 16826 7879 83371 281786 308185 240539 180385
6004 180385 98242 2965 -21324 68263 187593 145732 -8871 164261 221345 -99748 -24865
5993 -24865 69479 63676 147099 -3773 -46201 7528 -17463 102131 -130582 85035 110890
5982 110890 -39237 -108346 56023 155341 168120 251160 255676 204854 134482 129600 -11348
5971 -11348 -205228 87474 64973 15096 5516 47832 184333 107609 87855 -6842 86066
5960H6066K98460j59879j34440K9317j0342J5966J32761R1021k11677k32615o1531
5949a56893K80517J35622k46908n9065j6686j64869K17716Q8726j50460k0566
5939i2866J53122J7452m0708O436M9598K02835j40446Q6239j10914l564n1801
5928G5383n3498k0898j44198J28875o7005K599J30475k5140M4243N5216O3039
5917A89091j47350j08866N2806J01883K50585j19360k41109j20894K31003P041
5907I4830R097L20593j910j44212m089r6126J8290L5032K8368p28J47600k95287
5895A11458q1006J48921O5291p7419L4327r9633n5341L9761J63040L399j34251
5884A18547P8186J47476p3649j225j19531K4386K263p2870K2682J31925o3726
$$ plain form
5960 86066 384526 224647 90207 119524 109182 125148 257909 348930 137253 -95362 -156893
5949 -156893 123624 259246 12338 -46727 -63413 -228282 -10566 78160 -72300 -92866
5939 -92866 60256 77708 37000 43436 93034 295869 155423 241662 130748 127184 75383
5928 75383 21885 987 -143211 -14336 -81341 -78742 51733 26593 70836 126052 189091
5917 189091 41741 -67125 -14319 87564 338149 218789 -22320 -143214 87789 94830
5907 94830 103927 424520 422610 278398 274309 178183 196473 231505 259873 259145 406745 111458
5895 111458 30452 179373 244664 167245 201572 101939 46598 86359 249399 252798 118547
5884 118547 196733 344209 270560 269335 149804 174190 176453 103583 126265 258190 194464
5873A94464J1504J89682m2800j97114k7052P7710j01791J56888q248p6563l045
5862A73635j8865K16132j94254j84243m9975O6010R7350K91955p4164j02496P242
5851B28327J50466N5768j84570j3641L5725Q2063q7425o2778O3475R5492K920
5840C65822k05451J463L7727j41737R1856J30169L5105o0538n4490j28515J0605
5829H2016K29910L0532m7549J48437j22201q0702j32803K11179q5326k41262O2178
5818E4409J05348j44189J66320J38379m073j43643o7525p2068K28025J5533j51759
5807A24757p8829P8680K1757J42065L5262k7205N0740J51189j15506P1559N9742
5796E14211n6118O782j08372k1559q8210j27305L1610J17833j03531K7359J07895
$$ plain form
5873 194464 205968 395650 352850 155736 128684 206394 104603 261491 253243 176680 173635
5862 173635 154770 370902 176648 -7595 -57570 8440 105790 397745 323581 221085 228327
5851 228327 378793 434561 249991 236350 272075 354138 266713 203935 267410 362902 365822
5840 365822 160371 161834 199561 57824 149680 279849 314954 254416 199926 71411 82016
5829 82016 311926 342458 294909 443346 321145 240443 107640 318819 233493 -7769 54409
5818 54409 159757 15568 181888 320267 316194 172551 105026 32958 260983 276516 124757
5807 124757 45928 124608 146365 288430 323692 296487 347227 498416 382910 454469 514211
5796 514211 458093 464875 356503 334944 246734 119429 151039 268872 165341 192700 300595
5785C00595r7797K77274r0390o4826L0711j72738J3964j7124o4595j24749R2104
5774H2429J36776J29734N0102l4376j69345L3031Q326J3130m6433j09323q0444
5763A3607O7651K22553Q0632Q1711m6008j90245j982K40618J02231k96388J68566
5752D42946J3696K7258q5413q5375J16439M7857J07635j05566J4482q9132J99021
5741F03848J24476k00966J23564J3649q0195J88501J41428N8967j11239m3036
5731H18997Q4490j5957R7491J1217L5452J23031O9215J97932o6900K6669j00355
5720A281282j90524j87767J75283p468o117m0229j42067N7402k5608K706j36496
5709G80397P217p6295O5746m0556Q671j77282K7588j0305n8720j10133K03048
$$ plain form
5785 300595 202798 480072 389682 324856 355567 182829 196793 179669 115074 -9675 82429
5774 82429 219205 348939 399041 364665 195320 228351 236677 249807 203374 94051 13607
5763 13607 81258 303811 384443 466154 420146 229901 227919 468537 570768 274380 442946
5752 442946 456642 483900 398487 313112 429551 477408 585043 479477 493959 404827 603848
5741 603848 728324 527358 650922 664571 584376 772877 914305 973272 862033 818997
5731 818997 903487 887530 985021 996238 1031690 1154721 1223936 1421868 1354968 1381637 1281282
5720 1281282 1090758 902991 1078274 1070806 1064689 1024460 882393 939795 914187 916893 780397
5709 780397 787614 711319 777065 736509 745180 567898 595486 585181 526461 416328 619376
5698F19376j72394J1220P1051l7445J03036k9252j6915R1279K01072j54625j30856
5687E55547m7353j12348J51518q6550J23099j58057k7111Q8486J46143L0768P2793
5676G36935j59092j02110o2221K98036j0206k2803n0428q2015q4313J6253k1377
5665D56659J17562O292J44158J28470k28273j59233l2982R7959Q0079J25116j13249
5654F22558r4492p5395J84659o8455n1964m7834K0843J07758k5100o1627Q3478
5643E94429L9513K51231k68729j82781J54356K00780p6249M5295k50064N5250
5633E63031R3158K23340p292j52880k3959J37466o8930Q783J80860j7603r8164
5622H37810N729j8796M0618j7745p4804j22132J17506J07456j61934m8118J68478
$$ plain form
5698 619376 446982 458202 529253 491808 594844 565592 548677 639956 841028 686403 555547
5687 555547 508194 395846 547364 460814 583913 425856 398745 487231 633374 664142 736935
5676 736935 577843 475733 413512 711548 701342 678539 628111 546096 461783 478036 456659
5665 456659 574221 580513 724671 853141 624868 465635 432653 530612 610691 735807 622558
5654 622558 528066 452671 637330 568875 516911 469077 489920 597678 572578 510951 594429
5643 594429 633942 885173 616444 433663 588019 788799 712550 757845 507781 563031
5633 563031 656189 879529 872237 719357 695398 832864 763934 772717 953577 935974 837810
5622 837810 843539 824743 865361 847616 772812 650680 768186 875642 713708 665590 834068
5611H34068J34261K21648j65430j1720m7252P9844J03089L4264j19572l3280J1934
5600A041854P6751N8098m412o4417m0239L0523K89035P6961l5812j0660L8979
5589A456661l8580J4310m7538q1501K2261J05692j13798j57909K35155N9108J72152
5578A626013J7299l8892K1409l7614J22058q9388J24782M8301j88467J51696O0308
5567A817505l6878k12346J06770P7634J62805O3608M2569k90302N0523P8598J83168
5556B043654j1197L8531m3134J59097N782J50443j9436j30770m4626J44440j3201
5545B279583n3225m775P6391J10674O5913k33061J18777J16171j27017K26824
5535B576255J13222r6013R4441K05199L2681n0533N5131L56719j07843J53836
$$ plain form
5611 834068 968329 1189977 1024547 1012827 965575 1045419 1148508 1182772 1063200 1029920 1041854
5600 1041854 1118605 1176703 1172291 1107874 1067635 1098158 1387193 1464154 1428342 1417682 1456661
5589 1456661 1418081 1432391 1384853 1303352 1325613 1431305 1317507 1159598 1394753 1453861 1626013
5578 1626013 1643312 1604420 1625829 1588215 1710273 1620885 1745667 1793968 1605501 1757197 1817505
5567 1817505 1780627 1568281 1675051 1752685 1915490 1979098 2021667 1731365 1781888 1860486 2043654
5556 2043654 2032457 2070988 2027854 2186951 2192733 2343176 2323740 2192970 2148344 2292784 2279583
5545 2279583 2226358 2221583 2297974 2408648 2474561 2241500 2360277 2476448 2349431 2576255
5535 2576255 2689477 2593464 2687905 2893104 2925785 2875252 2930383 3287102 3179259 3333095
5525C333095K3441J14389J07176j12900J58172J82567q7414J31473J69465J74693
5515D194157L4600n6985O0627J17080P6453N4676K86097J27456J40022K30561
5505E264744m1057J80160J06370J67446K37174M8621L84583J5894J61357J89249
5495F714541J71441K49468K77959J74412K58438P0533J66449L36709J81750J33906
5485H735606K11851J72496J95845J49939L21328K62270L06089J92422J27033J57170
5475A0832049K83331K86245M14987L70614J75335O09170K74660L63760N06912
5466A4117063M66844M18208N65765M97571L34846M45930N87810O29687P30609
5457A8794333N81932Q74102R17115N76848R87024R35669R67842J061949J296663
$$ plain form
5525 3333095 3356536 3470925 3578101 3465201 3623373 3805940 3718526 3849999 4019464 4194157
5515 4194157 4228757 4171772 4232399 4349479 4425932 4480608 4766705 4894161 5034183 5264744
5505 5264744 5223687 5403847 5510217 5677663 5914837 5963458 6348041 6363935 6525292 6714541
5495 6714541 6885982 7135450 7413409 7587821 7846259 7916792 8083241 8419950 8601700 8735606
5485 8735606 8947457 9119953 9315798 9465737 9787065 10049335 10355424 10547846 10674879 10832049
5475 10832049 11115380 11401625 11816612 12187226 12362561 12971731 13246391 13610151 14117063
5466 14117063 14583907 15002115 15567880 16065451 16400297 16846227 17434037 18063724 18794333
5457 18794333 19376265 20250367 21167482 21744330 22731354 23667023 24634865 25696814 26993477
5448B6993477J626991J317367J492934J857093J952141J989789K500318K399043
5440D2129153K942476L154549L458888L834475M270036M454139N094321N827007
5432G5165044O291365O340983O758732P216577P333770P714284P615271P049559
5424A31485585O415194N903590M905448L684922K197666O51671j285971l077413
5416A50880692m212515n705002o975872p389997p752901p970146p893248p594205
5408I5386806p406899o735057o295893n635435n318007m904930m332157l633452
5400E1124976l226609l094805k789617k501892k287536k048653j537224j706819
5392C1931821j562187j559895j260288j233788j173885r04070r88366r64587q19600
$$ plain form
5448 26993477 28620468 29937835 31430769 33287862 35240003 37229792 39730110 42129153
5440 42129153 45071629 48226178 51685066 55519541 59789577 64243716 69338037 75165044
5432 75165044 81456409 87797392 94556124 101772701 109106471 116820755 124436026 131485585
5424 131485585 137900779 143804369 148709817 152394739 154592405 155244076 153958105 150880692
5416 150880692 146668177 140963175 133987303 126597306 118844405 110874259 102981011 95386806
5408 95386806 87979907 81244850 74948957 69313522 63995515 59090585 54758428 51124976
5400 51124976 47898367 44803562 42013945 39512053 37224517 35175864 33638640 31931821
5392 31931821 30369634 28809739 27549451 26315663 25141778 24237708 23249342 22284755 21465155
5383B1465155p32308j118803q07016n89549p99680m55480n65386n07388o00478
5374A5289067m91464m96289n60676m54770m12888m39721l70361k87942l94460
5365A1380496m58019l24510j98109l91558j92725k52567l04387k83378k64251
5356H710992j74711j62279l53112j35622k5090k38556k21351j78574k03667j80445
5346F837585j65489L0906j41835j45673p1859k30092k13647m212o6666j58261
5336E670757j63882k9433j20791q5797j80321k07135r8027p9301J20728k35453
5326D591345k05385p6394m5104o8785J0775N1280j00296k26572j87886j05735
5316C637243O5920p7069k78276N7200J23423j44548j24409j26135k34849J05964
$$ plain form
5383 21465155 20732847 19614044 18807028 18217479 17417799 16962319 16396933 15889545 15289067
5374 15289067 14797603 14301314 13740638 13285868 12872980 12433259 12062898 11774956 11380496
5365 11380496 10922477 10597967 10399858 10008300 9815575 9563008 9258621 8975243 8710992
5356 8710992 8536281 8374002 8020890 7885268 7860178 7621622 7400271 7221697 7018030 6837585
5346 6837585 6672096 6703002 6561167 6415494 6343635 6113543 5899896 5895684 5829018 5670757
5336 5670757 5506875 5477442 5356651 5270854 5090533 4883398 4785371 4706070 4826798 4591345
5326 4591345 4385960 4309566 4264462 4195677 4206452 4257732 4157436 3930864 3742978 3637243
5316 3637243 3703163 3626094 3347818 3405018 3528441 3383893 3259484 3133349 2898500 3004464
5306C004464Q2107l025j87985j4390j59363P2531R688j62429j06859J5575K19749
5295B770063k74942j63281J68439j64142l4195N8617j59258K4580r059j28561
5285B088261q5352O1933K0094k57898j7581J61054K457q1907l4065J76720J0719
5274B044435k91256k8089o3956r0386J21986j43359q4046J39086j52044j17941
5264A334430K13193j05519q0779R5750M3424o688Q5155j54298n7468o6149l13
5253A300738L0492P4999J8360j35138q4550J45022j62988n4597K63521O6735m935
5242A457659M8595o2318q6230j28471K8220Q681J36070O0666m270O1931K8211
5231A548744L5053k57172R0435R1869j20365l04949J78502l1171o0983J25538
$$ plain form
5306 3004464 3086571 3083546 2895561 2881171 2721808 2794339 2804027 2641598 2534739 2550314 2770063
5295 2770063 2495121 2331840 2500279 2336137 2301942 2360559 2201301 2225881 2216822 2088261
5285 2088261 2002909 2064842 2084936 1827038 1809457 1970511 1972968 1891061 1856996 2033716 2044435
5274 2044435 1753179 1725090 1661134 1570748 1692734 1549375 1465329 1604415 1452371 1334430
5264 1334430 1547623 1442104 1361325 1457075 1500499 1493811 1578966 1424668 1367200 1301051 1300738
5253 1300738 1331230 1406229 1424589 1289451 1204901 1349923 1186935 1132338 1395859 1462594 1457659
5242 1457659 1506254 1443936 1357706 1229235 1257455 1266136 1402206 1462872 1458602 1520533 1548744
5231 1548744 1583797 1326625 1417060 1508929 1388564 1083615 1262117 1230946 1169963 1295501
5221A295501j87169K4192J34224m4347q0402P4682M3101j50691n953k17597L25157
5210A210698J029q7523L4297j68301J81268j12184j09384j8951P1206J59896J14106
5199A276157j38362j71471n7430L2613N0967P928j40678K27757j6658j00281N5128
5188A025670M945l083m4291J40431J8979j10098l8395l8215J3304j3823k00144
5177G55280j32609L54600J95883j94956q9406m1115K8944j62021J61828j12097
5167G64331k92845N6595J53716J43806P9695p4693n0644j20107L2244Q7266j0298
5156G69066n4355K7465J7175R6922R0707o1067J28297J51775M0194j94379k78824
5145G32976J24703O9157L2963j04694j81183J35387N9203Q795M7326J3821l7733
$$ plain form
5221 1295501 1108332 1132524 1266748 1222401 1141999 1216681 1259782 1109091 1103138 885541 1210698
5210 1210698 1211727 1124204 1158501 990200 1171468 1059284 949900 930949 1002155 1162051 1276157
5199 1276157 1137795 966324 908894 941507 992474 1000402 859724 1087481 1070823 970542 1025670
5188 1025670 1030615 1027532 983241 1123672 1142651 1032553 994158 955943 969247 955424 755280
5177 755280 622671 977271 1173154 978198 888792 847677 876621 714600 876428 764331
5167 764331 471486 528081 681797 825603 905298 830605 779961 659854 692098 779364 769066
5156 769066 714711 742176 759351 856273 946980 885913 1014210 1165985 1206179 1011800 732976
5145 732976 857679 926836 959799 855105 673922 809309 868512 877307 924633 938454 900721
5134I00721K9229o7949r4837J77657J07142o5694J71948o908K07524j20220j62112
5123A076501J22642j36845J30946K57864N4266Q5410j83902R4794N8954J7764
5113A578394r8833J20746j50908M2736k933R0583k0844j14567L2178J4452k96116
5102A194888l281j16797j50418j5203j6202K5999j3972K06315j82891r8260J46796
5091I76974K23725O8184j13546O477k99124n023j49692k1216o112m0792J42296
5080G82151K7079J21107j92542j4911l8957J09609l9944J42038K1080j60056J12917
5069H69571j41078j25108N1510J47180M9775j88132K00724j10824o4650o7232
5059F21736J20077J95552Q3722j74249J31738l21968Q507K03900m8173j93092
$$ plain form
5134 900721 929950 862001 767164 944821 1051963 986269 1158217 1151309 1358833 1238613 1076501
5123 1076501 1199143 1062298 1193244 1451108 1505374 1590784 1406882 1501676 1560630 1578394
5113 1578394 1479561 1600307 1449399 1492135 1489202 1579785 1558941 1444374 1476552 1491004 1194888
5102 1194888 1191607 1074810 924392 909189 892987 918986 905014 1111329 928438 830178 976974
5091 976974 1200699 1268883 1155337 1161814 862690 857667 707975 686759 680647 639855 782151
5080 782151 809230 930337 737795 722884 683927 793536 753592 895630 916710 756654 869571
5069 869571 728493 603385 654895 802075 851850 663718 864442 753618 688968 621736
5059 621736 741813 937365 1021087 846838 978576 656608 665115 869015 820842 627750
5049F27750R2869j29014J31759o8384r4986J41009j7632O316K9061p4802J09083
5038G53029O4016l58197l1670J46444K5841K3616j69407L6597J08814j37925N5755
5027E16913L00913L6782m6572L3453J02704j04912j20345q112n3537m1182q7607
5016E28498p132J75803j7811j23430o7681r5245J02551K5139M9520J2805M1591
5005F24608J28200q723l6567K4987J35351k0206j43448K7907J0122M8030N5248
4994H45509R5410j51584k8018N8753j52829j24055R9160Q4374R5512J20172k2684
4983I19720r633J68937j48283J49497n2882o5803O7767P4368P2150L847n3271
4972A126414j40913j18987P5884P6497M0099K496n4765N1403J3887M4466J60613
$$ plain form
5049 627750 720619 591605 723364 654980 559994 701003 683371 689687 718748 643946 753029
5038 753029 817045 458848 427178 573622 599463 623079 453672 490269 599083 461158 516913
5027 516913 817826 854608 808036 841489 944193 839281 718936 710824 657287 616105 528498
5016 528498 521366 697169 679358 555928 488247 393002 495553 520692 570212 583017 624608
5005 624608 752808 744085 707518 732505 867856 847650 704202 732109 742231 790261 845509
4994 845509 940919 789335 761317 820070 667241 543186 642346 726720 822232 942404 919720
4983 919720 910087 1079024 930741 1080238 1027356 961553 1029320 1103688 1175838 1179685 1126414
4972 1126414 985501 866514 942398 1018895 1058994 1061490 1006725 1058128 1072015 1116481 1277094
4961A277094m5111R7365k05118j70995o7921L4369K02100p8022k04663K01419
4951A040517L7167K7228R0617j65025j06156K27767P2906J06005l9363j03980
4941A187683j06709O9077P9019Q7832j88858P030n6443R6639o6317k648J10696
4930A217001J55192j29512p5386k06596Q3764J46405j45148J28365j28925p2903
4920I72257N654J13435N7283N9958o8996K478K90738j62430k04958J17825j6797
4909A166447n8320L6513L9194j02535L2254j54596J27986J1474n1687K0520J55736
4898A222986l58728o2854R7267K5005J09356K8864k28864J57426J17824O6741
4888A175023L0444J34981p0864j62745P3656K5177r1362J96586k4139l4236k17017
$$ plain form
4961 1277094 1231983 1329348 1124230 953235 885314 919683 1121783 1043761 839098 1040517
4951 1040517 1077684 1104912 1195529 1030504 924348 1152115 1225021 1331026 1291663 1187683
4941 1187683 1080974 1150051 1229070 1316902 1128044 1135074 1078631 1175270 1108953 1106305 1217001
4930 1217001 1372193 1242681 1167295 960699 1044463 1190868 1045720 1174085 1045160 972257
4920 972257 977911 1091346 1148629 1208587 1139591 1142069 1432807 1270377 1065419 1183244 1166447
4909 1166447 1108127 1144640 1183834 1081299 1113553 958957 1086943 1098417 1046730 1067250 1222986
4898 1222986 864258 801404 898671 923676 1033032 1061896 833032 990458 1108282 1175023
4888 1175023 1205467 1340448 1269584 1106839 1180495 1205672 1114310 1310896 1286757 1252521 1035504
4877A035504j08847J28736J34620k7496N9800R0333p7442R5566l6473j20908J65716
4866A339109k8166n93j06903p5186n6342K4321O2080K72023J26830n0795N4656
4855A561034l7923M6684O0683j4750j52030j1547J14425O2578o5733j39557o3755
4844A360109J03000K21280R9374L6152M130j39322N5242J1620l8132J60855j8478
4833A855830q330J16182O0899L1342k6991J2105j30694N8173J09339j17857K8266
4822A988264K21116j5068O6372P2344J55250j28578m8669L4726J28304K00708
4812B674769j48493j36828J78315o7922J8909J89923J04114Q2402j51533l4846
4802B708810J66929L0931j34149L9144q195K16330J66930r6672j09742r3211J3807
$$ plain form
4877 1035504 926657 1055393 1190013 1162517 1222317 1312650 1235208 1330774 1294301 1173393 1339109
4866 1339109 1310943 1310350 1203447 1128261 1071919 1096240 1158320 1430343 1557173 1506378 1561034
4855 1561034 1523111 1569795 1630478 1615728 1463698 1452151 1566576 1629154 1563421 1423864 1360109
4844 1360109 1463109 1684389 1783763 1819915 1824045 1684723 1739965 1751585 1713453 1874308 1855830
4833 1855830 1847500 1963682 2024581 2055923 2028932 2041037 1910343 1968516 2077855 1959998 1988264
4822 1988264 2209380 2194312 2260684 2333028 2488278 2359700 2311031 2345757 2474061 2674769
4812 2674769 2526276 2389448 2567763 2499841 2518750 2708673 2812787 2895189 2743656 2708810
4802 2708810 2875739 2906670 2772521 2811665 2803470 3019800 3186730 3090058 2980316 2887105 2900912
4791B900912K00376K20333j5251L6742j28963k3388K9281J52807J90705J17589
4781C681143l1356J64248j99936M3711N1762n7850J33733l7968J10215O6087J81681
4770D105470m7953J48885J92580j01775K59559J5255P7753J20513K31173J70262
4760E171722J93355J58049O2007l3285K8872m325r1838K93000j31235j40208l8255
4749E467859K2813J78820R5473O5648J24578J1882j14503r4100K4210J86702J71646
4738F141028L4681K24160J49878K70727J13149K8556J2M2071K49622K50820J91174
4727G695878m0277J69606J48174K88980J06779K17986J57828K99058K87660L38123
4717I669795K79448J16122L10050K88819L14999k5195L30345J50781K25395M18939
$$ plain form
4791 2900912 3101288 3321621 3306370 3343112 3214149 3190761 3220042 3372849 3563554 3681143
4781 3681143 3649787 3814035 3614099 3657810 3709572 3651722 3785455 3747487 3857702 3923789 4105470
4770 4105470 4057517 4206402 4398982 4297207 4556766 4572021 4649774 4770287 5001460 5171722
4760 5171722 5365077 5523126 5585133 5551848 5580720 5576395 5484557 5777557 5646322 5506114 5467859
4749 5467859 5490672 5669492 5764965 5830613 5955191 5967073 5852570 5758470 5782680 5969382 6141028
4738 6141028 6175709 6399869 6549747 6820474 6933623 6962179 6962191 7004262 7253884 7504704 7695878
4727 7695878 7655601 7825207 7973381 8262361 8369140 8587126 8744954 9044012 9331672 9669795
4717 9669795 9949243 10065365 10375415 10664234 10979233 10954038 11284383 11435164 11660559 12079498
4707A2079498K75226K97169J76456O01408N03584O45583L29716M13533N60887
4698A5883060N97403N15502M82572N24054N65848R29063R69295J052209R12577
4689B2431583R28391J018994J377031J265943J331965J416775J565999J777386
4681C3114067J667797J765427J770130J852051J704423J550949J589960J400159
4673D6414963J280214J224203J056217Q59438J020988N81864O97147P23219R73579
4664E4831832J229813J173180J243930J558092J580171J914779K244306K446845
4656F8222948K635306K756383K886200K621854K926471L027527K609284K554111
4648I0240084K047990J415873P19805n3313p95926j299504k005436k752150k708292
$$ plain form
4707 12079498 12354724 12651893 12828349 13429757 13933341 14578924 14908640 15322173 15883060
4698 15883060 16480463 16995965 17478537 18002591 18568439 19497502 20466797 21519006 22431583
4689 22431583 23359974 24378968 25755999 27021942 28353907 29770682 31336681 33114067
4681 33114067 34781864 36547291 38317421 40169472 41873895 43424844 45014804 46414963
4673 46414963 47695177 48919380 49975597 50835035 51856023 52437887 53135034 53858253 54831832
4664 54831832 56061645 57234825 58478755 60036847 61617018 63531797 65776103 68222948
4656 68222948 70858254 73614637 76500837 79122691 82049162 85076689 87685973 90240084
4648 90240084 92288074 93703947 94423752 94370439 93574513 92275009 90269573 87517423 84809131
4639H4809131k522867k247639j824892j536289j007091o75645m55141R2766J16354
4630G4748687M67373N86950M37915P05319M05768N71785K3861m09691r45234j390320
4620G5202413j800016k327804k677852k967413k820290k833752l004120k651616
4612E4119550k517063k789424k096227j976035j893429j600428j497591j521611
4604C8227742j253704j135976j223035j182424r38733m39168o89212p11675m88462
4595C0165353n09021m79660m50300q1090l77899l98533l78317j62309K2803k54105
4585B7096922J54451Q3512k23797n5828J12617L05872J46274L20643j6481L30539
4575B8254724N64472M41868N46586L01993N42654P02009O63088Q08624P66560
$$ plain form
4639 84809131 82286264 80038625 78213733 76677444 75670353 74994708 74539567 74632333 74748687
4630 74748687 75216060 75803010 76240925 76946244 77352012 77923797 77947658 77537967 76592733 75202413
4620 75202413 73402397 71074593 68396741 65429328 62609038 59775286 56771166 54119550
4612 54119550 51602487 48813063 46716836 44740801 42847372 41246944 39749353 38227742
4604 38227742 36974038 35838062 34615027 33432603 32493870 32054702 31365490 30653815 30165353
4595 30165353 29656332 29176672 28726372 28645282 28267383 27868850 27490533 27328224 27351027 27096922
4585 27096922 27251373 27334885 27111088 27055260 27167877 27473749 27620023 27940666 27924185 28254724
4575 28254724 28819196 29261064 29807650 30109643 30652297 31354306 32017394 32826018 33592578
4566C3592578R62721J089849R77825J113080J264140J280100J317714J486174
4558D3084181J923625J689340J831414J947502K205155K149142J994785K407278
4550E9232422K365456K432535K185202J998169J881756J701281J748840J531916
4542G5077577J142793J164104Q83121O99762M20951L10425P25905N31455N11744
4533H1467837M06055L44486O41080P77757P00720J082854J059717J062821J176001
4524H8719328J165938J317364J097350R09271P75232P89001L32750J31612j76576
4515I5061270n93635q05356j127227r67568j304913j382997j515897j327908j414514
4506H4621255j478138j211404j440818j251796r69251p65704n82440n16535k95734
$$ plain form
4566 33592578 34555299 35645148 36622973 37736053 39000193 40280293 41598007 43084181
4558 43084181 45007806 46697146 48528560 50476062 52681217 54830359 56825144 59232422
4550 59232422 61597878 64030413 66215615 68213784 70095540 71796821 73545661 75077577
4542 75077577 76220370 77384474 78267595 78967357 79388308 79698733 80424638 80956093 81467837
4533 81467837 81873892 82218378 82859458 83637215 84337935 85420789 86480506 87543327 88719328
4524 88719328 89885266 91202630 92299980 93209251 93984483 94773484 95106234 95237846 95061270
4515 95061270 94467635 93662279 92535052 91567484 90262571 88879574 87363677 86035769 84621255
4506 84621255 83143117 81931713 80490895 79239099 78269848 77504144 76921704 76405169 76109435
4497G6109435m02804l69826j0479j61996Q0481K55823L8736L47253L69663K57056
4487G6513342L45031M03114M96594M52683R80331J080188J292382J525300J809341
4478H4898306K339704K914787L056766L535063M179124M936508N634764O396884
4470A17891906P173065Q454067R435108J0269154J1651887J2906649J4180717
4463A91962553J5362686J6391674J6865014J6661512J5219252J1954940P084129
4456B91501760k03884p878156j4585421j9379793k1214711k0821172j9596777
4449A87821846j7227894j4997283j3305756j1575666j0265423q835423p927419
4442A03686982p139152o257320n643287m896042m609262m239046l734008l301264
$$ plain form
4497 76109435 75706631 75336805 75326326 75164330 75244811 75500634 75539370 75886623 76256286 76513342
4487 76513342 76858373 77261487 77758081 78210764 79191095 80271283 81563665 83088965 84898306
4478 84898306 87238010 90152797 93209563 96744626 100923750 105860258 111495022 117891906
4470 117891906 125064971 133519038 142954146 153223300 164875187 177781836 191962553
4463 191962553 207325239 223716913 240581927 257243439 272462691 284417631 291501760
4456 291501760 291297876 283419720 268834299 249454506 228239795 207418623 187821846
4449 187821846 170593952 155596669 142290913 130715247 120449824 111614401 103686982
4442 103686982 96547830 90290510 84647223 79751181 75141919 70902873 67168865 63867601
4434F3867601l058259k845705k492771k284220k150756k390037k024066j814055
4426D4807732j694692j564267j518866j344016j213783j364313j431214j167589
4418C3508992j150469j025834q72039j093492q75359p82411r22388q56598j003261
4409B4927141q84445m26707o02073p09139n64071n13910p21163m43828o10524
4400A9451281m02532m39161n56561m22697p04263l18279m73634k20201k64322
4391A5649631m44189m32787k04753k39746l43174j88199k37033j77440l4800k51329
4381A3096181k06033l78881k99428j81189l16716k41226j50925j70381k48041
4372A0903361m6391j30554k80210j89329k39011r8972M4857k50003k12321k25826
$$ plain form
4434 63867601 60809342 57963637 55470866 53186646 51035890 48645853 46621787 44807732
4426 44807732 43113040 41548773 40029907 38685891 37472108 36107795 34676581 33508992
4418 33508992 32358523 31332689 30460650 29367158 28491799 27709388 26787000 25930402 24927141
4409 24927141 24042696 23615989 23013916 22304777 21740706 21226796 20505633 20061805 19451281
4400 19451281 19048749 18609588 18053027 17630330 16926067 16607788 16134154 15913953 15649631
4391 15649631 15205442 14772655 14567902 14328156 13984982 13796783 13559750 13382310 13347510 13096181
4381 13096181 12890148 12511267 12211839 12030650 11713934 11472708 11321783 11151402 10903361
4372 10903361 10856970 10726416 10446206 10256877 10017866 9918894 9963751 9713748 9501427 9275601
4362I275601O4564j12681l04613l41883l793l4787k11758m7128j39851m50702
4352G692969J07587j31259j98211N7296j68603j52979m1391j25942r2577j65731
4342F781159P8835j4271l9623l5785j39514J1221o7623j42101j04898k44601Q0567
4331F163366N8062k42500k10310j28003J05392r1439m1183j26687k985P7435j28500
4320E432648k59693Q3845J31740j4442j54178j87477j24776Q1472K16324j80814
4310E024649j57566j91349o0583N4615j07434j0141k42986K9176R0562K1599J00983
4299D551525l08694r6971J48790k9639O9958j91749j64371J86845L3695j09182
4289D090207j11196R980O3284l274O5394k0952j10170q7080O9061J8094J18389
$$ plain form
4362 9275601 9340165 9227484 8922871 8580988 8577195 8542408 8330650 8283522 8143671 7692969
4352 7692969 7800556 7669297 7471086 7528382 7359779 7206800 7165409 7039467 6946890 6781159
4342 6781159 6859994 6845723 6806100 6770315 6630801 6642022 6574399 6432298 6327400 6082799 6163366
4331 6163366 6221428 5978928 5768618 5640615 5746007 5654568 5613385 5486698 5483713 5561148 5432648
4320 5432648 5172955 5256800 5388540 5374098 5219920 5032443 4907667 4989139 5205463 5024649
4310 5024649 4867083 4675734 4615151 4669766 4562332 4552191 4309205 4338381 4428943 4450542 4551525
4299 4551525 4242831 4145860 4294650 4265011 4334969 4143220 3978849 4165694 4199389 4090207
4289 4090207 3979011 3988991 4052275 4049001 4114395 4093443 3983273 3896193 3965254 3983348 4101737
4278D101737j15287j39614N1701P6842R3004o0559O992N7343j73327j1322K24236
4267D111746Q4954q0972p336l31212J54689L01631j20943p6010J2753m4992j4752
4256C989556j55021J69693n1321J24717J08382k25303q1097r2599K2284J14020
4246C923311n7386J2921O6586J29353j53423r3204J88957o7771q2380j55259J01801
4235C813506L3149k3262L0042r8103k16312J62341K05427j57415J62889K7893
4225C940155q5710J63691j19815k5976q7999n2990J98331k33827j36664N7021
4215C616217l1322R0295j97489J06664J42973j25115p4396j77459n8906K85j31523
4204C160224K57120n4705j22954K08901r545N1859K6334j55751L3565j4120n5612
$$ plain form
4278 4101737 3986450 3846836 3898537 3975379 4068383 4007824 4014816 4072159 3898832 3887510 4111746
4267 4111746 4196700 4115728 4108392 3777180 3931869 4233500 4112557 4036547 4049300 4004308 3989556
4256 3989556 3834535 4004228 3952907 4077624 4186006 3960703 3879606 3787007 3809291 3923311
4246 3923311 3865925 3878846 3945432 4074785 3921362 3828158 4017115 3949344 3866964 3711705 3813506
4235 3813506 3846655 3823393 3853435 3755332 3539020 3701361 3906788 3749373 3912262 3940155
4225 3940155 3854445 4018136 3898321 3872345 3784346 3731356 3929687 3695860 3559196 3616217
4215 3616217 3584895 3675190 3477701 3584365 3727338 3602223 3527827 3350368 3291462 3291747 3160224
4204 3160224 3417344 3362639 3239685 3448586 3439041 3490900 3517234 3361483 3395048 3380928 3325316
4193C325316j16914j80776k9292K31739J00396R7678j91542j92329k5358n0390
4183B968528O4307J04692M894l5498k23800l4184P0860j30738q9787J9724J8377
4172B737375m1102K3623j46263J2342J43363K21175J45611J12354k9948q2463
4162C096067R2107J00704P2167o673K00620M9135j4771l0211J44694j03141L6630
4151C637328J7357p2626j43081k6558l63073j13367o7740l8964p6243p7164m9865
4140B626004j41229o8388p8075L8493j954J14773n9691j47580Q0984o0382l74941
4129A928014J20K12073k02871J5022M8385M9797O0530j97169J86820l39663k07234
4118A553824J00442K05569r3718Q1798k27099p6754J14413J76616j27110o5066
$$ plain form
4193 3325316 3208402 3027626 2998334 3230073 3330469 3428147 3236605 3044276 3018918 2968528
4183 2968528 3032835 3137527 3142421 3106923 2883123 2848939 2919799 2789061 2699274 2718998 2737375
4172 2737375 2696273 2719896 2573633 2585975 2729338 2950513 3096124 3208478 3178530 3096067
4162 3096067 3188174 3288878 3361045 3354372 3554992 3604127 3589356 3559145 3703839 3600698 3637328
4151 3637328 3654685 3582059 3438978 3412420 3049347 2935980 2868240 2829276 2753033 2675869 2626004
4140 2626004 2484775 2416387 2338312 2376805 2374851 2489624 2429933 2282353 2363337 2302955 1928014
4129 1928014 1928134 2140207 1937336 1952358 2000743 2050540 2111070 1913901 2100721 1761058 1553824
4118 1553824 1654266 1859835 1766117 1847915 1620816 1544062 1658475 1835091 1707981 1642915
4108A642915O6163j9597n5062J92948m4221j98835n6367r8082j74645M2684J18566
4097A416467J01506j49951J7265o0358j20620P5023O679P0521p1069r0276J9514
4086A214701J4966n2161K00818J74995j79991j54565K49208K0673l13341j43847
4076A031456j374J5200J56531K09568j47576k43451J55176j76099q7433J52991
4066A064989N5950q8396j15490M5273k0162j7536Q89M4350J74848k80641k01406
4055F62668J98284J00230Q9265j84409J27038J34202l06782j81728K06037J18572
4045I63377j22129j7751n3852K7442N3312J76067P7875q4594o9076j12313j48055
4034F90303j6980L115J20877K56795k47469j62611J75747j98899J34241k79696
$$ plain form
4108 1642915 1709078 1689481 1634419 1827367 1783146 1584311 1527944 1429862 1255217 1297901 1416467
4097 1416467 1517973 1368022 1385287 1324929 1204309 1279332 1286011 1356532 1285463 1195187 1214701
4086 1214701 1229667 1177506 1378324 1553319 1373328 1218763 1467971 1488644 1175303 1031456
4076 1031456 1030082 1045282 1201813 1411381 1263805 1020354 1175530 999431 911998 1064989
4066 1064989 1120939 1032543 917053 962326 942164 924628 925517 969867 1144715 864074 662668
4055 662668 860952 961182 1050447 866038 993076 1127278 820496 638768 844805 963377
4045 963377 841248 823497 769645 797087 850399 1026466 1104341 1019747 950671 838358 690303
4034 690303 673323 676438 797315 1054110 806641 644030 819777 620878 755119 475423
4024D75423J48286L6960p2766J94083j5615l7169J03224P2458j79710J41748M9148
4013I16070P828J68653J44056k46545j52575Q8865p9303j04842l3613j06345j1335
4002E90914K59841P5154l85050j23783K91665l1018L9768m3902n8738J31944k7679
3991G19116Q5223m9678N0484J21879J2051j05521N1490j10600j14562J44473P4000
3980H78355m546j28162p6456O7979m6777j59911J16862N2224j94081k64697K5135
3969B65925R0065J52777J7842q4431K0318k759J33587n0554j71364P6467j6405
3958D31468j7289l579m4367k4673J66911J77227j80208n0768r4021q1814K5537
3947C04424k2635R1722K34948P0733k44646j54582j29712M7696K69755K7452r757
$$ plain form
4024 475423 623709 660669 587903 781986 766371 729202 832426 904884 725174 866922 916070
4013 916070 923898 1092551 1236607 990062 837487 926352 847049 742207 708594 602249 590914
4002 590914 850755 925909 540859 417076 708741 677723 717491 673589 614851 746795 719116
3991 719116 804339 754661 805145 927024 939075 833554 885044 774444 659882 804355 878355
3980 878355 873809 745647 669191 737170 690393 530482 647344 699568 505487 240790 265925
3969 265925 355990 508767 526609 442178 462496 459737 593324 542770 371406 447873 431468
3958 431468 414179 410600 366233 341560 508471 685698 505490 454722 360701 278887 304424
3947 304424 281789 373511 608459 679192 434546 279964 150252 197948 467703 495155 485398
3936D85398K12845k51222q348j0696j82131k0486K392O9541Q5293L7404j09146
3925C10844L9207m9687k43074k366K06472J3093j95883J51612R6157k04611J90260
3914C12024R7500o6589m0265k2887k821P6828r9557J86024l6120k11690o2949
3903A29498P1503J84099n0656J9194j7667k51939P5017R4369l9360K62671r2604
3892C84125j93167L7865J94022m1055j34286j97202Q7162K39142j50517j2642
3882B13447O2327j51944n5152J97394J07884J85834j22850j06251k21916J43095
3872B51868O3770L7150o9930j7558k1699m2087L8832j91960N7599p1243j6424
3861A8318K69907j35706J5802m5966o1769j30335P9756J82727L3314M8260j08884
$$ plain form
3936 485398 698243 447021 438673 427977 245846 225360 227752 297293 382586 419990 310844
3925 310844 350051 300364 57290 54924 261396 274489 78606 230218 326375 121764 312024
3914 312024 409524 342935 302670 279783 276962 353790 254233 440257 404137 192447 129498
3903 129498 201001 385100 334444 353638 335971 84032 159049 253418 214058 476729 384125
3892 384125 190958 228823 422845 381790 247504 50302 137464 376606 226089 213447
3882 213447 275774 123830 68678 266072 373956 559790 436940 330689 108773 251868
3872 251868 315638 352788 282858 265300 243601 201514 240346 48386 105985 34742 18318
3861 18318 288225 152519 168321 122355 60586 -69749 10007 192734 226048 274308 165424
3850A65424k5121j66909J63290L7763j28474r5538j574L3014p1477J51936R936
3839G2270m9882O8539J69066m4255k56809J21609K00317m4642N292R4816r2249
3828B44072Q658K6444j40606j51354j6J88393M6132m5499m8856P6155J0455j87720
3816B6258j13552J97666R9271j29195J35518l6523J24760j66012N7097L6253q5377
3805A46164R1235k3338j82999n699J7609J40892Q1309r4168n0494J03126j12893
3794A10744J5851k4886o0804J7697l3279M3993J45831l495j85951j5999q1090
3783g1388J98181r2475j76738O2015J77498J85897l10734j23766N2067R2043j6137
3772b3537O989j7727Q164L832J49623j06345k9502P5005J1977M0959J0060r6763
$$ plain form
3850 165424 140303 -26606 136684 174447 45973 -49565 -51139 -18125 -89602 62334 72270
3839 72270 22388 90927 259993 215738 -41071 80538 280855 236213 241505 336321 244072
3828 244072 252730 279174 138568 -12786 -12802 175591 221723 176224 127368 203523 213978 26258
3816 26258 -87294 110372 209643 80448 215966 179443 304203 138191 195288 231541 146164
3805 146164 237399 214061 31062 25363 42972 183864 265173 171005 120511 223637 110744
3794 110744 126595 101709 40905 58602 25323 69316 215147 211652 25701 9702 -71388
3783 -71388 126793 34318 -142420 -80405 97093 282990 -27744 -151510 -99443 -7400 -23537
3772 -23537 -16548 -34275 -26111 -22279 127344 20999 -8503 66502 78479 119438 129498 32735
3760C2735j30702J3668J26142J16370l0636N6522j67426Q378O9706j58768J60862
3749I6851m2535j72843L5147K65344P1476j53204l1701n8685J90746r6328j606
3738A02662j51488l2779n3347q118j2931J06630R5493J0867J22220p561j64984
3727F664J23987j18496L4313P3167j82278l1538o22q6707J63352O9757L05998
3716C57597j2281j15293l872j48744n1574R8716j5034r0975N5483j75865J12201
3705A0359r0213N0570o6940R5638k0758m5426J46879p1205n8972k0323j19812
3694a90203l9952N8056j9373N5989R9731P5298j40942Q3792K17104p3278j11194
3683A5028m0974J6964l7473O3430J62669J5296J5175Q674J9716p9598O660M1810
$$ plain form
3760 32735 -97967 -84299 41843 158213 127577 184099 16673 25051 94757 -64011 96851
3749 96851 54316 -118527 -83380 181964 253440 100236 68535 9850 200596 104268 102662
3738 102662 -48826 -81605 -134952 -143070 -156001 -49371 46122 56989 179209 171648 6664
3727 6664 130651 12155 46468 119635 -62643 -94181 -94803 -181510 -18158 51599 357597
3716 357597 345316 230023 226151 77407 25833 124549 109515 18540 74023 -101842 10359
3705 10359 -79854 -29284 -96224 -586 -21344 -66770 80109 8904 -50068 -70391 -190203
3694 -190203 -230155 -172099 -191472 -135483 -35752 39546 -101396 -17604 199500 126222 15028
3683 15028 -25946 -8982 -46455 16975 179644 194940 210115 218789 238505 158907 165567 207377
3671B07377j42390q3840k9775r4812N440J29190M619Q1056l9123p5268l8961l9559
3659a16046P0163J74532r8935l6825j52811O2778J04020q5945P7292O755J91610
3648A96588j8498J43917p0426j70014k30967j529K26967j33528M5689N6978k6820
3637A8357L8198j48868J88725J88489j82205K0229l4287P611L9974o4401Q1047
3626A52869k61999J22506Q8490N9164o4093p6377j17828l3586O9064l2241K32421
3615A38390r3579o0958j37728J64007o8345N0507O9950p9318M9585J06130J68617
3604C07258k14200j49787O7848M8073o5268n5453J26242K4694j90577q9824J00322
3593i0672O7625j1681M8149J58038R104p0869n7098j22011N9094J4255r594J1611
$$ plain form
3671 207377 64987 -18853 -48628 -143440 -138000 -8810 -4191 76865 37742 -37526 -76487 -116046
3659 -116046 -45883 128649 29714 -7111 -159922 -97144 6876 -79069 -1777 4978 196588
3648 196588 178090 322007 251581 81567 -149400 -150929 76038 -57490 -11801 45177 18357
3637 18357 56555 -92313 96412 284901 102696 122925 88638 96249 136223 71822 152869
3626 152869 -109130 13376 101866 161030 96937 20560 -97268 -130854 -61790 -94031 138390
3615 138390 44811 -16147 -153875 10132 -58213 -7706 62244 -17074 32511 138641 307258
3604 307258 93058 -56729 11119 59192 -6076 -61529 64713 89407 -101170 -190994 -90672
3593 -90672 -23047 -34728 13421 171459 180563 109694 52596 -69415 -10321 3934 -5660 5951
3581E951N0831j5046n6196K05395q3193k02108j8179L7706K05667J35936O27k84172
3569a6781k66273K00097R3076L306k0380J821l0068m2341o2979P347q3945K00330
3557a6790P1661J46023k5281n3323J58365M6996k19380R6929j3732j33016p5572
3546a7120M2228Q7605M1722N7216l40507j29929J37775N8269R5407O0658l9410
3535E3914J18627j29052j36072o8723N4379O5959n9101q411J73483J6731j56458
3524g4724N5647R2364R5508M510k20580p4885l627J02722J94498M1999r6979j97022
3512h0569P4941J21433k12391J57428j47099k0667L68812K06738r1726k46328
3502A30572j77474J7850k00115L3825K39714r9072P2591L01747q263j65461m5122
$$ plain form
3581 5951 56782 41736 -14460 190935 107742 -94366 -112545 -74839 130828 266764 267391 -16781
3569 -16781 -283054 -82957 10119 13425 -6955 -5134 -35202 -77543 -140522 -133175 -217120 -16790
3557 -16790 54871 200894 175613 122290 280655 327651 108271 205200 191468 58452 -17120
3546 -17120 25108 112713 154435 211651 -128856 -258785 -121010 -62741 32666 93324 53914
3535 53914 172541 43489 -92583 -161306 -106927 -40968 -100069 -108480 65003 81734 -74724
3524 -74724 -19077 73287 168795 173305 -47275 -122160 -125787 -23065 171433 213432 116453 -80569
3512 -80569 -5628 115805 -96586 60842 -86257 -106924 261888 468626 376900 130572
3502 130572 -46902 -29052 -229167 -195342 44372 -54700 17891 319638 311375 145914 100792
3491A00792J89010j26485Q8746O8690q232j59128j85610O8425J77178K0182q0776
3480A52792l2808J3373m6344q2256n3040L8745K43955k26474O813L7169k8638
3469B3287l9707q8951J12370K41539j70307n3780r9646J21702j8884j47977J76208
3458E5854J5387n2566j20723l0922J21122P4214k5150N0670K8325n9858j52416
3447i6063J15046m0080n704J56344J081k26332M7563q3485q3541N9519P9117K23008
3435A46473m7649j70404N1067J1973q0629R3465j15707k732J11248J97914o1793
3424A33226J74821j14071l7935M7633o8583j44507P41M2340L3207K78128j79252
3413A65748n9163p9414J6106j1761r7521M1566j00293L1366J33398k3591k8411
$$ plain form
3491 100792 289802 163317 252063 320753 312521 153393 -32217 36208 213386 233568 152792
3480 152792 119984 133357 87013 4757 -48283 -9538 234417 7943 14756 51925 23287
3469 23287 -16420 -105371 6999 248538 78231 24451 -75195 46507 27623 -120354 55854
3458 55854 71241 18675 -102048 -132970 -11848 62366 37216 87886 116211 56353 -96063
3447 -96063 18983 -21097 -26801 129543 130624 -95708 -48145 -131630 -215171 -155652 -76535 146473
3435 146473 98824 -71580 -20513 -8540 -89169 4296 -111411 -114143 -2895 195019 133226
3424 133226 308047 193976 156041 203674 135091 -9416 -8675 33665 66872 345000 165748
3413 165748 106585 27171 43277 31516 -66005 -24439 -124732 -93366 40032 16441 -11970
3402a1970J24019P8561P5548m5062J07848k47233p1701J97064j84347K440J35730
3391A60897j11939k0306J82760N2118N5979j22892j33875p3089J94179K0807k39037
3380c4398r9069J0098J58084J4949j50997J48287K4385n3205J99076n6532p506
3369A53172K18222M93j86250p7730o3684j8067J56489P1855n0109j75164p6894
3358d7667P1171K35557O4494o6591J07884j11468j58978J24091M8564k17491n1410
3347a844M9611k5803J24661l4292l1463P8230Q0374p0058k00754N8335J62315
3336A89312J03876j3541r05J18026K811l1209j39482K9400j24765r6727P5250
3325A12046J75272j8887r2319K07086m119k42831J25266K97162K1753m1672k10930
$$ plain form
3402 -11970 112049 190610 266158 221096 328944 81711 10010 207074 22727 25167 160897
3391 160897 48958 28652 211412 263530 319509 196617 62742 -10347 183832 204639 -34398
3380 -34398 -133467 -123369 34715 49664 -101333 46954 71339 18134 217210 160678 153172
3369 153172 371394 371887 185637 107907 44223 26156 182645 254500 204391 29227 -47667
3358 -47667 23504 259061 323555 256964 364848 253380 94402 218493 267057 49566 -1844
3347 -1844 47767 21964 146625 112333 80870 159100 239474 169416 -31338 26997 189312
3336 189312 293188 279647 278742 396768 399579 368370 228888 258288 133523 36796 112046
3325 112046 287318 268431 176112 383198 379079 136248 261514 558676 580429 538757 327827
3314C27827J7301j17136J97657J5543j8446M5861q8213R3922K4921R0174Q6080
3303F75491j41283J33511K01753j44948n9274k9555j51367n6644J28524L19882
3293H76090O1417l42782K3306J7106Q9447K08902J10190j22639m981N3360L92346
3282A361762p701j30561R895M9090K18571J25233M4376J2157J59108P5835J65321
3271B083086L4952q7841p5088J66626L54018j74881j42085p3034j22821j45203
3261A817729k59955o1007p0915L7255k31009J8141j32387n035R3184J07085N865
3250A318951r0241k1656k5904k08755J17151o0445j278o7180l6524L7349J9733
3239I81201J14098k94565J36224k7808K52658K66690l5797k02123J53989R958
$$ plain form
3314 327827 345128 227992 425649 441192 422746 468607 380394 474316 499237 589411 675491
3303 675491 534208 667719 869472 724524 665250 635695 484328 427684 556208 876090
3293 876090 937507 594725 618031 635137 724584 933486 1043676 921037 916056 969416 1361762
3282 1361762 1354061 1223500 1233395 1282485 1501056 1626289 1670665 1682822 1841930 1917765 2083086
3271 2083086 2118038 2030197 1955109 2121735 2475753 2300872 2158787 2085753 1962932 1817729
3261 1817729 1557774 1496767 1425852 1463107 1232098 1250239 1117852 1112817 1206001 1313086 1318951
3250 1318951 1228710 1207054 1181150 972395 1089546 1029101 1027823 960643 924119 961468 981201
3239 981201 1095299 800734 936958 909150 1161808 1428498 1392701 1190578 1344567 1354525
3229A354525l31135q9145J09478o8648P8N3215k45584j06331L553j85557r9585
3218C94864K29711m8868j32543K8361J84959P9517j22745r2329Q8228o3812p0407
3207D74936n652J47968K48657j00710k94642J22430L29920j4865k48670L7764
3197F97136o3888k0148j47695j02903J83678k24301J48210P5997k41816j63416
3187A40854p2628Q8285j1508j27810J16823J93721j28944k8813J42075N5720J0351
3176C78126K0676L8613k56546r4007P2727K29585k9239l04458l165J02205m9887
3165A04630P05q5228Q785K01952o8216J03290J7891o1327j38246L2447J95813
3154C12496m5827n0165P8779l2915j41108j22866O2102J75490j43160M0444k38468
$$ plain form
3229 1354525 1023390 934245 1043723 975075 975153 1028368 782784 676453 680006 494449 394864
3218 394864 624575 575707 443164 471525 656484 736001 613256 520927 609155 545343 474936
3207 474936 469284 617252 865909 765199 470557 592987 922907 908042 659372 697136
3197 697136 633248 613100 465405 362502 546180 321879 470089 546086 304270 140854
3187 140854 68226 156511 145003 17193 134016 327737 198793 169980 312055 367775 378126
3176 378126 398802 437415 180869 86862 159589 389174 359935 55477 52312 154517 104630
3165 104630 105335 20107 28892 230844 162628 265918 283809 222482 84236 116683 312496
3154 312496 266669 216504 295283 262368 121260 -1606 60496 235986 92826 133270 -105198
3143a05198n6569R3800M1236K3231l0615K3369L74458k12773Q9848Q2347j81045
3132A42089R73l7393j58824K49473r611j20378J0473k96103J64149J03732J07116
3121A55696k68532n0162J51021L8042J33612J5596L0076j04030j95633J81731
3111H7417J30282m2553j22833j24369K0487L8108j5728Q3927J9251K0982j75812
3100h0841P2955p145P3280R157n5766L1253Q440J6899n908j34288N0094P4566
3088E2696Q7295K928q606k34394J0477m8884J36026K5275L0967N3602k49361J33302
3076h677n0523j18487j917J30916Q1947K3317K4095j32346j20311K1750J0739
3065a39497J2355K7140L8721n2665K73461k9789N7383j43715j12973P8428j81981
$$ plain form
3143 -105198 -161767 -67967 -26731 -3500 -34115 -10746 363712 150939 240787 323134 142089
3132 142089 143062 105669 -53155 196318 186707 66329 76802 -219301 -55152 48580 155696
3121 155696 -112836 -162998 -11977 26065 159677 175273 205349 101319 -94314 87417
3111 87417 217699 175146 52313 -72056 -51569 -13461 -29189 54738 73989 94971 -80841
3100 -80841 -7886 -15031 58249 67406 11640 42893 51333 68232 62324 -71964 -21870 52696
3088 52696 139991 142919 134313 -100081 -89604 -138488 -2462 22813 53780 107382 -141979 -8677
3076 -8677 -59200 -177687 -179604 -48688 33259 56576 80671 -51675 -171986 -150236 -139497
3065 -139497 -127142 -100002 -61281 -113946 159515 129726 187109 43394 -69579 8849 -173132
3054a73132j6632R3818J4354q3444P1020p9347K6610P3659q8675j41035K92726
3043a0078l1008p1946J74081O4172j44092m9143J19516m4574M345q9466J05797
3032B7604N1203O7250N4871l5396k2190j38133j11591J34935N6771R8747j07002
3021G7069n506L9235O8635j08752p2383r9811N0687L27207j8071j88186M4891
3010A15015K49820p066n6185l00243p4821N4165J17018n7729o1823J6013k0304
2999b6140l5638P8998j85623N8264k4178R8241K12159M7538l6127j88262L6681
2988C5913j61403K23062O8661j9921j98209j7998j24352r0811K7466K42081M6955
2977C1444m448J60710j30754j27145j22640K84926O8926m3233j00428k41995J42477
$$ plain form
3054 -173132 -189764 -95946 -81592 -165036 -94016 -173363 -146753 -73094 -161769 -302804 -10078
3043 -10078 -41086 -113032 61049 125221 -18871 -68014 51502 6928 11273 -78193 27604
3032 27604 78807 146057 200928 165532 143342 5209 -106382 28553 85324 184071 77069
3021 77069 71563 110798 179433 70681 -1702 -101513 -50826 276381 258310 70124 115015
3010 115015 364835 357769 301584 1341 -73480 -19315 97703 39974 -21849 -5836 -26140
2999 -26140 -61778 17220 -168403 -110139 -134317 -36076 176083 223621 187494 -768 35913
2988 35913 -125490 97572 166233 146312 -51897 -69895 -194247 -285058 -257592 -15511 31444
2977 31444 26996 187706 56952 -70193 -192833 92093 161019 117786 17358 -224637 -82160
2966h2160n2080k31553K11949N3897K6853K64534j91341M5009o0154o7279N3401
2955b8924J28493K29833l14394o5943N791K34249L22554r5950K0309M9597l51755
2944A33860j25229J49665j02413L2262n5649n0822k6472l5267m2168J86217J23933
2933A87917J2261j64418N7546j40494p0306J20785K620n0337J42384Q8340r6185
2922I0113L3440P8869K12853j75618J31058O3998k11095j69001j52618P6089K41698
2911B19786q0079K9063j27236j17183P8600K02345M4904p3909p1080R2512J40618
2900C38341n5791o6229M0042k9858j97909L9707K2890N5174r9459O5160M6480
2889A58548r2009K03792j5789k34975J21530J4299j8660R7775j48914l183r7991
$$ plain form
2966 -82160 -134240 -365793 -153844 -99947 -73094 191440 99 45108 -15046 -82325 -28924
2955 -28924 99569 329402 15008 -50935 -45144 189105 511659 415709 436018 485615 133860
2944 133860 8631 158296 55883 88145 32496 -18326 -44798 -80065 -122233 63984 187917
2933 187917 200178 35760 93306 -47188 -117494 3291 5911 -44426 97958 186298 90113
2922 90113 123553 202422 415275 239657 370715 434713 223618 54617 -98001 -21912 219786
2911 219786 139707 168770 41534 -75649 2951 205296 250200 176291 105211 197723 338341
2900 338341 282550 216321 256363 226505 28596 68303 91193 146367 46908 112068 158548
2889 158548 66539 270331 254542 19567 141097 155396 136736 234511 85597 82414 -15577
2878a5577o8227J2428K6218Q5059m3976J43164K2141j04953l8337M2984Q9105
2867A50029p6599J490J08900j45959j4072j8671M0663O1487J9824r3745j19816
2856h6469J12757O4524J66191k1815j97547k68510Q3459J41768J66776Q0187N835
2845B47156r1350j8142N5266l0979R9703n8317j18408j53379J31623j38201q3889
2834a58917J81396J51941J08152j84525k24759q6879O2204k6456N9441J8868N6321
2823d3213o1367K01528P5615L1403j43041r348O3345q9389n3787L6204n8318j70494
2811b20862M5103J20278M0364j76561r1102J84544N4333O4552K8592j42972n563
2800i9294J47177J01974r4116j29297M5414J31870m7429j05517j15983J85759
$$ plain form
2878 -15577 -83804 -71376 -45158 39901 -4075 139089 161230 56277 17940 60924 150029
2867 150029 73430 74920 183820 37861 23789 5118 45781 107268 127092 33347 -86469
2856 -86469 26288 90812 257003 235188 37641 -230869 -147410 -5642 161134 241321 247156
2845 247156 155806 137664 192930 161951 261654 203337 84929 -68450 63173 -75028 -158917
2834 -158917 22479 174420 282572 98047 -126712 -213591 -151387 -177843 -118402 -99534 -43213
2823 -43213 -104580 96948 172563 203966 60925 51577 114922 25533 -28254 7950 -50368 -220862
2811 -220862 -175759 -55481 -15117 -191678 -282780 -98236 -43903 20649 49241 -93731 -99294
2800 -99294 47883 149857 55741 -73556 -28142 103728 56299 -49218 -165201 20558
2790B0558j209k13262J9272O282K16479p3108R1998k00093j15862J22566P4493
2779e1886K10286j24618J30249l8338n0304j09308J21440K931j857R3264l26364
2768a44505j82106J8959Q7567J17097J115J02142R9071j44983P2215J22047k0444
2757A28175P9609j46272L6994n7942k52647o0478K10039J4460L8795p4069k6356
2746a09692j31910K49069k3105j49455k9957P863J4621K4433k8198Q0151N0962
2735d5218k88400J60083P9050j73477l8632J27368o2906J6186K01925q0782p5773
2724a80576J5282J62012J9306j57372j55638j0851K7143M1201K31389j05691L0734
2713h3061J74160K0178j69685O0662j4317l6869J60761r3226q0985p0910R3652
$$ plain form
2790 20558 19349 -193913 -174641 -168359 48120 -24988 67010 -133083 -248945 -126379 -51886
2779 -51886 158400 33782 164031 125693 75389 -33919 87521 90452 88595 181859 -144505
2768 -144505 -326611 -307652 -220085 -102988 -101873 269 99340 -45643 26572 148619 128175
2757 128175 207784 61512 98506 40564 -212083 -272561 -62522 -48062 -9267 -83336 -109692
2746 -109692 -241602 7467 -15638 -165093 -195050 -187187 -172566 -148133 -176331 -96180 -45218
2735 -45218 -333618 -173535 -94485 -267962 -306594 -179226 -242132 -225946 -24021 -104803 -180576
2724 -180576 -165294 -3282 16024 -141348 -296986 -307837 -280694 -239493 -8104 -113795 -83061
2713 -83061 91099 111277 -58408 2254 -12063 -48932 111829 18603 -62382 -133292 -39640
2702c9640k3936P9978r7979J19473M2561N2269P6465k34349R7293j13937K347
2691c9455q4097j68639p9408J59998O7335K6176P6961L6996j45696p9476J82842
2680d6463L2981J00704o9304q8914j18138p4534j95759K07707K93898n7755j01953
2669a17530N7604J00658j25513J51481k25089l3339R051j07629O7670K17975n1150
2658e5811j09110j22166K6336J7839J31002J2687P2802m6318j51279N5790R037
2647a59191n4458Q1750K9810K2173J22472l1637j86918j60194J64677J56938j42640
2636a57218N2199j6765j55534o6180O2585J03919j72248L08384J108p1372N4684
2625e6438k63781J404P6905J53711j50210K1953m1049O0842N9248o3383L6225
$$ plain form
2702 -39640 -63576 16402 -81577 37896 80457 132726 209191 -25158 72135 -41802 -39455
2691 -39455 -123552 -292191 -371599 -211601 -144266 -118090 -41129 -4133 -149829 -229305 -46463
2680 -46463 -13482 87222 17918 -70996 -189134 -263668 -459427 -251720 42178 -15577 -117530
2669 -117530 -59926 40732 -84781 66700 -158389 -191728 -182677 -290306 -222636 -4661 -55811
2658 -55811 -164921 -287087 -260751 -242912 -111910 -99223 -26421 -72739 -224018 -168228 -159191
2647 -159191 -213649 -131899 -102089 -79916 42556 10919 -175999 -336193 -171516 -14578 -157218
2636 -157218 -105019 -121784 -277318 -343498 -280913 -176994 -349242 -40858 -39750 -111122 -56438
2625 -56438 -320219 -318815 -241910 -88199 -238409 -216456 -257505 -196663 -137415 -200798 -164573
2614a64573R8138J88270O9166o3514m6048p1654j57622n499l5989J6398m3267
2603b16194O3388j63785Q6182J57565J65020K5383j91798j41796L2871K31525
2593D8361j57048J04698L8733j52302j0321j16150j7841m9357K68525J20690k5748
2582E2240j00843J36823j24741j69088o819m1867j10362n6193L28873N0297j02760
2571a44440N6767p919J8021l6550J12943j35853m9006J14691O6543p132l91258
2560d03193J98884m5944P947l1433P0068l3253K00352R8977K6195n2330k92173
2549b55903J29854J24120Q0465q2456R0496j70619n8552J01664j16223m1600J00009
2538i8745K2369O0028J71078P4418P6338k0580j43894j24637n8762J03465j51486
$$ plain form
2614 -164573 -66435 121835 191001 127487 81439 9785 -147837 -153336 -189325 -172927 -216194
2603 -216194 -152806 -316591 -230409 -72844 92176 117559 -74239 -216035 -183164 48361
2593 48361 -108687 -3989 34744 -117558 -127879 -244029 -261870 -311227 -42702 77988 52240
2582 52240 -48603 88220 -36521 -205609 -212428 -254295 -364657 -420850 -91977 -41680 -144440
2571 -144440 -87673 -95592 -77571 -114121 -1178 -137031 -186037 -71346 -4803 -11935 -403193
2560 -403193 -204309 -250253 -242306 -273739 -203671 -236924 -36572 62405 88600 36270 -255903
2549 -255903 -126049 -1929 78536 -3920 86576 -84043 -142595 -40931 -157154 -198754 -98745
2538 -98745 -76376 -16348 154730 229148 305486 284906 141012 16375 -42387 61078 -90408
2527i0408k2490J30356n0184j05012k7453L41416j41875l49106J72091l6593J34069
2516d5189m2133n7398l300l2861J31243k16997K1720J55574q3608J79747q8582
2505h1784L4908j17567J47338R9563J2327N2311j89411o0982J01815k6276j21745
2494a49503M1408m9980k05979N5605J11044k1301J01884Q3088k4301j10651j37364
2483c06050J03543K56259k49168j5770J73863O5334m460K1109j20198j72611J1573
2472b36576L56584J46990o4774j83161j63500m8456R6559J10735j9927K3012J1971
2461B9457J2919k19019P3128L9671O8044j37436l5585K0968m7463R1915L6468
2450f6933r7890K25892J22884j74185L3623K0384L6349j01429N7088j52227N8822
$$ plain form
2527 -90408 -112898 17458 -32726 -137738 -165191 176225 34350 -314756 -142665 -179258 -45189
2516 -45189 -87322 -144720 -148020 -180881 -49638 -266635 -244915 -89341 -172949 6798 -81784
2505 -81784 -46876 -164443 -17105 82458 94785 147096 -42315 -103297 -1482 -27758 -149503
2494 -149503 -108095 -158075 -364054 -308449 -197405 -218706 -116822 -33734 -58035 -168686 -306050
2483 -306050 -202507 53752 -195416 -211186 -37323 28011 23551 44660 -75538 -248149 -236576
2472 -236576 120008 266998 202224 19063 -144437 -192893 -96334 14401 -5526 17486 29457
2461 29457 42376 -176643 -103515 -63844 4200 -133236 -168821 -147853 -195316 -103401 -66933
2450 -66933 -164823 61069 183953 9768 43391 63775 100124 -1305 55783 -96444 -37622
2439c7622L3274L9793m0332n0495o6584J5143k294Q7293N6822K5099N4434P189
2427A21720K5993j03504r6119L3244l1442l4410l5919j6625J84675K67116j30417
2416A84312l4724m3608m194J93491j31201j54330J03340K17141q9266L7232J60066
2405D38259j39028j5301M5852j9882k2184K02213K0159j86178m2120q7295p62
2394A93733j10718N1895J09031R1877L2516j27204o9607m7492k9769O6315J03218
2383B63795r319j24195q7536l8650l8484j518J51349J97720o8086m8346j65984
2372C0746Q0509j4452N6280l1353k0481k2612j31149p3155P821L19159Q5979P6007
2360C63299j36796q7251M1467j26800j06128j5515L864J31760l2780O109R157
$$ plain form
2439 -37622 -4348 35445 -4887 -55382 -121966 -106823 -109117 -21824 34998 60097 114531 121720
2427 121720 147713 44209 -51910 -18666 -50108 -84518 -120437 -137062 47613 314729 184312
2416 184312 149588 105980 101786 295277 164076 9746 113086 330227 240961 278193 438259
2405 438259 299231 283930 329782 309900 287716 489929 510088 323910 281790 194495 193733
2394 193733 83015 134910 243941 335818 368334 241130 171523 124031 94262 160577 263795
2383 263795 254476 130281 42745 4095 -34389 -35907 115442 313162 245076 196730 30746
2372 30746 111255 96803 153083 121730 101249 78637 -52512 -125667 -117846 201313 287292 363299
2360 363299 226503 139252 180719 53919 -52209 -67724 -63860 67900 35120 41229 50386
2349E0386Q3791j06056K28869p6564k95088R335L9196Q3107J62109J80424j69360
2338A90149l6502k5287N0304Q7888m6172l0505j6121M5090K8191j20292P7315
2327B04058o6045M5572J47074n5667n4265j37864m0792k5078J33015l1663J23612
2316B41957o6938L7407O6557j4160Q5607p1067j23519O598J46794j68616p0846
2305F9774J42784K62556j02961k08564K5330O1592M7962R847k8072j4776J64494
2294D29966O0412r9495k0847l843k1512J9147J7378l0722K1035J12414q5687l7382
2282C60864o3279j06090J22197J5546r9840P6599n7861J23669Q7329O9059j21371
2271D06822j6373n070J24867J14489R3495K7784k06850j02999j41513R3266K18110
$$ plain form
2349 50386 134177 28121 256990 180426 -114662 -105327 -66131 16976 179085 359509 190149
2338 190149 153647 128360 178664 266552 220380 189875 173754 218844 247035 126743 204058
2327 204058 138013 183585 330659 274992 220727 82863 42071 16993 150008 118345 241957
2316 241957 175019 212426 278983 264823 350430 279363 155844 162442 309236 140620 69774
2305 69774 212558 475114 372153 163589 188919 250511 298473 308320 280248 265472 429966
2294 429966 490378 390883 370036 366193 344681 363828 381206 350484 371519 483933 398246 360864
2282 360864 297585 191495 313692 329238 229398 305997 248136 371805 459134 528193 406822
2271 406822 390449 385379 510246 624735 718230 746014 539164 436165 294652 387918 606028
2260F06028m6990M0204R3393j60412r645j0104L4116j0313p4975M9523N2353J56304
2248G19482K938l5935j00843N1883Q1098m2983n7638n6808l6090O8653K49775
2237H43532J32619l4869j14575K75712M5045k41454L327K46321j6313J18188p572
2226A249961o6564Q1383J35334j62312k0199Q3481L24145j84518J1734j02610
2216A349835K00712J85845J50511N4678q6316R1465P391L07549R3455K5592k2610
2205B358107K06871q9278J28420J09538R1023J67455j06383j56722L8776K59689
2195C007496K71368p4926J6653M6436K45462j46389J04161K26385J58040J38385
2185C993071K35142R411J68205K05697R9083J23262r0125J43269K64169K10220
$$ plain form
2260 606028 559038 599242 692635 532223 522578 512474 546590 536277 461302 510825 563178 719482
2248 719482 722420 686485 585642 637525 718623 675640 618002 561194 525104 593757 843532
2237 843532 976151 941282 826707 1102419 1147464 906010 909337 1155658 1139345 1257533 1249961
2226 1249961 1183397 1264780 1400114 1237802 1217603 1301084 1625229 1440711 1452445 1349835
2216 1349835 1550547 1736392 1886903 1941581 1855265 1946730 1954121 2261670 2355125 2380717 2358107
2205 2358107 2564978 2475700 2604120 2713658 2804681 2972136 2865753 2709031 2747807 3007496
2195 3007496 3278864 3203938 3220591 3267027 3512489 3366100 3470261 3696646 3854686 3993071
2185 3993071 4228213 4237624 4405829 4611526 4710609 4833871 4743746 4887015 5151184 5361404
2175E361404J31869K42812K09512J77805N1793M03889K60591M32362K15472K07533
2165G695042L70339L18680L57348M99959M92023N00498M19121P74837J014690
2156A2442537N32294P81712R08902J033023J203265J301701J763020J761973K022395
2147B3750822J938422K109054K275335K511092L206777L796460M319326N441872
2139D9349160O059347O612509P916601Q605853Q618808Q358146O793053K251984
2131A04565461n503812j1691371j2975852j1407987q948321p121722n665150m458004
2123C6793242l624478l032573k533669j991303j646120j607107j224992j534552
2115A9598448j518543j315906j101688q28387p93418r47004p05010m99411o11614
$$ plain form
2175 5361404 5493273 5736085 5945597 6123402 6175195 6579084 6839675 7272037 7487509 7695042
2165 7695042 8065381 8384061 8741409 9241368 9733391 10233889 10653010 11427847 12442537
2156 12442537 12974831 13756543 14665445 15698468 16901733 18203434 19966454 21728427 23750822
2147 23750822 25689244 27798298 30073633 32584725 35791502 39587962 43907288 49349160
2139 49349160 55408507 62021016 69937617 78543470 87162278 95520424 102313477 104565461
2131 104565461 99061649 87370278 74394426 62986439 54038118 46916396 41251246 36793242
2123 36793242 33168764 30136191 27602522 25611219 23965099 22357992 21133000 19598448
2115 19598448 18079905 16763999 15662311 14833924 14040506 13093502 12388492 11889081 11277467
2106A1277467n52393m49620l68307k14567m63798k88366l39133n23469m28035
2097G649779j81089l10506k61121l14731k05850k23346l83369k48650j73205j01294
2087E246618j47405l66379j8197q4003j98569j06669j54380o0564k51410j4197
2077C844845l16917o0902k10364r6845j14877K3635k14730j40341J28428m07005
2067B434927L78M7538K5263p7432m832R1283j00604j17390j05410J75780J23152
2056B492653j45652j4861K8571j99868j27588R9431o3937n6721M959j42166j02720
2045A772101j21531j44235j25105L7322M5985j33614o2784M321J94497j41051
2035A325906j3333o6101j20545j2031r7895M6790N8147L7598M9867j64278k0433
$$ plain form
2106 11277467 10725074 10275454 9907147 9692580 9228782 8940416 8601283 8077814 7649779
2097 7649779 7468690 7158184 6897063 6582332 6376482 6153136 5769767 5521117 5347912 5246618
2087 5246618 5099213 4732834 4714637 4630634 4432065 4325396 4171016 4110452 3859042 3844845
2077 3844845 3527928 3467026 3256662 3159817 3044940 3068575 2853845 2713504 2841932 2434927
2067 2434927 2435305 2482843 2508106 2430674 2425842 2517125 2416521 2299131 2193721 2369501 2492653
2056 2492653 2347001 2332140 2360711 2160843 2033255 2132686 2068749 2012028 2016987 1874821 1772101
2045 1772101 1650570 1506335 1381230 1418552 1464537 1330923 1268139 1272460 1466957 1325906
2035 1325906 1312573 1246472 1125927 1113896 1016001 1062791 1120938 1158536 1208403 1044125 1023692
2024A023692Q5853k17937P445M5293n0379N8437K3043j05177j64430J98596L351
2013I07787L1422l8370J1819K5758j70377j31174J06689L4987r3007J61546q4830
2002G62250R781j88254m2908M9716N8984j08987K16977p3357m8265o1333k18329
1991C56275q1695p8193R470k0382J6681Q3532k2948J03212K7656o8646l23830
1980A132K66951J75584j88557K32099R4246r6936j14781j46764r6421j7305O059
1969A15307J97391j78122L2338K20923o0110k09335P7540q282k9739J22790j08838
1958A71863j44718P2683K08496j24496l3478J44574J12963q2161r5440j07346
1948A22940j5118N2810O4878K10205K056j74120j51397M0621j4307J03330J18621
$$ plain form
2024 1023692 1109545 891608 899053 944346 893967 952404 975447 870270 705840 904436 907787
2013 907787 939209 900839 912658 938416 768039 636865 743554 778541 685534 847080 762250
2002 762250 772031 583777 540869 590585 649569 540582 757559 684202 635937 574604 356275
1991 356275 274580 196387 205857 185475 202156 285688 262740 365952 393608 324962 1132
1980 1132 268083 443667 255110 487209 581455 484519 369738 222974 126553 109248 115307
1969 115307 312698 134576 166914 387837 327727 118392 195932 187650 157911 280701 171863
1958 171863 27145 99828 308324 183828 150350 294924 407887 325726 230286 122940
1948 122940 107822 160632 225510 435715 437771 263651 112254 152875 138568 241898 360519
1937C60519j54126Q3031J13008j32542m9841j28371P0443J11770j15540r8148
1927F0203J77920O905K422k8032q163m8682j71950p585O8160L1524J94785P8409
1915C55916r9066J52859J364j88250l9207L6985J19497n9084j35130j3550o2554
1904F9780m488K2451L0640J21531q7764K6158P3260J1842k0646N4322j05488L6819
1892B28417J36488j41556K1127K5537j11155j8873r8395K7991Q0626J38586j5318
1881B73475j36439M4773j1144J88543m813j44862L3148j0888j02297K18524J65465
1870E13485K3352j07801O7053N646p7876L23328n7241j29701M3260m3425J8323
1859E78403k71144j09237J17305Q2720j38063Q3861L8673r4099n0752l9022N2573
$$ plain form
1937 360519 206393 289424 402432 269890 220049 91678 162121 273891 158351 60203
1927 60203 238123 245028 247450 219418 211255 162573 -9377 -16962 51198 82722 277507 355916
1915 355916 256850 409709 411073 222823 183616 220601 340098 281014 145884 132334 69780
1904 69780 65292 87743 118383 239914 152150 178308 251568 263410 242764 297086 191598 228417
1892 228417 364905 223349 244476 270013 158858 139985 41590 69581 150207 288793 273475
1881 273475 137036 181809 170665 359208 354395 209533 242681 231793 129496 348020 513485
1870 513485 536837 429036 496089 501735 423859 747187 689946 560245 603505 560080 578403
1859 578403 307259 198022 315327 398047 259984 343845 382518 288419 237667 198645 251218
1848B51218Q3696p3394m589j13927o0113J8828k2759o6046J21124j58400n7773
1837h2135K29564j71353k3355M9816j8262r2466n6671K29361L227j66089J69082
1826G0719J23611k3930j62880m4182p7508J71775J43309m2940k54133k5729K12136
1815I0248r5746k2680m6328o4992P9433n9739J46811r0463p0956Q6055M6632J7023
1803A5298L8636n9847j01865j13506k0285K58202l6654O1716j21277k3979Q2899
1792b0662O1144K0808q6639n4472j9753P7550K20493K2536k85474r6914r3076
1781b54459M4903M8494J34276j15503M2958n974r1685J69798k6579j17854K71740
1770A00115R0503p8909m1038P5k3111J27926k31458K2085k2909j03787J15151
$$ plain form
1848 251218 334914 261520 256931 143004 82891 101719 78960 12914 134038 -24362 -82135
1837 -82135 147429 -23924 -47279 2537 -15725 -108191 -164862 64499 67726 -98363 70719
1826 70719 194330 170400 7520 -36662 -114170 57605 200914 157974 -96159 -121888 90248
1815 90248 -5498 -28178 -74506 -139498 -60065 -119804 27007 -63456 -134412 -48357 -1725 15298
1803 15298 53934 -5913 -107778 -221284 -241569 16633 -20021 41695 -79582 -103561 -20662
1792 -20662 40482 61290 -25349 -79821 -99574 -22024 198469 221005 -64469 -161383 -254459
1781 -254459 -209556 -161062 -26786 -142289 -99331 -105305 -196990 -27192 -53771 -171625 100115
1770 100115 190618 111709 70671 70746 47635 175561 -55897 -33812 -56721 -160508 -45357
1759d5357J5251j64335L23689j54450k30284K75921k976J18279q1334p2744K31401
1748B13061K04879k45065p820j14869l2915J03595j26799j41762L3710J04666
1738i319p4259r0868K95444R95j60962o5493J16923k71487R1858P8970J8125J9396
1726e0677r7176J3872K44581j52240K01m7838j25892R6656n8340P0932L02072
1715A96151Q0634o6230r2608L5492K8950j07419j93183J1678K8702J27202r1767
1704d2398J29681J32758k6729j0648P9531j18174l28568J19865K3846N2748Q6830
1693I8742J8248j30917J3798R2014k1702l9502l3836j06328j8656O7448J15079
1682E4388J0517N444O27j84666j24728J01784M9000n1180O3109P2487j78818Q0942
$$ plain form
1759 -45357 -30106 -194441 129248 -25202 -255486 20435 17459 135738 54404 -18340 213061
1748 213061 417940 172875 165055 50186 17271 120866 -5933 -147695 -113985 -9319
1738 -9319 -83578 -174446 120998 121993 -38969 -104462 12461 -259026 -167168 -88198 -70073 -50677
1726 -50677 -147853 -133981 110600 -41640 -41439 -89277 -215169 -118513 -176853 -105921 196151
1715 196151 276785 210555 117947 153439 182389 74970 -118213 -106535 -77833 49369 -42398
1704 -42398 87283 220041 193312 182664 262195 144021 -184547 -64682 -40836 11912 98742
1693 98742 116990 -13927 -129 91885 70183 30681 -3155 -109483 -128139 -60691 54388
1682 54388 64905 70349 70976 -113690 -238418 -136634 -87634 -138814 -75705 -3218 -182036 -101094
1670a01094K0786M047K1343P3722k16704J30826N4369q3240k3719R6306j6373
1659c9731L1727r2540J5234J51775p781j40282j91028K7833J24275o344J09212
1648a7650L2897R3204l744j28885O2741j12626p5612K12861K04160K5969q6264
1637B07051j6028j54563j19696J2405p2652K4087p4895Q5133K14974p8353o7520
1626d0057l3228j16670J53023O8221m913l1104l2733J38261q096j51523J10643
1615E1824j25856j41942J96450K42690k67954j38753M6135R6204J5886o7683K2750
1604g0249j9957N559L3044j28602M5348J47862O6598p4975R0241m5430N6617J31793
1592B37849j67807k7546j05816N6015l6594k5062J7817l5402k1612L9604k7275
$$ plain form
1670 -101094 -80308 -76261 -54918 18804 -197900 -67074 -12705 -95945 -119664 -23358 -39731
1659 -39731 -8004 -100544 -85310 66465 58684 -81598 -272626 -244793 -120518 -126862 -17650
1648 -17650 15247 108451 104707 -24178 38563 -74063 -149675 63186 267346 293315 207051
1637 207051 191023 36460 -83236 -70831 -143483 -119396 -194291 -109158 105816 27463 -40057
1626 -40057 -73285 -189955 -36932 31289 26376 -4728 -37461 100800 92704 -58819 51824
1615 51824 -74032 -215974 -19524 223166 -44788 -183541 -137406 -41202 -25316 -92999 -70249
1604 -70249 -90206 -84647 -51603 -180205 -134857 13005 79603 4628 94869 49439 106056 237849
1592 237849 70042 42496 -63320 -7305 -43899 -68961 -51144 -86546 -108158 -68554 -95829
1581i5829j65884R8398J71332j62246o3761j54296M6643N0953K0022Q0866j47892
1570c21694J41687L03j9030J323Q7694n9779j1475o5090l0028M3123J5671P3475
1558a43820j3953p7626n7796k8740J52403p7022j09849R6593Q7637Q6821p6632
1547a61984N9936j68654R1063J39186K5403k52661P9254L5799J52118J11566q6835
1536B4191K35948o0983k62283J4559k6238m7597O1853J11617j67401n4765l5712
1525b06811J44327L5639j35341K9222p4737J11760k8377K5383O3304o7001P386
1514i5246q8840l9564K1996J60205j12228j53498O4270J17363k22738J73255J75926
1503I01n9730K10100k05091N868j67972J30247J70362Q6109j30998K3396j33588
$$ plain form
1581 -95829 -261713 -163315 8017 -154229 -217990 -372286 -325643 -274690 -254668 -173802 -321694
1570 -321694 -180007 -179704 -198734 -197411 -109717 -169496 -180971 -246061 -276089 -232966 -217295 -143820
1558 -143820 -157773 -235399 -293195 -321935 -169532 -246554 -356403 -259810 -172173 -85352 -161984
1547 -161984 -102048 -270702 -179639 -40453 -15050 -267711 -188457 -152658 -540 111026 24191
1536 24191 260139 199156 -63127 -48568 -74806 -122403 -60550 51067 -116334 -171099 -206811
1525 -206811 -62484 -26845 -162186 -132964 -207701 -95941 -124318 -98935 -35631 -102632 -95246
1514 -95246 -184086 -223650 -201654 -41449 -153677 -307175 -242905 -125542 -348280 -175025 901
1503 901 -58829 151271 -53820 -47952 -215924 -85677 84685 170794 39796 63192 -70396
1492g0396j31067K84793R6781j63276k6472L7318j53591l8827O3715J6053L4361
1481e0608j03830N6168j19705J26575P9731M0773p4344k25001K00451K4792k9718
1470g4716J28497j00877K481j34918J192K8780o6528k545k8199J24013K33294
1459A10474j12892k54356L4680N3563J15616j81968M387J68145o1252n7692J51310
1448b9985m6665o2017P2410o3525J65000n8821k2800O2735j59805P8324L7080
1437b8069p3198K22285J1866m702k48552N61R3276l9156k20781J08150K82965
1426A04645o0146k8799r5498q7667K8836O8931M1347j3129r056r2582J11291J91368
1414A59541j08735p702M626r2645o9392J98515l1645R4371m4941P0933j48924
$$ plain form
1492 -70396 -201463 83330 180111 16835 -9637 27681 -125910 -164737 -101022 -84969 -50608
1481 -50608 -154438 -98270 -217975 -91400 -11669 29104 -45240 -270241 -69790 -44998 -74716
1470 -74716 53781 -47096 -44615 -179533 -178341 -149561 -216089 -218634 -246833 -122820 110474
1459 110474 -2418 -256774 -222094 -168531 -52915 -234883 -230496 -62351 -123603 -181295 -29985
1448 -29985 -76650 -138667 -66257 -129782 35218 -23603 -46403 16332 -143473 -65149 -28069
1437 -28069 -101267 121018 132884 128182 -120370 -119809 -26533 -65689 -286470 -178320 104645
1426 104645 44499 15700 -79798 -167465 -138629 -69698 -28351 -41480 -50536 -143118 -31827 159541
1414 159541 50806 43104 47730 -44915 -114307 84208 52563 146934 101993 172926 24002
1403B4002o1047L878l5078p039k7766j28357K49894q8147P1088q0517Q2344j2805
1391i550M220p1507J36640n487l00567q1673Q4568K81053j74490l9390Q662J61153
1379f368P4351p9732J526R0495N1919j07600o8581K7572R9050j18357j33203m0767
1367b09695j71171J02942J28639K40154q4527j38421m8225J50077O4048o9277
1357c5456J4403j49894J62627N8814K31134l9297j98622j30336l2214J34785O8268
1346H4212j55262r0118K8482j37958Q8614j9334k59153O2017J21587J59081J66762
1335D8930r8602m3292q3136m9839n1075J32630o1569K34900M7151o3442K499J00823
1323A15978j85100k13547J16872J8274J56775M3181k2322P2858j26816R335L511
$$ plain form
1403 24002 -37045 -33167 -68245 -75284 -103050 -231407 18487 -69660 1428 -79089 3255 -9550
1391 -9550 -5330 -76837 59803 54316 -246251 -327924 -243356 37697 -136793 -176183 -167521 -6368
1379 -6368 67983 -11749 -10223 80272 132191 24591 -43990 -16418 82632 -35725 -168928 -209695
1367 -209695 -380866 -277924 -149285 90869 6342 -132079 -180304 -30227 33821 -35456
1357 -35456 -21053 -170947 -8320 50494 281628 242331 43709 -86627 -118841 15944 84212
1346 84212 -71050 -161168 -132686 -270644 -182030 -201364 -460517 -398500 -276913 -117832 48930
1335 48930 -49672 -92964 -176100 -225939 -277014 -144384 -205953 28947 76098 12656 15155 115978
1323 115978 -69122 -282669 -165797 -147523 9252 52433 30111 102969 -23847 -14512 -11001
1312a1001Q9728k27020j12672J01832J71422N7115o4989R551L2232M1049m5226
1301D2021j75790J93287j09803k00260j2467J08799J86773j05193k44904j4103
1291c31640K12893N9704J55095L2227k47078l9300j65056L767J52533m342k2373
$$ plain form
1312 -11001 78727 -148293 -260965 -159133 12289 69404 4415 13966 46198 87247 42021
1301 42021 -133769 59518 -50285 -250545 -263012 -154213 32560 -72633 -317537 -331640
1291 -331640 -118747 -59043 96052 128279 -118799 -158099 -323155 -319388 -166855 -171197 -193570
$$ [...]
##END NTUPLES=NMR SPECTRUM
##END=
