##TITLE=1H_CA-8948-1
 CDCl3
 8 sc, 
 10.11.2021
##JCAMPDX= 6.0         $$ Bruker NMR JCAMP-DX V2.0
##DATA TYPE= NMR SPECTRUM
##DATA CLASS= NTUPLES
##ORIGIN= UXNMR, Bruker Analytische Messtechnik GmbH
##OWNER= root
$$ XWIN-NMR		Version 3.5
$$ Wed Nov 10 11:52:18 2021 Russian Standard Time (UT+4h)  she@DPX200
##.OBSERVE FREQUENCY= 200.1313468511
##.OBSERVE NUCLEUS= ^1H
##.ACQUISITION MODE= SIMULTANEOUS
##.ACQUISITION SCHEME= undefined
##.AVERAGES= 8
##.DIGITISER RES= 18
##SPECTROMETER/DATA SYSTEM= spect
##.PULSE SEQUENCE= zg30
##.SOLVENT NAME= CDCl3
##.SHIFT REFERENCE= (INTERNAL, CDCl3, 0, 15.7127)
##AUDIT TRAIL= $$ (NUMBER, WHEN, WHO, WHERE, WHAT)
$$ ##TITLE= Audit trail, XWIN-NMR		Version 3.5
$$ ##JCAMPDX= 5.01
$$ ##ORIGIN= Bruker BioSpin GmbH
$$ ##OWNER= she
$$ F:/spectra/data/she/nmr/H-F/1/pdata/1/auditp.txt
$$ ##AUDIT TRAIL=  $$ (NUMBER, WHEN, WHO, WHERE, WHAT)
(   1,<2021-11-10 11:50:29.28 +0400>,<she>,<DPX200>,
      <created by zg, POWCHK disabled, PULCHK disabled
       configuration hash MD5:
       00 E9 B6 7A A2 85 ED C7 34 08 36 98 17 FE 4E 26
       data hash MD5: 16K
       03 12 80 C0 3E 25 7A 4A 9A 75 4E B5 AE DC 86 A4>)
(   2,<2021-11-10 11:50:31.78 +0400>,<she>,<DPX200>,
      <Start of raw data processing
       efp BC_mod = 2 LB = 0.24 FT_mod = 6 PKNL = 1 PHC0 = -15521.88 PHC1 = 36.60082 SI = 16K 
       data hash MD5: 16K
       F2 4C 38 D3 2E DC E9 1E B1 25 EF DC 81 76 64 C4>)
(   3,<2021-11-10 11:50:57.82 +0400>,<she>,<DPX200>,
      <pk PHC0 = 11.13839 PHC1 = -33.60001 
       data hash MD5: 16K
       C0 E2 87 4E 6D A1 A8 95 E2 CC 25 BD 3D 85 21 E4>)
(   4,<2021-11-10 11:51:01.43 +0400>,<she>,<DPX200>,
      <abs ABSG = 5 
       data hash MD5: 16K
       A4 F1 6D 82 14 45 3B 34 9F DF 2E 23 E0 92 D5 20>)
(   5,<2021-11-10 11:51:43.68 +0400>,<she>,<DPX200>,
      <pk PHC0 = -1.760058 PHC1 = 5.6 
       data hash MD5: 16K
       C3 CB 0E 13 5B 9E B9 D7 9F DB 48 67 3F 4B E7 B8>)
(   6,<2021-11-10 11:51:47.39 +0400>,<she>,<DPX200>,
      <abs ABSG = 5 
       data hash MD5: 16K
       9B 75 9D 08 EF B4 1D 01 55 AC D6 D7 9E D7 05 C2>)
$$ ##END=
$$ 
$$ hash MD5
$$ A3 D1 C5 CF DE 21 73 0F E5 2D F9 70 AF C3 0C 7E
##$RELAX= 
##$RELAX= 
##$RELAX= 
##$RELAX= 
##$RELAX= 
##$RELAX= 
$$ Bruker specific parameters
$$ --------------------------
##$DU= <F:/spectra>
##$EXPNO= 1
##$NAME= <H-F>
##$PROCNO= 1
##$TYPE= <nmr>
##$USER= <she>
##$AMP= (0..31)
100 100 100 100 100 100 100 100 100 100 100 100 100 100 100 100 100 100 
100 100 100 100 100 100 100 100 100 100 100 100 100 100 
##$AQSEQ= 0
##$AQ_mod= 1
##$AUNM= <au_zg>
##$AUTOPOS= <>
##$BF1= 200.13
##$BF2= 200.13
##$BF3= 200.13
##$BF4= 200.13
##$BF5= 200.13
##$BF6= 200.13
##$BF7= 200.13
##$BF8= 200.13
##$BYTORDA= 1
##$CFDGTYP= 0
##$CFRGTYP= 5
##$CHEMSTR= <none>
##$CNST= (0..31)
1 1 145 1 1 1 1 1 1 1 1 1 1 1 1 1 1 1 1 1 1 1 1 1 1 1 1 1 1 1 1 1 
##$CPDPRG= <>
##$CPDPRG1= <>
##$CPDPRG2= <>
##$CPDPRG3= <>
##$CPDPRG4= <mlev>
##$CPDPRG5= <mlev>
##$CPDPRG6= <mlev>
##$CPDPRG7= <mlev>
$$ [...]
##$SUBNAM2= <"">
##$SUBNAM3= <"">
##$SUBNAM4= <"">
##$SUBNAM5= <"">
##$SUBNAM6= <"">
##$SUBNAM7= <"">
##$SUBNAM8= <"">
##$SUBNAM9= <"">
##$SW= 18.0517286264689
##$SWIBOX= (0..15)
0 0 2 0 0 0 0 0 0 0 0 0 0 0 0 0 
##$SW_h= 3612.71676300578
##$TD= 16384
##$TD0= 1
##$TE= 0
##$TE2= 300
##$TE3= 300
##$TEG= 300
##$TL= (0..7)
0 120 120 120 120 120 120 120 
##$TP= (0..7)
150 150 150 150 150 150 150 150 
##$TP07= 0
##$TPNAME0= <>
##$TPNAME1= <>
##$TPNAME2= <>
##$TPNAME3= <>
##$TPNAME4= <>
##$TPNAME5= <>
##$TPNAME6= <>
##$TPNAME7= <>
##$TPOAL= (0..7)
0.5 0.5 0.5 0.5 0.5 0.5 0.5 0.5 
##$TPOFFS= (0..7)
0 0 0 0 0 0 0 0 
##$TUNHIN= 0
##$TUNHOUT= 0
##$TUNXOUT= 0
##$USERA1= <user>
##$USERA2= <user>
##$USERA3= <user>
##$USERA4= <user>
##$USERA5= <user>
##$V9= 5
##$VALIST= <valist>
##$VCLIST= <CCCCCCCCCCCCCCC>
##$VD= 0
##$VDLIST= <DDDDDDDDDDDDDDD>
##$VPLIST= <PPPPPPPPPPPPPPP>
##$VTLIST= <TTTTTTTTTTTTTTT>
##$WBST= 1024
##$WBSW= 4
##$XGAIN= (0..3)
0 0 0 0 
##$XL= 0
##$YL= 0
##$YMAX_a= 232089
##$YMIN_a= -327964
##$ZGOPTNS= <>
##$ZL1= 120
##$ZL2= 120
##$ZL3= 120
##$ZL4= 120
##$ABSF1= 15.71273
##$ABSF2= -2.339119
##$ABSG= 5
##$ABSL= 3
##$ALPHA= 0
##$AQORDER= 0
##$ASSFAC= 0
##$ASSFACI= 0
##$ASSFACX= 0
##$ASSWID= 0
##$AUNMP= <proc_1d>
##$AZFE= 0.1
##$AZFW= 0.1
##$BCFW= 0
##$BC_mod= 2
##$BYTORDP= 0
##$COROFFS= 0
##$CY= -3
##$DATMOD= 1
##$DC= 0
##$DFILT= <>
##$DTYPP= 0
##$F1P= 0
##$F2P= 0
##$FCOR= 1
##$FTSIZE= 16384
##$FT_mod= 6
##$GAMMA= 0
##$GB= 0
##$INTBC= 1
##$INTSCL= 0
##$ISEN= 128
##$LB= 0.24
##$LEV0= 0
##$LPBIN= 0
##$MAXI= 10000
##$MC2= 0
##$MEAN= 0
##$ME_mod= 0
##$MI= 1.114404
##$NCOEF= 0
##$NC_proc= -7
##$NLEV= 6
##$NOISF1= 3.799351
##$NOISF2= 2.8
##$NSP= 0
##$NTH_PI= 0
##$NZP= 0
##$OFFSET= 15.71273
##$PC= 1
##$PHC0= -15512.5
##$PHC1= 8.600809
##$PH_mod= 1
##$PKNL= yes
##$PPARMOD= 0
##$PSCAL= 0
##$PSIGN= 0
##$REVERSE= no
##$SF= 200.130008620662
##$SI= 16384
##$SIGF1= 3
##$SIGF2= 2
##$SINO= 5.538805
##$SIOLD= 16384
##$SREGLST= <1H.CDCl3>
##$SSB= 0
##$STSI= 16384
##$STSR= 0
##$SW_p= 3612.71676300578
##$SYMM= 0
##$S_DEV= 0
##$TDeff= 16384
##$TDoff= 0
##$TI= <>
##$TILT= no
##$TM1= 0
##$TM2= 0
##$TOPLEV= 0
##$USERP1= <user>
##$USERP2= <user>
##$USERP3= <user>
##$USERP4= <user>
##$USERP5= <user>
##$WDW= 1
##$XDIM= 16384
##$YMAX_p= 365617785
##$YMIN_p= -1989287
$$ End of Bruker specific parameters
$$ ---------------------------------
##NTUPLES= NMR SPECTRUM
##VAR_NAME=  FREQUENCY,     SPECTRUM/REAL,   SPECTRUM/IMAG
##SYMBOL=    X,             R,               I
##VAR_TYPE=  INDEPENDENT,   DEPENDENT,       DEPENDENT
##VAR_FORM=  AFFN,          ASDF,            ASDF
##VAR_DIM=   16384,         16384,           16384
##UNITS=     HZ,            ARBITRARY UNITS, ARBITRARY UNITS
##FACTOR=    0.220516191357247, 1,           1
##FIRST=     3144.58887195011, 0,            0
##LAST=      -468.12789105567, 0,            0
##MIN=       -468.12789105567, -1989287,     0
##MAX=       3144.58887195011, 365617785,    0
$$ Real data points
##PAGE= N=1
##DATA TABLE= (X++(R..R)), XYDATA
$$ [...]
7550A81668k63806M37856J59093k3882N49584m3185l01924m53562M51153Q1118
7540G74113l41036l74360N06162L57621L80962J09182l9493p82383p9007k98546
7530B13215M52335Q8242M19141r1527l94275j20737l58842K3194J62831L52254
7520G45831l84870k30732m00508Q22066j69673K25873J64776l26051m03852l26863
7510b84003L91583j9412n06813M66690n0671J7530P26293K42139k0661q99373
7500F3302J15940O4096J61722o32920l65404L2243N71664L88729l73357m51591
7490d25576J53158M85426J05396j00656k15955m33382L36065L31379K97834j40332
7480C93357L7028j67407n31939L95261O49093n28643k94892K28342N35151l22186
$$ y = [181668, -82138, 355718, 514811, 490929, 1040513, 997328, 695404, 241842, 692995, 774113, 433077, 58717, 564879, 922500, 1303462, 1412644, 1373151, 590768, 511761, 213215, 665550, 753792, 1172933, 1081406, 687131, 566394, 207552, 230746, 393577, 745831, 360961, 130229, -270279, 551787, 382114, 607987, 772763, 446712, 42860, -284003, 107580, 88168, -418645, 48045, -2626, 14904, 741197, 983336, 962675, 63302, 179242, 243338, 405060, -227860, -593264, -561021, 10643, 399372, 26015, -425576, -272418, 213008, 318404, 217748, 1793, -431589, -95524, 235855, 533689, 393357, 430385, 262978, -268961, 126300, 775393, 246750, -48142, 180200, 715351, 393165]
7470C93165k57472O00297j22415o87600L01783K17567l64133j52029K01526K53774
7460C84463l70266L22110P69105J73634o5450l69758m42988L46351n27348l08852
7450h8999l0221j18372M73137j019691M89165O1952l13744N93977j76988P49165
7440F19381m29189m13563O21836j06620K44807j76345L000J48604m13471M38122
7430E36562O27441L72202o59762j10687l71021k26773P3269k4030J60480m38080
7420f0399l83701L47990j65850L24132K22444p37414j28034K98732M75773k05087
7410a1414m92533J70972K97928J05177L17751j75104m37934j02090K43220L32025
7400B47998m03669j98384k59717K46485P0669q8490j21988l2387K55231m05757
$$ y = [393165, 135693, 735990, 613575, -74025, 227758, 445325, 81192, -70837, 130689, 384463, 14197, 336307, 1105412, 1279046, 1213596, 843838, 400850, 747201, 219853, -88999, -119220, -237592, 235545, -784146, -294981, -233029, -546773, 47204, -129784, 619381, 190192, -223371, 398465, 291845, 536652, 360307, 363307, 511911, 98440, 536562, 1164003, 1536205, 876443, 765756, 394735, 167962, 241231, 217201, 377681, -60399, -444100, -96110, -261960, 62172, 284616, -452798, -580832, -282100, 193673, -11414, -503947, -332975, -35047, 70130, 387881, 212777, -225157, -327247, -84027, 247998, -155671, -354055, -613772, -367287, -296618, -385108, -507096, -539483, -284252, -690009]
7390f90009j30464M63120J8363m9420j54408K97371k47791K37589k29042l55146
7380h39837O64448M75163k76622o67377m686N21321o3200p0584N34712l83121
7370a09783k52599l65533L70716K70198m19780m79415M21398P02267J60859q8963
7360B09365m50663m41898k00421L14584L53882j52646k62851j84499p2381N10317
7350c77211J76144N5078l03318l44805l43583k2430L75148J73403n29456J24676
7340a016354k10488R88399j60745j19273L32017K57953l57389m16817l73595M65051
7330f11241N74907J2126o83451l1644L92092m29470l4831m8414J20439m8319J8592
7319g69214M73703o98294k15302J119052m55631n54995q88606P85759M48006m3655
$$ y = [-690009, -820473, -357353, -338990, -388410, -542818, -245447, -493238, -255649, -484691, -839837, -175389, 299774, 23152, -644225, -648911, -127590, -190790, -261374, 273338, -109783, -362382, -727915, -357199, -87001, -506781, -986196, -564798, 137469, 298328, 209365, -241298, -683196, -883617, -569033, -215151, -367797, -630648, -815147, -887528, -377211, -201067, -145989, -449307, -794112, -1137695, -1160125, -784977, -611574, -1141030, -1016354, -1226842, -238443, -399188, -518461, -186444, 71509, -285880, -702697, -1076292, -611241, -36334, -24208, -707659, -739303, -347211, -776681, -811512, -859926, -739487, -787806, -769214, -295511, -993805, -1209107, -90055, -545686, -1100681, -1989287, -1203528, -755522, -799177]
7309g99177j7830L49303j79179J92888n22912P11832k60826K08880o02388l87722
7299a307131O28537j22653N14647K05596j93921J57447l20060K67768n9528j195563
7289a424861J37640J44001r5195J69735J32805k33919j9650L1893K59579L43501
7279e54471n2901L50115J01700l68504o0518O0639o2303k58975n5554L18755l17008
7268h99025n23213O13806P63820n92346J15721O2019K04918K25877q77629L13134
7258e92918J35228o1561k19686j46805J47456l26252J71176Q55036j36233m03691
7248e78250J50181N44354j23372r45207j70059l1605j19521K71269M59126O0801
7238d82283J56579j92585J71663m38747p5540j39212K20374O96263K62907m13084
$$ y = [-799177, -817007, -467704, -646883, -453995, -976907, -265075, -525901, -317021, -919409, -1307131, -678594, -801247, -286600, -81004, -274925, -117478, -437538, -169770, -229298, -1424861, -1287221, -1143220, -1238415, -1068680, -935875, -1169794, -1189444, -1157551, -897972, -554471, -607372, -257257, -155557, -524061, -584579, -523940, -586243, -845218, -900772, -582017, -899025, -1422238, -808432, -44612, -636958, -521237, -459218, -254300, -28423, -906052, -592918, -457690, -519251, -738937, -885742, -738286, -1064538, -893362, -38326, -174559, -578250, -428069, 116285, -7087, -952294, -1122353, -1153958, -1273479, -1002210, -543084, -482283, -325704, -518289, -346626, -785373, -860913, -1000125, -779751, -83488, 179419, -233665]
7228b33665K53131M8394k39782r6041j55817N75710q46435n79765J38591N85853
7218e49826n76455k00032J24900k89495K7575L65058j8819M22862p83021J45325
7208a331928N88409M35870l57837J9399Q72337J08090p03942J6434K30639M9558
7198g2971N1997J08919l51606j42333N33003l92p11021m17080K3956p4649o4572
7187a116749L34794K5321n44848l66744P10606J00287O0854M77566J67479J71354
7177A9920j13721j11110k25004N09921j63738L31918n36784p7229M33558j18746
7167e1015n09489M4775j22632k02565k09217J68660k2069M2138p9830M15627K11661
7156c13956n27504r3909R9718L73967P4528k55325q8120P22557R8820J79999l36250
$$ y = [-233665, 19466, 67860, -171922, -267963, -423780, 151930, -694505, -1274270, -1135679, -549826, -1126281, -1326313, -1201413, -1490908, -1463333, -1098275, -1117094, -694232, -1477253, -1331928, -743519, -307649, -665486, -646087, 226250, 334340, -369602, -353168, -122529, -72971, -20974, 87945, -263661, -405994, 127009, 126617, -584404, -1001484, -977528, -1052177, -1116749, -781955, -756634, -1301482, -1668226, -957620, -857333, -796479, -318913, -151434, 19920, -93801, -204911, -429915, 80006, -83732, 248186, -288598, -365827, 67731, -51015, -560504, -515729, -638361, -840926, -1050143, -881483, -903552, -861414, -941244, -525617, -313956, -841460, -935369, -835651, -461684, -387156, -642481, -730601, -8044, 90776, 270775, -65475]
7145f5475L60227k41042n2618l05836Q0428l01024K6914M22419l37483l04919
7135g18409P0240K12270O4205k89409k06689j47076O62835J16509q2021j91106
7125e08651K96417J52756n50010L24800j08513j13476p75653K16194N97947M79883
7115A1694k60249L53217l98371L32822q99867M6402k37225N9569R66407j12333
7105a37934k90905j06533O96824j96177p63809o0787N40149J43410j66896K55562
7095h7096l85766K04030O46538N7862o81008q32965K49639m67779L03084M09946
7085e83515r4734l65108M95538N49943n41077n02929N06211J37999p59758m6461
7075a203891M30979J99585K113N24649M52608n21339n05441P38455L49677k32159
$$ y = [-65475, 294752, 53710, 1092, -304744, -224316, -525340, -498426, -76007, -413490, -718409, -648169, -435899, -371694, -661103, -867792, -1014868, -352033, -235524, -317545, -508651, -212234, -59478, -609488, -284688, -393201, -506677, -1282330, -1066136, -468189, 11694, -248555, 104662, -293709, 39113, -860754, -814352, -1051577, -992008, -25601, -137934, -428839, -535372, 161452, -34725, -798534, -859321, -319172, -175762, -342658, -87096, -472862, -268832, 377706, 435568, -245440, -1078405, -828766, -1296545, -993461, -583515, -678249, -1043357, -547819, 2124, -538953, -1041882, -535671, -397672, -1157430, -1203891, -772912, -573327, -571214, -46565, 406043, -115296, -620737, 117718, 467395, 235236]
7065B35236n4327l3529m83498j84847L4552L9188j117019k92394J29073L17560
7055a410005k50780K47169L28006k48497M60570j36406O31851k72297L0888k68881
7045h88382j15893Q08086K90003K48326n60678j32294J36988J01741p3616R91726
7035H06007M78133n81360n64750L77809R58121j75063O980q24504o70292J36476
7025e2443O19917j12846j34164m50233K99989l25275p8092j27870K3041l8251
7015c76227k86316O50293k59689M35347k04483L03409O51105o90953K64410K6698
7005E13594L85282n83770p45562O42578J30971J11787O11991k87303p62762n56867
6995e40061r1304M07960j8003N54471M47079r4753K80090k03568j50945j074710
$$ y = [235236, 180909, 147380, -336118, -520965, -486413, -447225, -1564244, -1856638, -1727565, -1410005, -1660785, -1413616, -1085610, -1334107, -873537, -1009943, -378092, -650389, -619501, -888382, -1004275, -196189, 93814, 342140, -218538, -350832, -213844, -112103, -185719, 806007, 1284140, 702780, 138030, 515839, 1473960, 1298897, 1305877, 481373, -188919, -52443, 567474, 454628, 320464, -129769, 170220, -155055, -233147, -361017, -337976, -376227, -662543, -12250, -271939, 163408, -41075, 262334, 913439, 222486, 486896, 513594, 898876, 315106, -430456, 212122, 343093, 454880, 1066871, 779568, 16806, -540061, -631365, -223405, -241408, 313063, 760142, 665389, 945479, 741911, 590966, -483744]
6985d83744M37817k21577l59773l7239l2467O40207n64270N28189M68287l82019
6975f589n41214k58322K68044K39885J11825N36452k72019l6512K28203J288220
6965A557973m95117L035Q6634K41025m53631m83326L28323r3933l8282N6549p7319
6954F31931o43385p1444J06474n84218o68909L67631Q38157k95429k18352M96526
6944d1018l52317R71362J55661L26907p36981j82700O68676q248o36140j06736
6934E8466K21338j33396p80704n2911j02298L28436m09455N26729o7828l17762
6924g29385Q91972l82887j05664r34284M09353K22839K16767l9777J37872J49612
6914a63582j57453K85617J1049O6947j57456j76139j41941l16565O43521r6520
$$ y = [-483744, -45927, -267504, -627277, -664516, -696983, -56776, -621046, -92857, 375430, -6589, -547803, -806125, -538081, -298196, -186371, 350081, 78062, 41550, 269753, 1557973, 1062856, 1065891, 1152525, 1393550, 939919, 456593, 784916, 690983, 652701, 709250, 631931, -11454, -82898, 23576, -560642, -1229551, -861920, -23763, -319192, -537544, -41018, -393335, 578027, 733688, 1060595, 323614, 140914, 809590, 801342, 165202, 58466, 279804, 146408, -634296, -687207, -789505, -461069, -870524, -343795, -411623, -729385, 162587, -220300, -325964, -1260248, -850895, -628056, -411289, -451066, -313194, -163582, -321035, -35418, -24369, 42578, -114878, -291017, -432958, -749523, -106002, -202522]
6904b02522l93044N26839L781Q827k28388p0310m6356l44109M78786N28205j25495
6893A36214j84386j43807J38748L15949k18872l29383J96463J6506J059253k61481
6883G25204n8465M21134o6412j35771o71709J59873K76563n6594K04550J84484
6873I82857p5858k89781m44325M37470k27024N60420k18331o9738k23909K98291
6863G30072L41714m0131k06374J13156j72779n22873l93567L2620J12419J63367
6853A57624k22973k46820j81508O61340L1266o29929K26584L90440K6173J6534
6843B28731k91241m5485m85031K24820l2046M2170R52810m96627p23435o91020
6833a316354P53355O43284j91341l45484M81237l2307m91510J80132L49387P95333
$$ y = [-202522, -595566, -68727, -64946, -56119, -284507, -354817, -401173, -745282, -266496, 261709, 136214, -48172, -191979, -53231, 262718, 43846, -285537, -89074, -72568, 986685, 725204, 666739, 1087873, 1021461, 885690, 213981, 373854, 650417, 593823, 798373, 982857, 906999, 617218, 172893, 610363, 383339, 943759, 725428, 655690, 431781, 730072, 1071786, 1031655, 825281, 938437, 765658, 242785, -150782, -118162, -5743, 157624, -65349, -312169, -493677, 167663, 198929, -431000, -204416, 186024, 212197, 228731, -62510, -107995, -593026, -368206, -400252, -358082, 594728, 98101, -625334, -1316354, -562999, 80285, -111056, -456540, 24697, -7610, -499120, -318988, 30399, 825732]
6823H25732m19361k38994j12852j71139M18073K99011j20469r2821L26315J31792
6813H45287p37054j83864K40084N4752q56831k18712O82960l03347M81705m03215
6803c98235L89459K07672J43463q5617j99474J93398L00718k23346j61602l72574
6793b06138P15511m2720n51899l30891O87682N33919p76513j33560J53911K34415
6783B83717j01909o12879j42303J27363O10167m84004l16486k18653K13417j17108
6773g58678J77801M5858n02262K13110k10072j22850m16317P82447R70470L26918
6763E06425Q0022o49364r388j09744q7556R9249j82617N3405l63564P16083M56691
6752E09642K11825k23033l055j10432o7170n76375m17463M52041K61861l3481
$$ y = [825732, 406371, 167377, 54525, -116614, 301459, 600470, 480001, 387180, 713495, 845287, 108233, -75631, 164453, 219205, -637626, -856338, -173378, -476725, 4980, -398235, -8776, 198896, 342359, 256742, 57268, 250666, 551384, 328038, 166436, -206138, 509373, 466653, -85246, -416137, 271545, 805464, 28951, -104609, 49302, 283717, 181808, -431071, -573374, -446011, 164156, -319848, -636334, -854987, -641570, -758678, -580877, -535019, -1037281, -824171, -1034243, -1157093, -1573410, -790963, 179507, 506425, 586447, -62917, -72305, -182049, -269605, -170356, -352973, -299568, -663132, 52951, 509642, 721467, 498434, 495379, 384947, 317777, -258598, -676061, -224020, 37841, 4360]
6742D360n59171m66819J12457L49669M51194Q8469K9689K85952J03398J74034
6732E73232J9183L17104r9839j72569m41397k39092K66289k75008J29549J15676
6722A93128K75215n76176J82686M08342J34313k34273j4855N23205m16991l48531
6712A26063l43447Q7247k42369N58608L725n54064M1175P4157J84270P83964j91758
6701E27571j38130l87551L18898M35063l3017M71811k45225j83104o3659O63174
6691A365831l4444o6819j38953Q80318J12296p01922j25108j82762M47791k38643
6681A317585r9352L39388l82325m02994J06458m81098Q262k87908L86326L49179
6671H53521m24080J16902k08725J6887q530p575j93135K21406J85372n1657M34023
$$ y = [4360, -554811, -1021630, -909173, -559504, -108310, -19841, 9848, 295800, 399198, 573232, 592415, 909519, 809680, 637111, 195714, -43378, 222911, -52097, 77452, 193128, 468343, -107833, 74853, 483195, 617508, 383235, 368380, 891585, 474594, 126063, -217384, -130137, -372506, 186102, 189827, -364237, -323062, -248905, -64635, 719329, 527571, 389441, 1890, 320788, 755851, 722834, 1194645, 949420, 766316, 702657, 1365831, 1331387, 1264568, 1125615, 2005933, 2118229, 1416307, 1291199, 1108437, 1556228, 1317585, 1218233, 1557621, 1175296, 772302, 878760, 397662, 405924, 118016, 504342, 853521, 429441, 546343, 337618, 354505, 345975, 338400, 145265, 366671, 552043, 500386, 934409]
6660I34409j10240q2103j35337j70411K88227q08081k4306k02911P9487L35647
6650A04381J04457j24754k09284J71288L64532q80410k89145l48563Q83982l97145
6640f20661m88785L50915L90281J26717o58772P09872L1952j87162p1971K55486
6630a62128K5990l15914Q26077K34005n03704K32326J86310K9255p13307l03058
6620d64148J6419J18434m84449K70111L05495M4380k30276R2772N68736j78417
6610E9057J58946n87993k83030J96365L45430K94442l11388M2893K27795K51692
6600C94209L15713q47389j53357L33237J14174J3745o33625K10540R51052q07409
6590a09110p04414l0169Q35152O40717o49762l56188K9296M08295l91342O20543
$$ y = [934409, 824169, 742066, 606729, 436318, 724545, -83536, -107842, -310753, -231266, 104381, 208838, 84084, -125200, 46088, 410620, -469790, -758935, -1107498, -223516, -620661, -1109446, -758531, -368250, -241533, -900305, -190433, -158481, -345643, -417614, -162128, -136138, -452052, 374025, 608030, 104326, 336652, 522962, 552217, -161090, -464148, -447729, -329295, -813744, -543633, -238138, -193758, -424034, -331262, 237474, 59057, 218003, -369990, -653020, -456655, -111225, 183217, -128171, -85278, 142517, 394209, 709922, -137467, -290824, 42413, 156587, 170332, -463293, -252753, 698299, -109110, -813524, -843693, -8541, 632176, -17586, -373774, -344478, 63817, -327525, 293018]
6580B93018M31410k96785p15665n69681L71040J12922n36252M23512k4762J18793
6570c92450k96752K91850O72906M41969n25756l07501l2295K75983J06413n3221
6560A81146L76373R2811J4770o01716n58839M50744Q1586Q4989j79145o2872J73585
6549E3432p45016J78060J96327j23364L76426m56913R9739K22731N2204N15882
6539C69508j53933M00557K81853n88652j63293l80392m42572q6528O05153J96445
6529C8146J70280j10488J23152k28091M96251M86645m33172m39876k03086k9553
6519a29792o08263M48585O44189N94780j3296k19358L72428k59764m37646L08629
6509G00492k29036N29461m26684l13524o0813J18626K05999M7403p3645J71846
$$ y = [293018, 724428, 427643, -288022, -857703, -486663, -373741, -909993, -486481, -511243, -392450, -689202, -397352, 275554, 717523, 191767, -115734, -148029, 127954, 234367, 181146, 557519, 650330, 665100, 63384, -495455, -44711, 36875, 121864, -57281, -120153, 53432, -691584, -513524, -317197, -440561, -64135, -521048, -421309, -198578, -146374, 369508, 215575, 616132, 897985, 309333, 146040, -234352, -676924, -763452, -158299, 38146, 208426, 97938, 221090, -7001, 489250, 975895, 542723, 102847, -100239, -129792, -738055, -289470, 354719, 949499, 936203, 716845, 1089273, 829509, 391863, 700492, 471456, 1000917, 574233, 260709, 199896, 318522, 524521, 571924, 498279, 670125]
6499F70125m8713r42738K20660K6899M13497P1552j54992M55878L16086K84898
6489A313152k13081l47274m3542K29646j99290j13364n7476n28086k61702o5231
6479b86248J76261J03146j63180M06141l71660K92203j56002k4545p661P112l15283
6468c39716j20647L39911j97278N11497K21864k95928j16440l27103L70049l03754
6458b57545j63465O07057K56523j5218J98736o88499K75336M16512m85610j18121
6448B5706J05623N83586r6842j3137L82032j41213M5741J33431j34567o0019K13586
6437A043927K3674j90886k19941j94689J43392j73576l38815n2307q9481K34501
6427A85799k31503L84823O52668l43501k75225l34258j23335k29773J25386L82942
$$ y = [670125, 621412, -321326, -100666, -73767, 339730, 411282, 256290, 712168, 1028254, 1313152, 1100071, 752797, 709255, 938901, 739611, 626247, 568771, 40685, -221017, -286248, -109987, -6841, -170021, 236120, -135540, 156663, 661, -23884, -31545, -24433, -339716, -460363, -120452, -317730, 193767, 415631, 119703, 3263, -323840, 46209, -257545, -421010, 186047, 442570, 427352, 626088, -62411, 212925, 629437, 143827, 25706, 131329, 714915, 618073, 604936, 986968, 845755, 891496, 1024927, 890360, 830341, 1043927, 1067601, 876715, 656774, 462085, 605477, 431901, 93086, 40779, -48702, 185799, -45704, 339119, 991787, 648286, 373061, 38803, -84532, -314305, -188919, 194023]
6417A94023p0634L97066N33517L60501j17118j01546N58570l92283k79086l63984
6407G19026J98455n6325k81210k01442K56133j07289l78418L08623K66696q4467
6397F39782k77954j13373K75857q0044P06005o0942K9278j93825L67324Q8441
6387A380549n1063j0058l65442R17359K56480N47389m60167k4712j45733K09517
6377B254119m04448l90166K92305L0664J69237j7347N07329k93155N28439K4299
6367B701276j57684o6327j38280q66134p62195K75693N38171k24006r551N88021
6357A878984J25525l44393j76745L31019m46075p82482K67109K83791k907o14606
6347E19220N792M35623k74005M54005j70246j62451l67026K76463Q68888K671
$$ y = [194023, 123389, 520455, 1053972, 1414473, 1297355, 1195809, 1754379, 1362096, 1083010, 719026, 917481, 861156, 579946, 378504, 634637, 527348, 148930, 457553, 724249, 639782, 361828, 248455, 524312, 444268, 1150273, 1089331, 1118609, 924784, 1292108, 1380549, 1329486, 1319428, 953986, 1871345, 2127825, 2675214, 2215047, 2190335, 2044602, 2254119, 1849671, 1459505, 1751810, 1782474, 1951711, 1934364, 2441693, 2148538, 2676977, 2701276, 2543592, 2477265, 2338985, 1472851, 710656, 986349, 1524520, 1300514, 1290963, 1878984, 2004509, 1660116, 1483371, 1814390, 1368315, 585833, 852942, 1136733, 1133826, 519220, 525012, 960635, 686630, 1140635, 970389, 807938, 440912, 717375, 1586263, 1588934]
6337A588934M23394K88993o2998m70667k58262M11403k10639L52225l83563M2872
6327A721692l90944L20342P78467j54067l18460j08973L49003Q0284l98910J08657
6317A987091M5338N19865K0118k09727k23711M50150N996n13551K26447P5967
6307B383983J87830q39148O65588L56991L30611q01389J38948N31697Q4990k52935
6297B787166l30880L13546J35157m40239q64074p5957N7470L25907j39716k67348
6287A501032J40214K33887l73902r25882J38367J39063K70353K34167j42656m0118
6277A174525l42437J06503L74192K08349O4214Q4320M52058p8435L00083j53838
6267B189534k43152l69625k09304j11125r1052N78917j24441P1565n01659N05300
$$ y = [1588934, 2012328, 2301321, 2238323, 1767656, 1509394, 1920797, 1710158, 2062383, 1678820, 1721692, 1330748, 1651090, 2429557, 2275490, 1957030, 1848057, 2197060, 2277344, 1878434, 1987091, 2032429, 2552294, 2572412, 2362685, 2138974, 2589124, 2595120, 2081569, 2308016, 2383983, 2571813, 1732665, 2398253, 2755244, 3085855, 2284466, 2423414, 2955111, 3040101, 2787166, 2456286, 2769832, 2904989, 2464750, 1600676, 1524719, 1582189, 1908096, 1768380, 1501032, 1641246, 1875133, 1501231, 575349, 713716, 852779, 1123132, 1357299, 1214643, 1174525, 832088, 938591, 1312783, 1521132, 1585346, 1669666, 2121724, 2043289, 2343372, 2189534, 1946382, 1576757, 1367453, 1256328, 1165276, 1744193, 1619752, 1691317, 1189658, 1694958]
6257A694958J59816j83214J19444k07467j93598M14082K51856P33375l42606n83066
6247A863580L40937M9627j62302J42224L9374m64053l59119P45814M98869q62184
6237A832767k56570N60862N52586j093646J89898L14229N0716j9387J2007J47316
6227B290778o06647j96280K63166J06057j99499Q5704l5636q671J78683M37619
6217B315274K37202K69281l82101p9794m28662k34412m63388q4957l51539K46369
6207A043273P26198K28267M14013J99966L25610k49974j75528j22455j27127o11840
6197A650403m5012N32326p6724L14479m93381K76036k5523j45394l26000L77537
6187B038747P02571l61528m68612j77083k1324N42490k15137k42471l40308k86460
$$ y = [1694958, 1854774, 1671560, 1791004, 1583537, 1389939, 1804021, 2055877, 2789252, 2446646, 1863580, 2204517, 2254144, 2091842, 2234066, 2273440, 1809387, 1450268, 2196082, 2694951, 1832767, 1576197, 2137059, 2689645, 1595999, 1785897, 2100126, 2150842, 2131455, 2143462, 2290778, 1684131, 1487851, 1751017, 1857074, 1657575, 1743279, 1707643, 1698972, 1877655, 2315274, 2552476, 2821757, 2439656, 2359862, 1931200, 1696788, 1233400, 1148443, 796904, 1043273, 1769471, 1997738, 2411751, 2611717, 2937327, 2687353, 2511825, 2389370, 2262243, 1650403, 1605391, 2137717, 2060993, 2375472, 1882091, 2158127, 2132604, 1987210, 1661210, 2038747, 2741318, 2379790, 1911178, 1734095, 1712771, 2255261, 2040124, 1797653, 1457345, 1170885]
6177A170885M02354m61159L45706K60315L91069l28408l7569j80850Q41334l87756
6167B015921Q9942J55952K19441M24008j14042j04458L03028j78634n25506k43739
6157B041913Q8932j35656j54496n87113N81568L08033n06829N27508l50380N4515
6147A867995l29282Q70410K90953l55784m22083J88829K84180k52741J84303L08561
6137B635341p2324k56298j68947J48930K56844j59206L64786J82686N5252J89033
6127C176097m1029m71463j98276n6123j81105l24624K6487L06684q75489j34186
6117A226973K80976J001325K76825q96993J32154J19018K36276m8992M60276L18291
6107C106129n50825k04506O41815L30173J76221m20791R5068l45308l80252K95699
$$ y = [1170885, 1573239, 1112080, 1457786, 1718101, 2109170, 1780762, 1743193, 1562343, 2403677, 2015921, 2105863, 2261815, 2481256, 2905264, 2791222, 2686764, 2989792, 2811158, 2285652, 2041913, 2130845, 1995189, 1840693, 1253580, 1835148, 2143181, 1636352, 2163860, 1813480, 1867995, 1538713, 2409123, 2700076, 2344292, 1922209, 2111038, 2395218, 2142477, 2326780, 2635341, 2563017, 2306719, 2137772, 2286702, 2543546, 2384340, 2749126, 2931812, 2987064, 3176097, 3135068, 2663605, 2465329, 2409206, 2228101, 1903477, 1929964, 2236648, 1361159, 1226973, 1507949, 2509274, 2786099, 1889106, 2021260, 2140278, 2376554, 2327562, 2787838, 3106129, 2555304, 2350798, 2992613, 3322786, 3499007, 3078216, 3173284, 2827976, 2447724, 2743423]
6097B743423j37293J92590N38349k59054l43336j59235J32182L37360k72445L96929
6087C169470r47736p46553M71408M25329L6801J91800K42621m19139l61104L46608
6077B409505K06635L4510k58694K22979J27649n89137L81751k51658k26039O50686
6067B708187K86621j20899L9343k52497L92043m3496K1242N26286j78473J73837
6057C552194J38764o24140n07263l35211K22992L94832P9468R0619j43636r7708
6047B770911K05552M64614k42606J85980M62370k32195p24767L18017K38586R0075
6037C536537R2304M48437m33518l46894Q5337R09427K56479k78551m32814k44786
6027C591958K13012l26326P02455q6465q0514k27274Q9261J84645R2920L44514
$$ y = [2743423, 2606130, 2798720, 3337069, 3078015, 2734679, 2575444, 2707626, 3044986, 2772541, 3169470, 2221734, 1475181, 1946589, 2371918, 2408719, 2600519, 2843140, 2424001, 2062897, 2409505, 2616140, 2650650, 2391956, 2614935, 2742584, 2153447, 2535198, 2283540, 2057501, 2708187, 2994808, 2873909, 2913252, 2660755, 3052798, 3009302, 3030544, 3556830, 3378357, 3552194, 3690958, 3066818, 2559555, 2224344, 2447336, 2842168, 2921636, 3012255, 2868619, 2770911, 2976463, 3441077, 3198471, 3384451, 3846821, 3614626, 2889859, 3207876, 3446462, 3536537, 3628841, 4077278, 3643760, 3296866, 3382203, 4291630, 4548109, 4269558, 3836744, 3591958, 3804970, 3478644, 4181099, 4094634, 4014120, 3786846, 3876107, 4060752, 4153672, 4498186]
6017D498186L68063m44290k0956J18307m66167L67245J63570k29377m02092j5152
6007C937337Q45942r8320j12496J17476m38252j59862K27203J49397n20988N65040
5997D512477M33550M89013n07648P4401M77550j97387l0869l12411k36211m66633
5987D235832K64042L49020K10058j58634j44049k05360k58004M61463L25557j80514
5977D899411Q32298o0063L5590p03685j1653L72718R2635M56840l20885j04978
5967E488228N66867K05708n71088J59680M47706J292044m07970m7555M80037k44045
5957G369612O1012l85100J38679j95462p82196J0932o74954K9357J49128P06136
5947F427144Q77944J34662J8875q46720M8838P12375K09880j88111j32644j77659
$$ y = [4498186, 4866249, 4421959, 4401003, 4519310, 4053143, 4420388, 4583958, 4354581, 3952489, 3937337, 4783279, 4684959, 4572463, 4689939, 4251687, 4091825, 4319028, 4468425, 3947437, 4512477, 4946027, 5435040, 4927392, 5001793, 5479343, 5281956, 5251087, 4938676, 4702465, 4235832, 4499874, 4848894, 5058952, 4900318, 4756269, 4550909, 4292905, 4754368, 5079925, 4899411, 5731709, 5671646, 5707236, 5003551, 4991898, 5364616, 5457251, 5914091, 5593206, 5488228, 6055095, 6260803, 5689715, 5849395, 6297101, 7589145, 7181175, 7133620, 7613657, 7369612, 7430624, 7045524, 7184203, 6988741, 6206545, 6217477, 5542523, 5571880, 5721008, 6427144, 7305088, 7439750, 7458625, 6611905, 6660743, 7373118, 7582998, 7394887, 7262243, 7084584]
5937G084584N80142J75873m6426K91104J48154J48994l04156r1172L51734n18156
5927G820675J37447L3553K87186N09340K84263L68156m30697Q8977J63803O36012
5917I898715r4261p0542k46498n49219l8923j59452N59019j42798k58958k13890
5907H683193N68964L72687j61297n24963K63338M66707o2413K03653n36779j89184
5897I083906O60344M90114J79134k31418K09332P71200P1463j93375M5101k41520
5887A0844281K70328p322q7932L30764m47330o18489P91533R28238M56152q97236
5877A1562987n37008J199879k82513N80553j53671j68325L42876k44523P18939
5868A3019194l13183K52298L43274L44722K02851O8062O53530p78761n02126l29959
$$ y = [7084584, 7664726, 7840599, 7794173, 8085277, 8233431, 8382425, 8078269, 7987097, 8338831, 7820675, 7958122, 7991675, 8278861, 8788201, 9072464, 9440620, 9009923, 9098900, 9262703, 9898715, 9804454, 9733912, 9487414, 8938195, 8899272, 8739820, 9298839, 9156041, 8897083, 8683193, 9252157, 9624844, 9463547, 8938584, 9201922, 9668629, 9606216, 9809869, 9273090, 9083906, 9744250, 10234364, 10413498, 10182080, 10391412, 11162612, 11234075, 11040700, 11085801, 10844281, 11114609, 11107287, 11019355, 11350119, 10902789, 10284300, 11075833, 12004071, 12460223, 11562987, 11025979, 12225858, 11943345, 12523898, 12370227, 12201902, 12544778, 12300255, 13019194, 12706011, 12958309, 13301583, 13646305, 13849156, 13917218, 14570748, 13791987, 13289861, 12959902]
5858A2959902O76408P46596n08050k56064j17196K79516L37574j11638R59866
5849A4966914N15752L99026l21879l30694k6746J0657k11120K61312K0808M25066
5839A5709096K5479J85844N57474L02991Q63513N58849M89085R01002j55611L44630
5829A9782352M21284M10451R25147N79593J041060P05937J474173J275803J750513
5820B8366313J339497J777124J097310N91891n78217j807285k226630j648165
5812B6911838j727216j332037j433224m72640k08212l41212k37662r4936K1005
5803B1085704j09692l05160p51441j31110m56053l99956m78005l34363L29304
5794A8449228p00705p8719R7948r23836m32323N881J53823k34132l68891j32944
$$ y = [12959902, 13636310, 14382906, 13874856, 13618792, 13501596, 13781112, 14118686, 14007048, 14966914, 15482666, 15881692, 15559813, 15229119, 15202373, 15213030, 15001910, 15263222, 15284030, 15709096, 15734575, 15920419, 16477893, 16780884, 17644397, 18203246, 18692331, 19593333, 19437722, 19782352, 20203636, 20614087, 21539234, 22118827, 23159887, 23865824, 25339997, 26615800, 28366313, 29705810, 31482934, 32580244, 33172135, 32593918, 30786633, 28560003, 26911838, 25184622, 23852585, 22419361, 21946721, 21738509, 21397297, 21159635, 21064699, 21085704, 20976012, 20670852, 19919411, 19788301, 19332248, 18932292, 18454287, 18119924, 18449228, 17748523, 17669804, 17767752, 16843916, 16411593, 16417474, 16571297, 16337165, 15968274, 15835330]
5784A5835330q6150j09414K94211L37341n67347q6474K7332k89449M49602N9807
5774A5864789K39629q1188Q614m298J165553O34026j67562j75107M07749J131370
5764A9023575l21178K19143M68020J47721J83720j56536k38435m60410j67581
5755A8698039K21295n9384m1353L05085M22496m8997L69597J027103J074297O71631
5745B2639809M1589P6061M19657Q21404r8477m82101l89569p5771J49356L73890
5735B3475848k4752m40885r4381m02994m03922j027013q0688K0026l72526l07650
5725B0341063m53223j026856q42827N99601O4100R1458l26582J122660P35480
5716B0304874l51019k26096l3294N46065q1082k49929O03765P12104J52241p99357
$$ y = [15835330, 15749180, 15639766, 15933977, 16271318, 15703971, 15617497, 15644829, 15355380, 15804982, 15864789, 16104418, 16023230, 16031844, 16027546, 17193099, 17827125, 17659563, 17484456, 17892205, 19023575, 18702397, 18921540, 19389560, 19537281, 19721001, 19564465, 19326030, 18865620, 18698039, 18919334, 18859950, 18818597, 19123682, 19546178, 19497181, 19866778, 20893881, 21968178, 22639809, 22681398, 22757459, 23177116, 23998520, 23900043, 23417942, 23028373, 22952602, 23101958, 23475848, 23451096, 23010211, 22915830, 22512836, 22108914, 21081901, 21001213, 21021239, 20648713, 20341063, 19887840, 18860984, 18018157, 18617758, 18681858, 18773316, 18446734, 19569394, 20304874, 19953855, 19727759, 19694465, 20240530, 20159448, 19909519, 20513284, 21225388, 21377629, 20578272]
5706B0578272o21996o17038k49610k15670o84451p54676r34690j047241p90470
5697A4662430j019389n3248l29090k98887j46824r8337j92535q97516J37548J14417
5687A1878569j97116n56197P29927m03418m21100n76524K24018L98896L8025k35506
5677A0879574p6087K83126O765k38292M62400P06303P3850K29334K5781O17312
5667A2970066J23159N0016Q6589M74497J66209L60864R5691K96319K91150L16467
5657A5231027K66394O8484j133630m80350M75342L55952K43299m5367P73058O41257
5647A6395466J29206n38506l75088Q5758J57918j97095q13219M73761j79444Q654
5637A5147411M0857L3645N22843j69427J81671p1811L04350R67493K47956J15181
$$ y = [20578272, 19956276, 19339238, 19089628, 18873958, 18189507, 17434831, 16500141, 15452900, 14662430, 13643041, 13589793, 13260703, 12961816, 12814992, 12716655, 12524120, 11626604, 11764152, 11878569, 11681453, 11125256, 11855183, 11451765, 11030665, 10454141, 10678159, 11077055, 11115080, 10879574, 10803487, 11086613, 11093378, 10855086, 11317486, 12023789, 12097639, 12326973, 12352754, 12970066, 13093225, 13143241, 13229830, 13704327, 13870536, 14231400, 14327091, 14623410, 14914560, 15231027, 15497421, 15565905, 14432275, 13951925, 14427267, 14783219, 15026518, 14981151, 15754209, 16395466, 16524672, 15986166, 15611078, 15696836, 15854754, 15657659, 14844440, 15318201, 15138757, 15147411, 15188268, 15221913, 15744756, 15575329, 15757000, 15685189, 15989539, 16957032, 17204988, 17320169]
5627A7320169Q78237N45455L74945q8543P81794R60156L65692O54257M66115P45566
5617B3003843M51046M25799O70960J00146R75370O01003N580m66915M03569J319583
5607B7489984P47501l40183r3420O8307M20685K64228Q55906m7710l76721N2170
5597B9040747L54989N9738m71680m99718j076481j485104k66904n38776n92888
5588B4523923l50848L9727K52758J58654j91508R85162K3254N73628R84331L32910
5578B7331991M21327L56421J727929Q80036J258310J510256K179131K458337J995866
5569D0119604K040892J916987Q03587J6499k171871k363083k239267k264891j112318
5560C4746139j122680r29918n03452r47625r46417k18740r31408n66508m94393
$$ y = [17320169, 18198406, 18743861, 19118806, 19030263, 19812057, 20772213, 21137905, 21792162, 22258277, 23003843, 23454889, 23880688, 24551648, 24651794, 25627164, 26228167, 26233747, 25766832, 26170401, 27489984, 28237485, 27897302, 27803882, 27872189, 28292874, 28557102, 29413008, 29365298, 28988577, 29040747, 29395736, 29455474, 28983794, 28484076, 27407595, 25922491, 25655587, 25116811, 24523923, 24173075, 24212802, 24465560, 24624214, 24432706, 25417868, 25441122, 26014750, 26999081, 27331991, 27753318, 28109739, 29837668, 30717704, 31976014, 33486270, 35665401, 38123738, 40119604, 42160496, 44077483, 44881070, 44897569, 42725698, 40362615, 38123348, 35858457, 34746139, 33623459, 32693541, 32190089, 31242464, 30296047, 30077307, 29145899, 28579391, 28084998]
5551B8084998L00661J036029k70717N43412K6962j78376j124202m59190m95956
5542B7463621j153121n44631m17180m61581j170272j034096j22564n20160K56181
5533B2296197P7376K77026n69743j18878n88440m39302L77658j95296j76036j116732
5523A9823830o87142L82022n9666l48940j35390k32357K62990j91750L42618J11458
5513A9267673K63702j64319r4542N25221O02566L97005n53739l80673o53906P2859
5503A9281847J69356M3184j69513l31613J42185m0345P406J78739K9082r10423
5493A8399905p20286N1778k16201j143800p17763n67188m97680j117625M7181
5484A3518321O8025o05817q1647K20572J42935l69801k30196l27960j046K12610
$$ y = [28084998, 28385659, 29421688, 29150971, 29694383, 29721345, 29542969, 28418767, 27959577, 27463621, 26310500, 25765869, 25348689, 24887108, 23716836, 22682740, 22560176, 22040016, 22296197, 22373573, 22650599, 22080856, 21961978, 21373538, 20934236, 21311894, 21116598, 20940562, 19823830, 19136688, 19518710, 19459044, 19110104, 18974714, 18742357, 19005347, 18813597, 19156215, 19267673, 19531375, 19367056, 19272514, 19797735, 20400301, 20797306, 20243567, 19862894, 19208988, 19281847, 19451203, 19494387, 19324874, 18993261, 19135446, 19095101, 19102507, 19281246, 19310328, 18399905, 17679619, 17731397, 17515196, 16371396, 15653633, 15086445, 14588765, 13471140, 13518321, 13586346, 12980529, 12898882, 13119454, 13262389, 12892588, 12662392, 12334432, 12333386, 12545996]
5474A2545996m6819k80358m87002q6701N21196k61756j28879o62465L78919l41399
5464A1150732q643r1572n66251j1439j38771J24235l70818j10167N23230N7889
5454A0558425n32724k62759m09369M45648N62785j4005k16643m78915m3369M81611
5444A0090685j9840M51791k09881o96912J5483M10163N48849n1689m75643r8878
5434I964128j83266m2342O30299m60815M21682O7062j57324l08128R1006Q53709
5424A0876011K60764p47738k62159J27481m02699j7147j23158j8516r4918J06477
5414I704398j11101M73410n9563p1730k66058o0763R88489o30968J08475R25244
5404A0999833K39667J20734J04413M41845n09473J33174J51185l77071n87949
$$ y = [12545996, 12499177, 12218819, 11731817, 11645116, 12166312, 11904556, 11775677, 11113212, 11492131, 11150732, 11142089, 11050517, 10484266, 10472827, 10334056, 10458291, 10087473, 9977306, 10500536, 10558425, 10025701, 9762942, 9353573, 9799221, 10362006, 10348001, 10131358, 9652443, 9609074, 10090685, 10070845, 10522636, 10312755, 9615843, 9631326, 10041489, 10590338, 10538649, 10063006, 9964128, 9780862, 9738520, 10368819, 9908004, 10329686, 10396748, 10239424, 9931296, 10022302, 10876011, 11136775, 10389037, 10126878, 10254359, 9851660, 9834513, 9711355, 9692839, 9597921, 9704398, 9593297, 10066707, 10007144, 9935414, 9669356, 9608593, 10597082, 9966114, 10074589, 10999833, 11239500, 11360234, 11464647, 11906492, 11397019, 11530193, 11681378, 11304307, 10716358]
5395A0716358j74437O18578P3839m85466M72087n44716n47909n76419M91111l7364
5385A0005662P9382J03770j57871m73089M3900J101631M54699p70639N32123o1247
5375A0858321J04092j87288Q68138n4124L7239q46517j63739J46560q45397M96898
5365A0414183j9614K77230L97443k53702K99775n33841p65242L98745j68255L83141
5355A0429863n06317l78983l83762R33886K71946J22609l17525k6510k36733n54863
5345I353611l35239J145114K64362k8677N15402n768J63414L65083p6059k73181
5335A1088062p67925O9829j09249l8758q6053Q21088L04757n26412J7867j01942
5325A0671264L98107O03836j32526m55309p7916M15948n2510k02114p5684J039547
$$ y = [10716358, 10541921, 11160499, 11234338, 10748872, 11220959, 10676243, 10128334, 9551915, 10043026, 10005662, 10085044, 10188814, 10030943, 9557854, 9601754, 10703385, 11158084, 10387445, 10919568, 10858321, 10962413, 10775125, 11643263, 11589139, 11626378, 10779861, 10616122, 10762682, 9917285, 10414183, 10394569, 10671799, 11069242, 10815540, 11115315, 10581474, 9816232, 10214977, 10046722, 10429863, 9923546, 9544563, 9160801, 10094687, 10366633, 10489242, 10171717, 10145207, 9908474, 9353611, 9018372, 10163486, 10427848, 10399171, 10914573, 10908805, 11072219, 11437302, 11361243, 11088062, 10320137, 10389966, 10280717, 10241959, 10155906, 10976994, 11281751, 10755339, 10773206, 10671264, 11069371, 11673207, 11540681, 11085372, 11007456, 11423404, 11370894, 11168780, 11093096, 12132643]
5315A2132643L42640J40125m79238N30002L59046N31872J100462J97147J77992
5306A5032691j96741L8797p93238n51588q6783N85704m31128l69843j47396O3230
5296A3143705N9535P3328p51195j65379N58979M72631L65826n10049J817O03435
5286A3852633j22061L11064k8671M08159L94074m79860p5457k46809m01422j97363
5276A3414287L4398O038k00794p74052J35331l03969M06892K61145L90598M06211
5266A3776085n8180M60077j32456P7655j45283m697N29730P31381Q88897O09366
5256A6732575R69274N88569N37092n7541K29394J60454J35055n67825M28173j88481
5246A8966739M15554M00123m55335J38463j324172l33816o49136J42919m45397
$$ y = [12132643, 12475283, 12615408, 12136170, 12666172, 13025218, 13557090, 14657552, 14854699, 15032691, 14835950, 14874747, 14081509, 13529921, 13443138, 14028842, 13597714, 13227871, 13080475, 13143705, 13203240, 13276568, 12525373, 12359994, 12918973, 13391604, 13757430, 13247381, 13249198, 13852633, 13730572, 14041636, 14012965, 14421124, 14815198, 14335338, 14259881, 14013072, 13611650, 13414287, 13448685, 13454723, 13253929, 12479877, 12615208, 12311239, 12718131, 12979276, 13369874, 13776085, 13717905, 14177982, 14045526, 14123181, 13977898, 13973201, 14502931, 15234312, 16123209, 16732575, 17701849, 18290418, 18827510, 18769969, 18999363, 19159817, 19294872, 18727047, 19155220, 18966739, 19382293, 19782416, 19327081, 19465544, 18141372, 17807556, 17158420, 17301339, 16855942]
5237A6855942n62389j70885N27583L99640j10095M79084K28746M69451N0547j43831
5227A8023793P40979L98986K23222q9433J04511J70628n0312K57607M90338L92887
5217B0663206m65904K01814k14324r1848J01178k31842M48447l04073R7966j21272
5207B0083348P78961O41867j2141l7823n78772m62482n47162j05863J83989m02861
5197A9541061k09887J31690j7887L11454K53893j25481L29674p33927P4581k7065
5187A9528106K21833J39084l65364L66252L30802L04596R63251j43542O34665
5178B1979683l3850q3611p33244q58428k46171n61477k52207P84243J9090k89963
5168A9724065o88179p6919L13119k65240M46463k64153p17494n61066L54100l10672
$$ y = [16855942, 16293553, 16122668, 16650251, 17049891, 16939796, 17418880, 17647626, 18117077, 18167624, 18023793, 18764772, 19163758, 19386980, 19297547, 19402058, 19572686, 19522374, 19779981, 20270319, 20663206, 20197302, 20399116, 20184792, 20092944, 20194122, 19962280, 20410727, 20106654, 20204620, 20083348, 20862309, 21504176, 21492035, 21454212, 20875440, 20412958, 19865796, 19759933, 19943922, 19541061, 19331174, 19462864, 19444977, 19756431, 20010324, 19884843, 20214517, 19480590, 19555171, 19528106, 19749939, 19889023, 19523659, 19889911, 20220713, 20525309, 21488560, 21345018, 21979683, 21945833, 21862222, 21128978, 20270550, 20024379, 19462902, 19210695, 19994938, 20014028, 19724065, 19035886, 18958967, 19272086, 19006846, 19453309, 19189156, 18471662, 17910596, 18264696, 17954024]
5158A7954024p2849R90797R02086j85629l88718p83753l42540j128384l3447l1443
5148A6880144l9656o1456j74822k73301l37029K49596j1643q7216Q2306L87188
5138A6614111L18156Q6879J09149L99770K24483n77233N51054L65791Q38240O3883
5128A8994283K23377j1068j46897O1489M47367j28707m86275J79758j86382K8250
5118A8975195m50767J245443M59334P7790m95139M3329N72369K36611O24188O59130
5108B1947483J53684P4714M61213K73542O41501L21084O80406J3450J04337K64101
5098B4935515O18110P29339N55084o1088k94805M44347Q53435j88817R2853N23579
5088B8207552m96138M9187L39988J180188J49088l77718l85481n09345m9260m2615
$$ y = [17954024, 17881175, 18871972, 19774058, 19588429, 19199711, 18415958, 18073418, 16945034, 16911587, 16880144, 16840488, 16779032, 16604210, 16330909, 15993880, 16243476, 16231833, 16144617, 16226923, 16614111, 16932267, 17019146, 17128295, 17528065, 17752548, 17175315, 17726369, 18092160, 18930400, 18994283, 19217660, 19206592, 19059695, 19121184, 19568551, 19439844, 18953569, 19133327, 18946945, 18975195, 18524428, 19769871, 20229205, 20306995, 19811856, 19855185, 20427554, 20664165, 21288353, 21947483, 22101167, 22175881, 22637094, 22910636, 23552137, 23873221, 24553627, 24567077, 24671414, 24935515, 25553625, 26282964, 26838048, 26776960, 26482155, 26926502, 27779937, 27591120, 27683973, 28207552, 27711414, 27760601, 28100589, 29280777, 29429865, 29052147, 28666666, 28157321, 28108061, 28065446]
5078B8065446K83218n22668j67274n3902J98897j3987j60885j63686L28281O5376
5068B7858816k30406m5114o0537K26019P3642p20524O365m13939K72521p53276
5058B6213567j39187n41187n39264k41849L02896L29963n61193j43824j89397
5049B4490525K40472k54262p47240j61875J95967j81681J72330l14303L73675
5040B3813608N4728N00868P190J36300m26119J88954N4807r8620K27175M31933
5030B4890824M00738K58387M68090J71529J16445P8291M47479j31610K07362N652
5020B6913187M46983J115737P18095L48510m49114J259628R88069J05513K79734
5011C1726342J053396J003167L06645o3180J67784M882l95626l65879L18769J53841
$$ y = [28065446, 28348664, 27825996, 27658722, 27604820, 27803717, 27789730, 27628845, 27465159, 27793440, 27858816, 27628410, 27583296, 27522759, 27748778, 27822420, 27101896, 27108261, 26694322, 26966843, 26213567, 26074380, 25533193, 24993929, 24752080, 25054976, 25384939, 24823746, 24679922, 24490525, 24730997, 24476735, 23729495, 23567620, 23763587, 23581906, 23754236, 23439933, 23813608, 23868336, 24369204, 24376394, 24512694, 24086575, 24275529, 24330336, 24231716, 24458891, 24890824, 25291562, 25549949, 26018039, 26189568, 26306013, 26384304, 26831783, 26700173, 26907535, 26913187, 27360170, 28475907, 29194002, 29542512, 29093398, 30353026, 31341095, 31446608, 31726342, 32779738, 33782905, 34089550, 34026370, 34194154, 34199036, 33803410, 33437531, 33756300, 33910141]
5001C3910141O31560J70672O37837R37895P5200J92380J74189L79481r92934j205112
4991C4911309k87036M06810O0848m90612K37116l06182K42550j53612N6489l69783
4981C4307897J48186n25152O468j99532L0700P590p39451q0154n12143l01545
4971C2142864p7336k49492m2225l30615j67212j4965j48195K40742j39918J26653
4961C1340301j02912K12242R5703n94171n40544J04090k99268m33323o33460j1521
4951B9137137n08018q04568l26414k73988j080297n38210j96875j83619m48919
4942B4776229l04758J35145j60729m38877L04945K32124m49117r45684J6743J30053
4932B3296074k7355m88211m65869M33248k69509l43672l99054o28130K9342q54572
$$ y = [33910141, 34541701, 34712373, 35350210, 36288105, 36363305, 36555685, 36729874, 37109355, 36116421, 34911309, 34624273, 35031083, 35091931, 34601319, 34838435, 34532253, 34774803, 34621191, 34677680, 34307897, 34456083, 33930931, 33937399, 33737867, 33768567, 33776157, 33036706, 32956552, 32444409, 32142864, 32065528, 31816036, 31773811, 31443196, 31275984, 31261019, 31112824, 31353566, 31213648, 31340301, 31237389, 31449631, 31545334, 30951163, 30410619, 30514709, 30215441, 29782118, 29148658, 29137137, 28629119, 27824551, 27498137, 27224149, 26143852, 25605642, 25408767, 25225148, 24776229, 24471471, 24606616, 24445887, 24007010, 24311955, 24544079, 24094962, 23149278, 23166021, 23296074, 23268719, 22780508, 22314639, 22747887, 22478378, 22134706, 21735652, 21107522, 21136864, 20282292]
4922B0282292J72668L16682j04712M85020J53196P79170l0232k55462j70516M59142
4912B2087248j71956l84881j49009J45820J13140m2983P20523l64121j43999n13143
4902B1296639L34332m25476J35529K17927P21094m14344N63969L03112k4594J42132
4892B2850320K84102P93919l27807N83392J22902m54005k4804P58845L75829j72608
4882B4790085n84845O04405M23182j19188l00606J208557R63298Q0886q9089M40577
4872B7417262J42226J73193N27383R37608L01291N43874N53872J005298N36292
4863C2138299O60514K82451k41682p7116o1888O70223N12729M97488O7694O26570
4853C5075282K96753L02345P56924M08959R24490N42300L01125J178281J562285
$$ y = [20282292, 20454960, 20771642, 20666930, 21151950, 21305146, 22084316, 22054084, 21798622, 21628106, 22087248, 21915292, 21530411, 21381402, 21527222, 21640362, 21597379, 22317902, 21953781, 21809782, 21296639, 21630971, 21205495, 21341024, 21558951, 22280045, 21865701, 22429670, 22732782, 22708188, 22850320, 23134422, 23928341, 23600534, 24183926, 24306828, 23852823, 23828019, 24586864, 24962693, 24790085, 24205240, 24809645, 25232827, 25113639, 24813033, 26021590, 26984888, 27065774, 26976685, 27417262, 27559488, 27732681, 28260064, 29197672, 29498963, 30042837, 30596709, 31602007, 32138299, 32798813, 33081264, 32839582, 32762466, 32700578, 33370801, 33883530, 34381018, 34448712, 35075282, 35372035, 35674380, 36431304, 36840263, 37764753, 38307053, 38608178, 39786459, 41348744]
4844D1348744R13561J161525J390176J320134J327478J875649K511836J514930
4836E3364033K189290K600239K595475J882439K281504K093712K157801K270181
4828G1434674J371425O28797j89383p45616m69542l63926m21809L31593j0048
4819G1566165J045528P35946J485923J420004J347980J133706K137855J880722
4811H2753829J407830J439457J813574K088240P93344M94140J5384o347J97737
4802I0997188P46293P50584J048132J625858K819093K354030K162750K745379
4794A05249307L104772L015935K857104K672701K525129P27490Q46912R58855
4786A21958205J079244K113736J771053K146613L090179L902271M396121L867022
$$ y = [41348744, 42262305, 43423830, 44814006, 46134140, 47461618, 49337267, 51849103, 53364033, 55553323, 58153562, 60749037, 62631476, 64912980, 67006692, 69164493, 71434674, 72806099, 73434896, 73245513, 72499897, 72030355, 71666429, 71244620, 71576213, 71566165, 72611693, 73347639, 74833562, 76253566, 77601546, 78735252, 80873107, 82753829, 84161659, 85601116, 87414690, 89502930, 90296274, 90790414, 90805798, 90799451, 90997188, 91743481, 92494065, 93542197, 95168055, 97987148, 100341178, 102503928, 105249307, 108354079, 111370014, 114227118, 116899819, 119424948, 120152438, 120999350, 121958205, 123037449, 125151185, 126922238, 129068851, 132159030, 136061301, 140457422, 144324444]
4778A44324444M319189M838452M738502M547523M665269M281503L119279J343713
4770A76177874M0537j017981j953855k011000j784549j596694j633483j217661
4762A65003188n53287N23086L62522J821310K335887L199077M698049M334018
4754A81723850M936865M949281N880182N874843N742495O985683O167302L783276
4746B26043777j016378n875772q795138q336415o745950m360648l472462j676404
4738A85764610K75934J312982K451897K625532M662311M937152N198008N770062
4730B12998488N599615N236047L184797K413245J735336M80646J42651j004262
4722B30786563n44469M03273K662431L456993M669691O789618Q074319R221007
$$ y = [144324444, 148643633, 153482085, 158220587, 162768110, 167433379, 171714882, 174834161, 176177874, 176218411, 175200430, 173246575, 171235575, 169451026, 167854332, 166220849, 165003188, 164449901, 164972987, 165335509, 167156819, 169492706, 172691783, 177389832, 181723850, 186660715, 191609996, 197490178, 203365021, 209107516, 216093199, 222260501, 226043777, 225027399, 219151627, 210356489, 202020074, 195274124, 190913476, 187441014, 185764610, 186040544, 187353526, 189805423, 192430955, 197093266, 202030418, 207228426, 212998488, 218598103, 223834150, 227018947, 229432192, 231167528, 231648174, 231790825, 230786563, 230242094, 230645367, 233307798, 236764791, 241434482, 248224100, 256298419, 265519426]
4714B65519426J0568141J1930330J2644910J2194505J2879359J3032447J2472945
4707C51242063R886952M488770m078919j4509588k0455067k1819324k0285044
4700B84469843j8442242j5254576j3261750j2051266r948702q618259p148604
4693A99744444p044692o080573n166133m111843l569000l211452l022037l181060
4685A64357654k325550k299770j582330k067811k237150k935325j642468j761118
4677A47506132j534420k159440j807968j066602j422988n23287m18402m05078
4669A38167947K36735J97075l65679n30541o94827j329488j856205j808034j845600
4660A30171383k211885k730214k752352l488149l499557k713273j616568k215221
$$ y = [265519426, 276087567, 288017897, 300662807, 312857312, 325736671, 338769118, 351242063, 361129015, 365617785, 361538866, 347029278, 326574211, 304754887, 284469843, 266027601, 250773025, 237511275, 225460009, 215511307, 206893048, 199744444, 192699752, 186619179, 181453046, 177341203, 173772203, 170560751, 167538714, 164357654, 162032104, 159732334, 158150004, 156082193, 153845043, 150909718, 149267250, 147506132, 145971712, 143812272, 142004304, 140937702, 139514714, 138991427, 138573025, 138167947, 138404682, 138601757, 138236078, 137705537, 137010710, 135681222, 133825017, 132016983, 130171383, 127959498, 125229284, 122476932, 118988783, 115489226, 112775953, 111159385, 108944164]
4652A08944164l055913k592849j144662o48168r84071n74315p47460o90839j235101
4643I7270786j089982j339280r65377j128047j275944j901435j403624j515519
4635H6651578j302193r11236j545304q28475j690248j085081q82806p60814j108720
4626G6536701q06234o33953n25577j28510l47267K54741K81022L33502K56289
4617G5220714k16590K76044L35839P2149p9791L24303R02737O86007J047325J762471
4607H0331208K801188K302220K326105K537104K758991K845205J602294J93705
4599I7698020k179602m682979o045662n077821l768231l158217m157710m214421
4591F4413377l099926k068607j873537k452336k401236j629134j894302j707131
$$ y = [108944164, 105888251, 103295402, 102150740, 101502572, 100518501, 99944186, 99196726, 98505887, 97270786, 96180804, 94841524, 93876147, 92748100, 91472156, 89570721, 88167097, 86651578, 85349385, 84438149, 82892845, 82064370, 80374122, 79289041, 78406235, 77645421, 76536701, 75730467, 75096514, 74570937, 74442427, 74095160, 74349901, 74630923, 74964425, 75220714, 75004124, 75280168, 75616007, 75688156, 75608365, 75932668, 76835405, 77521412, 78568737, 80331208, 83132396, 85434616, 87760721, 90297825, 93056816, 95902021, 97504315, 97698020, 95518418, 90835439, 84789777, 79711956, 75943725, 72785508, 68627798, 64413377, 61313451, 59244844, 57371307, 54918971, 52517735, 50888601, 48994299, 47287168]
4583D7287168j430720j340208j419606j623533j249360j428852j213226j053257
4575C6528406r02928p36478j472964l90695q43434q12419p56887n97037m20269
4566B9595295n27823j561352n33606J62951J70254o99905o72863n16363K32296
4557B5648884l94058n25686L57069o72189O3k65068J44460l86688k62628j61608
4547B3482551l82383l27525j63754O7092m38414p5212Q77149q19513R2994n05950
4537B1807035K72035M47102l67251P63845M49286N20232O2426K6318L81346M20336
4527B4782710j99899J7139n70006q9841N73157L65703K19405J91966J029401k03811
4517B6115924N33639Q96903L01149n09832K79148M43096P54681N58299P28014
$$ y = [47287168, 45856448, 44516240, 43096634, 41473101, 40223741, 38794889, 37581663, 36528406, 35625478, 34889000, 33416036, 33025341, 32181907, 31369488, 30612601, 30015564, 29595295, 29067472, 27506120, 26972514, 27135465, 27305719, 26605814, 25932951, 25416588, 25648884, 25254826, 24729140, 25086209, 24414020, 24414083, 24149015, 24293475, 23906787, 23644159, 23482551, 23100168, 22772643, 22608889, 22675981, 22237567, 22162355, 23039504, 22219991, 22312985, 21807035, 22079070, 22526172, 22158921, 22922766, 23372052, 23892284, 23954710, 23981028, 24362374, 24782710, 24582811, 24599950, 24029944, 23940103, 24513260, 24878963, 25098368, 25290334, 26319735, 26115924, 26649563, 27546466, 27847615, 27337783, 27616931, 28060027, 28814708, 29373007, 30101021]
4508C0101021M82528J37399L37335P61945K22682p14686J07381p59429L36694
4499C1012870j33451n34104J96524O73985j43471k37087n50840j1108O6796o08041
4489B9732073o68199p97071p08049k48916n16132k67463j52550p4681j2738o87017
4479B5599257L56852l13117n87516p17845R0894n85522p29396n47430R900j87319
4469B2388758n26033K61843p80455p29019j381888m71262L28183l34895l55429
4460A8399803m24927o86954l91418n42522m49643K4434m54536k96520l38738r89874
4450A3849105j53859M54855J33192j83355n14430L0208o51108k31845m28324K97004
4440A2601443k31647N5438k97896q4445k51897j52595l4538j21330K90461n89219
$$ y = [30101021, 30583549, 30720948, 31058283, 31820228, 32042910, 31328224, 31435605, 30676176, 31012870, 30879419, 30345315, 30541839, 31215824, 31072353, 30835266, 30284426, 30273318, 30340114, 29732073, 29063874, 28266803, 27558754, 27309838, 26793706, 26526243, 26373693, 26299012, 26286274, 25599257, 25956109, 25642992, 25055476, 24337631, 24428525, 23843003, 23113607, 22566177, 22576077, 22388758, 21862725, 22124568, 21344113, 20615094, 19233206, 18761944, 19090127, 18755232, 18399803, 17974876, 17287922, 16896504, 16353982, 15904339, 15928773, 15474237, 15177717, 14838979, 13849105, 13695246, 14150101, 14283293, 14099938, 13585508, 13615716, 12964608, 12732763, 12304439, 12601443, 12369796, 12425234, 12127338, 12042893, 11790996, 11638401, 11603863, 11482533, 11772994, 11183775]
4430A1183775m92201k37180l15580k7878j09765l00995l84386l88939K45048n36018
4420H635881l37787L56572L96571l33391m88494L85883n73129k20134K06976N99635
4410H628583J03582j262785m28225K88260M11451p6828j98148k72336n84897o84548
4400E924109Q22226L30991K73772n21145J8108Q0420n32710J52156r8774m13048
4390F036105m60193m34618N104J0718J80753L15723K37961o2675r2915m84597
4380E251366k58816o3068n44046Q8668n95636M8672J5592j28786N80974j64783
4370D230137N93715j006165q37984p4052N24986M56661J80703j83039L3874J20773
4360D039609r242j139K60453l7984J8775l59787L16272n28648k28790K69234N5289
$$ y = [11183775, 10691574, 10454394, 10138814, 10110936, 10001171, 9700176, 9315790, 8926851, 9171899, 8635881, 8298094, 8654666, 9051237, 8717846, 8229352, 8615235, 8042106, 7821972, 8028948, 8628583, 8732165, 7469380, 7041155, 7329415, 7740866, 7664038, 7465890, 7193554, 6608657, 5924109, 6746335, 7077326, 7351098, 6829953, 6848061, 6928481, 6395771, 6547927, 6449153, 6036105, 5575912, 5141294, 5146398, 5157116, 5337869, 5653592, 5891553, 5828878, 5735963, 5251366, 4992550, 4929482, 4385436, 4474104, 3878468, 3927140, 3942732, 3813946, 4394920, 4230137, 4823852, 3817687, 2979703, 2905651, 3430637, 3887298, 4068001, 3884962, 3918836, 4039609, 4030367, 4029228, 4289681, 4251697, 4270472, 3910685, 4226957, 3698309, 3469519, 3738753, 3794042]
4349C794042N3295k96855P8232m33052j57344P5015j80402o06698p3502N97514
4339B850245L82713n42613m29826j02798M98198r3027M84785K23180m46357q0936
4329B743564J07566j57693N11258m34346K3747R2647k98187J05269m81123M08504
4319B621206l60350n59578M43216Q73572K12923q59038P903l39632J44237k42167
4309A942292L41355L6785r44403M70829k65583j33812K47688L25708J52534p21682
4299A451711r6945O13504L03917l21357P4383k10222J46955K32920L69300K44510
4289B808676p16728L65167k62874m12030J05188n43064l374q6623j0960n370j08303
4278A129705J72051N3818k00994L35468L01233l34151j46723m09237J81848O5785
$$ y = [3794042, 3847337, 3550482, 3628714, 3195662, 3038318, 3113333, 2932931, 2326233, 2252731, 2850245, 3232958, 2690345, 2260519, 2157721, 2655919, 2562892, 3047677, 3270857, 2824500, 2743564, 2851130, 2693437, 3204695, 2770349, 2794096, 2886743, 2588556, 2693825, 2212702, 2621206, 2260856, 1701278, 2144494, 3018066, 3230989, 2371951, 2379854, 2040222, 2184459, 1942292, 2283647, 2320432, 1376029, 1846858, 1581275, 1447463, 1695151, 2020859, 2173393, 1451711, 1354766, 1968270, 2272187, 1950830, 2025213, 1814991, 1961946, 2194866, 2564166, 2808676, 2091948, 2457115, 2194241, 1782211, 1887399, 1344335, 1340961, 1254338, 1243378, 1238008, 1129705, 1301756, 1355574, 1154580, 1490048, 1791281, 1457130, 1310407, 901170, 1083018, 1148803]
4268A148803j69057j40682M45005M56474n09388k85998M23196L59872p44867K13493
4258A196851L31020L59629k80865O0459O09006r4305n87420L13047l21636J72957
4248A758743O6834l05663J52426n86342M03166J83208p28867M30782Q3272l5981
4238A421578j33927k67782K99287P47671j32562n6242p25850l71563L52134q20600
4228C12144J87536L01397Q06586L1710j77234m34746L63053o6264l65157L01443
4218A260468p9075m56763q46365Q6368P36584N47219J09128o90341Q4223j78580
4208E72866O18127m11031q6313O34868O27832j85171j342772N92560O07177r0733
4198A537410o26942M28619L11439k85323r13230N39696K6816L84936M76129M8863
$$ y = [1148803, 979746, 839064, 1284069, 1740543, 1231155, 945157, 1368353, 1728225, 983358, 1196851, 1527871, 1887500, 1606635, 1667094, 2276100, 2181795, 1594375, 1907422, 1585786, 1758743, 1825577, 1519914, 1672340, 1085998, 1489164, 1672372, 943505, 1374287, 1457559, 1421578, 1287651, 1019869, 1319156, 2066827, 1934265, 1878023, 1152173, 780610, 1132744, 312144, 499680, 801077, 1607663, 1639373, 1462139, 1027393, 1390446, 1324182, 959025, 1260468, 1181393, 724630, -121735, -35367, 701217, 1248436, 1357564, 667223, 751446, 572866, 1190993, 779962, 693649, 1328517, 1956349, 1771178, 428406, 1020966, 1628143, 1537410, 910468, 1339087, 1650526, 1365203, 451973, 991669, 1018485, 1403421, 1879550, 1928413]
4188A928413l67620j77068m77366N3758p190k36563K83214k62352j14469l70407
4178B52350R5859M22440k193j06197K92339m34005L12443K42345l4586k03859
4168H36936P3826j38593n17957j57397O70474Q4554N6693l11038k80495j19466
4158A97537q447J42949K13169O6856J48148j85624j90655R1660J85355J50680
4148H11628n48770o46581O95431l1627k30439J98491J62277m50664M6290N52914
4138E58950L92694r48087k41117j26764K33972l56650L34824l5685J28181P33105
4128F73423k20267j83845N304K08939K87648k17589R406J66065k19427l02320
4118B07337l91521L62458P04839n4848r98396P17152J70073j75219j73957L51745
$$ y = [1928413, 1560793, 1383725, 906359, 960117, 952927, 716364, 999578, 737226, 622757, 252350, 348209, 770649, 768456, 662259, 954598, 520593, 833036, 1075381, 1040795, 836936, 910762, 772169, 254212, 96815, 767289, 851843, 908536, 597498, 317003, 197537, 189090, 332039, 545208, 612064, 760212, 574588, 383933, 475593, 660948, 811628, 262858, -383723, 311708, 280081, 49642, 248133, 410410, -40254, 6036, 558950, 951644, 3557, -237560, -364324, -130352, -487002, -152178, -187863, -59682, 673423, 453156, 269311, 274615, 483554, 771202, 553613, 563019, 729084, 509657, 207337, -184184, 178274, 883113, 828265, -170131, 547021, 717094, 541875, 367918, 719663]
4108G19663J16661q7751K7802L22376k18051o71433n39328K11161N85040l5797
4098D30343l89960j14365J87608j86502O13156J28295L40026j23100n84313N4054
4088C55242J04267K65252p5924k43493N1135P03806j86099o48883n35163O12200
4078D02340j23792N7814K25770n5943J93332q8744p1061l17406n7752j40489j46703
4067a22634J21745K91646j42931k22661J95312K84635K94431m55837J38171k99779
4057H2098J6905j154038L13864O46093M52977q2179m23386O2226l43412o6508
4047d95360O9493m10802N55923K88815m7934k09417J96469q7431j83546R08072
4037E84282L12391m45192q5251N49091L8594J51621k92805j2476P1633o9065o21227
$$ y = [719663, 836324, 748573, 776375, 1098751, 880700, 209267, -330061, -118900, 466140, 430343, 40383, -73982, 113626, -72876, 540280, 668575, 1008601, 885501, 301188, 355242, 459509, 724761, 648837, 405344, 456479, 1160285, 974186, 325303, -209860, 402340, 278548, 336362, 562132, 506189, 699521, 610777, 539716, 222310, 164558, 24069, -122634, -889, 290757, 147826, -74835, 120477, 405112, 699543, 243706, 381877, 82098, 99003, -1055035, -741171, -95078, 357899, 275720, -147666, -85440, -428852, -495360, -425867, -836669, -280746, 8069, -39865, -249282, -52813, -140244, -323790, 584282, 896673, 451481, 366230, 915321, 953915, 1105536, 812731, 800255, 871888, 802823, 181596]
4026A81596l51096K1089k84879M40476J05141L62585L40900m22035N87366l52975
4016F28168j55093n4594k69732K60433m56439p3497N7014M86216k78987k19860
4006g6371J54954l92225L31418K72137k26643l97584q0413N93302L94866r44525
3996c71084j38204j01849L36683J12603m80895O29395r5169R625l27883j27473
3986e54251M59196k67681M95196k2242k57685K09664K92394N21058m95211j29118
3976B51320N10053J66138J61573j65899O3998k52501m83187k25126R0553q1902
3966C5020J97942O5364k80825L66140k16421J91690K76827n18829J04178k65438
3956d4352k61272L243L76745j61878n26028k96369J059809j9665j4679n3136J95035
$$ y = [181596, -169500, -148411, -433290, 7186, 112327, 474912, 815812, 393777, 981143, 628168, 473075, 418481, 148749, 409182, -47257, -120754, -63740, 422476, 143489, -76371, 78583, -313642, 17776, 289913, 63270, -334314, -414727, 178575, 573441, -371084, -509288, -611137, -274454, -161851, -642746, -13351, -108520, -98895, -426778, -554251, -95055, -362736, 132460, 110218, -147467, 62197, 354591, 875649, 380438, 251320, 761373, 927511, 1089084, 923185, 987183, 734682, 251495, 26369, 116922, 35020, 232962, 298326, 17501, 383641, 167220, 358910, 635737, 116908, 221086, -44352, -305624, -302381, 74364, -87514, -613542, -909911, 149898, 130233, 115554, 62418, 257453]
3945B57453l14574K3056M15890m60413K02872Q2565J48376Q0259n33187O95343
3935E97640m61269l80664M73085P3462n2873k48274J10909k50067m22179N46860
3925a3370j93862j62712l97014k05404L92846R03241L02926o12880n63650M85874
3915f4005l01680l8573M96848J63348k97320p27128N93708N8132J37924N14508
3905E35762k41126l99149j74519K1357K8857Q9599N9678j61365q9551J94471L20478
3894A84492k48610J73769M750O8052k88876k64687L07775N93360Q3712J00095
3884G13832n06473n68458J78429O26497l73483j40446k05397P57909k33271j08263
3874A40876K63991Q6158p12086K09905O84760n29861p60093j22855K82700m03880
$$ y = [257453, -57121, -34065, 381825, -78588, 124284, 206849, 355225, 435484, -97703, 597640, 136371, -244293, 228792, 302254, 249381, 1107, 112016, -138051, -560230, -13370, -207232, -369944, -766958, -972362, -579516, 323725, 626651, 13771, -549879, -64005, -365685, -404258, 92590, 255938, -41382, -768510, -174802, -116670, 21254, 535762, 294636, -104513, -279032, -257675, -228818, -139219, -79541, -240906, -330457, -135986, 184492, -64118, 109651, 114401, 182453, -106423, -371110, -63335, 530025, 613737, 713832, 207359, -361099, -182670, 443827, 70344, -70102, -275499, 482410, 249139, 140876, 404867, 491025, -221061, -11156, 673604, 143743, -616350, -739205, -456505, -860385]
3864h60385l41277P25073K04174j44424O85872O81141r1805l13560K41437K92413
3854A078659l96994p39286N12934k18990Q3730J11563L8554K8888p41988R13922
3844F70992l66830l35468m17254P27410K59950j61548q2046k73564k85480L34251
3834G0413M27050J20594q22216k9735N95686N5436J93989K83098l51554q9936
3824D52825Q26087K55321j21832m30182J40962J21557n22582P5431Q066j53252
3814F52401M97084j92272o11688j59466N12043K04453m04135j79692K44916j88890
3804C74754j85224K45287J07725l54591N7981k30045N40979L24422K07288m25289
3794F63287k57062P6705R6388m69434Q15554j79292q69153n60626M48077L92900
$$ y = [-860385, -1201662, -476589, -272415, -416839, 269033, 950174, 858369, 544809, 786246, 1078659, 681665, -57621, 455313, 236323, 320053, 431616, 470170, 499058, -242930, 670992, 304162, -31306, -448560, 278850, 538800, 377252, 295206, 21642, -263838, 70413, 497463, 618057, -204159, -233894, 361792, 417228, 611217, 894315, 542761, 452825, 1278912, 1534233, 1412401, 982219, 1123181, 1244738, 722156, 797587, 805653, 652401, 1149485, 957213, 345525, 186059, 698102, 902555, 498420, 318728, 563644, 374754, 189530, 434817, 542542, 187951, 245932, 15887, 556866, 881288, 1088576, 663287, 406225, 482930, 579318, 109884, 925438, 746146, -123007, -683633, -235556, 157344]
3784A57344j04896j13476p2895k9217L11730O33458J15092j18759K13745n41085
3774D51041l49277J70711P93082J67124l98770L8274o8979j46485o6593N60800
3764A150928J95410k22601l84840j91416J11648m18810K78291J42726J59384m55771
3754C64949R2565J57120j13263j25926M49599P87567m64537k91614j7968J5752
3744H54244Q8991L09150j34429K2708r20367m91701K95604n06293K98140j45725
3734c29678Q0940L10524K08123L32015o67710J75488J20547K59745k04075k41319
3724D4600N79590p50163K23378M29706m0739j92889m01146M69315P3818k94996
3714A40474M41095M18396J05956P124n15158J33165l45150Q68852M10437J32429
$$ y = [157344, 52448, -61028, -133923, -163140, 148590, 782048, 897140, 778381, 992126, 451041, 101764, 272475, 1065557, 1232681, 833911, 872185, 803206, 656721, 590128, 1150928, 1346338, 1123737, 738897, 547481, 659129, 240319, 518610, 661336, 820720, 364949, 457514, 614634, 501371, 375445, 825044, 1612611, 1148074, 856460, 838492, 854244, 943235, 1252385, 1117956, 1140664, 220297, -271404, 24200, -482093, -183953, -329678, -248738, 61786, 269909, 601924, -65786, 109702, 230249, 489994, 285919, 44600, 624190, -125973, 97405, 527111, 486372, 293483, -107663, 361652, 435470, 140474, 581569, 999965, 1105921, 1113045, 597887, 731052, 385902, 1254754, 1665191, 1797620]
3704A797620n75822K28229P63183n57413q02288K782O60279l25387q85964O83192
3694I88411N05960l90611o27423J18965P00712o3249J11599K44591j47622l09823
3684A131510L31603P93915m13728L57650l65215m04014o3543L91515K37660r58802
3674A038551k81195R6033K26968K46006m20305J0886K60768l12228K44838j46395
3664I63927R6522r5737J62656K26536k35410K48834J82688l24352k09963n1571
3654I64130J64643K65027o4646n97581n47239M5430L20696M4318j5262M71756
3644A051272R08305j5984K54640n32937L11854J99060l02218K60695p24384j11968
3634A298335K24016J36737L018r0485O2445P3867r5228K91236k23304q49383M49235
$$ y = [1797620, 1221798, 1450027, 2213210, 1655797, 853509, 856291, 1516570, 1191183, 305219, 988411, 1494371, 1103760, 476337, 595302, 1296014, 1232765, 1344364, 1588955, 1441333, 1131510, 1463113, 2257028, 1843300, 2200950, 1835735, 1431721, 1368178, 1759693, 1997353, 1038551, 757356, 853389, 1080357, 1326363, 906058, 916944, 1177712, 865484, 1110322, 963927, 1060449, 964712, 1127368, 1353904, 1118494, 1367328, 1550016, 1225664, 1015701, 964130, 1128773, 1393800, 1329154, 731573, 184334, 229764, 550460, 594778, 579516, 1051272, 1959577, 1943593, 2198233, 1665296, 1977150, 2176210, 1873992, 2134687, 1410303, 1298335, 1522351, 1659088, 1662106, 1571621, 1634066, 1707933, 1612705, 1903941, 1680637, 831254, 1280489]
3623A280489P03446j89345n69531k10377P44250L22507l86150j91681J63764k36370
3613A431002k49761J70202k44135J6230K59041L28399j9066r72069O91040K08390
3603A619273J94228L14393q46133n8736K37965K69461j58236k7663J29376K17574
3593A891502m74903M10427Q6316n0910m20346j27426l89348Q7771k4118J17286
3583A106251J52955j26671J73985O41761J06492J30159l10074j67710L55864M5727
3573B108739J67236m38378L69463J12926r236p26257J56601r5692k56463j64474
3563A224465O7162O25587l50231m12311O9980J70398J11767o81915R5355K31228
3553A151485L56569J93397j66535o1979L94329J61184J0342p75477O24190K34525
$$ y = [1280489, 1983935, 1794590, 1225059, 1014682, 1758932, 2081439, 1695289, 1503608, 1667372, 1431002, 1181241, 1351443, 1107308, 1123538, 1382579, 1710978, 1691912, 719843, 1410883, 1619273, 1813501, 2127894, 1281761, 1223025, 1460990, 1730451, 1572215, 1544552, 1673928, 1891502, 1416599, 1827026, 1913342, 1862432, 1442086, 1314660, 925312, 1013083, 988965, 1106251, 1259206, 1132535, 1306520, 1948281, 2054773, 2184932, 1874858, 1707148, 2063012, 2108739, 2275975, 1837597, 2207060, 2319986, 2310750, 1584493, 1741094, 1645402, 1388939, 1224465, 1291627, 1917214, 1566983, 1154672, 1224652, 1395050, 1506817, 824902, 920257, 1151485, 1508054, 1701451, 1534916, 1472937, 1867266, 2028450, 2038792, 1263315, 1887505, 2122030]
3543B122030Q1370N29248k43077K76631k88850Q04904j2558p58337l42553m54136
3533A714672l68570l67929M28588M06484J18630J88795M13664j165j81154n1359
3523B300656k13744k1448L0160l78621l36388K00262M75053L72222l40707M0297
3513B127742L35271n10057k81575l12345N14589J72081R4986j51201k09731L93228
3503B172988j82911K75615n2122J48160L75350j12125j40659j12451l15593L15865
3493B372117o36455M18819M5755L51550J95794k42067K22791l67936L28980p5603
3483B613745j43685o87635Q4882M64971M95439r9269m96733J13502K03681J76302
3473B725200o52913N1893J73621L4924O3054m09619K87282M47076P5418K45574
$$ y = [2122030, 2203400, 2732648, 2489571, 2766202, 2477352, 3282256, 3269698, 2511361, 2168808, 1714672, 1346102, 978173, 1406761, 1813245, 1931875, 2120670, 2534334, 2533169, 2352015, 2300656, 2086912, 2065464, 2095624, 1717003, 1380615, 1580877, 2055930, 2428152, 2087445, 2127742, 2463013, 1952956, 1671381, 1359036, 1873625, 2045706, 2140692, 1989491, 1779760, 2172988, 1990077, 2265692, 2213570, 2361730, 2737080, 2624955, 2484296, 2371845, 2056252, 2372117, 1735662, 2154481, 2200236, 2551786, 2747580, 2505513, 2728304, 2360368, 2689348, 2613745, 2470060, 1782425, 1867307, 2332278, 2827717, 2728448, 2231715, 2345217, 2548898, 2725200, 2072287, 2124180, 2297801, 2332725, 2395779, 1986160, 2273442, 2720518, 2795936, 3041510]
3463C041510m95415L41083o37593L22390M85050K79327j0647p57733K35656k22065
3453B581563j06088R5615n50902M04901J65595L00468J22536k02032N30596l80180
3443B962072m95370J72835N94323k92979m97194R7125k51646n07757M38973P84387
3433C004769L38978q69369J18494M14691J12996O82891j13744k04082l32910j99804
3423B952910O22919l0530l32075j9151L42333L8672k55088k49404N91538K82462
3413C944586p4277m94157L36627L09396O6271n0690j49201j93263l64127P04441
3403D035606J40377j37710k91006n004k6745l4159J17682l38017r373R82755J65789
3392D600195n18785L56815K10680l53181n27278O99040L16461l37396J68558K80398
$$ y = [3041510, 2546095, 2887178, 2249585, 2571975, 3057025, 3336352, 3325705, 2567972, 2803628, 2581563, 2475475, 2571090, 2020188, 2425089, 2590684, 2891152, 3013688, 2811656, 3342252, 2962072, 2466702, 2639537, 3233860, 2940881, 2443687, 2540812, 2289166, 1781409, 2220382, 3004769, 3343747, 2474378, 2592872, 3007563, 3120559, 3803450, 3689706, 3485624, 3152714, 2952910, 3575829, 3545299, 3213224, 3194073, 3536406, 3575078, 3319990, 3070586, 3662124, 3944586, 3870309, 3376152, 3712779, 4022175, 4088446, 4037756, 3888555, 3695292, 3331165, 4035606, 4175983, 4038273, 3747267, 3742263, 3715518, 3681359, 3799041, 3461024, 3451651, 4434406, 4600195, 4081410, 4438225, 4648905, 4295724, 3768446, 4467486, 4783947, 4446551, 4615109, 4895507]
3382D895507j5044k24701N09579l6579j19745o31959k63846m79817O39430J181094
3372E453919l23933k2793p7188L57758j03102L84317P79032m67464q94282N35347
3362E621611K94485N4000l88970L68516j5767m93821L34903n4514l29373K23377
3352E614447O58730Q4127K62836J92038N02679N6491j47795N12982m38905K12435
3342G510065L57148L28487J41052k60314K02362p7020l0680J26247J66401n98188
3332G865560m60119O23473K68581L40150L42751M6231j58066J57112Q42858k22596
3322I645935l93022P0177M87135J03732L55495O59871L44958l0141N9662K8191
3312A1331993L33547N16105M44423j62585k24346R3793P69911J47426L26112M91048
$$ y = [4895507, 4880463, 4655762, 5165341, 5128762, 5009017, 4377058, 4113212, 3633395, 4272825, 5453919, 5129986, 5107193, 5030005, 5387763, 5284661, 5668978, 6448010, 5980546, 5086264, 5621611, 5916096, 5970096, 5581126, 5949642, 5933875, 5440054, 5774957, 5720443, 5391070, 5614447, 6273177, 6357304, 6620140, 6812178, 7314857, 7371348, 7223553, 7736535, 7297630, 7510065, 7867213, 8195700, 8336752, 8076438, 8278800, 8201780, 8171100, 8297347, 8463748, 7865560, 7405441, 8028914, 8297495, 8637645, 8980396, 9026627, 8868561, 9025673, 9868531, 9645935, 9252913, 9323090, 9810225, 9913957, 10269452, 10929323, 11274281, 11244140, 11303802, 11331993, 11665540, 12181645, 12626068, 12463483, 12239137, 12332930, 13102841, 13250267, 13576379, 14067427]
3302A4067427j61804k48994l42929K95613R02721M11997Q38205J7365L73410J044486
3292A7197497M28452Q7752r0979K91467M44361P21639O25571J243832M27849N38245
3282B1915686K27056L73471O73777L14287J833201J049097J139306R39313J365370
3273B9830564K212168J669480J354969J213257J293782P92221J173367K279126
3265D1818934J044352N66675N79919L93653J81871j140918l07572j735927j646081
3256C9754906j702813j583793p44661k089400j574771j161786l21294j259327
3248B9317061j800194p22345j191031m85005o12266l33526p12409o84265L48819
3239B3124839k32298m29364p7606p41836l33031j31137k2560r1900m92279m94097
$$ y = [14067427, 13905623, 13656629, 13313700, 13609313, 14512034, 14924031, 15762236, 15779601, 16153011, 17197497, 17625949, 17713701, 17622722, 17914189, 18358550, 19080189, 19705760, 20949592, 21377441, 21915686, 22142742, 22516213, 23189990, 23504277, 25337478, 26386575, 27525881, 28465194, 29830564, 32042732, 33712212, 35067181, 36280438, 37574220, 38366441, 39539808, 41818934, 42863286, 43429961, 44009880, 44403533, 44585404, 43444486, 43136914, 41400987, 39754906, 38052093, 36468300, 35723639, 33634239, 32059468, 30897682, 30576388, 29317061, 27516867, 26794522, 25603491, 25118486, 24506220, 24172694, 23460285, 22776020, 23124839, 22892541, 22463177, 22385571, 21643735, 21310704, 21179567, 21157007, 21065107, 20572828, 20078731]
3229B0078731k13912o29118M62277k78085j224445j82071l89488q45860o68316
3220A6109713k42662M25684k7305n19433m37681m18112p63462n979k41159l8764
3210A3840840K332n61343L94133p30780o58156Q9287k00289J54489J2821m66575
3200A1876759k86053p2554P6529K45383l43812m50593m55704l94119k46710R2955
3190A0042081k57555m79879q6197n6853M86383r4562n85454j59046J97065k53544
3180H752439o24461n07491J029394q4054m5709k76725l81708J50310l66312l34035
3170G311648p9077q6346N69956m83225j61042j9574L1131p6006k38928l49788
3160F418749L04606j06000N1436m83714K2379O03592J43255J57007m00394k82092
$$ y = [20078731, 19864819, 19235701, 19697978, 19419893, 18195448, 18013377, 17623889, 16778029, 16109713, 15867051, 16292735, 16265430, 15745997, 15308316, 14890204, 14126742, 14120763, 13879604, 13840840, 13843172, 13281829, 13675962, 12945182, 12287026, 12376313, 12176024, 12330513, 12343334, 11876759, 11590706, 11518152, 11594681, 11840064, 11496252, 11045659, 10589955, 10195836, 9949126, 10042081, 9784526, 9304647, 9218450, 9161597, 9647980, 9553418, 8967964, 8808918, 9005983, 8752439, 8127978, 7620487, 8649881, 8565827, 8520118, 8243393, 7861685, 8011995, 7645683, 7311648, 7232571, 7146225, 7716181, 7232956, 7071914, 7052340, 7083471, 7007465, 6768537, 6418749, 6723355, 6617355, 6668791, 6185077, 6207456, 6811048, 6954303, 7111310, 6710916, 6428824]
3150F428824p06385j26232j12768K10991m07233k83418L1187Q5855n1021J36282
3140E206082m79651l51604K47370J42961K69515l87977O26400K57295m67485K49908
3130E312814o35721n8716o9558n88677o7889o6748l98992P76529J08019L43227
3120D654288O1499j47001M07878j76649j4251J62255J11538l67611k47167q06449
3110C638330J1076k1656N40126k018k86849K4906M894R9678q8073K10126k17763
3099C912777j92877J59105N34324n27998o62734j90793M55002K5954N7918j65076
3089C405602k00481J28345O39035K4485J26304m29051o7367L2442K54454j3923
3079C899845p17413N4095P568o6160k92208n44875m5447j23842O95672p96615
$$ y = [6428824, 5722439, 5596207, 5483439, 5694430, 5287197, 5003779, 5034966, 5120821, 5069800, 5206082, 4726431, 4374827, 4622197, 4765158, 5034673, 4646696, 5273096, 5530391, 5062906, 5312814, 4677093, 4618377, 4548819, 3960142, 3892253, 3825505, 3426513, 4203042, 4311061, 4654288, 4715787, 4568786, 4976664, 4800015, 4785764, 4948019, 5059557, 4691946, 4444779, 3638330, 3649406, 3627750, 4167876, 4165858, 3879009, 3903915, 3908809, 4008487, 3920414, 4130540, 3912777, 3719900, 3879005, 4413329, 3885331, 3222597, 3031804, 3486806, 3512760, 3570678, 3405602, 3205121, 3333466, 3972501, 3996986, 4123290, 3694239, 3626872, 3659314, 3913768, 3899845, 3182432, 3236527, 3244095, 3177935, 2885727, 2340852, 2295405, 2171563, 2867235, 2070620]
3069B070620m18769R21090O91243j01812l75500L26957L06060J75815n98534J80908
3059C178078M61309k34869l93768o64717N7309k5738L08907O17773k0614n72985
3049B710685J47785j0877k91472k08718Q9705P10153l22079p6011k221N25399
3039C272349k81098K74495N33428o7701m79426l38533J3135M09078j2789P04310
3029D027248K14187m86102n21156M32605j8615j07960r5346L32835l67950m65122
3019B944624L33705K09899P8394j94096k27051P3423J4432r704o28163j3789O91015
3008C272689M62418n5425R5247L19991J05867l90577l69534L46184L7701Q03384
2998D627945l66972L55016n75252M43218M85948j34831k22161j65267K05455k0874
$$ y = [2070620, 1651851, 2572941, 3264184, 3162372, 2786872, 3113829, 3419889, 3595704, 2997170, 3178078, 3639387, 3404518, 3010750, 2346033, 2403342, 2377604, 2686511, 3304284, 3283670, 2710685, 2858470, 2847593, 2556121, 2347403, 2437108, 3147261, 2825182, 2749171, 2746950, 3272349, 2991251, 3265746, 3799174, 3731473, 3252047, 2913514, 2926649, 3335727, 3322938, 4027248, 4241435, 3755333, 3234177, 3666782, 3648167, 3540207, 3444861, 3777696, 3409746, 2944624, 3278329, 3488228, 3566622, 3372526, 3145475, 3218898, 3233330, 3223626, 2595463, 2581674, 3272689, 3735107, 3679682, 3774929, 4094920, 4200787, 3810210, 3440676, 3786860, 3824561, 4627945, 4260973, 4615989, 4040737, 4483955, 4969903, 4835072, 4612911, 4447644, 4653099, 4632225]
2988D632225k30976M08932R17258j08368J90683r4660K75658O41479l58051q68283
2978E405897l32963R5863K52668J97903K54190O8317j98162K80519L91409m52835
2968E962806m50024K65409j49641J4938P59379M23445K51373J59316L46006k81347
2958G301660l33176M39988M57639k86105m274R22837k8373j49620Q59855O78156
2948I858587j50255o08172L75950k25766P3100m12042R91951N5666L3200J86159
2938A0178378J12017O66996L0352N836K10851o5858L27540O95538L32382j67701
2928A2326331K11568J200196K99962M7195P94786P20333o1475k27158L58376R29628
2918A6599742n83234o20566o10831m32696k77841M2554n6527K75288q7101J15103
$$ y = [4632225, 4401249, 4810181, 5727439, 5619071, 5809754, 5715094, 5990752, 6632231, 6274180, 5405897, 5072934, 5168797, 5421465, 5619368, 5873558, 5941875, 5743713, 6024232, 6415641, 5962806, 5512782, 5778191, 5628550, 5643488, 6402867, 6826312, 7077685, 7237001, 7583007, 7301660, 6968484, 7408472, 7866111, 7580006, 7575732, 8498569, 8470196, 8320576, 9180431, 9858587, 9708332, 9100160, 9476110, 9250344, 9323444, 8911402, 9903353, 9959019, 9992219, 10178378, 10290395, 10957391, 10987743, 10993579, 11204430, 11138572, 11466112, 12161650, 12494032, 12326331, 12537899, 13738095, 14038057, 14085252, 14880038, 15600371, 15538896, 15311738, 15670114, 16599742, 16016508, 15395942, 14785111, 14352415, 14074574, 14117128, 14060601, 14335889, 14248788, 14363891]
2908A4363891J19809n24516N53465Q6901K08073J66780k96680j2687j79106O50710
2898A5136640J96433k68400q96459R93028N17215M01638m53291l00391K03342
2889A5529755r86560K83716m91874l58836l42746q31406l37509p2521K19954k73466
2879A2338507p06675q7266J28556n4641l53821m00606J01943m31067J52268j12340
2869A0574858k25803k55291k04286l41892m29986n75375J99851n75674o48066
2860G518336o16607K49010l16704n18619J35927l47199r5699j10187M96325j19771
2850F274812n52819o941M66045R6203r5070k69613k81146o67592j08345L5382
2840D890916J08316p81794k28705J76106j88507k24446m31726k43601m35047J45761
$$ y = [14363891, 14483700, 13959184, 14512649, 14599550, 14807623, 14974403, 14677723, 14665036, 14485930, 15136640, 15333073, 15064673, 14168214, 15161242, 15678457, 16080095, 15626804, 15326413, 15529755, 14543195, 14826911, 14335037, 13976201, 13633455, 12802049, 12464540, 12392019, 12611973, 12338507, 11631832, 11544566, 11673122, 11618481, 11264660, 10864054, 10965997, 10534930, 10687198, 10574858, 10349055, 10093764, 9889478, 9547586, 9117600, 8542225, 8742076, 8166402, 7518336, 6901729, 7150739, 6834035, 6315416, 6451343, 6104144, 6008445, 5898258, 6394583, 6274812, 5721993, 5715052, 6181097, 6277300, 6182230, 5912617, 5631471, 4963879, 4855534, 4890916, 4999232, 4217438, 3988733, 4164839, 3976332, 3751886, 3320160, 3076559, 2641512, 2787273]
2830B787273m26832l83244o9709J61882M26633p5533q03050j22972O34281M60663
2820B589392o82060l27979N30648O71519p29161n61328P27290P27809M00987j248264
2810B098853r3938Q46315L18421q05157k55091J76120K50772q32639p1914K65055
2800A896797m81270l29567j3182J56667K62563j46767l47572j45997l70599N85268
2790A066341Q74619j87243m60331j8789N55082N68561m34350k4400J61672l15642
2780A785520j24353o76714J02860j056190M19742L18444K06375k83843J50380
2771H42221K13313k08987k75126N46858k2540p04848M35897J05203l24896m50515
2761A56580l23731q0174k67823L30049L85498j49640k85137J58472Q80928L38994
$$ y = [2787273, 2360441, 1977197, 1907488, 2069370, 2496003, 2420470, 1617420, 1494448, 2128729, 2589392, 1907332, 1579353, 2110001, 2781520, 2052359, 1491031, 2218321, 2946130, 3347117, 2098853, 2004915, 2851230, 3169651, 2364494, 2109403, 2285523, 2536295, 1703656, 1631742, 1896797, 1415527, 1085960, 1072778, 1229445, 1492008, 1345241, 997669, 851672, 481073, 1066341, 1940960, 1753717, 1293386, 1274597, 1829679, 2398240, 1963890, 1939490, 2101162, 1785520, 1661167, 984453, 1087313, 31123, 450865, 769309, 975684, 691841, 842221, 1055534, 846547, 571421, 1118279, 1095739, 390891, 826788, 931991, 607095, 156580, -167151, -247325, -515148, -185099, 200399, 50759, -234378, -75906, 805022, 1144016]
2751A144016K40731m25477o0983Q9789m38129n28036L33442L23201M27997p10339
2741C96212j67319J13464l79300P43271J0098M17676Q5094m00827J06690k90727
2731F34332l62264l40550M38802J4694m18087j46757J93836J57277L96816L04832
2721H72931J34251o96765p56437j66878K39371r6573L14899n3705o29241j17592
2711i55739J26168M98122P37113m4125j25237q42920K60434P43864k78579p8560
2701D0541K92548J77159n56635K98886N16390j27375l64777l1320j45583l93926
2691b94092K12336j12496k47286L35174K17578l37909K61534K63884r8952k05449
2681e678j0773l0890k01771L29730M78612l32461j099150M3487L09924j75801
$$ y = [1144016, 1384747, 959270, 898287, 988076, 549947, 21911, 355353, 678554, 1106551, 396212, 228893, 342357, -36943, 706328, 716426, 1134102, 1219196, 818369, 925059, 634332, 272068, -68482, 370320, 385014, -33073, -179830, 14006, 171283, 568099, 872931, 1007182, 310417, -446020, -612898, -373527, -470100, -155201, -208906, -838147, -955739, -829571, -331449, 405664, 361539, 236302, -606618, -346184, 397680, 119101, 40541, 333089, 510248, -46387, 252499, 768889, 641514, 276737, 245417, 99834, -294092, -81756, -194252, -441538, -106364, 111214, -226695, 34839, 298723, 199771, -5678, -16451, -47341, -249112, 80618, 559230, 226769, -872381, -828894, -518970, -694771]
2671f94771J07652l92928O66151K72453n53057L54225J5489O79060K15463m59492
2661B10245L12533k74008j15522l27678q9261k23748J84410n291O06615j78997
2651I9298n54889k38701M85856J30211K92645k36611j24817J73790J8840k89118
2641b43496J90953j59388P02066J05344n89965J42207o10295L89221o50750J78439
2631e45664r9020O84230m64847o92166o767R84163J01142m84688O16965L18812
2621D12160l03655j15030L06540M39801m49816j53614O38741l61777l98107O63777
2611F79020j9472K43371m34313l5844p5974q05385M49515K031n21585L9991K40623
2600b38022j99685l83006N82131M36346o4547J52837j02860j86066p34050P57827
$$ y = [-694771, -587119, -980047, -313896, -41443, -594500, -240275, -224786, 454274, 669737, 210245, 522778, 248770, 133248, -194430, -283691, -507439, -323029, -328320, 278295, 99298, -455591, -694292, -208436, -78225, 214420, -22191, -147008, 26782, 45622, -243496, -52543, -211931, 490135, 595479, 5514, 147721, -462574, -73353, -724103, -545664, -644684, 39546, -425301, -1117467, -1124234, -140071, -38929, -523617, 93348, 412160, 108505, -6525, 300015, 739816, 290000, 136386, 775127, 413350, 15243, 679020, 659548, 902919, 468606, 432762, 356788, -448597, 918, 2949, -518636, -478645, -238022, -437707, -820713, -238582, 197764, 133217, 286054, 183194, -2872, -736922, 20905]
2590B0905o517l74237K04661J31525K9574j40723q0621M48721Q9090J13231l15743
2579A19866k06563J80091k95126J29447l04052L63402n64753q7946L5884P0262
2569e59488j81063M74250J89711L02782l14065o69092N1504K78945Q5561j74573
2559e15528K40361L1375j69546L93686P1621O7980p80874j2948j74332l87471
2549a235676M85956M69805N77556n69962j78231J50268k33270L95520J33741k07661
2539b11954l42786j29364J24343l01046L43771J11730m90743L41016Q5425L76240
2529i3368m0164m16005j50218J18851Q65124J64227o65235j32924N48200o3724
2519A34764n01589j46384J313948J11646q12722p70925o2165L08542K28917J15259
$$ y = [20905, 14388, -359849, -155188, -23663, 5911, -134812, -215433, 233288, 322378, 435609, 119866, -86697, 93394, -201732, -72285, -376337, -12935, -577688, -665634, -629750, -559488, -740551, -266301, -76590, 226192, -87873, -756965, -705461, -426516, -340955, -515528, -275167, -243792, -413338, -19652, 51969, 119949, -660925, -673873, -848205, -1235676, -749720, -279915, 297641, -272321, -450552, -300284, -533554, -138034, -4293, -211954, -554740, -684104, -559761, -860807, -517036, -405306, -896049, -555033, -469608, -93368, -133532, -549537, -699755, -580904, 284220, 448447, -216788, -349712, 198488, 134764, -366825, -513209, 800739, 912385, 99663, -671262, -733427, -424885, -195968, -80709]
2509h0709m02143n56071J3157J32231L61480M05393M5846n90633l8321J9358K74348
2498d16064m19260L77222l20927j15298l04517N49019L56327k67781k8504k54729
2488h44512j77066O6038j67705o3311k13991J86569M27058p1861m29719Q01533
2478d86967L24010l00488n66026L50323P56189j52659L73781k31614J37978n829
2468A98698k72140k21672l52700n6835N39819l2454J30104m9359J24816L21247
2458C29524l1236n39129j94223j55960K67329k15151P0052l44346j02680M55754
2448d60066M13784o45399m18902J02572L47893j51816m35938L05301O9369j25079
2438i98281J44891M55608j26775j8824J86900L0753m2620n79199K30542L1033
$$ y = [-80709, -482852, -1038923, -1025766, -893535, -532055, -126662, -80816, -671449, -709770, -690412, -416064, -835324, -458102, -779029, -894327, -1198844, -649825, -293498, -561279, -589783, -844512, -1021578, -955540, -1123245, -1186556, -1400547, -1213978, -786920, -858781, -1288500, -486967, -162957, -463445, -1029471, -679148, 77041, -75618, 298163, 66549, 204527, 198698, -73442, -295114, -647814, -704649, -164830, -197284, -67180, -116539, 8277, 329524, 298288, -240841, -435064, -591024, -323695, -538846, -468794, -813140, -915820, -460066, -46282, -691681, -1110583, -1008011, -660118, -811934, -1247872, -942571, -873202, -998281, -853390, -397782, -524557, -543381, -356481, -325728, -368348, -947547, -717005, -685972]
2428f85972j70378N51248N72110k26359J05993n77772M27279m46967N3676M66859
2418F9717M39960K25763p70317q08377K62260K89969P7737K05272q82887N26438
2408c64465m57818J41371J21186J72349L10028l23263m04880K289O0157J77038
2398e66008K68144K78460N5251l1716K67894O10459K36171k67900n14418k34388
2388A01949J75185N06830o83248l24014k25672K73823J27715k3582j54523l35167
2378e60704o5759r7695N30047j18511J52828n04662O8409Q0058m34113N08466
2368d41636K3712J044m25499k43088K63717o967j23344J87416r2084k03889K80729
2357g79889M23631Q8428k63079J57636O85142M01594p1735m44386J26681m60503
$$ y = [-685972, -856350, -305102, 267008, 40649, 146642, -431130, -3851, -450818, -397142, 69717, 509677, 735440, -34877, -843254, -580994, -291025, -213288, -8016, -890903, -364465, -822283, -680912, -559726, -387377, -77349, -400612, -805492, -803203, -743046, -566008, -297864, -19404, 35847, 4131, 272025, 882484, 1118655, 850755, 336337, 101949, 277134, 783964, 100716, -223298, -448970, -175147, -47432, -71014, -225537, -560704, -626463, -724158, -194111, -312622, -159794, -664456, -596047, -515989, -950102, -441636, -417924, -416880, -842379, -1085467, -821750, -828717, -952061, -764645, -856729, -1060618, -779889, -356258, -267830, -530909, -373273, 311869, 713463, 641728, 197342, 324023, -136480]
2347a36480J25769j20959m31855O8288l35074K85709J96912m1883M06789l74346
2337c57130m78636L40345l03098M7982k36024k7601M40543M64950q02293k91870
2327a202832M68957P55884M8892j94340M75746k57198n85416K25104p3769M03698
2317F4726J97837k30878l79909o20279l8132j83077K30770O57774L944j24312
2307d21536N77941M41118q06825n49125m1969O72357M6925J03639m67091r0894
2297e35460M84488R2374j19365m11969n4574J89795N32579n7041k35813L79634
2287B64648R8298L7430m565j14115k23683k02341J56791L26146M53368L31836
2277A123813K30783j80710l50836M8034k84794o0140k04660k79604k17122k67999
$$ y = [-136480, -10711, -131670, -563525, -495237, -830311, -544602, -347690, -389573, 17216, -357130, -835766, -495421, -798519, -750537, -986561, -1014162, -573619, -108669, -910962, -1202832, -733875, 22009, 70901, -123439, 352307, 95109, -490307, -265203, -338972, 64726, 262563, 31685, -348224, -968503, -1006635, -1189712, -958942, -301168, -297224, -421536, 156405, 597523, -209302, -758427, -800396, -128039, -81114, 22525, -444566, -535460, -50972, 41402, -77963, -489932, -544506, -354711, 177868, 120827, -114986, 264648, 362946, 400376, 395811, 281696, 58013, -144328, 12463, 338609, 791977, 1123813, 1354596, 1173886, 823050, 871084, 586290, 526150, 321490, 41886, -175236, -443235]
2267d43235k88711K52148K04677M21123K87475j14418j12483n03565M09516J20241
2257B32768j34116J4686M18398j179101J06088K08555L84253M04684j4509l60029
2247H1677n43122p48802M77969L60040J52944J70630N8661k01936O9590p8564
2237b00913J33825L18998o8954O15143L3774o4898K49460j80076j14256p7605
2227F44498k30924L47016M2899n87319L47829j74964N78912N29789m99456l95034
2217F03246j76342M36547k43947N06558L18815l71201j191754J7925M97455M3668
2207D40970j67154K71481K83155N42946P5859k87454O5983n9025O07163o23044
2197A150880j72773J96605P98494m05488J0881N4046L88474M30809j067674N70071
$$ y = [-443235, -731946, -479798, -275121, 146002, 433477, 319059, 206576, -296989, 112527, 232768, 98652, 113338, 531736, -647365, -541277, -332722, 51531, 456215, 441706, 81677, -461445, -1210247, -732278, -372238, -219294, -48664, 9997, -191939, -122349, -200913, -67088, 251910, 182956, 798099, 831873, 766975, 1016435, 836359, 722103, 644498, 413574, 760590, 803489, 216170, 563999, 389035, 967947, 1497736, 998280, 603246, 426904, 863451, 619504, 1126062, 1444877, 1073676, -118078, -100153, 397302, 440970, 273816, 545297, 828452, 1371398, 1447257, 1159803, 1225786, 1166761, 1773924, 1150880, 978107, 1174712, 1973206, 1567718, 1578599, 1632645, 2021119, 2451928, 1384254, 1954325]
2187A954325k39903M65051m84023J29425J94380L8541l31906k61113J92731k18776
2177A438732R5999n2228O94214O67905m84176m1358M32802K35256K66660n82107
2167B671699k88798O50561N83305K30910k09046P76444Q00074R4194K57103L15671
2157E882117j1941Q2383M1278O84920M11068L13687N15809R18877M90071k23070
2147I105199K29183Q9456Q07646M65304O41524R04675J044493R91896P91954J104417
2137A6175747J293271J250228J644217J541109J607956K662999L553334M075834
2129C3804695M543099M885773M801001N288577O042817O412883P651658O851576
2121H0282079L110680m570946r817651j0819493r237084p700384n530577m501497
$$ y = [1954325, 1714422, 2179473, 1695450, 1824875, 2019255, 2057796, 1725890, 1464777, 1657508, 1438732, 1534731, 1482503, 2176717, 2844622, 2360446, 2319088, 2751890, 2987146, 3253806, 2671699, 2382901, 3033462, 3616767, 3847677, 3638631, 4415075, 5215149, 5309343, 5566446, 5882117, 5870176, 5952559, 5993837, 6678757, 7089825, 7403512, 7919321, 8838198, 9328269, 9105199, 9334382, 9423838, 10231484, 10696788, 11338312, 12242987, 13287480, 14279376, 15071330, 16175747, 17469018, 18719246, 20363463, 21904572, 23512528, 26175527, 29728861, 33804695, 38347794, 43233567, 48034568, 53323145, 59365962, 65778845, 73430503, 80282079, 83392759, 78821813, 69004162, 58184669, 48947585, 41247201, 35716624, 31215127]
2113C1215127l687604l319083k872701j423247j853334j854808j307231p19780
2105A4177339j028079j423620r72208q76284p91606k73352n82163m01643q24222
2096G004162k17991m76454k73153k8646q19291o80042N5620M94461l75993m59256
2086D223417J22146K89395l31134k51805J4861n18108r34402P4808J55401j68442
2076B676137o09596J16896N70700m83089j82422j00847q0097q6243m2628R6872
2066A875683L79117m87587m22347J34716j02735J39808J87814m76292M08420l6441
2056A600156m16285J78801j20904p674L40927o30151l23437K73929K50642M55312
2046A601316m49929m33214M38684j58527J47611j01271j29576j08723J69673J1517
$$ y = [31215127, 27527523, 24208440, 21335739, 19912492, 18059158, 16204350, 14897119, 14177339, 13149260, 11725640, 10753432, 9877148, 9085542, 8812190, 8230027, 7828384, 7004162, 6786171, 6309717, 6036564, 6007918, 5188627, 4508585, 4564205, 5058666, 4682673, 4223417, 4345563, 4634958, 4303824, 4052019, 4066880, 3548772, 2614370, 2689178, 2844579, 2676137, 2066541, 2183437, 2754137, 2271048, 2088626, 1987779, 1907682, 1821439, 1778811, 1875683, 2254800, 1767213, 1344866, 1479582, 1376847, 1516655, 1704469, 1228177, 1636597, 1600156, 1183871, 1362672, 1241768, 1234094, 1575021, 944870, 621433, 895362, 1146004, 1601316, 1151387, 718173, 1156857, 998330, 1145941, 1044670, 915094, 806371, 976044, 987561]
2036I87561q489o16707Q4527M93851k08431k08183m6052J06926k55621J61806
2026D91188K54070k52185j42211L60855L9736l76669m13563K77287K82397L07494
2016H28399l78972o8585m25904L25882K77286j30067j50080k48248N72366l85373
2006B16704p25029n2410R38407l64610m57837L32671K04690n22374m79633l06794
1996a216215P64460J83569J34807j40465o06906P14899k33867l1016N8937J162510
1986G90713o00273l8613k58841O5574k66443l02365O83151k41080k18892P29397
1976C42328k28619j61548m77916M52516l3512n38309M2436K67120K23724l7809
1966a49589K38019j25395K74982J74234J85462l30431l84330r8637K11913L16668
$$ y = [987561, 979072, 362365, 446892, 940743, 732312, 524129, 478077, 585003, 329382, 491188, 745258, 493073, 350862, 711717, 751453, 374784, -38779, 238508, 520905, 828399, 449427, 380842, -45062, 280820, 558106, 428039, 277959, 29711, 602077, 216704, -508325, -560735, 377672, 13062, -444775, -112104, 92586, -429788, -909421, -1216215, -451755, -268186, -133379, -273844, -880750, -165851, -399718, -430734, -371797, 790713, 190440, 151827, -107014, -41440, -307883, -610248, 72903, -168177, -387069, 342328, 113709, -47839, -525755, -73239, -106751, -645060, -602624, -335504, -111780, -149589, 88430, -36965, 238017, 412251, 597713, 267282, -117048, -215685, -3772, 312896]
1956C12896O01730l38625n44739l66778P18032K14499n21316k17413L0073n5440
1946a67081k7300p35930N8112k18234k0344O29618M81150R4422o65066Q2427L26516
1935a61710p8717p2764P53909J00541n20410m79027m27710l71514Q53018P79881
1925C75497M12112m37826k16023L43658n47913l56656N22428j5178J38068o31647
1915d13480N0067L56890k99916O23700J08489k1972o62088j15964o9590r2535
1905e36399m34363N69184k70614J46129k64247K23045J4783J10719P7101m55163
1895h19825O48138N32758K78474o63588k26336N00580n17931n58518J31683j45423
1885h39988R3211K16733O54765J94293k92949L24563L62373o2274O2672k4112
$$ y = [312896, 914626, 576001, 31262, -335516, 382516, 597015, 75699, -141714, -111641, -167081, -194381, -930311, -872199, -1090433, -1110777, -481159, -9, 94413, -570653, -488226, -161710, -240427, -313191, 440718, 541259, 20849, -458178, -885888, -1257402, -404384, 375497, 787609, 349783, 133760, 477418, -70495, -427151, 95277, 80099, 218167, -413480, -363413, -6523, -306439, 317261, 425750, 403778, -258310, -374274, -443864, -536399, -970762, -401578, -672192, -526063, -790310, -567265, -552482, -441763, -364662, -819825, -171687, 361071, 639545, -24043, -250379, 250201, -267730, -826248, -694565, -839988, -746777, -530044, 124721, 319014, 26065, 350628, 713001, 650727, 713399, 689287]
1875F89287r4830q30845L72544l56209j89215j00989O98500J72784p66390K6196
1865c79167k93875N38681j41405N76954n08384l77229K21616L80968K0274n46304
1855e07871J81561K08038J59298l79894L58588k5897l46201M62284K70581k48026
1845A32461l15157l19020L2370j98527K78213K48475n12370k97966M45387J2537
$$ y = [689287, 594457, -236388, 136156, -220053, -409268, -510257, 188243, 361027, -405363, -379167, -673042, -134361, -275766, 301188, -207196, -584425, -362809, 18159, 38433, -507871, -326310, -118272, 41026, -338868, 19720, -6177, -352378, 109906, 380487, 132461, -182696, -501716, -469346, -667873, -389660, -141185, -653555, -951521, -506134, -493597]
$$ [...]
##END NTUPLES=NMR SPECTRUM
##END=
