##TITLE=1H_CA-8947-1
 CDCl3
 8 sc, 
 8.11.2021
##JCAMPDX= 6.0         $$ Bruker NMR JCAMP-DX V2.0
##DATA TYPE= NMR SPECTRUM
##DATA CLASS= NTUPLES
##ORIGIN= UXNMR, Bruker Analytische Messtechnik GmbH
##OWNER= root
$$ XWIN-NMR		Version 3.5
$$ Mon Nov  8 12:04:36 2021 Russian Standard Time (UT+4h)  she@DPX200
##.OBSERVE FREQUENCY= 200.1313468511
##.OBSERVE NUCLEUS= ^1H
##.ACQUISITION MODE= SIMULTANEOUS
##.ACQUISITION SCHEME= undefined
##.AVERAGES= 8
##.DIGITISER RES= 18
##SPECTROMETER/DATA SYSTEM= spect
##.PULSE SEQUENCE= zg30
##.SOLVENT NAME= D2O
##.SHIFT REFERENCE= (INTERNAL, D2O, 0, 15.737)
##AUDIT TRAIL= $$ (NUMBER, WHEN, WHO, WHERE, WHAT)
$$ ##TITLE= Audit trail, XWIN-NMR		Version 3.5
$$ ##JCAMPDX= 5.01
$$ ##ORIGIN= Bruker BioSpin GmbH
$$ ##OWNER= she
$$ F:/spectra/data/she/nmr/H-F/1/pdata/1/auditp.txt
$$ ##AUDIT TRAIL=  $$ (NUMBER, WHEN, WHO, WHERE, WHAT)
(   1,<2021-11-08 12:03:06.51 +0400>,<she>,<DPX200>,
      <created by zg, POWCHK disabled, PULCHK disabled
       configuration hash MD5:
       00 E9 B6 7A A2 85 ED C7 34 08 36 98 17 FE 4E 26
       data hash MD5: 16K
       6D 53 65 99 06 56 0D 61 4C D0 B5 C3 09 F2 BE 82>)
(   2,<2021-11-08 12:03:21.92 +0400>,<she>,<DPX200>,
      <Start of raw data processing
       efp BC_mod = 2 LB = 0.24 FT_mod = 6 PKNL = 1 PHC0 = -15153.39 PHC1 = 9.600823 SI = 16K 
       data hash MD5: 16K
       A5 5B 8F 87 44 55 8A 38 29 92 DD 30 5C 09 36 DD>)
(   3,<2021-11-08 12:03:37.98 +0400>,<she>,<DPX200>,
      <pk PHC0 = -1.554391 PHC1 = 2.4 
       data hash MD5: 16K
       AF FA 61 28 16 75 FD 27 41 C8 88 95 BC 58 D0 F6>)
(   4,<2021-11-08 12:03:41.46 +0400>,<she>,<DPX200>,
      <abs ABSG = 5 
       data hash MD5: 16K
       4C 8C 2E AD 6B 15 B6 68 82 EC 7C 51 C1 A2 C9 8A>)
$$ ##END=
$$ 
$$ hash MD5
$$ 0A D9 95 78 75 1F B6 CE D2 AD 7F 66 39 5A 7F 93
##$RELAX= 
##$RELAX= 
##$RELAX= 
##$RELAX= 
##$RELAX= 
##$RELAX= 
$$ Bruker specific parameters
$$ --------------------------
##$DU= <F:/spectra>
##$EXPNO= 1
##$NAME= <H-F>
##$PROCNO= 1
##$TYPE= <nmr>
##$USER= <she>
##$AMP= (0..31)
100 100 100 100 100 100 100 100 100 100 100 100 100 100 100 100 100 100 
100 100 100 100 100 100 100 100 100 100 100 100 100 100 
##$AQSEQ= 0
##$AQ_mod= 1
##$AUNM= <au_zg>
##$AUTOPOS= <>
##$BF1= 200.13
##$BF2= 200.13
##$BF3= 200.13
##$BF4= 200.13
##$BF5= 200.13
##$BF6= 200.13
##$BF7= 200.13
##$BF8= 200.13
##$BYTORDA= 1
##$CFDGTYP= 0
##$CFRGTYP= 5
##$CHEMSTR= <none>
##$CNST= (0..31)
1 1 145 1 1 1 1 1 1 1 1 1 1 1 1 1 1 1 1 1 1 1 1 1 1 1 1 1 1 1 1 1 
##$CPDPRG= <>
##$CPDPRG1= <>
##$CPDPRG2= <>
##$CPDPRG3= <>
##$CPDPRG4= <mlev>
##$CPDPRG5= <mlev>
##$CPDPRG6= <mlev>
##$CPDPRG7= <mlev>
##$CPDPRG8= <mlev>
##$CPDPRGB= <>
##$CPDPRGT= <>
##$D= (0..31)
0 1.2 0 0 0 0 0 0 0 0.06 0 0.03 0 0 0 0 0.0002 0 0 0 0 0 0 0 0 0 0 0 0 
0 0 0 
##$DATE= 1636358585
##$DBL= (0..7)
120 120 120 120 120 120 120 120 
##$DBP= (0..7)
150 150 150 150 150 150 150 150 
##$DBP07= 0
##$DBPNAM0= <>
##$DBPNAM1= <>
##$DBPNAM2= <>
##$DBPNAM3= <>
##$DBPNAM4= <>
$$ [...]
##$SUBNAM2= <"">
##$SUBNAM3= <"">
##$SUBNAM4= <"">
##$SUBNAM5= <"">
##$SUBNAM6= <"">
##$SUBNAM7= <"">
##$SUBNAM8= <"">
##$SUBNAM9= <"">
##$SW= 18.0517286264689
##$SWIBOX= (0..15)
0 0 2 0 0 0 0 0 0 0 0 0 0 0 0 0 
##$SW_h= 3612.71676300578
##$TD= 16384
##$TD0= 1
##$TE= 0
##$TE2= 300
##$TE3= 300
##$TEG= 300
##$TL= (0..7)
0 120 120 120 120 120 120 120 
##$TP= (0..7)
150 150 150 150 150 150 150 150 
##$TP07= 0
##$TPNAME0= <>
##$TPNAME1= <>
##$TPNAME2= <>
##$TPNAME3= <>
##$TPNAME4= <>
##$TPNAME5= <>
##$TPNAME6= <>
##$TPNAME7= <>
##$TPOAL= (0..7)
0.5 0.5 0.5 0.5 0.5 0.5 0.5 0.5 
##$TPOFFS= (0..7)
0 0 0 0 0 0 0 0 
##$TUNHIN= 0
##$TUNHOUT= 0
##$TUNXOUT= 0
##$USERA1= <user>
##$USERA2= <user>
##$USERA3= <user>
##$USERA4= <user>
##$USERA5= <user>
##$V9= 5
##$VALIST= <valist>
##$VCLIST= <CCCCCCCCCCCCCCC>
##$VD= 0
##$VDLIST= <DDDDDDDDDDDDDDD>
##$VPLIST= <PPPPPPPPPPPPPPP>
##$VTLIST= <TTTTTTTTTTTTTTT>
##$WBST= 1024
##$WBSW= 4
##$XGAIN= (0..3)
0 0 0 0 
##$XL= 0
##$YL= 0
##$YMAX_a= 752983
##$YMIN_a= -738440
##$ZGOPTNS= <>
##$ZL1= 120
##$ZL2= 120
##$ZL3= 120
##$ZL4= 120
##$ABSF1= 15.74909
##$ABSF2= -2.302759
##$ABSG= 5
##$ABSL= 3
##$ALPHA= 0
##$AQORDER= 0
##$ASSFAC= 0
##$ASSFACI= 0
##$ASSFACX= 0
##$ASSWID= 0
##$AUNMP= <proc_1d>
##$AZFE= 0.1
##$AZFW= 0.1
##$BCFW= 0
##$BC_mod= 2
##$BYTORDP= 0
##$COROFFS= 0
##$CY= -3
##$DATMOD= 1
##$DC= 0
##$DFILT= <>
##$DTYPP= 0
##$F1P= 0
##$F2P= 0
##$FCOR= 1
##$FTSIZE= 16384
##$FT_mod= 6
##$GAMMA= 0
##$GB= 0
##$INTBC= 1
##$INTSCL= 0
##$ISEN= 128
##$LB= 0.24
##$LEV0= 0
##$LPBIN= 0
##$MAXI= 10000
##$MC2= 0
##$MEAN= 0
##$ME_mod= 0
##$MI= 1.114404
##$NCOEF= 0
##$NC_proc= -4
##$NLEV= 6
##$NOISF1= 3.799351
##$NOISF2= 2.8
##$NSP= 0
##$NTH_PI= 0
##$NZP= 0
##$OFFSET= 15.73697
##$PC= 1
##$PHC0= -15154.94
##$PHC1= 12.00082
##$PH_mod= 1
##$PKNL= yes
##$PPARMOD= 0
##$PSCAL= 0
##$PSIGN= 0
##$REVERSE= no
##$SF= 200.130003767965
##$SI= 16384
##$SIGF1= 3
##$SIGF2= 2
##$SINO= 5.538805
##$SIOLD= 16384
##$SREGLST= <1H.CDCl3>
##$SSB= 0
##$STSI= 16384
##$STSR= 0
##$SW_p= 3612.71676300578
##$SYMM= 0
##$S_DEV= 0
##$TDeff= 16384
##$TDoff= 0
##$TI= <>
##$TILT= no
##$TM1= 0
##$TM2= 0
##$TOPLEV= 0
##$USERP1= <user>
##$USERP2= <user>
##$USERP3= <user>
##$USERP4= <user>
##$USERP5= <user>
##$WDW= 1
##$XDIM= 16384
##$YMAX_p= 340302605
##$YMIN_p= -124053
$$ End of Bruker specific parameters
$$ ---------------------------------
##NTUPLES= NMR SPECTRUM
##VAR_NAME=  FREQUENCY,     SPECTRUM/REAL,   SPECTRUM/IMAG
##SYMBOL=    X,             R,               I
##VAR_TYPE=  INDEPENDENT,   DEPENDENT,       DEPENDENT
##VAR_FORM=  AFFN,          ASDF,            ASDF
##VAR_DIM=   16384,         16384,           16384
##UNITS=     HZ,            ARBITRARY UNITS, ARBITRARY UNITS
##FACTOR=    0.220516191357247, 1,           1
##FIRST=     3149.43985495256, 0,            0
##LAST=      -463.276908053224, 0,           0
##MIN=       -463.276908053224, -124053,     0
##MAX=       3149.43985495256, 340302605,    0
$$ Real data points
##PAGE= N=1
##DATA TABLE= (X++(R..R)), XYDATA
$$ [...]
$$ plain form
7354 -11531 -9720 13378 13791 -2826 10581 54608 27915 -8536 7131 29130 20802 23588 39626
7341 39626 24286 21968 29930 22419 32685 36330 35592 44248 31674 23036 20215 -4236 -7832 23157
7327 23157 7491 8670 16244 13701 16843 50045 44272 41803 11381 15314 10116 8108 10499 11844
7313 11844 25035 33654 22584 15455 33753 28637 38095 49699 53576 37748 28045 38032 22461
7300 22461 4971 30742 33928 14359 36120 61497 38656 23663 24192 19404 17150 49301 53636
7287 53636 23389 16338 21127 14996 9080 15222 13983 15269 24906 8227 -4812 -5862 -4967 4244
7273 4244 -4707 -1649 31098 25963 10324 -4284 -484 6640 -20258 -19861 551 -1863 -27001 -15382
7259 -15382 12310 30663 17742 15477 -2090 14639 20782 20434 11809 12750 4558 -3336 11848 21694
$$ packed form
7354a1531J811K3098M13j6617J3407M4027k6693l6451J5667K1999q328K786J6038
7341C9626j5340k318P962p511J0266L645p38Q656j2574q638k821k4451l596L0989
7327B3157j5666J179P574k543L142L3202n773k469l0422L933n198k008K391J345
7313A1844J3191Q619j1070p129J8298n116R458J1604L877j5828r703R987j5571
7300B2461j7490K5771L186j9569K1761K5377k2841j4993N29m788k254L2151M335
7287E3636l0247p051M789o131n916O142j239J286R637j6679j3039j050Q95R211
7273D244q951L058L2747n135j5639j4608L800P124k6898L97K0412k414k5138J1619
7259a5382K7692J8353j2921k265j7567J6729O143l48q625R41q192p894J5184R846
$$ plain form
7245 21694 9178 -18651 -2711 19499 35793 28718 32311 31961 16891 847 24259 19169 60369
7232 60369 43778 5104 31961 53628 42187 27412 29691 48542 56248 60349 62769 59208 24549
7219 24549 38176 54453 27251 34208 34148 11215 19305 33976 44096 28524 31634 57900 14391
7206 14391 25203 22235 27773 33132 27367 5177 18822 32369 22977 25596 32934 17797 5313
7193 5313 3506 4957 229 -6362 -11748 -21862 -34400 -3488 -2286 -2411 10024 -2105 1675 -20864
7179 -20864 -18532 -8695 5899 7555 6175 -7152 -6185 -17286 95 2845 8379 10174 163 11399
7165 11399 39501 47736 44122 27592 14974 17960 32888 -698 -8314 28071 5829 -9500 -21647
7152 -21647 4137 19763 20316 11378 3684 4529 1825 6999 10746 17115 -144 -1067 -15723 -8587
$$ packed form
7245B1694j2516k7829J5940K2210J6294p075L593l50j5070j6044K3412n090M1200
7232F0369j6591l8674K6857K1667j1441j4775K279J8851P706M101K420l561l4659
7219B4549J3627J6277k7202O957o0k2933Q090J4671J0120j5572L110K6266m3509
7206A4391J0812k968N538N359n765k2190J3645J3547r392K619P338j5137j2484
7193E313j807J451m728o591n386j0114j2538L0912J202j25J2435j2129L780k2539
7179b0864K332R837J4594J656j380j3327R67j1101J7381K750N534J795j0011J1236
7165A1399K8102Q235l614j6530j2618K986J4928l3586p616L6385k2242j5329j2147
7152b1647K5784J5626N53q938p694Q45k704N174L747O369j7259r23j4656P136
$$ plain form
7138 -8587 -92 -5988 -12949 2497 10132 28649 46271 36541 40462 34300 9371 9063 -6112 -11027
7124 -11027 10903 3925 19112 21550 31915 32302 68881 33532 17624 -5130 -8995 27580 49223
7111 49223 33814 22919 44057 46652 49326 46506 24868 32091 31330 27810 67847 98017 83068
7098 83068 74680 69238 70640 82674 94638 74434 77873 102693 100628 114415 79181 85593 86978
7085 86978 115463 123241 115625 125474 136370 128939 121154 161282 171236 164572 179458 170961 191315
7072 191315 203539 196577 216826 230392 237949 240188 240748 246425 245062 264548 305721 329605 318973
7059 318973 325275 353483 390873 419515 422343 466437 481367 502432 580267 594351 626435 701182
7047 701182 773840 877859 970296 1067957 1183724 1336302 1520766 1736407 1956113 2225171
$$ packed form
7138h587Q495n896o961J5446P635J8517J7622r730L921o162k4929l08j5175m915
7124a1027K1930o978J5187K438J0365L87L6579l5349j5908k2754l865L6575K1643
7111D9223j5409j0895K1138K595K674k820k1638P223p61l520M0037L0170j4949
7098H3068q388n442J402J2034J1964k0204L439K4820k065J3787l5234O412J385
7085H6978K8485P778p616R849J0896p431p785M0128R954o664J4886q497K0354
7072A91315J2224o962K0249J3566P557K239N60N677j363J9486M1173K3884j0632
7059C18973O302K8208L7390K8642K828M4094J4930K1065P7835J4084L2084P4747
7047G01182P2658J04019R2437R7661J15767J52578J84464K15641K19706K69058
$$ plain form
7037 2225171 2548106 2898593 3247923 3600274 3849585 3899550 3752100 3372767 2917231 2454362
7027 2454362 2046809 1748284 1508881 1298973 1137471 1008519 938478 873181 783996 709816
7017 709816 657000 600702 547535 520671 500647 496213 471219 427131 398861 373555 358339 322954
7005 322954 330850 319366 308343 299115 269788 269227 274948 279849 283594 236367 225526 247577 214829
6992 214829 194497 191482 208791 169305 170636 174503 168829 169213 171807 161565 150897 137458 129464
6979 129464 131572 141094 134221 127273 112135 124275 135905 131853 133047 136331 133640 114428 106955
6966 106955 105542 109909 106810 119802 111963 135123 127874 114017 114636 117135 123011 122881 128061 106477
6952 106477 119186 131589 150598 154251 122350 110243 131867 112779 109358 106971 114393 126030
$$ packed form
7037B225171L22935L50487L49330L52351K49311M9965j47450l79333m55536m62869
7027B454362m07553k98525k39403k09908j61502j28952p0041o5297q9185p4180
7017G09816n2816n6298n3167k6864k0024m434k4994m4088k8270k5306j5216l5385
7005C22954P896j1484j1023r228k9327n61N721M901L745m7227j0841K2051l2748
6992B14829k0332l015J7309l9486J331L867n674L84K594j0242j0668j3439p994
6979A29464K108R522o873o948j5138J2140J1630m052J194L284k691j9212p473
6966A06955j413M367l099J2992p839K3160p249j3857O19K499N876j30N180k1584
6952A06477J2709J2403J9009L653l1901j2107K1624j9088l421k387P422J1637
$$ plain form
6940 126030 112053 92918 85310 109366 105285 105305 133693 142893 149822 149212 147841 144698 150996 145352
6926 145352 156207 146079 126997 140007 130666 141559 169555 178346 162211 158504 144729 138902
6914 138902 149700 177326 168793 195722 206867 215827 221084 202203 208921 246845 250366 270379 275891
6901 275891 276279 258796 262871 272276 279614 310932 309999 310140 316856 334692 338039 350105 366950 382903
6887 382903 431059 426264 428692 437104 454172 476794 488848 526445 525557 535882 557093 581436 581692
6874 581692 617274 635026 638561 682949 717592 736367 763503 766300 783848 823532 864214 898986
6862 898986 914241 964714 994047 1023378 1081961 1131478 1168727 1218256 1284739 1342496 1394086 1453154
6850 1453154 1520396 1598320 1681265 1783180 1869342 1960979 2079308 2201538 2358314 2506416
$$ packed form
6940A26030j3977j9135p608K4056m081K0K8388R200O929o10j371l143O298n644
6926A45352J0855j0128j9082J3010r341J0893K7996Q791j6135l707j3775n827
6914A38902J0798K7626q533K6929J1145Q960N257j8881O718L7924L521K0013N512
6901B75891L88j7483M075R405P338L1318r33J41O716J7836L347J2066J6845J5953
6887C82903M8156m795K428Q412J7068K2622J2054L7597q88J0325K1211K4343K56
6874E81692L5582J7752L535M4388L4643J8775K7136K797J7548L9684M0682L4772
6862H98986J5255N0473K9333K9331N8583M9517L7249M9529O6483N7757N1590N9068
6850A453154O7242P7924Q2945J01915Q6162R1637J18329J22230J56776J48102
$$ plain form
6840 2506416 2674902 2861704 3046413 3247221 3466930 3739661 4036073 4338038 4680382 5051838
6830 5051838 5485485 5906267 6354346 6822357 7297627 7736253 8113964 8460071 8718066 8880462
6820 8880462 8953592 8887551 8687375 8381196 7987865 7548858 7069821 6574523 6052695 5571825
6810 5571825 5144438 4763018 4410211 4090755 3807075 3520888 3277440 3052997 2874375 2704582
6800 2704582 2529361 2391255 2252019 2113722 1976953 1860038 1768382 1704311 1640567 1532096
6790 1532096 1454661 1408219 1356674 1281380 1229600 1184729 1133254 1095854 1043825 1030002 1025126 972346
6778 972346 916338 863427 817389 808555 798262 761478 693678 657798 651358 645649 620552 615771
6766 615771 597888 573997 560298 522919 505115 491231 480155 472486 458595 445367 416316 398277
$$ packed form
6840B506416J68486J86802J84709K00808K19709K72731K96412L01965L42344L71456
6830E051838M33647M20782M48079M68011M75270M38626L77711L46107K57995J62396
6820H880462P3130o6041k00176l06179l93331m39007m79037m95298n21828m80870
6810E571825m27387l81420l52807l19456k83680k86187k43448k24443j78622j69793
6800B704582j75221j38106j39236j38297j36769j16915r1656o4071o3744j08471
6790A532096p7435m6442n1545p5294n1780m4871n1475l7400n2029j3823m876n2780
6778I72346n6008n2911m6038q834j0293l6784o7800l5880o440n709k5097m781
6766F15771j7883k3891j3699l7379j7804j3884j1076p669j3891j3228k9051j8039
$$ plain form
6754 398277 363755 347562 365269 349141 321137 296104 303476 288515 287740 297347 251467 250053 268971
6741 268971 253031 240489 248175 248663 257747 241440 210057 230815 221107 209994 198745 206438 216562
6728 216562 195382 171147 175584 142602 133855 157446 128988 103820 120136 136233 117850 117409
6716 117409 112342 111974 112427 125900 118008 91045 90009 92139 80863 41675 58528 86728 105291
6703 105291 74478 40136 32710 39727 57968 46421 43987 30096 24336 32525 34915 36037 70889
6690 70889 58539 31509 26987 17084 5246 11632 16486 13216 20030 35702 5080 -3797 -1504
6677 -1504 11352 -8258 13295 22298 3502 -409 -3916 467 16836 -2976 -30133 -32651 -30145
6664 -30145 -34752 -31592 -28955 -29961 -34160 -25059 -24437 -9118 -19189 -23212 -47484 -70256 -67281 -43780
$$ packed form
6754C98277l4522j6193J7707j6128k8004k5033P372j4961p75R607m5880j414J8918
6741B68971j5940j2542P686M88R084j6307l1383K0758r708j1113j1249P693J0124
6728B16562k1180k4235M437l2982q747K3591k8458k5168J6316J6097j8383m41
6716A17409n067l68M53J3473p892k6963j036K130j1276l9188J6853K8200J8563
6703A05291l0813l4342p426P017J8241j1547k434j3891n760Q189K390J122L4852
6690G0889j2350k7030m522r903j1838O386M854l270O814J5672l0622q877K293
6677a504J2856j9610K1553R003j8796l911l507M383J6369j9812k7157k518K506
6664c0145m607L160K637j006m199R101O22J5319j0071m023k4272k2772K975K3501
$$ plain form
6650 -43780 -15001 -35711 -26757 -48066 -51294 -59491 -50434 -26048 -48637 -53874 -44621 -41812 -27148
6637 -27148 -25606 -14657 -57183 -46331 -19647 -10550 -24159 -11978 -12214 -40101 -48111 -51374 -52682
6624 -52682 -28536 -26301 -17410 -28712 -48482 -41168 -53655 -63881 -59711 -62516 -63655 -50690 -34145
6611 -34145 -10883 -21311 -39675 -56602 -49218 -30998 -55725 -44187 -27307 -17591 -14616 -12918 -13649
6598 -13649 -20744 -24974 -18044 -23511 -36197 -48817 -47332 -30154 -40150 -25031 -33298 -35147 -36540 -41600
6584 -41600 -23083 -30298 -43610 -50883 -44457 -28787 -37573 -39294 -47930 -40425 -42583 -64219 -88421
6571 -88421 -67603 -49292 -47245 -47615 -53031 -31742 -38128 -61560 -68029 -43012 -28608 -49826 -75061
6558 -75061 -68439 -90939 -68105 -50951 -40628 -51799 -47810 -41987 -66628 -65515 -43621 -36076 -31641
$$ packed form
6650d3780K8779k0710Q954k1309l228q197R057K4386k2589n237R253K809J4664
6637b7148J542J0949m2526J0852K6684R097j3609J2181k36k7887q010l263j308
6624e2682K4146K235Q891j1302j9770P314j2487j0226M170k805j139J2965J6545
6611c4145K3262j0428j8364j6927P384J8220k4727J1538J6880R716K975J698p31
6598a3649p095m230O930n467j2686j2620J485J7178r996J5119q267j849j393n060
6584d1600J8517p215j3312p273O426J5670q786j721q636P505k158k1636k4202
6571h8421K0818J8311K047l70n416K1289o386k3432o469K5017J4404k1218k5235
6558g5061O622k2500K2834J7154J0323j1171L989N823k4641J113K1894P545M435
$$ plain form
6545 -31641 -54729 -75941 -84981 -102876 -93133 -56682 -59675 -88814 -103570 -75921 -62202 -69701 -56404
6532 -56404 -52909 -79849 -78460 -63040 -85670 -87776 -76366 -72295 -86930 -82813 -92708 -107029 -82030
6519 -82030 -77653 -93039 -83241 -102076 -87381 -70783 -64516 -81984 -91071 -78374 -79155 -82922 -79599
6506 -79599 -101751 -90104 -84158 -85305 -79130 -83930 -93211 -98036 -107102 -96059 -93254 -81930 -78900 -90209
6492 -90209 -102030 -70026 -91086 -84431 -52576 -78404 -68377 -64938 -77313 -72698 -77983 -64040 -72743
6479 -72743 -68898 -71243 -70506 -72709 -84277 -88925 -99239 -104034 -91099 -83637 -89260 -92502 -88001 -95632
6465 -95632 -77455 -89357 -93731 -91141 -85592 -76935 -77444 -81390 -75069 -66321 -81106 -83677 -111112 -68266
6451 -68266 -102064 -115488 -103138 -80524 -56915 -88666 -80931 -91118 -67783 -74628 -95228 -90628
$$ packed form
6545c1641k3088k1212r040j7895R743L6451k993k9139j4756K7649J3719p499J3297
6532e6404L495k6940J389J5420k2630k106J1410M071j4635M117r895j4321K4999
6519h2030M377j5386R798j8835J4695J6598O267j7468r087J2697p81l767L323
6506g9599k2152J1647N946j147O175m800r281m825r066J1043K805J1324L030j1309
6492i0209j1821L2004k1060O655L1855k5828J0027L439j2375M615n285J3943q703
6479g2743L845k345P37k203j1568m648j0314m795J2935P462n623l242M501p631
6465i5632J8177j1902m374K590N549Q657n09l946O321Q748j4785k571k7435M2846
6451f8266l3798j3424J2350K2614K3609l1751P735j0187K3335o845k0600M600
$$ plain form
6439 -90628 -74874 -52766 -56066 -56505 -50097 -72212 -76397 -52997 -72451 -68609 -93614 -57794 -66683
6426 -66683 -49962 -57598 -58571 -65155 -40232 -10366 -16576 -31186 -35994 -23300 -30970 -15589 -12019
6413 -12019 -9269 -12287 -27492 -39781 -56990 -57377 -58371 -47517 -56953 -52669 -70787 -83373 -71337
6400 -71337 -49951 -56006 -91901 -88129 -78721 -60694 -56423 -68268 -55319 -63315 -97370 -79792 -66086
6387 -66086 -68537 -56366 -70989 -76428 -76847 -62246 -64901 -76550 -79773 -69495 -68964 -72375 -92554 -68981
6373 -68981 -35229 -75505 -76977 -85801 -77307 -73485 -64706 -79533 -69081 -78744 -65113 -72739 -89488
6360 -89488 -82761 -68276 -96177 -110904 -95781 -98333 -91724 -108324 -124053 -113219 -121321 -109492 -88812
6347 -88812 -100025 -107730 -98299 -100518 -116448 -93816 -77746 -91003 -87006 -89694 -100762 -74641 -76222
$$ packed form
6439i0628J5754K2108l300m39O408k2115m185K3400j9454L842k5005L5820q889
6426f6683J6721p636r73o584K4923K9866o210j4610m808J2694p670J5381L570
6413a2019K750l018j5205j2289j7209l87r94J0854r436M284j8118j2586J2036
6400g1337K1386o055l5895L772R408J8027M271j1845J2949p996l4055J7578J3706
6387f6086k451J2171j4623n439m19J4601k655j1649l223J0278N31l411k0179K3573
6373f8981L3752m0276j472q824Q494L822Q779j4827J0452r663J3631p626j6749
6360h9488O727J4485k7901j4727J5123k552O609j6600j5729J0834q102J1829K0680
6347h8812j1213p705R431k219j5930K2632J6070j3257L997k688j1068K6121j581
$$ plain form
6334 -76222 -94025 -94936 -102066 -102537 -95961 -78591 -99274 -106565 -89920 -91503 -87931 -105024 -96966 -80798
6320 -80798 -83127 -76931 -58818 -59061 -65545 -70094 -95347 -83116 -44335 -46985 -76408 -86108 -65611
6307 -65611 -68901 -86378 -71626 -71294 -82630 -77814 -65366 -63134 -46811 -48116 -76120 -67930 -54668
6294 -54668 -46630 -29053 -54568 -71048 -42795 -25937 -40153 -50319 -65482 -43133 -31059 -43914
6282 -43914 -80701 -87851 -72335 -50188 -37470 -16995 -9212 -26064 -37889 -28726 -51366 -78389
6270 -78389 -53878 -56665 -50528 -48885 -27898 -72074 -99276 -83906 -58243 -42004 -59196 -50211 -41109
6257 -41109 -74167 -68940 -70447 -83519 -96447 -99352 -108546 -95154 -70514 -39678 -47455 -61040 -81286
6244 -81286 -96849 -94121 -71891 -71688 -64356 -41778 -51632 -38294 -48233 -50065 -63185 -71414 -70042 -78079
$$ packed form
6334g6222j7803r11p130m71O576J7370k0683p291J6645j583L572j7093Q058J6168
6320h0798k329O196J8113k43o484m549k5253J2231L8781k650k9423r700K0497
6307f5611l290j7477J4752L32j1336M816J2448K232J6323j305k8004Q190J3262
6294e4668Q038J7577k5515j6480K8253J6858j4216j0166j5163K2349J2074j2855
6282d3914l6787p150J5516K2147J2718K0475P783j6852j1825R163k2640k7023
6270g8389K4511k787O137J643K0987m4176k7202J5370K5663J6239j7192Q985R102
6257d1109l3058N227j507j3072j2928k905r194J3392K4640L0836p777j3585k0246
6244h1286j5563K728K2230K03P332K2578r854J3338r939j832j3120q229J372q037
$$ plain form
6230 -78079 -86928 -78234 -65663 -76059 -78475 -65765 -83680 -78304 -76250 -72415 -69976 -53777 -63857
6217 -63857 -60822 -51176 -44822 -66054 -77367 -83689 -90045 -85095 -91426 -100703 -93169 -74650 -86661 -73034
6203 -73034 -78363 -62201 -65188 -92588 -50460 -65849 -74566 -67209 -92351 -76114 -69368 -79019 -68459
6190 -68459 -69194 -78673 -81421 -72560 -62435 -58997 -58260 -65999 -78173 -96161 -82094 -83466 -85459 -70846
6176 -70846 -55677 -77592 -56198 -58326 -51960 -19778 -43856 -56127 -61642 -71190 -66195 -34588 -10278
6163 -10278 -36514 -65334 -63124 -62366 -76169 -92773 -114190 -93592 -90350 -72668 -73094 -84552 -84894
6150 -84894 -64611 -43240 -42123 -67338 -41116 -35374 -48528 -48204 -32663 -41298 -55453 -75201 -90095
6137 -90095 -80192 -81284 -61462 -64372 -62580 -66752 -50799 -42517 -38199 -44639 -43534 -29036 -26319 -42588
$$ packed form
6230g8079q849Q694J2571j0396k416J2710j7915N376K054L835K439J6199j0080
6217f3857L035R646O354k1232j1313o322o356M950o331r277P534J8519j2011J3627
6203g3034n329J6162k987k7400M2128j5389q717P357k5142J6237O746r651J0560
6190f8459p35r479k748Q861J0125L438P37p739j2174j7988J4067j372j993J4613
6176g0846J5169k1915K1394k128O366L2182k4078j2271n515r548M995L1607K4310
6163a0278k6236k8820K210P58j3803j6604k1417K0598L242J7682m26j1458l42
6150h4894K0283K1371J117k5215K6222N742j3154L24J5541q635j4155j9748j4894
6137i0095R903j092J9822k910J792m172J5953Q282M318o440J105J4498K717j6269
$$ plain form
6123 -42588 -32900 -43078 -12566 -19109 -37661 -57716 -82074 -61592 -41640 -59173 -48263 -42208
6111 -42208 -52961 -59028 -76993 -57115 -36067 -36187 -41586 -66425 -50950 -44144 -36737 -59317 -73163
6098 -73163 -51725 -55251 -57473 -47871 -41577 -38641 -30417 -41687 -43894 -45395 -40735 -22875 -29276 -50058
6084 -50058 -51005 -37194 -25246 -23259 -22625 -60520 -53297 -18393 -30611 -45129 -28974 -18686 -25281
6071 -25281 -33212 -38591 -22820 -3508 4030 -24920 -31476 -28325 -24680 -5771 -11071 -36538 -37045 -30363
6057 -30363 -19436 -31573 -34899 -31172 -26023 -3318 -771 -13588 -15977 246 -4776 -13555 -10129
6044 -10129 -5508 26306 27257 -22681 -16604 -5647 -24850 -35383 -4042 21505 2520 -19052 -15762
6031 -15762 -24949 -33971 -11397 13952 21670 4806 -10974 -22120 -3787 15234 7662 20708 26664
$$ packed form
6123d2588R688j0178L0512o543j8552k0055k4358K0482J9952j7533J0910O055
6111d2208j0753o067j7965J9878K1048j20n399k4839J5475O806P407k2580j3846
6098g3163K1438l526k222R602O294K936Q224j1270k207j501M660J7860o401k0782
6084e0058r47J3811J1948J987O34l7895P223L4904j2218j4518J6155J0288o595
6071b5281p931n379J5771J9312P538k8950o556L151L645J8909n300k5467n07O682
6057c0363J0927j2137l326L727N149K2705K547j2817k389J6223n022q779L426
6044a0129M621L1814R51m9938O077J0957j9203j0533L1341K5547j8985k1572L290
6031a5762r187r022K2574K5349P718j6864j5780j1146J8333J9021p572J3046N956
$$ plain form
6018 26664 18873 36056 45628 48140 36698 4629 3845 16192 23802 19989 24155 25678 27528 17171
6004 17171 45898 40147 41411 26538 20297 31490 39204 56768 56563 62892 63465 35276 42421 46392
5990 46392 38583 46474 52458 42348 46431 49537 51549 43448 45248 65869 51952 63136 68105 84736
5976 84736 90036 71259 73102 81193 73334 48255 59506 71579 46077 48110 61580 48453 48708
5963 48708 52102 66749 73660 49567 62422 71606 87720 71451 76973 76603 71098 76052 113709
5950 113709 122061 109631 105797 92982 71565 84454 95063 114136 116665 120039 94206 79447
5938 79447 98844 92962 94693 129992 135546 102080 80944 89176 118265 128090 124575 97988 89481
5925 89481 96104 122838 115170 116360 107953 102870 121592 123487 135256 146284 148487 133631 104470
$$ packed form
6018B6664p791J7183R572K512j1442l2069p84J2347P610l813M166J523J850j0357
6004A7171K8727n751J264j4873o241J1193P714J7564k05O329N73k8189P145L971
5990D6392p809P891N984j0110M083L106K012q101J800K0621j3917J1184M969J6631
5976H4736N300j8777J843Q091p859k5079J1251J2073k5502K033J3470j3127K55
5963D8708L394J4647O911k4093J2855R184J6114j6269N522l70n505M954L7657
5950A13709Q352j2430l834j2815k1417J2889J0609J9073K529L374k5833j4759
5938G9447J9397n882J731L5299N554l3466k1136Q232K9089R825l515k6587q507
5925H9481O623K6734p668J190q407n083J8722J895J1769J1028K203j4856k9161
$$ plain form
5912 104470 135381 157844 164197 148453 153952 171360 164371 182486 200411 202047 178349 164208
5900 164208 191614 197421 209112 222106 218126 211896 241299 242377 226314 225265 241382 250180 283102
5887 283102 289110 267518 295277 284903 277855 285667 315930 338210 340158 339333 352506 356548 383647
5874 383647 384973 374110 371578 374605 374654 377468 393615 396888 425593 464752 479327 498358 515721
5861 515721 536661 547577 577018 607485 637160 679147 703500 730638 770724 782271 795689 827854
5849 827854 890659 913139 925367 1005926 1073332 1164323 1231569 1297623 1342622 1405289 1500923 1584696
5837 1584696 1669931 1781392 1906659 2033794 2104968 2185459 2205036 2167600 2100766 2018998 2001390
5826 2001390 1970487 1977812 2029634 2060104 2117746 2215197 2333854 2460321 2626272 2786955 2995153
$$ packed form
5912A04470L0911K2463O353j5744N499J7408o989J8115J7925J636k3698j4141
5900A64208K7406N807J1691J2994l980o230K9403J078j6063j049J6117Q798L2922
5887B83102O008k1592K7759j0374p048P812L0263K2280J948q25J3173M042K7099
5874C83647J326j0863k532L027M9K814J6147L273K8705L9159J4575J9031J7363
5861E15721K0940J0916K9441L0467K9675M1987K4353K7138M0086J1547J3418L2165
5849H27854O2805K2480J2228Q0559O7406R0991O7246O6054M4999O2667R5634Q3773
5837A584696Q5235J11461J25267J27135P1174Q0491J9577l7436o6834q1768j7608
5826B001390l0903P325N1822L0470N7642R7451J18657J26467J65951J60683K08198
$$ plain form
5815 2995153 3235167 3485172 3691618 3787853 3785281 3713811 3626219 3449325 3257586 3059736
5805 3059736 2860095 2640350 2476141 2356523 2270673 2244690 2247031 2290889 2331444 2383386 2432199
5794 2432199 2502212 2594953 2673462 2746003 2789449 2722261 2545123 2368344 2145074 1946191 1772835
5783 1772835 1679803 1614645 1545481 1502805 1481521 1449668 1409913 1339016 1235574 1141202 1020973
5772 1020973 944776 902970 863155 786400 751133 722898 679025 667958 643189 629923 612621
5761 612621 603370 582714 565791 552146 516194 530846 524508 510044 521281 527802 518832 507000
5749 507000 504828 485052 480470 495962 506005 497976 484387 488735 471523 422760 416231 414985 416657
5736 416657 375779 384253 381612 393829 400739 371498 357499 367744 373445 365946 365900 362010 379276
$$ packed form
5815B995153K40014K50005K06446R6235k572p1470q7592j76894j91739j97850
5805C059736j99641k19745j64209j19618q5850k5983K341M3858M0555N1942M8813
5794B432199P0013R2741P8509P2541M3446o7188j77138j76779k23270j98883j73356
5783A772835r3032o5158o9164m2676k1284l1853l9755p0897j03442r4372j20229
5772A020973p6197m1806l9815p6755l5267k8235m3873j1067k4769j3266j7302
5761F12621r251k0656j6923j3645l5952J4652o338j4464J1237O521q970j1832
5749E07000k172j9776m582J5492J0043q029j3589M348j7212m8763o529j246J672
5736D16657m0878Q474k641J2217O910k9241j3999J0245N701p499m6l890J7266
$$ plain form
5723 379276 373390 346506 348606 339660 329946 351656 358148 337690 313771 306596 344211 358935 350603
5710 350603 344138 321161 331874 320393 309179 296600 294684 278035 272383 283282 305443 312123
5698 312123 336999 319354 334184 337158 336864 309467 295175 302478 318316 300309 299812 303406 321153
5685 321153 326316 327555 320995 314021 325622 311505 336669 356245 351277 348717 346384 347624 351035
5672 351035 349789 337981 359932 376917 364418 354541 354620 375698 361121 359745 371402 367451 386370
5659 386370 400077 402384 401086 422817 406654 419953 443640 443177 439783 438120 466544 473833 492196
5646 492196 501753 518864 520832 552642 556297 552957 566857 595298 611717 614933 637432 651579 661330
5633 661330 668986 696059 722585 733793 773412 786484 809422 861201 914233 972495 1052523 1103269
$$ packed form
5723C79276n886k6884K100q946r714K1710O492k0458k3919p175L7615J4724q332
5710C50603o465k2977J0713j1481j1214j2579j916j6649n652J0899K2161O680
5698C12123K4876j7645J4830K974k94k7397j4292P303J5838j8007m97L594J7747
5685C21153N163J239o560o974J1601j4117K5164J9576m968k560k333J240L411
5672C51035j246j1808K1951J6985j2499r877P9K1078j4577j376J1657l951J8919
5659C86370J3707K307j298K1731j6163J3299K3687m63l394j663K8424P289J8363
5646D92196R557J7111J968L1810L655l340J3900K8441J6419L216K2499J4147R751
5633F61330P656K7073K6526J1208L9619J3072K2938N1779N3032N8262Q0028N0746
$$ plain form
5621 1103269 1203846 1303949 1410802 1529682 1659674 1799689 1958359 2150709 2352086 2534646
5611 2534646 2715904 2825261 2823440 2716016 2561082 2424745 2329826 2248545 2239243 2219251 2204116
5600 2204116 2243147 2270315 2332826 2456027 2572756 2756767 2935074 3057413 3147826 3231412
5590 3231412 3322463 3398500 3444323 3403198 3268376 3022647 2776055 2568103 2408739 2302673
5580 2302673 2245358 2179264 2131846 2134960 2164434 2154440 2160736 2202297 2245837 2319100 2386043 2415392
5568 2415392 2418878 2365967 2265630 2119425 1985122 1861204 1763936 1692199 1646281 1597293 1541242
5557 1541242 1523098 1502998 1468879 1451941 1454459 1464812 1475674 1483624 1487220 1494879 1514466 1557568
5545 1557568 1585187 1639814 1672740 1714514 1800131 1893857 1977870 2079268 2180534 2260600 2347630
$$ packed form
5621A103269J00577J00103J06853J18880J29992J40015J58670J92350K01377J82560
5611B534646J81258J09357j821j07424j54934j36337r4919q1281r302j9992j5135
5600B204116L9031K7168O2511J23201J16729J84011J78307J22339R0413Q3586
5590C231412R1051P6037M5823m1125j34822k45729k46592k07952j59364j06066
5580B302673n7315o6094m7418L114K9474r994O296M1561M3540P3263O6943K9349
5568B415392L486n2911j00337j46205j34303j23918r7268p1737m5918m8988n6051
5557A541242j8144k0100l4119j6938K518J0353J0862P950L596P659J9587M3102
5545A557568K7619N4627L2926M1774Q5617R3726Q4013J01398J01266Q0066Q7030
$$ plain form
5534 2347630 2405429 2465985 2501385 2536568 2585981 2635000 2734854 2853931 2990062 3184427 3397584
5523 3397584 3616789 3907951 4250718 4698553 5206925 5766847 6388117 7134298 7932766 8737258
5513 8737258 9292103 9360350 8946605 8163410 7301641 6598474 6055892 5661737 5371292 5143614
5503 5143614 4993846 4896511 4863578 4907701 4988416 5101969 5281467 5517756 5850056 6245669
5493 6245669 6756561 7367218 8117870 8977089 9984033 11118443 12386836 13836527 15393875
5484 15393875 16622027 17029989 16281500 14464097 12333832 10461951 8989581 7883138
5476 7883138 7045926 6413739 5929048 5560260 5271164 5042032 4872457 4757101 4686604 4647654
5466 4647654 4685845 4775144 4912004 5147210 5442854 5797422 6197235 6656092 7226982 7886297
$$ packed form
5534B347630N7799O0556L5400L5183M9413M9019R9854J19077J36131J94365K13157
5523C397584K19205K91162L42767M47835N08372N59922O21270P46181P98468Q04492
5513H737258N54845O8247m13745p83195q61769p03167n42582l94155k90445k27678
5503E143614j49768r7335l2933M4123Q0715J13553J79498K36289L32300L95613
5493F245669N10892O10657P50652Q59219J006944J134410J268393J449691J557348
5484A5393875J228152M07962p48489j817403k130265j871881j472370j106443
5476G883138q37212o32187m84691l68788k89096k29132j69575j15356p0497l8950
5466D647654L8191Q9299J36860K35206K95644L54568L99813M58857N70890O59315
$$ plain form
5456 7886297 8643515 9410833 9863526 9679580 8873834 7740193 6623902 5702223 4973065
5447 4973065 4402543 3959910 3615400 3333373 3128937 2935131 2746129 2580238 2428560 2289403
5437 2289403 2190865 2124218 2034865 1953201 1895691 1860059 1801669 1759633 1739273 1679921 1612505
5426 1612505 1574054 1560061 1510842 1490216 1461538 1427362 1392995 1379380 1363475 1371001 1367838 1349158
5414 1349158 1363753 1345232 1351281 1353191 1370186 1369545 1405241 1450297 1472363 1515501 1565563 1637055
5402 1637055 1680336 1750470 1820483 1893855 1955313 1959327 1946657 1939437 1876225 1794641 1738088 1628944
5390 1628944 1515739 1434169 1345581 1265497 1233145 1179518 1140417 1094059 1078133 1071899 1033519
5379 1033519 1022562 1014230 1008494 1033154 1040766 1036122 1008058 993278 990328 982495 971277 974644 974564
$$ packed form
5456G886297P57218P67318M52693j83946q05746j133641j116291r21679p29158
5447D973065n70522m42633l44510k82027k04436j93806j89002j65891j51678j39157
5437B289403r8538o6647q9353q1664n7510l5632n8390m2036k0360n9352o7416
5426A612505l8451j3993m9219k0626k8678l4176l4367j3615j5905P526l163j8680
5414A349158J4595j8521O049J910J6995o41L5696M5056K2066M3138N0062P1492
5402A637055M3281P0134P0013P3372O1458M014j2670p220o3212q1584n6553j09144
5390A628944j13205q1570q8588q0084l2352n3627l9101m6358j5926o234l8380
5379A033519j0957q332n736K4660P612m644k8064j4780k950p833j1218L367q0
$$ plain form
5366 974564 970137 1003466 997713 1014108 1044294 1054839 1085614 1135068 1148024 1173875 1235704 1300214
5354 1300214 1345632 1415522 1500151 1613614 1738833 1846381 1880938 1862406 1785236 1678561 1576748
5343 1576748 1472701 1423745 1381486 1360824 1356596 1346153 1370703 1393241 1427305 1491300 1568683
5332 1568683 1651589 1705264 1775241 1853525 1948090 2007266 2033900 2085298 2186983 2258375 2246773
5321 2246773 2194467 2093886 1954741 1814598 1715938 1638514 1566077 1503547 1452670 1410726 1428928
5310 1428928 1438795 1398420 1400199 1402945 1455630 1480942 1495628 1527556 1556034 1597123 1649196 1663808
5298 1663808 1652871 1632468 1591053 1525521 1442630 1393264 1361161 1323755 1310778 1321159 1277837
5287 1277837 1261932 1264638 1263256 1234992 1216656 1206954 1203231 1203193 1171664 1197672 1161871 1127396 1140280
$$ packed form
5366I74564m427L3329n753J6395L0186J0545L0775M9454J2956K5851O1829O4510
5354A300214M5418O9890Q4629J13463J25219J07548L4557j8532p7170j06675j01813
5343A576748j04047m8956m2259k0662m228j0443K4550K2538L4064O3995P7383
5332A568683Q2906N3675O9977P8284R4565N9176K6634N1398J01685P1392j1602
5321B246773n2306j00581j39145j40143r8660p7424p2437o2530n0877m1944J8202
5310A428928R867m0375J779K746N2685K5312J4686L1928K8478M1089N2073J4612
5298A663808j0937k0403m1415o5532q2891m9366l2103l7406j2977J0381m3322
5287A277837j5905K706j382k8264j8336r702l723l8l1529K6008l5801l4475J2884
$$ plain form
5274 1140280 1142661 1147107 1166701 1126417 1071331 1065247 1062437 1066870 1059280 1072368 1085979 1093522 1108254
5261 1108254 1129096 1112269 1125751 1144979 1124640 1133342 1136664 1151212 1171619 1181234 1174878 1209161
5249 1209161 1230962 1229546 1256039 1269479 1289122 1299988 1319910 1339637 1336512 1368467 1388117 1390956
5237 1390956 1408015 1423252 1458520 1483622 1492820 1487332 1489983 1538645 1598949 1615401 1666274 1726876
5225 1726876 1730333 1733789 1786868 1820250 1842614 1889571 1929940 1952541 1982581 1999809 2030282 2073352
5213 2073352 2097473 2138168 2168643 2193763 2229279 2252900 2310754 2364046 2403544 2413473 2407415 2477006
5201 2477006 2549294 2587977 2610256 2657306 2693136 2730161 2760111 2797192 2870088 2922327 2975666
5190 2975666 3011583 3065497 3104955 3140904 3177570 3250922 3337866 3403940 3461673 3579527 3693268
$$ packed form
5274A140280K381M446J9594m0284n5086o084k810M433p590J3088J3611P543J4732
5261A108254K0842j6827J3482J9228k0339Q702L322J4548K0407R615o356L4283
5249A209161K1801j416K6493J3440J9643J0866J9922J9727l125L1955J9650K839
5237A390956J7059J5237L5268K5102R198n488K651M8662O0304J6452N0873O0602
5225A726876L457L456N3079L3382K2364M6957M0369K2601L0040J7228L0473M3070
5213B073352K4121M0695L0475K5120L5516K3621N7854N3292L9498R929o058O9591
5201B477006P2288L8683K2279M7050L5830L7025K9950L7081P2896N2239N3339
5190B975666L5917N3914L9458L5949L6666P3352Q6944O6074N7733J17854J13741
$$ plain form
5179 3693268 3801642 3943391 4050038 4139468 4268818 4431966 4556743 4703555 4857339 5001721
5169 5001721 5152260 5323606 5506122 5687629 5863187 6030785 6232132 6450579 6671581 6895242
5159 6895242 7077301 7240028 7429574 7638349 7834580 8036561 8267377 8481552 8706759 8953936
5149 8953936 9194941 9489344 9815267 10153614 10500683 10856829 11237882 11664022 12085984 12508045
5139 12508045 12947921 13367336 13799334 14243867 14720786 15233039 15804552 16412750 17053294
5130 17053294 17755430 18505608 19321737 20153374 21027645 21949343 22933857 23981722 25083965
5121 25083965 26298452 27646831 29125710 30758918 32591788 34674983 37032059 39674539
5113 39674539 42698471 46156410 50123776 54675225 59888877 65870274 72712097 80561945
$$ packed form
5179C693268J08374J41749J06647Q9430J29350J63148J24777J46812J53784J44382
5169E001721J50539J71346J82516J81507J75558J67598K01347K18447K21002K23661
5159F895242J82059J62727J89546K08775J96231K01981K30816K14175K25207K47177
5149H953936K41005K94403L25923L38347L47069L56146L81053M26140M21962M22061
5139A2508045M39876M19415M31998M44533M76919N12253N71513O08198O40544
5130A7053294P02136P50178Q16129Q31637Q74271R21698R84514J047865J102243
5121B5083965J214487J348379J478879J633208J832870K083195K357076K642480
5113C9674539L023932L457939L967366M551449N213652N981397O841823P849848
$$ plain form
5105 80561945 89541614 99747002 111383165 124549789 138955675 154237387 169819015
5098 169819015 184655136 197664982 207196966 211386460 210310017 204949132 194732466 179898718
5090 179898718 162807256 145365718 128495309 113014984 99561451 88215976 78806961
5083 78806961 70941312 64264979 58614763 53736780 49436503 45649656 42335211 39429480
5075 39429480 36848845 34570903 32562659 30793599 29192276 27779894 26520172 25371615
5067 25371615 24295126 23329882 22435591 21568714 20800488 20085695 19399272 18757967 18173703
5058 18173703 17582454 16997755 16438644 15886540 15345814 14829786 14358578 13898403 13461595
5049 13461595 13073039 12709470 12384162 12131615 11885665 11646949 11477254 11265531 11073113
$$ packed form
5105H0561945Q979669J0205388J1636163J3166624J4405886J5281712J5581628
5098A69819015J4836121J3009846R531984M189494j076443n360885j0216666j4833748
5090A79898718j7091462j7441538j6870409j5480325j3453533j1345475r409015
5083G8806961p865649o676333n650216m877983m300277l786847l314445k905731
5075C9429480k580635k277942k008244j769060j601323j412382j259722j148557
5067B5371615j076489r65244q94291q66877p68226p14793o86423o41305n84264
5058A8173703n91249n84699n59111n52104n40726n16028m71208m60175m36808
5049A3461595l88556l63569l25308k52547k45950k38716j69695k11723j92418
$$ plain form
5040 11073113 10909886 10771890 10656350 10526808 10425242 10378405 10369320 10393417 10503997 10689064
5030 10689064 10927432 11267108 11673059 12161663 12746403 13456787 14227970 14750011 14731493 14053224
5020 14053224 12941046 11814468 10868111 10117916 9568413 9165893 8870010 8655330 8477831
5011 8477831 8352424 8314305 8269091 8283908 8331634 8441943 8614122 8858414 9188132 9633780
5001 9633780 10170881 10849751 11652734 12531369 13583451 14888895 16406581 17719698 18081126
4992 18081126 17261875 15612566 13643948 11892329 10472290 9355169 8502136 7861657 7315334
4983 7315334 6866781 6496842 6216452 5973170 5792046 5647242 5565947 5510861 5499165 5550427
4973 5550427 5662238 5831042 6041509 6334929 6654055 7043533 7511379 8072865 8632771 8956629
$$ packed form
5040A1073113j63227j37996j15540j29542j01566m6837r085K4097J10580J85067
5030A0689064K38368L39676M05951M88604N84740P10384P71183N22041j8518o78269
5020A4053224j112178j126578r46357p50195n49503m02520k95883k14680j77499
5011H477831j25407l8119m5214J4817M7726J10309J72179K44292L29718M45648
5001I633780N37101O78870Q02983Q78635J052082J305444J517686J313117L61428
4992A8081126q19251j649309j968618j751619j420039j117121q53033o40479n46323
4983G315334m48553l69939k80390k43282j81124j44804q1295n5086j1696N1262
4973E550427J11811J68804K10467K93420L19126L89478M67846N61486N59906L23858
$$ plain form
4963 8956629 8885087 8318236 7434287 6527237 5788158 5170772 4682042 4308253 4002241 3748549
4953 3748549 3538058 3339011 3175463 3009302 2857906 2728108 2598557 2511288 2417565 2347160
4943 2347160 2283308 2190117 2128843 2105535 2059451 2012638 1945136 1884042 1824878 1769539 1749014
4932 1749014 1721875 1699793 1668564 1620108 1579659 1559766 1522183 1468054 1415446 1376109 1318926
4921 1318926 1271100 1202217 1144767 1124410 1108743 1060614 1022959 1001401 982812 990426 930335 894722
4909 894722 874034 872011 836946 773289 757148 729840 688209 667409 655879 638910 624137 618107
4897 618107 579597 576227 564130 578507 558463 544025 541562 549777 540626 520225 512183 492574 463303
4884 463303 445844 440681 444578 432358 417861 424736 430847 433547 424738 438005 407312 410721 416375
$$ packed form
4963H956629p1542n66851q83949r07050p39079o17386m88730l73789l06012k53692
4953C748549k10491j99047j63548j66161j51396j29798j29551q7269r3723p0405
4943B347160o3852r3191o1274k3308m6084m6813o7502o1094n9164n5339k0525
4932A749014k7139k2082l1229m8456m0449j9893l7583n4129n2608l9337n7183
4921A318926m7826o8883n7450k0357j5667m8129l7655k1558j8589P614o0091l5613
4909H94722k0688k023l5065o3657j6141k7308m1631k0800j1530j6969j4773o030
4897F18107l8510l370j2097J4377k0044j4438k463Q215r151k0401q042j9609k9271
4884D63303j7459n163L897j2220j4497O875O111K700q809J3267l0693L409N654
$$ plain form
4871 416375 414077 424125 424740 430326 413774 400157 366133 345560 340066 351551 345553 365802 376112
4858 376112 358103 327134 318945 298558 323336 348516 336577 349540 338226 343161 362606 328263
4846 328263 302296 327987 331036 340862 336669 307079 284819 270635 271646 292161 313087 319411 289611
4833 289611 288350 308816 311064 321588 336625 335330 315181 303635 318404 332228 341063 344534 350324
4820 350324 352918 385200 375650 356715 351123 376907 376126 397425 433176 449296 462322 474427 486822
4807 486822 500481 535481 570641 619867 653380 680872 715159 738806 805959 861088 893041 987479
4795 987479 1055610 1073727 1163739 1224309 1245956 1230918 1202973 1169074 1094767 1008463 937754 835903
4783 835903 725348 651523 574102 524237 471983 467613 441117 384933 359613 324707 323269 309907
$$ packed form
4871D16375k298J0048O15N586j6552j3617l4024k0573n494J1485n998K0249J0310
4858C76112j8009l0969q189k0387K4778K5180j1939J2963j1314M935J9445l4343
4846C28263k5967K5691L049R826m193k9590k2260j4184J011K0515K0926O324k9800
4833B89611j261K0466K248J0524J5037j295k0149j1546J4769J3824Q835L471N790
4820C50324K594L2282r550j8935n592K5784p81K1299L5751J6120J3026J2105J2395
4807D86822J3659L5000L5160M9226L3513K7492L4287K3647O7153N5129L1953R4438
4795I87479O8131J8117R0012O0570K1647j5038k7945l3899p4307q6304p0709j01851
4783H35903j10555p3825p7421m9865n2254m370k6496n6184k5320l4906j438j3362
$$ plain form
4771 309907 315065 313193 316987 304656 279966 262178 283585 256394 232013 235185 227419 231268 233192
4758 233192 218491 212210 214556 203979 192776 187633 190409 159364 143402 124223 145274 147240 152642
4745 152642 144385 159193 138358 135764 138206 146613 159040 158037 162193 154236 142904 127862 95605
4732 95605 90221 73496 92713 87486 85693 69168 53211 55995 53063 64337 56866 56039 42113
4719 42113 50366 40243 43809 29859 13449 11356 -2980 17420 21299 11438 17755 12289 -11680
4706 -11680 7710 14954 -8345 134 9063 20516 -1132 314 24612 40944 32526 4453 14832
4693 14832 27259 10205 -761 -22670 -19254 10815 16202 -26649 -91 14934 14602 18748 15317
4680 15317 37024 49628 68813 45240 58587 51168 48782 82405 48695 24292 24129 24128 39651
$$ packed form
4771C09907N158j872L794j2331k4690j7788K1407k7191k4381L172p766L849J924
4758B33192j4701o281K346j0577j1203n143K776l1045j5962j9179K1051J966N402
4745A52642q257J4808k0835k594K442Q407J2427j003M156p957j1332j5042l2257
4732I5605n384j6725J9217n227j793j6525j5957K784k932J1274p471q27j3926
4719D2113Q253j0123L566j3950j6410k093j4336K0400L879r861O317n466k3969
4706a1680J9390P244k3299Q479Q929J1453k1648J446K4298J6332q418k8073J0379
4693A4832J2427j7054j0966k1909L416L0069N387m2851K6558J5025l32M146l431
4680A5317K1707J2604J9185k3573J3347p419k386L3623l3710k4403j63jJ5523
$$ plain form
4667 39651 26757 17580 37622 37829 50363 45230 51627 78679 82497 77462 75942 73008 95718 124644
4653 124644 150344 149968 133107 123917 115335 122108 131058 117107 106881 79243 48776 53044 85031
4640 85031 71791 59895 66543 62187 55904 57900 55347 59529 54238 54838 57327 56069 74007 47665
4626 47665 41866 59502 64415 43062 70057 48149 40773 31242 25440 10723 11365 38892 36557
4613 36557 20725 2926 -27762 -29708 -13728 -11269 -21707 -29093 -17029 -12304 -9566 -8659 -17658
4600 -17658 -21142 -2838 -10753 -9896 9970 -21258 -27092 -37634 -56286 -25799 -5038 -20896 -40768
4587 -40768 -30176 -9721 -2048 -23508 -26522 -24157 -31357 -38806 -33570 -19461 -10123 8186 9235
4574 9235 -3359 -1251 -15012 -7640 -16016 -10978 9321 12385 -7226 -4788 11744 20014 -8567
$$ packed form
4667C9651j2894r177K0042K07J2534n133O397K7052L818n035j520k934K2710K8926
4653A24644K5700l76j6861r190q582O773Q950j3951j0226k7638l0467M268L1987
4640H5031j3240j1896O648m356o283J996k553M182n291O00K489j258J7938k6342
4626D7665n799J7636M913k1353K6995k1908p376r531n802j4717O42K7527k335
4613C6557j5832j7799l0688j946J5980K459j0438p386J2064M725K738R07q999
4600a7658l484J8304p915Q57J9866l1228n834j0542j8652L0487K0761j5858j9872
4587d0768J0592K0455P673k1460l014K365p200p449N236J4109R338J8309J049
4574I235j2594K108j3761P372q376N038K0299L064j9611K438J6532Q270k8581
$$ plain form
4561 -8567 19662 34844 -4439 -7121 32490 51104 24190 1281 16970 35310 24128 23989 10290
4548 10290 11043 -12140 -15534 -9567 -9625 4900 30092 32592 10744 23883 34133 18223 15836 46856
4534 46856 34881 27825 13597 18645 44682 32777 29740 35475 38049 36107 24566 31780 25732
4521 25732 24257 -5495 -908 28365 28532 32542 30832 23566 -1027 24163 40419 31423 19496
4508 19496 23328 34372 30387 28374 47259 62548 55259 58586 42381 27711 36205 31158 58968
4495 58968 46569 43776 64007 79192 81122 62881 71209 67272 82753 98239 83172 122143 142794
4482 142794 143836 148481 131154 113781 98289 105163 114649 126528 113564 112282 108384 134907 129101
4469 129101 118928 139142 141999 141725 132339 113886 87209 98166 119872 126547 109029 117716 125799
$$ packed form
4561h567K8229J5182l9283k682L9611J8614k6914k2909J5689J8340j1182j39j3699
4548A0290P53k3183l394N967n8J4525K5192K500k1848J3139J0250j5910k387L1020
4534D6856j1975p056j4228N048K6037j1905l037N735K574j942j1541P214o048
4521B5732j475k9752M587K9273J67M010j710p266k4593K5190J6256q996j1927
4508A9496L832J1044l985k013J8885J5289p289L327j6205j4670Q494n047K7810
4495E8968j2399k793K0231J5185J930j8241Q328l937J5481J5486j5067L8971K0651
4482A42794J042M645j7327j7373j5492O874R486J1879j2964j282l898K6523n806
4469A29101j0173K0214K857k74r386j8453k6677J0957K1706O675j7518Q687Q083
$$ plain form
4456 125799 149654 165774 158125 171174 186362 192668 189076 190148 202322 219441 213444 215476 210746
4443 210746 184744 186523 177176 144952 138492 135731 139540 131848 126966 130203 108368 76658 69353
4430 69353 102501 108782 121423 108195 108134 114933 100113 137684 161005 163586 180907 180972 188320 160376
4416 160376 170786 179675 184296 180335 192514 202244 213320 219848 205924 226725 256216 264737 249675
4403 249675 235463 240059 228653 199791 224807 238187 254687 253225 254455 251076 253319 277577 282964
4390 282964 276355 283096 315723 328129 328458 323695 338082 355847 344794 365919 351607 334361 332476
4377 332476 323143 320289 308365 294555 276731 257702 262993 281824 275703 256973 237194 241718 236024
4364 236024 224796 243258 267666 253115 252020 237611 219367 249029 258822 255122 235302 266489
$$ packed form
4456A25799K3855J6120p649J3049J5188O306l592J072J2174J7119n997K032m730
4443B10746k6002J779r347l2224o460k761L809p692m882L237k1835l1710p305
4430F9353L3148O281J2641j3228o1O799j4820L7571K3321K581J7321O5P348k7944
4416A60376J0410Q889M621l961J2179R730J1076O528j3924K0801K9491Q521j5062
4403B49675j4212M596j1406k8862K5016J3380J6500j462J230l379K243K4258N387
4390B82964o609O741L2627J2406L29m763J4387J7765j1053K1125j4312j7246j885
4377C32476r333k854j1924j3810j7824j9029N291J8831o121j8730j9779M524n694
4364B36024j1228J8462K4408j4551j095j4409j8244K9662R793l700j9820L1187
$$ plain form
4352 266489 267128 269141 257591 239542 242489 252730 270578 269727 246227 209370 180150 188881 198657
4339 198657 178682 182365 187679 160692 160073 170924 166035 185796 223061 227963 234270 248332 222589
4326 222589 205265 207942 197567 204701 231359 271089 279267 273564 261363 273142 270303 283074 301894
4313 301894 303850 331194 341403 346011 359538 386487 379709 403055 460613 501813 562701 585026
4301 585026 613920 642874 652495 689570 688387 683712 675638 694206 700714 727354 726621 730649 773857
4288 773857 777869 814795 858209 862894 921528 963583 1017963 1075073 1144193 1271103 1370715 1496358
4276 1496358 1628061 1756360 1895498 2024208 2129054 2167476 2152995 2114418 2001160 1854725
4266 1854725 1694925 1516781 1388266 1252162 1161325 1071437 1004902 959335 909471 870866 851416
$$ packed form
4352B66489O39K013j1550j8049K947J0241J7848q51k3500l6857k9220Q731R776
4339A98657j9975L683N314k6987o19J0851m889J9761L7265M902O307J4062k5743
4326B22589j7324K677j0375P134K6658L9730Q178n703j2201J1779k839J2771J8820
4313C01894J956K7344J0209M608J3527K6949o778K3346N7558M1200O0888K2325
4301E85026K8894K8954R621L7075j183m675q074J8568O508K6640p33M028M3208
4288G73857M012L6926M3414M685N8634M2055N4380N7110O9120J26910R9612J25643
4276A496358J31703J28299J39138J28710J04846L8422j4481l8577j13258j46435
4266A854725j59800j78144j28515j36104r0837q9888o6535m5567m9864l8605j9450
$$ plain form
4255 851416 831046 816455 795065 791992 779692 755910 755944 754015 725715 747976 749224 739439 764214
4242 764214 781101 802212 811576 849446 882976 914245 911597 944687 975890 1006647 992494 990630
4230 990630 995168 994780 968521 947685 919577 899769 929764 948982 966056 986497 989663 1020337
4218 1020337 1042774 1062178 1086527 1091289 1093511 1114587 1152699 1140142 1133696 1190161 1201244 1232170
4206 1232170 1280505 1284475 1304296 1300709 1305005 1350489 1385934 1398522 1419872 1438967 1487144 1524106
4194 1524106 1546828 1603479 1639318 1651595 1703997 1733893 1761567 1788245 1844490 1911687 1942079
4183 1942079 1996957 2082738 2114304 2168157 2195029 2218486 2281258 2329132 2378044 2413096 2481082
4172 2481082 2561241 2617334 2685243 2765131 2864479 2960853 3028018 2997614 2893922 2805844 2732310
$$ packed form
4255H51416k0370j4591k1390l073j2300k3782L4j929k8300K2261J248r785K4775
4242G64214J6887K1111R364L7870L3530L1269k648L3090L1203L0757j4153j864
4230I90630M538l88k6259k0836k8108j9808K9995J9218J7074K0441L166L0674
4218A020337K2437J9404K4349M762K222K1076L8112j2557o446N6465J1083L0926
4206A232170M8335L970J9821l587M296M5484L5445J2588K1350J9095M8177L6962
4194A524106K2722N6651L5839J2277N2402K9896K7674K6678N6245O7197L0392
4183A942079N4878Q5781L1566N3853K6872K3457O2772M7874M8912L5052O7986
4172B481082Q0159N6093O7909P9888R9348R6374O7165l0404j03692q8078p3534
$$ plain form
4161 2732310 2665407 2613278 2546824 2530068 2527910 2534782 2521863 2527536 2555971 2555322 2602192 2624973
4149 2624973 2643474 2700855 2742794 2828673 2938473 3014770 3086733 3174183 3252296 3376919 3518024
4138 3518024 3663040 3816757 3981781 4222153 4474392 4782615 5093990 5463808 5901771 6389771
4128 6389771 6919460 7436783 7900894 8393353 8900260 9488915 10202905 11103238 12175300
4119 12175300 13177269 13693790 13482882 12532593 11205075 9921009 8820326 7948846 7324933
4110 7324933 6830997 6421817 6130181 5906414 5723594 5565716 5450507 5343221 5236576 5172888
4100 5172888 5112462 5051822 5012235 4969107 4939434 4943472 4935661 4987267 4996516 4992365 5031642 5057397
4088 5057397 5072480 5106231 5167648 5204938 5265617 5359328 5430377 5487233 5582406 5662855 5753868
$$ packed form
4161B732310o6903n2129o6454j6756k158O872j2919N673K8435o49M6870K2781
4149B624973J8501N7381M1939Q5879J09800P6297P1963Q7450P8113J24623J41105
4138C518024J45016J53717J65024K40372K52239L08223L11375L69818M37963M88000
4128F389771N29689N17323M64111M92459N06907N88655P13990R00333J072062
4119A2175300J001969N16521k10908r50289j327518j284066j100683q71480o23913
4110G324933m93936m09180k91636k23767j82820j57878j15209j07286j06645o3688
4100E172888o0426o0640l9587m3128k9673M038p811N1606R249m151L9277K5755
4088E057397J5083L3751O1417L7290O0679R3711P1049N6856R5173Q0449R1013
$$ plain form
4077 5753868 5854609 5941704 6035534 6148637 6255071 6351400 6471172 6593443 6694440 6822753
4067 6822753 6969639 7131560 7336390 7551048 7747966 7987927 8268279 8561670 8881654 9220436
4057 9220436 9561769 9969099 10284424 10526872 10739625 10973967 11243906 11516553 11840304 12181074
4047 12181074 12526019 12893030 13270050 13660952 14032176 14436316 14853279 15257932 15681370
4038 15681370 16162664 16683050 17247915 17840896 18489750 19208546 19972488 20798476 21708337
4029 21708337 22700203 23753759 24871233 26061617 27338845 28660559 30075429 31594271
4021 31594271 33258357 35037148 37009552 39145043 41431382 43926776 46553949 49251076
4013 49251076 51962564 54673351 57245181 59623003 61737842 63552187 65097946 66447086
$$ packed form
4077E753868J00741Q7095R3830J13103J06434R6329J19772J22271J00997J28313
4067F822753J46886J61921K04830K14658J96918K39961K80352K93391L19984L38782
4057I220436L41333M07330L15325K42448K12753K34342K69939K72647L23751L40770
4047A2181074L44945L67011L77020L90902L71224M04140M16963M04653M23438
4038A5681370M81294N20386N64865N92981O48854P18796P63942Q25988R09861
4029B1708337R91866J053556J117474J190384J277228J321714J414870J518842
4021C1594271J664086J778791J972404K135491K286339K495394K627173K697127
4013D9251076K711488K710787K571830K377822K114839J814345J545759J349140
$$ plain form
4005 66447086 67669519 68939427 70301978 71937103 73895266 76248020 79133513 82549250
3997 82549250 86610720 91432122 97056747 103686473 111558406 120813790 131644596 144363042
3989 144363042 159239427 176151944 195183171 216867462 241089707 266605043 291654847
3982 291654847 313623129 330178967 340232423 340302605 327366539 304966759 277913982
3975 277913982 248036785 217427358 189166368 164869799 144673978 128123016 114560072
3968 114560072 103332045 93919847 85905494 79018917 73031208 67815864 63198076 59114502
3960 59114502 55456924 52164318 49252412 46602412 44182441 42008270 40032002 38234077
3952 38234077 36595087 35115575 33707267 32389350 31161469 30057437 29008841 27977191
$$ packed form
4005F6447086J222433J269908J362551J635125J958163K352754K885493L415737
3997H2549250M061470M821402N624625O629726P871933R255384J0830806J2718446
3989A44363042J4876385J6912517J9031227K1684291K4222245K5515336K5049804
3982B91654847K1968282J6555838J0053456P0182j2936066k2399780k7052777
3975B77913982k9877197l0609427k8260990k4296569k0195821j6550962j3562944
3968A14560072j1228027r412198q014353o886577n987709n215344m617788m083574
3960E9114502l657578l292606k911906k650000k419971k174171j976268j797925
3952C8234077j638990j479512j408308j317917j227881j104032j048596j031650
$$ plain form
3944 27977191 27016508 26096142 25165800 24213057 23333034 22458846 21593038 20738897 19943939
3935 19943939 19235524 18554924 17957277 17436455 16922809 16456948 16014644 15584710 15143825
3926 15143825 14715778 14291483 13885491 13463498 13039952 12654369 12262203 11839095 11447260
3917 11447260 11109849 10786061 10460050 10158290 9887976 9625423 9391874 9159251 8939616
3908 8939616 8702716 8500556 8297282 8087541 7929810 7745632 7591046 7461578 7323758 7179532
3898 7179532 7084521 7002081 6878141 6742026 6597018 6447099 6298285 6136059 5959387 5771316
3888 5771316 5579137 5410603 5237792 5073374 4899334 4735367 4608654 4483245 4388357 4258916
3878 4258916 4150919 4044062 3956847 3886337 3782289 3690575 3586212 3498133 3417790 3346049 3280582
$$ packed form
3944B7977191r60683r20366r30342r52743q80023q74188q65808q54141p94958
3935A9943939p08415o80600n97647n20822n13646m65861m42304m29934m40885
3926A5143825m28047m24295m05992m21993m23546l85583l92166m23108l91835
3917A1447260l37411l23788l26011l01760k70314k62553k33549k32623k19635
3908H939616k36900k02160k03274k09741j57731j84178j54586j29468j37820j44226
3898G179532r5011q2440j23940j36115j45008j49919j48814j62226j76672j88071
3888E771316j92179j68534j72811j64418j74040j63967j26713j25409r4888j29441
3878D258916j07997j06857q7215p0510j04048r1714j04363q8079q0343p1741o5467
$$ plain form
3867 3280582 3199075 3127884 3070200 3005881 2944912 2890972 2816817 2756828 2713595 2645362 2597194
3856 2597194 2553951 2532877 2518561 2465379 2433233 2390728 2353100 2333367 2281098 2243609 2175572
3845 2175572 2170185 2180371 2121970 2102604 2078963 2040492 1988313 1987712 1969659 1969295 1943720 1889287
3833 1889287 1859053 1800547 1782785 1748135 1709771 1724694 1699962 1659701 1627688 1606637 1599312 1579862
3821 1579862 1562021 1548100 1519661 1481696 1462736 1456799 1419532 1376157 1349054 1328069 1315782 1282782
3809 1282782 1262234 1252960 1226063 1169225 1147673 1107008 1065839 1008313 987443 943730 885678 840267
3797 840267 804371 815851 789463 765049 750807 718299 678523 654417 639400 579136 556028 529819
3785 529819 519205 513979 494527 489626 504760 519443 507494 523674 522688 536613 521226 516808 489453
$$ packed form
3867C280582q1507p1191n7684o4319o0969n3940p4155n9989m3233o8233m8168
3856B597194m3243k1074j4316n3182l2146m2505l7628j9733n2269l7489o8037
3845B175572n387J0186n8401j9366k3641l8471n2179o01j8053l64k5575n4433
3833A889287l0234n8506j7762l4650l8364J4923k4732m0261l2013k1051p325j9450
3821A579862j7841j3921k8439l7965j8960n937l7267m3375k7103k0985j2287l3000
3809A282782k0548r274k6897n6838k1552m0665m1169n7526k0870m3713n8052m5411
3797H40267l5896J1480k6388k4414j4242l2508l9776k4106j5017o0264k3108k6209
3785E29819j0614n226j9452m901J5134J4683j1949J6180r86J3925j5387m418k7355
$$ plain form
3772 489453 451249 442795 439548 429642 438966 453731 451375 468025 464193 461284 478544 478713 462648
3759 462648 435553 452254 434715 409517 422512 429111 425760 419835 403137 390793 377242 381305
3747 381305 393785 396037 391630 368510 377206 401263 424330 449521 459007 494910 534867 534000 550245
3734 550245 563045 572145 566602 575050 581599 563083 539383 533367 569976 598190 600524 627617 647949
3721 647949 679916 700459 698872 693928 716611 734212 742473 734730 686270 664058 695903 725670
3709 725670 731794 727087 733865 754851 752701 737238 756382 750654 765051 818219 858189 918685 976092
3696 976092 1076090 1158000 1229739 1310715 1404135 1537476 1679217 1844891 1983149 2033691 2116799
3685 2116799 2127379 2066791 1927496 1752620 1577931 1408810 1227009 1067158 971656 885094
$$ packed form
3772D89453l8204q454l247r906R324J4765k356J6650l832k909J7260J69j6065
3759D62648k7095J6701j7539k5198J2995O599l351n925j6698j2344j3551M063
3747C81305J2480K252m407k3120Q696K4057K3067K5191R486L5903L9957q67J6245
3734E50245J2800R100n543Q448O549j8516k3700o016L6609K8214K334K7093K0332
3721F47949L1967K0543j587m944K2683J7601Q261p743m8460k2212L1845K9767
3709G25670O124m707O778K0986k150j5463J9144n728J4397N3168L9970O0496N7407
3696I76092R9998Q1910P1739Q0976R3420J33341J41741J65674J38258N0542Q3108
3685B116799J0580o0588j39295j74876j74689j69121j81801j59851r5502q6562
$$ plain form
3675 885094 789640 725541 675097 616881 590670 558610 522639 501715 500906 477927 437983 408889
3663 408889 410808 412535 364501 360328 355762 355339 377404 361976 373144 380519 375874 347062 355013
3650 355013 351450 338525 341625 311330 306381 308901 294726 282546 274746 283917 272779 285370 268988
3637 268988 247243 253754 245695 249159 227934 203804 239766 236051 202984 217677 224027 224513 229694
3624 229694 204324 220102 220712 202173 171355 137726 121111 141130 140401 112982 107002 137852 138293
3611 138293 125476 90830 77982 78745 65530 79484 97236 79530 48329 59566 52537 35209
3599 35209 18489 4961 17405 45731 69958 34695 8184 17301 -5625 -10523 92 -13367
3587 -13367 -1341 10027 7842 22025 14347 12851 -291 -693 1666 -624 -13245 8293 16413
$$ packed form
3675H85094r5454o4099n0444n8216k6211l2060l5971k0924q09k2979l9944k9094
3663D08889J919J727m8034m173m566m23K2065j5428J1168P375m645k8812P951
3650C55013l563j2925L100l0295m949K520j4175j2180p800R171j1138J2591j6382
3637B68988k1745O511q059L464k1225k4130L5962l715l3067J4693O350M86N181
3624B29694k5370J5778O10j8539l0818l3629j6615K0019p29k7419n980L0850M41
3611A38293j2817l4646j2848P63j3215J3954J7752j7706l1201J1237p029j7328
3599C5209j6720j3528J2444K8326K4227l5263k6511R117k2926m898J0615j3459
3587a3367J2026J1368k185J4183p678j496j3142m02K359k290j2621K1538Q120
$$ plain form
3574 16413 33870 -4555 -37906 -12527 33849 18845 7647 30049 41362 34767 38561 24335
3562 24335 24189 56144 34246 16009 9812 -10545 -22930 950 -29 -2826 -7030 -21622 -24688
3549 -24688 -4858 20983 31144 57392 49667 28470 22836 11984 28246 56071 60173 42746
3537 42746 44295 66292 58136 66553 62422 70533 79756 78385 58375 39906 48548 60290 72433
3524 72433 72056 77012 71926 32231 19666 7880 10635 12193 13335 38398 33265 27288 15323 19542
3510 19542 -5637 7526 33722 28417 22230 25937 682 -18843 -16571 -2408 -8951 -16996 -18850
3497 -18850 -20397 -45559 -25260 -13895 13372 21904 7202 1204 -8967 1338 17413 18105 -30662
3484 -30662 -5958 -26451 -44482 -28275 -46477 -36087 -22975 -8139 -10660 -4632 20557 2464
$$ packed form
3574A6413J7457l8425l3351K5379M6376j5004j1198K2402J1313o595L794j4226
3562B4335j46L1955k1898j8237o197k0357j2385K3880r79k797m204j4592l066
3549b4688J9830K5841J0161K6248p725k1197n634j0852J6262K7825M102j7427
3537D2746J549K1997q156Q417m131Q111R223j371k0010j8469Q642J1742J2143
3524G2433l77M956n086l9695j2565j1786K755J558J142K5063n133n977j1965M219
3510A9542k5179J3163K6196n305o187L707k5255j9525K272J4163o543q045j854
3497a8850j547k5162K0299J1365K7267Q532j4702n998j0171J0305J6075O92m8767
3484c0662K4704k0493j8031J6207j8202J0390J3112J4836k521O028K5189j8093
$$ plain form
3472 2464 17619 9011 11427 14830 15038 20039 27377 55599 46259 17386 6852 56603 73116 76632
3458 76632 97640 112700 86238 78600 63861 60437 72038 67050 62011 53463 51262 40008 57018
3445 57018 41859 32865 35766 28073 36386 32421 28831 46304 66816 78776 59353 40774 55899
3432 55899 67519 85792 82957 66311 51887 59434 77177 68444 84925 89225 87748 82978 107184
3419 107184 101414 120455 142618 124375 112060 109935 143480 142893 123143 113771 129039 129914 130082
3406 130082 117674 116304 114237 136748 158544 149247 137400 135977 140797 164029 173364 186782 206871
3393 206871 233302 250086 241415 262415 316019 337088 350777 391985 438033 470505 529427 543527
3381 543527 490644 453446 403048 387499 372078 369920 397560 428643 458991 482925 519732 586454
$$ packed form
3472B464J5155q608K416L403K08N001P338K8222r340k8873j0534M9751J6513L516
3458G6632K1008J5060k6462p638j4739l424J1601m988n039q548k201j1254J7010
3445E7018j5159q994K901p693Q313l965l590J7473K0512J1960j9423j8579J5125
3432E5899J1620J8273k835j6646j4424P547J7743q733J6481M300j477m770K4206
3419A07184n770J9041K2163j8243j2315k125L3545n87j9750r372J5268Q75J68
3406A30082j2408j370k067K2511K1796r297j1847j423M820K3232R335J3418K0089
3393B06871K6431J6784q671K1000N3604K1069J3689M1208M6048L2472N8922J4100
3381E43527n2883l7198n0398j5549j5421k158K7640L1083L0348K3934L6807O6722
$$ plain form
3369 586454 645331 685449 741205 800752 813217 823747 790251 754665 735139 703844 673386 647638
3357 647638 653483 681739 713913 730593 760963 823582 886383 886189 839648 738108 625386 546026
3345 546026 483186 419232 357053 333067 321192 285156 276394 266160 260618 242334 239990 246877
3333 246877 252197 250040 259733 288772 303725 309676 302792 292750 306018 338962 363108 400925 432506
3320 432506 464633 481021 474820 445073 408305 342020 289976 262117 249825 233383 218234 192908
3308 192908 192656 202278 173721 141168 155155 137475 142858 167000 180472 168097 162301 131127 136255
3295 136255 170410 170144 152065 149951 153990 131707 141425 152372 164940 151615 149074 169997 155533
3282 155533 140533 177569 194197 183135 216258 211124 200854 231643 222987 221043 265153 260916
$$ packed form
3369E86454N8877M0118N5756N9547J2465J0530l3496l5586j9526l1295l0458k5748
3357F47638N845K8256L2174J6680L0370O2619O2801j94m6541j01540j12722p9360
3345E46026o2840o3954o2179k3986j1875l6036q762j0234n542j8284k344O887
3333B46877N320k157R693K9039J4953N951o884j0042J3268L2944K4146L7817L1581
3320D32506L2127J6388o201k9747l6768o6285n2044k7859j2292j6442j5149k5326
3308A92908k52R622k8557l2553J3987j7680N383K4142J3472j2375n796l1174N128
3295A36255L4155k66j8079k114M039k2283R718J0947J2568j3325k541K0923j4464
3282A55533j5000L7036J6628j1062L3123n134j0270L0789q656j944M4110m237
$$ plain form
3270 260916 236163 268107 291056 300159 307345 333119 326556 327289 330327 325078 350366 371318 367791
3257 367791 376539 389171 415477 433891 462111 490589 500347 534768 577753 619443 666337 684902
3245 684902 710893 750596 786701 819799 843884 904027 914507 920916 947834 913410 905936 837183
3233 837183 782051 739585 672560 631001 582579 555274 519440 472699 442496 424904 415415 402256
3221 402256 371134 368942 359368 372863 375517 380443 403416 400076 379801 396584 414307 421931 448033
3208 448033 438938 480348 514176 555588 590274 592136 532672 486736 426775 410658 395839 336568
3196 336568 346956 320524 276535 277220 267868 243096 218354 211575 213638 231587 242070 221944 243418
3183 243418 237822 244699 262357 241285 240396 263699 261666 255383 306773 348680 360975 381778 389898
$$ packed form
3270B60916k4753L1944K2949R103P186K5774o563P33L038n249K5288K0952l527
3257C67791Q748J2632K6306J8414K8220K8478R758L4421M2985M1690M6894J8565
3245F84902K5991L9703L6105L3098K4085O0143J0480O409K6918l4424p474o8753
3233H37183n5132m2466o7025m1559m8422k7305l5834m6741l0203j7592r489j3159
3221D02256l1122k192r574J3495K654M926K2973l340k0275J6783J7723P624K6102
3208D48033r095M1410L3828M1412L4686J862n9464m5936n9961j6117j4819n9271
3196C36568J0388k6432m3989O85r352k4772k4742o779K063J7949J0483k0126K1474
3183B43418n596O877J7658k1072q89K3303k033o283N1390M1907J2295K0803Q120
$$ plain form
3170 389898 383616 334513 314419 310381 288271 262829 247240 229253 205189 176469 199508 200377
3158 200377 174457 150590 131916 156891 170075 163942 122167 111351 119884 114316 110883 149572
3146 149572 124671 122366 109057 78282 97632 83762 88023 102610 90501 99589 109254 84577
3134 84577 74759 71827 76766 81790 78343 75235 72476 77445 67024 64497 66811 70225 77874 81846
3120 81846 88774 65418 74862 86498 96345 98971 119517 123631 123189 142183 136754 113180 88718
3107 88718 100062 97398 81237 94353 83646 94432 86568 67001 81386 99126 116383 76237
3095 76237 67836 68709 59386 92891 94461 98590 85959 101991 107130 130317 141970 153282 162818
3082 162818 174915 211424 214483 207580 202940 190804 170371 174251 166226 152213 134460 101271 100674
$$ packed form
3170C89898o282m9103k0094m038k2110k5442j5589j7987k4064k8720K3039Q69
3158B00377k5920k3867j8674K4975J3184o133m1775j0816Q533n568l433L8689
3146A49572k4901k305j3309l0775J9350j3870M261J4587j2109R088R665k4677
3134H4577r818k932M939N024l447l108k759M969j0421k527K314L414P649L972
3120H1846O928k3356R444J1636R847K626K0546M114m42J8994n429k3574k4462
3107H8718J1344k664j6161J3116j0707J0786p864j9567J4385J7740J7257m0146
3095G6237q401Q73r323L3505J570M129j2631J6032N139K3187J1653J1312R536
3082A62818J2097L6509L059o903m640j2136k0433L880q025j4013j7753l3189n97
$$ plain form
3069 100674 132677 130303 124423 103073 79360 93555 83583 73247 68861 57067 57865 66295 65330
3056 65330 59425 55206 55522 65291 81860 108685 129601 132463 124847 146645 132569 93343 118952
3043 118952 113143 107459 114228 96335 100208 109738 113584 105839 104019 118301 121308 114024 111147 138398
3029 138398 138372 135464 150530 157869 154287 144264 155081 165797 143999 152875 174184 180437 200581
3016 200581 181351 164491 151227 124475 133228 149147 165447 188657 173199 166612 172014 184089
3004 184089 210712 216283 201637 217239 212789 212510 204215 235138 213641 226925 233294 238464 243196
2991 243196 252916 305343 340394 354739 371009 400531 420986 423996 402062 367865 338961 344015
2979 344015 336791 329999 320502 295698 260774 279475 301174 291002 307810 311856 274854 250860
$$ packed form
3069A00674L2003k374n880k1350k3713J4195r972j0336m386j1794P98Q430r65
3056F5330n905m219L16R769J6569K6825K0916K862p616K1798j4076l9226K5609
3043A18952n809n684O769j7893L873R530L846p745j820J4282L007p284k877K7251
3029A38398k6k908J5066P339l582j0023J0817J0716k1798Q876K1309O253K0144
3016B00581j9230j6860j3264k6752Q753J5919J6300K3210j5458o587N402J2075
3004A84089K6623N571j4646J5602m450k79q295L0923k1497J3284O369N170M732
2991B43196R720N2427L5051J4345J6270K9522K0455L010k1934l4197k8904N054
2979C44015p224o792r497k4804l4924J8701K1699j0172J6808M046l7002k3994
$$ plain form
2967 250860 266543 269097 264784 252833 238416 220420 214475 225453 229553 229842 244176 226590 243171
2954 243171 248987 257474 250881 244523 253723 249182 227559 220686 228856 197862 194986 182641 172628
2941 172628 167792 170976 181581 193044 189352 188726 185716 164077 175260 160793 172274 154778 124611
2928 124611 139665 142259 149313 125176 113804 117624 126062 104671 96069 72910 54731 68099 61168
2915 61168 79955 80951 72911 84730 62875 60238 52092 58109 62056 71828 95686 107097 94789
2902 94789 101055 86361 110104 98636 101393 83030 73217 69575 58972 59565 66442 63059 84371
2889 84371 83232 78606 81578 71038 75651 37413 42066 61067 75218 77622 72607 72686 68713 59698
2875 59698 76645 68488 48076 53540 55810 59617 44093 31817 50403 51240 41055 22905 31789
$$ packed form
2967B50860J5683K554m313j1951j4417j7996n945J0978M100K89J4334j7586J6581
2954B43171N816Q487o593o358R200m541k1623o873Q170l0994k876j2345j0013
2941A72628m836L184J0605J1463l692o26l010k1639J1183j4467J1481j7496l0167
2928A24611J5054K594P054k4137j1372L820Q438k1391q602k3159j8179J3368o931
2915F1168J8787R96q040J1819k1855k637q146O017L947R772K3858J1411j2308
2902I4789O266j4694K3743j1468K757j8363r813l642j0603N93O877l383K1312
2889H4371j139m626K972j0540M613l8238M653J9001J4151K404n015P9l973r015
2875E9698J6947q157k0412N464K270L807j5524j2276J8586Q37j0185j8150Q884
$$ plain form
2862 31789 69591 66841 50614 18656 32835 19838 34446 55342 19416 -11744 -11826 -4783 -6450
2849 -6450 -16996 -33195 -5767 -31438 -41656 -23388 12005 11834 -20907 -26262 -22177 -2838 -3237
2836 -3237 5070 12140 20718 14313 -3115 -9085 -42719 -43289 -26994 -15155 -17813 -27052 -27721 -15845
2822 -15845 -24138 -31744 -17762 -36672 -52168 -48119 -60566 -67433 -56750 -58646 -50486 -28040 -34301
2809 -34301 -41872 -40091 -31899 -20831 -16498 -25077 -18962 -36476 -42112 -48646 -43590 -49918 -59865 -57195
2795 -57195 -37418 -36714 -48054 -55901 -23801 -17630 -36326 -24029 8194 -14109 -15141 4445 1831
2782 1831 -9265 -22161 -32866 -15496 -5743 -16854 -7687 -17161 -28095 -19753 2768 -21601 -36116
2769 -36116 -42960 -25518 -2879 -1165 -10147 -25934 -22357 5575 17044 -2991 24578 44210 24538
$$ packed form
2862C1789L7802k750j6227l1958J4179j2997J4608K0896l5926l1160q2P043j667
2849f450j0546j6199K7428k5671j0218J8268L5393j71l2741n355M085J9339l99
2836c237Q307P070Q578o405j7428n970l3634n70J6295J1839k658r239o69J1876
2822a5845q293p606J3982j8910j5496M049j2447o867J0683j896Q160K2446o261
2809c4301p571J781Q192J1068M333q579O115j7514n636o534N056o328r947K670
2795e7195J9777P04j1340p847L2100O171j8696J2297L2223k2303j032J9586k614
2782A831j1096j2896j0705J7370R753j1111R167r474j0934Q342K2521k4369j4515
2769c6116o844J7442K2639J714q982j5787L577K7932J1469k0035K7569J9632j9672
$$ plain form
2756 24538 33495 34258 28737 43489 32118 41328 34230 5359 -7366 27921 20386 10432 -28954
2743 -28954 -61439 -61983 -55224 -56734 -42646 -27327 -55427 -57672 -46435 -36016 -41274 -31830 -21217
2730 -21217 -25914 -46662 -46658 -45773 -47580 -69149 -76374 -66495 -60292 -67718 -46919 -38111 -16692 -42605
2716 -42605 -48077 -39232 -47544 -44558 -46394 -62045 -80987 -89193 -77917 -70888 -45192 -47454 -34124
2703 -34124 -60387 -68655 -47719 -32293 -38294 -43799 -25997 -29436 -39579 -59211 -62283 -71310 -43380
2690 -43380 -34510 -16239 -4020 -43478 -69864 -44579 -28885 -55024 -40533 -49670 -62405 -55282
2678 -55282 -24359 -31280 -19499 -14975 -22487 -17187 -36224 -40708 -37071 -11816 -2349 20576 17923
2665 17923 3767 12580 9261 -4288 -2360 3365 27269 24665 18628 23420 21077 47103 43390 31294
$$ packed form
2756B4538Q957P63n521J4752j1371R210p098k8871j2725L5287p535r954l9386
2743b8954l2485n44O759j510J4088J5319k8100k245J1237J0419n258R444J0613
2730b1217m697k0748MQ85j807k1569p225R879O203p426K0799Q808K1419k5913
2716d2605n472Q845q312K986j836j5651j8942q206J1276P029K5696k262J3330
2703c4124k6263q268K0936J5426o001n505J7802l439j0143j9632l072r027K7930
2690d3380Q870J8271J2219l9458k6386K5285J5694k6139J4491r137j2735P123
2678e5282L0923o921J1781M524p512N300j9037m484L637K5255R467K2925k653
2665A7923j4156Q813l319j3549J928N725K3904k604o037M792k343K6026l713j2096
$$ plain form
2651 31294 42825 30461 26775 30986 51955 51582 34105 68382 74633 46934 72106 96536 53203
2638 53203 44951 68520 82238 61969 63796 83277 92070 89218 57285 45436 48587 51581 65293
2625 65293 103916 118442 122460 112376 141783 131540 117361 114246 120404 112416 117442 125536 107762
2612 107762 125454 115908 142081 144880 130680 155167 137732 124133 112496 119378 140092 131964
2600 131964 111504 104814 101873 90857 87816 63934 77695 91819 103935 85861 63344 84904
2588 84904 88097 98567 88193 103965 121163 107735 120160 101217 115236 115655 107019 122380 108897
2575 108897 101276 90515 110447 142193 112183 62365 89668 79421 76257 63112 66212 73394
2563 73394 87554 70738 33001 19171 9493 -2702 -3573 9083 -18754 -24589 -2608 13213 15032
$$ packed form
2651C1294J1531j2364l686M211K0969l73j7477L4277O251k7699K5172K4430m3333
2638E3203q252K3569J3718k0269J827J9481Q793k852l1933j1849L151K994J3712
2625F5293L8623J4526M018j0084K9407j0243j4179l115O158p988N026Q094j7774
2612A07762J7692r546K6173K799j4200K4487j7435j3599j1637O882K0714q128
2600A31964k0460o690k941j1016l041k3882J3761J4124J2116j8074k2517K1560
2588H4904L193J0470j0374J5772J7198j3428J2425j8943J4019M19q636J5361j3483
2575A08897p621j0761J9932L1746l0010m9818K7303j0247l164j3145L100P182
2563G3394J4160j6816l7737j3830r678j2195q71J2656k7837n835K1981J5821J819
$$ plain form
2550 15032 5301 -699 -15539 -22535 -11637 17530 29096 25748 25215 19065 29458 19491 -159
2537 -159 15194 4580 827 -15620 -33827 -23772 -8757 -8879 -8875 -29216 -43669 -30917 -39360 -46687
2523 -46687 -37615 -34344 -47298 -58353 -44020 -24329 -53775 -44957 -54101 -63587 -63365 -51620 -57347
2510 -57347 -44409 -11902 -6034 -40382 -45349 -10098 -27836 -36115 -30672 -39157 -74673 -74639 -58227
2497 -58227 -69083 -47152 -43477 -59036 -67543 -40440 -63417 -52144 -43514 -77187 -81945 -70943 -80592
2484 -80592 -73571 -48735 -42642 -50920 -44592 -51490 -55317 -45537 -61657 -72339 -57162 -57112 -70955 -84550
2470 -84550 -73249 -61854 -63098 -71057 -65084 -63973 -67302 -47935 -55355 -42435 -62727 -73041 -56509
2457 -56509 -69246 -90987 -75224 -67709 -71538 -69479 -73527 -59612 -70439 -74120 -92246 -76239 -85438
$$ packed form
2550A5032r731o000j4840o996J0898K9167J1566l348n33o150J0393r967j9650
2537a59J5353j0614l753j6447j8207J0055J5015j22Mk0341j4453J2752q443p327
2523d6687R072L271j2954j1055J4333J9691k9446Q818r144r486K22J1745n727
2510e7347J2938L2507N868l4348m967L5251j7738q279N443q485l5516L4J6412
2497e8227j0856K1931L675j5559q507K7103k2977J1273Q630l3673m758J1002r649
2484h0592P021K4836O093q278O328o898l827R780j6120j0682J5177N0j3843j3595
2470h4550J1301J1395j244p959N973J111l329J9367p420J2920k0292j0314J6532
2457e6509j2737k1741J5763P515l829K059m048J3915j0827l681j8126J6007r199
$$ plain form
2444 -85438 -68016 -70435 -101551 -73605 -81125 -59976 -61571 -76631 -84289 -66570 -58867 -55245 -55206 -83600
2430 -83600 -64320 -63410 -65433 -78842 -81220 -62116 -60395 -56835 -73873 -67101 -60261 -46649 -62379
2417 -62379 -60478 -56628 -66483 -76371 -65786 -48308 -31925 -68164 -71035 -80660 -84466 -68450 -72487
2404 -72487 -86135 -96777 -62987 -76490 -68263 -61743 -66979 -64102 -47473 -38931 -64917 -52562 -51283
2391 -51283 -71135 -62877 -53792 -46783 -51107 -56429 -74405 -74349 -82319 -82014 -64557 -57811 -56762 -60828 -48713
2376 -48713 -48992 -9871 4540 -27651 -47524 -19862 -24827 -44187 -31475 -15439 -25783 -26995 -18756
2363 -18756 -31374 -33008 -38041 -45783 -23172 9177 9580 5564 -1914 -4040 -33216 -56482 -57954 -55332
2349 -55332 -66483 -53975 -53853 -38281 -45629 -39558 -43177 -40275 -36454 -31659 -42145 -54405 -49894 -45584
$$ packed form
2444h5438J7422k419l1116K7946p520K1149j595j5060p658J7719P703L622L9k8394
2430h3600J9280R10k023j3409k378J9104J721L560j7038O772O840J3612j5730
2417f2379J901L850r855r888J0585J7478J6383l6239k871r625l806J6016m037
2404g2487j3648j0642L3790j3503Q227O520n236K877J6629Q542k5986J2355J279
2391e1283j9852Q258R085P009m324n322j7976N6p970L05J7457O746J049m066J2115
2376d8713k79L9121J4411l2191j9873K7662m965j9360J2712J6036j0344j212Q239
2363a8756j2618j634n033p742K2611L2349M03m016p478k126k9176k3266j472K622
2349e5332j1151J2508J22J5572p348O071l619K902L821M795j0486j2260M511M310
$$ plain form
2335 -45584 -50338 -51272 -48124 -77939 -60014 -54365 -38813 -44113 -59481 -61092 -44169 -40052 -40058 -43584
2321 -43584 -46362 -39586 -41783 -31606 -30569 -42079 -31514 -50016 -54164 -42236 -53275 -60524 -58441
2308 -58441 -57972 -58458 -52548 -38017 -45249 -39566 -35447 -38750 -45741 -41180 -38892 -25904 -25663 -45271 -51386
2293 -51386 -52772 -47539 -46281 -35015 -47897 -37175 -34270 -36747 -47306 -18008 -9804 -7912 -18738
2280 -18738 -19332 2216 -5408 -24418 -12844 -20958 -27605 -41723 -50909 -36750 -47104 -35566 -38333
2267 -38333 -13776 -20553 -48432 -49040 -47638 -17126 -22720 -45977 -47917 -42958 -27646 -18575 -8539
2254 -8539 -15539 -21159 -36848 -30223 -31307 -36198 -25384 -14765 -22424 -46215 -44402 -16439 -43449
2241 -43449 -40854 -25723 -2349 -11272 -34963 -14979 -25444 7747 20354 -4190 -9189 -6548 -103
$$ packed form
2335d5584m754r34L148k9815J7925N649J5552n300j5368j611J6923M117ol526
2321d3584k778O776k197J0177J037j1510J0565j8502m148J1928j1039p249K083
2308e8441M69m86N910J4531p232N683M119l303o991M561K288J2988K41j9608o115
2293e1386j386N233J258J1266j2882J0722K905k477j0559K9298Q204J892j0826
2280a8738n94K1548p624j9010J1574q114o647j4118r186J4159j0354J1538k767
2267c8333K4557o777k7879o08J402L0512n594k3257j940M959J5312R071J0036
2254h539p000n620j5689O625j084m891J0814J0619p659k3791J813K7963k7010
2241d3449K595J5131K3374q923k3691J9984j0465L3191J2607k4544m999K641O445
$$ plain form
2228 -103 -37578 -20945 424 4492 18556 6433 1301 7313 15922 24245 -8417 5082 3965
2215 3965 -2064 15319 -3210 -4623 -2375 10854 9360 24450 42184 48736 31340 25003 34722
2202 34722 23526 18457 44586 38190 33952 24588 36908 73543 90412 66784 73982 61855 81782
2189 81782 72654 53030 63012 81195 79363 85794 97665 116531 96745 91890 110417 123328 98680
2176 98680 107221 112827 123358 139817 123712 140616 141788 148537 161793 179114 176896 177631 168815
2163 168815 205127 204902 192506 195874 224403 218002 205156 202118 215980 250041 268870 267435 283370
2150 283370 294748 324500 333742 336886 361276 390704 421549 401206 400639 411515 440335 450166 483008
2137 483008 497113 521417 561499 595547 602450 627868 676044 692617 708368 742861 789583 824785
$$ packed form
2228a03l7475J6633K1369M068J4064j2123n132O012Q609Q323l2662J3499j117
2215C965o029J7383j8529j413K248J3229j494J5090J7734O552j7396o337R719
2202C4722j1196n069K6129o396m238r364J2320L6635J6869k3628P198j2127J9927
2189H1782r128j9624R982J8183j832O431J1871J8866j9786m855J8527J2911k4648
2176I8680Q541N606J0531J6459j6105J6904J172O749J3256J7321k218P35q816
2163A68815L6312k25j2396L368K8529o401j2846l038J3862L4061J8829j435J5935
2150B83370J1378K9752R242L144K4390K9428L0845k0343n67J0876K8820R831L2842
2137D83008J4105K4304M0082L4048O903K5418M8176J6573J5751L4493M6722L5202
$$ plain form
2125 824785 895085 949858 1012673 1076482 1170579 1301987 1418960 1526043 1682317 1835209 1964342
2114 1964342 2165715 2355035 2589261 2924246 3278438 3737980 4302703 4978596 5618310 6343286
2104 6343286 7352223 8574124 9801604 10148577 9016295 7485458 6120593 4994245
2096 4994245 4208402 3612355 3139449 2742230 2449627 2217329 2057958 1923527 1783840 1685948
2086 1685948 1578940 1431305 1303399 1197221 1109423 1042316 963488 909704 853294 790907 779544
2075 779544 750439 714555 672578 660489 645751 609391 585773 539472 523760 502919 498178 496314
2063 496314 471569 459253 433478 397197 383217 378521 343622 361987 374041 345122 320392 297335
2051 297335 307143 327047 307874 286330 267417 280367 260112 254777 216172 225080 217578 220207 218303
$$ packed form
2125H24785P0300N4773O2815O3809R4097J31408J16973J07083J56274J52892J29133
2114A964342K01373J89320K34226L34985L54192M59542N64723O75893O39714P24976
2104F343286J008937J221901J227480L46973j132282j530837j364865j126348
2096D994245p85843n96047m72906l97219k92603k32298j59371j34431j39687r7892
2086A685948j07008j47635j27906j06178q7798o7107p8828n3784n6410o2387j1363
2075G79544k9105l5884m1977j2089j4738l6360k3618m6301j5712k0841m741j864
2063D96314k4745j2316k5775l6281j3980m696l4899J8365J2054k8919k4730k3057
2051B97335R808J9904j9173k1544j8913J2950k0255n335l8605Q908p502K629j904
$$ plain form
2038 218303 205493 178042 179793 208677 174841 189840 169608 156729 161801 144795 137188 145135
2026 145135 144691 151519 148386 143591 129385 103133 97020 116997 96697 87318 98187 111525 102006
2013 102006 67629 72190 87657 83247 48847 75477 51642 41610 47312 49978 74101 62595
2001 62595 53546 25521 35177 63356 62063 45498 67404 63469 30263 17784 20621 32371 59316
1988 59316 61801 33266 4779 -9263 7374 30744 40713 33089 29377 26055 31395 33482 35124
1975 35124 19208 10153 14992 25707 12509 11153 -9167 -17429 -1251 4934 15443 12983 4170
1962 4170 -7880 -30853 -40880 -25231 -1832 -19030 -7768 4612 -3784 -5752 -34608 -14892
1950 -14892 18807 20889 27462 12560 6267 7557 -4181 -14434 -24355 -19018 -26552 -25465 -3735
$$ packed form
2038B18303j2810k7451J751K8884l3836J4999k0232j2879N072j7006p607P947
2026A45135m44O828l133m795j4206k6252o113J9977k0300r379J0869J3338r519
2013A02006l4377M561J5467m410l4400K6630k3835j0032N702K666K4123j1506
2001F2595r049k8025R656K8179j293j6565K1906l935l3206j2479K837J1750K6945
1988E9316K485k8535k8487j4042J6637K3370R969p624l712l322N340K087J642
1975C5124j5916r055M839J0715j3198j356k0320q262J6178O185J0509k460q813
1962D170j2050k2973j0027J5649K3399j7198J1262J2380q396j968k8856J9716
1950a4892L3699K082O573j4902o293J290j1738j0253r921N337p534J087K1730
$$ plain form
1937 -3735 21033 9801 12169 -97 -25728 -22416 -14812 -15962 -5950 -9445 -10386 -12347 -1439 8165
1923 8165 1148 4658 -4184 -14982 -9673 -6359 173 -461 -1169 -5410 1884 11908 -15929 -24329 -29008
1908 -29008 -19598 -3855 -15034 -22879 -35595 -34274 -21375 -5352 -21717 -40762 -35234 -12784 -1961
1895 -1961 -27119 -50139 -41942 -40919 -28423 -25870 -22597 -17862 2905 5068 8656 9900 -23282 -30938
1881 -30938 -31652 -37571 -23456 -15155 10451 -1379 -6850 -4694 -4529 -20411 -35363 -43086 -39218 -36605
1867 -36605 -36573 -41322 -41477 -20149 13432 7191 -29509 -29516 -25160 -21531 -29804 -35102 -36773 -27090 -54895
1852 -54895 -32437 -22675 -26717 -44010 -31028 -15136 -28610 -37751 -14248 2114 16336 3143
1840 3143 -30999 -29040 -15008 10204 12296 -1631 32242 47314 47247 24091 7004 15600 1310
$$ packed form
1937c735K4768j1232K368j2266k5631L312P604j150J0012l495r41j961J0908R604
1923H165p017L510q842j0798N309L314O532o34p08m241P294J0024k7837q400m679
1908b9008R410J5743j1179p845j2716J321J2899J6023j6365j9045N528K2450J0823
1895a961k5158k3020Q197J023J2496K553L273M735K0767K163L588J244l3182p656
1881c0938p14n919J4115Q301K5606j1830n471K156J65j5882j4952p723L868K613
1867c6605L2m749j55K1328L3581o241l6700pM356L629q273n298j671R683k7805
1852e4895K2458R762m042j7293J2982J5892j3474r141K3503J6362J4222j3193
1840C143l4142J959J4032K5212K092j3927L3873J5072o7k3156j7087Q596j4290
$$ plain form
1827 1310 -14270 -16466 -11060 -12047 -21344 -8253 -15726 -18835 -12746 -16435 -15294 -18601 -11144 -32667
1813 -32667 -20019 -22791 -13777 -16747 -14932 -18732 -19799 -11897 -24744 -47236 -40892 -15029 -23013 -15644
1799 -15644 -2321 -2741 -11317 -37149 -44449 -34335 -22768 -16804 -25877 -39314 -42148 -10477 -9097
1786 -9097 -11255 -24312 -10946 2839 -14722 -26159 -31534 -46155 -36365 -27919 -42325 -26157 -36948
1773 -36948 -5488 1779 -16618 -23762 -32715 -41974 -38691 -26216 -6439 -17444 -31490 -4267 -18941
1760 -18941 -11846 13425 6769 -6302 -15087 -32353 -27093 -45048 -36931 -15328 -36088 -41812 -27843
1747 -27843 -41166 -25876 -54689 -58249 -24019 -22262 -25145 3859 -5680 -5295 -4351 -12063 -7646 -7399
1733 -7399 -31225 -54030 -33556 -56891 -50150 -30682 -7559 -22773 -11926 -20978 -39198 -33129 -21394
$$ packed form
1827A310j5580k196N406r87r297J3091p473l109O089l689J141l307P457k1523
1813c2667J2648k772R014k970J815l800j067P902j2847k2492O344K5863p984P369
1799a5644J3323m20q576k5832p300J0114J1567N964r073j3437k834L1671J380
1786i097k158j3057J3366J3785j7561j1437n375j4621R790Q446j4406J6168j0791
1773c6948L1460P267j8397p144q953r259L283J2475J9777j1005j4046K7223j4674
1760a8941P095K5271o656j3071q785j7266N260j7955Q117K1603k0760n724J3969
1747b7843j3323J5290k8813l560L4230J757k883K9004r539L85R44p712M417K47
1733g399k3826k2805K0474k3335O741J9468K3123j5214J0847r052j8220O069J1735
$$ plain form
1720 -21394 -35173 -33029 -19529 -38916 -21295 -35307 -34990 -31297 -40420 -40831 -24574 -23821 -25623 -54678
1706 -54678 -45184 -24233 -3720 6311 -12806 2332 -29873 -67363 -67782 -47015 -58284 -31438
1694 -31438 -34755 -8755 -9984 -42876 -30919 1088 10762 -31312 -16004 -6524 -9762 -15334 -22504
1681 -22504 -23609 -16587 -18025 3508 -1441 -9170 -30916 -42688 -21490 -27758 -27857 -33227 -22407 -20017
1667 -20017 -13397 -7911 -13979 -50520 -44110 -55433 -43236 -39434 -28731 -27639 -31091 -8536 -6064
1654 -6064 -10506 1831 21609 -2586 2356 -9132 -19070 -6828 -11961 -6298 -28613 1281 5151
1641 5151 16472 -18981 -31905 -20222 -11858 -19573 -19409 -10120 -34426 -18121 -8282 -10331 -17728 -16037
1627 -16037 -29363 -10422 -19706 -16759 -10867 -998 -6814 -7399 -4836 -11600 -22973 -27398 -39400 -40112
$$ packed form
1720b1394j3779K144J3500j9387J7621j4012L17L693r123m11J6257P53j802k9055
1706e4678R494K0951K0513J0031j9117J5138l2205l7490m19K0767j1269K6846
1694c1438l317K6000j229l2892J1957L2007R674m2074J5308R480l238n572p170
1681b2504j105P022j438K1533m949p729k1746j1772K1198o268r9n370J0820K390
1667b0017O620N486o068l6541O410j1323J2197L802J0703J092l452K2555K472
1654f064m442J2337J9778k4195M942j1488r938J2242n133N663k2315K9894L870
1641E151J1321l5453j2924J1683Q364p715J64R289k4306J6305R839k049p397J691
1627a6037j3326J8941r284K947N892R869n816n85K563o764j1373m425j2002p12
$$ plain form
1613 -40112 -45653 -46056 -31932 -20963 -33750 -22569 -28283 -33860 -30290 -33215 -14367 -4911 2909 -362
1599 -362 -10949 -9767 -14232 -1387 -15728 -23404 -37823 -25962 -23045 -20446 -4229 -14162 -1004
1586 -1004 -4029 2354 -3909 -615 -17846 -41705 -37842 -23325 -21109 -3859 -9497 -2635 -1487 -8640
1572 -8640 -13166 -30983 -20360 -27204 -16427 -20322 -21656 -20630 -51315 -23919 -28823 -37115 -13701
1559 -13701 -32256 -35319 -25779 -20708 -24926 -25867 -33437 -32129 -45244 -15790 -7425 -14716 -23075 -32622
1545 -32622 -20229 -17699 -15372 -11529 -17377 -30051 -43759 -15143 -3938 -22580 -5563 -5381 -8073
1532 -8073 -19667 -26397 -8415 -21156 7498 8250 -20394 -36148 -32715 13408 -9056 -36010 -25892
1519 -25892 -11030 -27845 -4766 12380 -27000 -21359 -27816 -43289 -12283 -26389 -23853 -35975
$$ packed form
1613d0112n541m03J4124J0969j2787J1181n714n577L570k925J8848R456P820l271
1599c62j0587J182m465J2845j4341p676j4419J1861K917K599J6217r933J3158
1586a004l025O383o263L294j7231k3859L863J4517K216J7250n638O862J148p153
1572h640m526j7817J0623o844J0777l895j334J026l0685K7396m904q292K3414
1559a3701j8555l063R540N071m218r41p570J308j3115K9454Q365p291q359r547
1545c2622J2393K530K327L843n848j2674j3708K8616J1205j8642J7017J82k692
1532h073j1594o730J7982j2741K8654P52k8644j5754L433M6123k2464k6954J0118
1519b5892J4862j6815K3079J7146l9380N641o457j5473L1006j4106K536j2122
$$ plain form
1507 -35975 -44468 -23186 -18643 -18394 -22186 -5895 4081 -30059 -22350 -1851 -5933 -15115 -52442 -37647
1493 -37647 -7795 -23708 -24931 -12534 -1301 3259 -1407 -22846 2830 8294 -16948 -33958 -34220
1480 -34220 -14550 -18934 -15268 -15151 -19357 -11402 8929 3881 8627 -11124 -14924 10717 8075 22974
1466 22974 -524 -15143 -2977 -1580 -21710 -32924 -45712 -53452 -21970 1888 -2639 -32269
1454 -32269 -7109 5077 -12786 -13470 -44015 -48727 -16394 -11157 -19698 -11201 -21309 -29916 -51181
1441 -51181 -45431 -47312 -45764 -29264 -31104 -19709 -20923 1132 -12582 -36246 -20790 -27863 -46394
1428 -46394 -20209 -27654 -59191 -38501 -17599 -3325 -40294 -29704 -2439 -32835 -11024 136
1416 136 14327 13907 9469 -3423 -14870 -18238 -6500 17957 11430 8848 -13095 2353 37308
$$ packed form
1507c5975q493K1282M543K49l792J6291R976l4140P709K0499m082r182l7327J4795
1493c7647K9852j5913j223J2397J1233M560m666k1439K5676N464k5242j7010k62
1480c4220J9670m384L666J17m206P955K0331n048M746j9751l800K5641k642J4899
1466B2974k3498j4619J2166J397k0130j1214j2788p740L1482K3858m527k9630
1454c2269K5160J2186j7863o84l0545m712L2333N237q541Q497j0108q607k1265
1441e1181N750j881J548J6500j840J1395j214K2055j3714k3664J5456p073j8531
1428d6394K6185p445l1537K0690K0902J4274l6969J0590K7265l0396K1811J1160
1416A36J4191m20m438j2892j1447l368J1738K4457o527k582k1943J5448L4955
$$ plain form
1403 37308 33088 25176 -3239 -4969 -9972 18908 30937 13391 29648 20270 4224 7073 10794
1390 10794 17265 -12104 -21227 13896 1388 -20900 -26865 -18938 -32368 -19384 -12561 -2900 3080
1377 3080 -3056 -13770 -7617 -13291 -17228 -29603 -26779 -15697 -16431 -16153 -29582 -33390 -40931 -15826
1363 -15826 -5067 -10644 -16615 -14311 -21338 -13146 -20781 -13138 -12921 -18446 -19644 -3556 10514 -1644
1349 -1644 -8031 -3551 -9265 -24349 -19820 -25964 -5862 204 7361 11708 10291 11566 6796 13764
1335 13764 -679 -17431 -8065 12028 -10966 -4550 -7789 -3078 -10215 -15419 -14982 -25814 -37376
1322 -37376 -19554 -10357 -8408 6572 -16490 -9158 13345 -10388 -45764 -656 31600 31140 30
1309 30 7752 3717 -7716 -14686 -6323 -7936 17798 -12520 -19358 21654 9529 9550 3535 6200 6039
$$ packed form
1403C7308m220p912k8415j730n003K8880J2029j7546J6257r378j6046K849L721
1390A0794O471k9369r123L5123j2508k2288n965P927j3430J2984O823R661N980
1377C080o136j0714O153n674l937j2375K824J1082p34K78j3429l808p541K5105
1363a5826J0759n577n971K304p027Q192p635P643K17n525j198J6088J4070j2158
1349a644o387M480n714j5084M529o144K0102O066P157M347j417J275m770O968
1335A3764j4443j6752R366K0093k2994O416l239M711p137n204M37j0832j1562
1322c7376J7822R197J949J4980k3062P332K2503k3733l5376M5108L2256m60l1110
1309C0P722m035j1433o970Q363j613K5734l0318o838M1012j2125K1o015K665j61
$$ plain form
1294 6039 -19013 -25959 6908 -5395 -11325 -14508 -17857 -19967 -21593 12478 8328 -16127 -30623
1281 -30623 -27702 -21941 -10665 -5346 -7541 844 4405 -941 3029 -14281 -19209 -4415 -5929 -16433
1267 -16433 -30583 -8334 15561 11971 -6273 17545 10123 -979 -16373 -15838 -715 1974 -11728
1254 -11728 -20014 -7200 6982 -20057 -2397 15213 10403 7388 -18463 -12648 -14716 -4188 2679
1241 2679 -9564 17979 23208 -10302 -23446 -26933 -11785 8702 -1861 -7707 2575 11271 -7836
1228 -7836 -35715 -22042 -15619 -12175 -9922 -13324 -3236 -8501 -15462 -3177 10014 2857 28047
1215 28047 12665 16176 19357 20859 -4654 -6418 10381 11428 -5427 -18183 -3569 -290 -6941
1202 -6941 -28131 -1463 -5645 2289 -10726 -8969 -10059 -215 -7981 6515 -1394 -6632 -12339 -10983
$$ packed form
1294F039k5052o946L2867j2303n930l183l349k110j626L4071m150k4455j4496
1281c0623K921N761J1276N319k195Q385L561n346L970j7310m928J4794j514j0504
1267a6433j4150K2249K3895l590j8244K3818p422j1102j5394N35J5123K689j3702
1254a1728q286J2814J4182k7039J7660J7610m810l015k5851N815k068J0528O867
1241B679j2243K7543N229l3510j3144l487J5148K0487j0563n846J0282Q696j9107
1228g836k7879J3673O423L444K253l402J0088n265o961J2285J3191p157K5190
1215B8047j5382L511L181J502k5513j764J6799J047j6855j2756J4614L279o651
1202f941k1190K6668m182P934j3015J757j090R844p766J4496p909n238n707J356
$$ plain form
1188 -10983 -9589 -33325 -23077 -9472 -16757 -7937 4297 9705 13033 22774 50685 24211 -5795
1175 -5795 5544 -2377 4350 15036 2315 10262 14613 4822 -13777 -27737 -13366 10845 8842
1162 8842 -4994 8235 24054 15396 8168 3071 -3282 -25177 -9443 3105 -16158 -8073 -9808
1149 -9808 15492 31484 31850 36249 20490 5126 7141 20017 28078 -15725 -8381 24170 35899
1136 35899 32307 14266 2280 -1942 4102 15955 -11745 -10971 10066 -19090 -19662 7909 -7971
1123 -7971 -27604 13014 3958 -4644 -13106 -11634 -28249 -14424 17034 10272 -1949 -32416 -41178
1110 -41178 -18950 21628 8150 -31937 -15923 -14203 -17683 7380 -1119 -3458 4723 20676 32106
1097 32106 8000 9787 -1513 9654 4088 1997 7374 -16348 -21794 -12288 1130 166 16350
$$ packed form
1188a0983J394k3736J0248J3605p285Q820J2234N408L328R741K7911k6474l0006
1175e795J1339p921O727J0686j2721P947M351r791j8599j3960J4371K4211k003
1162H842j3836J3229J5819q658p228n097o353k1895J5734J2548j9263Q085j735
1149i808K5300J5992L66M399j5759j5364K015J2876Q061m3803P344L2551J1729
1136C5899l592j8041j1986m222O044J1853k7700P74K1037k9156n72K7571j5880
1123g971j9633M0618r056q602q462J472j6615J3825L1458o762j2221l0467q762
1110d1178K2228M0578j3478m0087J6014J720l480K5063q499k339Q181J5953J1430
1097C2106k4106J787j1300J1167n566k091N377k3722n446R506J3418r64J6184
$$ plain form
1084 16350 6034 5441 260 -8863 9451 -9735 -9101 18645 20800 739 -6043 -4326 38614 28569
1070 28569 -13148 -21884 11131 365 -2377 -8058 -6286 -14474 -10791 -3536 -9791 -1130 -10264 -15848
1056 -15848 -3683 -14675 -34529 -15204 -24145 -13683 -13265 -10519 10704 13082 25099 16249 4642
1043 4642 -3781 -1804 -4622 -6632 15104 12698 -1035 -747 10115 -11966 -1112 -3899 -6748 -1456
1029 -1456 -22906 -24627 22678 3497 -18954 -35695 -9715 -4266 -6330 3261 10522 25042 29072
1016 29072 42108 9945 -15469 -9124 5478 -6931 2458 -11151 -1870 8803 11116 -5110 -17982
1003 -17982 -17739 -17169 -7213 -3857 16414 7614 959 -3649 -6783 -19725 1105 42005 32382 16026
989 16026 1282 -4962 -25853 -9286 -6262 6723 2201 -6815 1288 9179 3384 -10560 2040
$$ packed form
1084A6350j0316n93n181r123J8314j9186O34K7746K155k0061o782J717M2940j0045
1070B8569m1717q736L3015j0766k742n681J772q188L683P255o255Q661r134n584
1056a5848J2165j0992j9854J9325q941J0462M18K746K1223K378J2017q850j1607
1043D642q423J977k818k010K1736k406j3733K88J0862k2081J0854k787k849N292
1029a456k1450j721M7305j9181k2451j6741K5980N449k064R591P261J4520M030
1016B9072J3036l2163k5414O345J4602j2409R389j3609R281J0673K313j6226j2872
1003a7982K43N70R956L356K0271q800o655m608l134j2942K0830M0900r623j6356
989A6026j4744o244k0891J6567L024J2985m522r016Q103P891n795j3944J2600
$$ plain form
976 2040 8666 -4327 16712 40155 21569 15042 17428 5873 10623 15267 13408 9698 -5401 6697
962 6697 -11129 4490 5304 -4027 -7621 -23096 -16687 23924 7699 19575 32897 2799 6974
949 6974 42209 36411 18356 5222 -17204 -21237 -20303 -27900 -18129 9940 44301 20382 12976 -464
935 -464 -2391 19786 -16733 -27806 3679 -3083 9113 7822 -10796 -15006 -8631 3951 17192
922 17192 29310 10926 1606 -5596 -13086 -12357 -21522 -9798 -16293 -19789 -6485 -1001 -190 -5710
908 -5710 15152 17885 13527 -3194 -17931 -28766 -14429 -14685 -18361 -17169 3742 2797 -28045 -15697
894 -15697 -18834 -39674 -23680 -12098 -11147 8952 19214 -899 -10180 18596 61982 74716 53098
881 53098 19664 -3446 16494 8055 27723 14233 -13789 1649 -20384 14953 -194 36941
$$ packed form
976B040O626j2993K1039K3443j8586o527K386j1555M750M644j859l710j5099J2098
962F697j7826J5619Q14r331l594j5475O409M0611j6225J1876J3322l0098M175
949F974L5235n798j8055j3134k2426m033R34p597R771K8069L4361k3919p406j3440
935d64j927K2177l6519j1073L1485o762J2196j291j8618m210O375J2582J3241
922A7192J2118j8384r320p202p490P29r165J1724o495l496J3304N484Q11n520
908e710K0862K733m358j6721j4737j0835J4337k56l676J192K0911r45l0842J2348
894a5697l137k0840J5994J1582R51K0099J0262k0113r281K8776M3386J2734k1618
881E3098l3434k3110J9940q439J9668j3490k8022J5438k2033L5337j5147L7135
$$ plain form
869 36941 26326 25699 29088 6092 8365 33649 26189 8982 20905 47897 40131 43377 25535
856 25535 5815 -4655 -4863 14324 17078 18977 9504 -13860 -2798 14926 24396 1477 -8711
843 -8711 2516 4985 21307 7397 13012 3966 -7862 13573 -3167 448 20880 7497 10092
830 10092 13364 11618 -21638 -10764 -22360 -4836 4193 6348 28463 -4827 -12418 8758 -9582
817 -9582 -13327 -8429 18161 -12035 -13589 7932 -1425 1649 -10095 -23616 -11552 -14866 -16146 -13848
803 -13848 -10285 -923 -8066 -8549 -10652 -15273 2462 -1547 133 5298 17167 14397 8172 16187 13714
788 13714 21427 25428 12959 -8959 29464 23189 24837 16410 -18788 -6942 10523 17518 15132
775 15132 -872 -1052 18491 34504 8468 8954 21533 -12759 3771 2956 4411 -19667 -11227 -19376
$$ packed form
869C6941j0615o27L389k2996K273K5284p460j7207J1923K6992p766L246j7842
856B5535j9720j0470k08J9187K754J899r473k3364J1062J7724R470k2919j0188
843h711J1227K469J6322j3910N615r046j1828K1435j6740L615K0432j3383K595
830A0092L272j746l3256J0874j1596J7524R029K155K2115l3290p591K1176j8340
817i582l745M898K6590l0196j554K1521r357L074j1744j3521J2064l314j280K298
803a3848L563R362p143m83k103m621J7735m009J680N165J1869k770o225Q015k473
788A3714P713M001j2469k1918L8423o275J648q427l5198J1846J7465O995k386
775A5132j6004j80J9543J6013k6036M86J2579l4292J6530q15J455k4078Q440q149
$$ plain form
761 -19376 -25635 2430 15678 4852 -20096 -6526 -3488 19477 14012 17484 16599 9544 14696 11834
747 11834 23206 19570 22053 18431 33796 41412 24232 12780 -6387 -21927 -19105 -31998 -24920
734 -24920 -19283 3254 -1819 -14236 8321 22684 14761 11442 3730 13628 17137 -269 -25813
721 -25813 -23345 -6107 -2782 10591 7964 8272 29585 36350 13123 1976 9961 34457 34024 12264
707 12264 7889 21228 23941 16046 21591 -5512 -101 8655 12130 17678 17755 22089 6894 4851 21574
692 21574 27443 20505 17798 2747 25852 11062 -4015 3891 -2909 -7570 -11715 -18949 -159 -12199
678 -12199 -15770 -360 -7554 -7291 -11249 -6348 12205 7996 29821 1365 -12347 -17825 -13974 -5560
664 -5560 21911 23733 12388 15428 -13294 -17154 6835 6876 12896 4161 11313 7245 -7233 -4365
$$ packed form
761a9376o259K8065J3248j0826k4948J3570L038K2965n465L472q85p055N152k862
747A1834J1372l636K483l622J5365P616j7180j1452j9167j5540K822j2893P078
734b4920N637K2537n073j2417K2557J4363p923l319p712R898L509j7406k5544
721b5813K468J7238L325J3373k627L08K1313O765k3227j1147P985K4496m33k1760
707A2264m375J3339K713p895N545k7103N411Q756L475N548P7M334j5195k043J6723
692B1574N869o938k707j5051K3105j4790j5077P906o800m661m145p234J8790j2040
678a2199l571J5410p194K63l958M901J8553m209K1825k8456j3712n478L851Q414
664e560K7471J822j1345L040k8722l860K3989M1O020q735P152m068j4478K868
$$ plain form
650 -4365 5556 -5146 7643 8311 1735 21249 33656 6523 772 30768 27122 18839 25839 30090
636 30090 39266 10279 2271 9622 -16322 2452 17765 20331 26848 8593 -7229 14805 29499
623 29499 36308 12627 14306 14562 2189 7353 -6225 -2792 5599 -9949 26373 38373 30810 20303
609 20303 23157 22426 5339 3448 24731 40415 47978 9608 13684 12549 7394 12141 7105 25315
595 25315 31881 35869 49018 14631 -8570 -2064 -3226 7895 3989 31115 37784 23602 17671
582 17671 8752 14552 24949 37460 32339 19582 10313 16290 26173 19562 -9363 9888 -312
569 -312 18292 48344 35114 26419 23797 16587 13682 20003 -2424 -25969 -4071 -8820 -4404 26407
555 26407 -9558 -10674 -2243 -4059 25649 34281 49332 15314 11258 33617 17751 32799 39252
$$ packed form
650d365R921j0702J2789O68o576J9514J2407k7133n751K9996l646q283P000M251
636C0090R176k8987q008P351k5944J8774J5313K566O517j8255j5822K2034J4694
623B9499O809k3681J679K56j2373N164j3578L433Q391j5548L6322J2000p563j0507
609B0303K854p31j7087j891K1283J5684P563l8370M076j135n155M747n036J8210
595B5315O566L988J3149l4387k3201O506j162J1121l906K7126O669j4182n931
582A7671q919N800J0397J2511n121j2757r269N977R883o611k8925J9251j0200
569c12J8604L0052j3230q695k622p210k905O321k2427k3545K1898m749M416L0811
555B6407l5965j116Q431j816K9708Q632J5051l4018m056K2359j5866J5048O453
$$ plain form
542 39252 44431 29883 -334 940 -4703 -16458 -23069 -17994 5499 14584 3486 20580 14181
529 14181 3675 -9093 5459 16928 404 8125 -1201 35692 30360 8178 5615 -4322 -6194
516 -6194 12277 5690 8171 17908 6105 553 21538 17415 28155 -2716 -6103 7709 25690
503 25690 30491 11784 22542 29830 19643 23471 10767 28799 26379 8511 -11136 -8367 1086
490 1086 -906 42989 28284 34082 26310 30306 23355 -2779 -10833 7314 10067 12531 8884 21930
476 21930 22508 11298 46766 56424 24991 -12370 6016 8846 21504 24231 -6561 -22732 6517
463 6517 3070 3174 2219 23391 11916 15875 7335 -27728 -5101 6253 21724 12115 25343 20057
449 20057 6473 9371 3486 8121 20743 -1823 -2949 26403 47505 25420 30204 7283 2778
$$ packed form
542C9252N179j4548l0217J274n643j1755o611N075K3493R085j1098J7094o399
529A4181j0506j2768J4552J1469j6524P721r326L6893n332k2182k563r937j872
516f194J8471o587K481R737j1803n552K0985m123J0740l0871l387J3812J7981
503B5690M801j8707J0758P288j0187L828j2704J8032k420j7868j9647K769R453
490A086j992M3895j4705N798p772L996o951k6134q054J8147K753K464l647J3046
476B1930N78j1210L5468R658l1433l7361J8386K830J2658K727l0792j6171K9249
463F517l447J04r55K1172j1475L959q540l5063K2627J1354J5471r609J3228n286
449B0057j3584K898n885M635J2622k2566j126K9352K1102k2085M784k2921m505
$$ plain form
436 2778 102 -22891 -7824 30038 36501 12065 -8774 13841 37850 19653 27466 23828 19619
423 19619 26707 35186 40167 36067 39148 49222 46808 30277 1760 16483 13518 -13058 16351
410 16351 37046 40657 26202 7764 22683 26901 16522 2641 14655 27829 1696 -1385 8285
397 8285 30222 27814 24572 7068 17215 11202 5725 19539 26630 43132 35318 16360 12320 40617
383 40617 39292 48349 25990 1868 2682 15053 2377 14699 19396 28165 21197 2565 469 9053
369 9053 13420 22709 26321 16834 23319 -6767 -1106 3517 11975 1513 7298 45189 31277 -7240
355 -7240 1353 18959 26788 34111 18472 26259 28485 24945 25165 18183 -841 -6778 13204 6129
$$ packed form
436B778k676k2993J5067L7862O463k4436k0839K2615K4009j8197P813l638m209
423A9619P088Q479M981m100L081J0074k414j6531k8517J4723k965k6576K9409
410A6351K0695L611j4455j8438J4919M218j0379j3881J2014J3174k6133l081R670
397H285K1937k408l242j7504J0147o013n477J3814P091J6502p814j8958m040K8297
383D0617j325R057k2359k4122Q14J2371j2676J2322M697Q769o968j8632k096Q584
369I053M367R289L612r487O485l0086N661M623Q458j0462N785L7891j3912l8517
355g240Q593J7606P829P323j5639P787K226l540K20o982j9024n937J9982p075
$$ [...]
##END NTUPLES=NMR SPECTRUM
##END=
