##TITLE=1H_CA-8946-2
 CDCl3
 40 sc, 
 8.11.2021
##JCAMPDX= 6.0         $$ Bruker NMR JCAMP-DX V2.0
##DATA TYPE= NMR SPECTRUM
##DATA CLASS= NTUPLES
##ORIGIN= UXNMR, Bruker Analytische Messtechnik GmbH
##OWNER= root
$$ XWIN-NMR		Version 3.5
$$ Mon Nov  8 11:15:55 2021 Russian Standard Time (UT+4h)  she@DPX200
##.OBSERVE FREQUENCY= 200.1313468511
##.OBSERVE NUCLEUS= ^1H
##.ACQUISITION MODE= SIMULTANEOUS
##.ACQUISITION SCHEME= undefined
##.AVERAGES= 40
##.DIGITISER RES= 18
##SPECTROMETER/DATA SYSTEM= spect
##.PULSE SEQUENCE= zg30
##.SOLVENT NAME= D2O
##.SHIFT REFERENCE= (INTERNAL, D2O, 0, 15.7238)
##AUDIT TRAIL= $$ (NUMBER, WHEN, WHO, WHERE, WHAT)
$$ ##TITLE= Audit trail, XWIN-NMR		Version 3.5
$$ ##JCAMPDX= 5.01
$$ ##ORIGIN= Bruker BioSpin GmbH
$$ ##OWNER= she
$$ F:/spectra/data/she/nmr/H-F/1/pdata/1/auditp.txt
$$ ##AUDIT TRAIL=  $$ (NUMBER, WHEN, WHO, WHERE, WHAT)
(   1,<2021-11-08 11:14:52.29 +0400>,<she>,<DPX200>,
      <continue with go, POWCHK disabled, PULCHK disabled
       configuration hash MD5:
       00 E9 B6 7A A2 85 ED C7 34 08 36 98 17 FE 4E 26
       data hash MD5: 16K
       5A 7F AC D3 60 CE 99 F4 E1 09 E4 65 D7 E4 EB 3C>)
(   2,<2021-11-08 11:14:55.09 +0400>,<she>,<DPX200>,
      <Start of raw data processing
       efp BC_mod = 2 LB = 0.24 FT_mod = 6 PKNL = 1 PHC0 = -15149.6 PHC1 = 8.600821 SI = 16K 
       data hash MD5: 16K
       D8 10 60 FD B0 4D 01 5D BE A4 C5 F2 D9 27 A0 2C>)
(   3,<2021-11-08 11:14:58.95 +0400>,<she>,<DPX200>,
      <abs ABSG = 5 
       data hash MD5: 16K
       44 3A E5 24 46 08 7F 5A A9 55 A8 BF 7B B4 86 A0>)
(   4,<2021-11-08 11:15:12.75 +0400>,<she>,<DPX200>,
      <pk PHC0 = 3.341137 PHC1 = -3.8 
       data hash MD5: 16K
       E9 BE 2C 6E FE 19 3E AB BA 0F 47 D8 54 AE 9A 72>)
(   5,<2021-11-08 11:15:16.06 +0400>,<she>,<DPX200>,
      <abs ABSG = 5 
       data hash MD5: 16K
       04 BB E9 17 35 7E FB 41 AA 21 85 BC 25 EC 9E A5>)
$$ ##END=
$$ 
$$ hash MD5
$$ C9 AE 24 74 A5 3D C6 BD C9 F5 32 23 D0 5B F2 45
##$RELAX= 
##$RELAX= 
##$RELAX= 
##$RELAX= 
##$RELAX= 
##$RELAX= 
$$ Bruker specific parameters
$$ --------------------------
##$DU= <F:/spectra>
##$EXPNO= 1
##$NAME= <H-F>
##$PROCNO= 1
##$TYPE= <nmr>
##$USER= <she>
##$AMP= (0..31)
100 100 100 100 100 100 100 100 100 100 100 100 100 100 100 100 100 100 
100 100 100 100 100 100 100 100 100 100 100 100 100 100 
##$AQSEQ= 0
##$AQ_mod= 1
##$AUNM= <au_zg>
##$AUTOPOS= <>
##$BF1= 200.13
##$BF2= 200.13
##$BF3= 200.13
##$BF4= 200.13
##$BF5= 200.13
##$BF6= 200.13
##$BF7= 200.13
##$BF8= 200.13
##$BYTORDA= 1
##$CFDGTYP= 0
##$CFRGTYP= 5
##$CHEMSTR= <none>
##$CNST= (0..31)
1 1 145 1 1 1 1 1 1 1 1 1 1 1 1 1 1 1 1 1 1 1 1 1 1 1 1 1 1 1 1 1 
##$CPDPRG= <>
##$CPDPRG1= <>
##$CPDPRG2= <>
##$CPDPRG3= <>
##$CPDPRG4= <mlev>
##$CPDPRG5= <mlev>
##$CPDPRG6= <mlev>
##$CPDPRG7= <mlev>
##$CPDPRG8= <mlev>
##$CPDPRGB= <>
##$CPDPRGT= <>
##$D= (0..31)
0 1.2 0 0 0 0 0 0 0 0.06 0 0.03 0 0 0 0 0.0002 0 0 0 0 0 0 0 0 0 0 0 0 
0 0 0 
##$DATE= 1636355516
##$DBL= (0..7)
$$ [...]
##$SUBNAM2= <"">
##$SUBNAM3= <"">
##$SUBNAM4= <"">
##$SUBNAM5= <"">
##$SUBNAM6= <"">
##$SUBNAM7= <"">
##$SUBNAM8= <"">
##$SUBNAM9= <"">
##$SW= 18.0517286264689
##$SWIBOX= (0..15)
0 0 2 0 0 0 0 0 0 0 0 0 0 0 0 0 
##$SW_h= 3612.71676300578
##$TD= 16384
##$TD0= 1
##$TE= 0
##$TE2= 300
##$TE3= 300
##$TEG= 300
##$TL= (0..7)
0 120 120 120 120 120 120 120 
##$TP= (0..7)
150 150 150 150 150 150 150 150 
##$TP07= 0
##$TPNAME0= <>
##$TPNAME1= <>
##$TPNAME2= <>
##$TPNAME3= <>
##$TPNAME4= <>
##$TPNAME5= <>
##$TPNAME6= <>
##$TPNAME7= <>
##$TPOAL= (0..7)
0.5 0.5 0.5 0.5 0.5 0.5 0.5 0.5 
##$TPOFFS= (0..7)
0 0 0 0 0 0 0 0 
##$TUNHIN= 0
##$TUNHOUT= 0
##$TUNXOUT= 0
##$USERA1= <user>
##$USERA2= <user>
##$USERA3= <user>
##$USERA4= <user>
##$USERA5= <user>
##$V9= 5
##$VALIST= <valist>
##$VCLIST= <CCCCCCCCCCCCCCC>
##$VD= 0
##$VDLIST= <DDDDDDDDDDDDDDD>
##$VPLIST= <PPPPPPPPPPPPPPP>
##$VTLIST= <TTTTTTTTTTTTTTT>
##$WBST= 1024
##$WBSW= 4
##$XGAIN= (0..3)
0 0 0 0 
##$XL= 0
##$YL= 0
##$YMAX_a= 151558
##$YMIN_a= -185399
##$ZGOPTNS= <>
##$ZL1= 120
##$ZL2= 120
##$ZL3= 120
##$ZL4= 120
##$ABSF1= 15.72375
##$ABSF2= -2.328099
##$ABSG= 5
##$ABSL= 3
##$ALPHA= 0
##$AQORDER= 0
##$ASSFAC= 0
##$ASSFACI= 0
##$ASSFACX= 0
##$ASSWID= 0
##$AUNMP= <proc_1d>
##$AZFE= 0.1
##$AZFW= 0.1
##$BCFW= 0
##$BC_mod= 2
##$BYTORDP= 0
##$COROFFS= 0
##$CY= -3
##$DATMOD= 1
##$DC= 0
##$DFILT= <>
##$DTYPP= 0
##$F1P= 0
##$F2P= 0
##$FCOR= 1
##$FTSIZE= 16384
##$FT_mod= 6
##$GAMMA= 0
##$GB= 0
##$INTBC= 1
##$INTSCL= 0
##$ISEN= 128
##$LB= 0.24
##$LEV0= 0
##$LPBIN= 0
##$MAXI= 10000
##$MC2= 0
##$MEAN= 0
##$ME_mod= 0
##$MI= 1.114404
##$NCOEF= 0
##$NC_proc= -6
##$NLEV= 6
##$NOISF1= 3.799351
##$NOISF2= 2.8
##$NSP= 0
##$NTH_PI= 0
##$NZP= 0
##$OFFSET= 15.72375
##$PC= 1
##$PHC0= -15146.26
##$PHC1= 4.80082
##$PH_mod= 1
##$PKNL= yes
##$PPARMOD= 0
##$PSCAL= 0
##$PSIGN= 0
##$REVERSE= no
##$SF= 200.130006414888
##$SI= 16384
##$SIGF1= 3
##$SIGF2= 2
##$SINO= 5.538805
##$SIOLD= 16384
##$SREGLST= <1H.CDCl3>
##$SSB= 0
##$STSI= 16384
##$STSR= 0
##$SW_p= 3612.71676300578
##$SYMM= 0
##$S_DEV= 0
##$TDeff= 16384
##$TDoff= 0
##$TI= <>
##$TILT= no
##$TM1= 0
##$TM2= 0
##$TOPLEV= 0
##$USERP1= <user>
##$USERP2= <user>
##$USERP3= <user>
##$USERP4= <user>
##$USERP5= <user>
##$WDW= 1
##$XDIM= 16384
##$YMAX_p= 342009318
##$YMIN_p= -797516
$$ End of Bruker specific parameters
$$ ---------------------------------
##NTUPLES= NMR SPECTRUM
##VAR_NAME=  FREQUENCY,     SPECTRUM/REAL,   SPECTRUM/IMAG
##SYMBOL=    X,             R,               I
##VAR_TYPE=  INDEPENDENT,   DEPENDENT,       DEPENDENT
##VAR_FORM=  AFFN,          ASDF,            ASDF
##VAR_DIM=   16384,         16384,           16384
##UNITS=     HZ,            ARBITRARY UNITS, ARBITRARY UNITS
##FACTOR=    0.220516191357247, 1,           1
##FIRST=     3146.79421126916, 0,            0
##LAST=      -465.922551736624, 0,           0
##MIN=       -465.922551736624, -797516,     0
##MAX=       3146.79421126916, 342009318,    0
$$ Real data points
##PAGE= N=1
##DATA TABLE= (X++(R..R)), XYDATA
$$ [...]
14172 129741 31704 -151165 -108973 50695 -27582 52293 13428 83190 37144 110036 -120260
14161 -120260 -118011 -155311 -155730 -56017 -193452 -33446 -140125 22904 -179849 -87032 48586
14150 48586 54220 19732 145228 163103 230607 8440 89651 25808 -103769 -56923 -78517
14139 -78517 -123256 -41614 -142452 -14031 97130 120977 82307 54806 15908 -107346 98657
14128 98657 91705 -176935 -27990 -142930 -236060 -46023 176093 2685 57210 -2543 -206727
14117 -206727 49733 87287 -3867 93682 152595 143147 7021 137550 169932 219808 106141
14106 106141 17211 126168 29922 61017 -8837 -197511 -319724 -164111 -148886 -40102
14096 -40102 -179381 -77658 -18582 37815 -25384 36541 145343 203839 97027 -174199 -56828
14085 -56828 -33128 10459 150559 105529 85940 218417 192840 293299 242612 214024 30479
14074 30479 34244 -30931 58985 280124 144929 101282 136504 173894 163543 249360 203419
14063 203419 -104454 61890 46143 308361 291821 122932 -10617 42351 -25197 -56091
14053 -56091 -113201 -184329 -149005 23089 44422 66659 -134498 -65255 171925 -20789 -10673
14042 -10673 -89642 54905 110298 -193745 -117096 213144 120852 358376 250824 109394
14032 109394 -97416 -4739 34813 212337 273132 75205 84003 108836 1484 -149866 55312
14021 55312 203988 -45576 134469 337743 23166 -134221 -26097 -175804 -141352 -55803
14011 -55803 95779 165630 64356 94735 -83883 45601 139335 -6466 147523 186741
14001 186741 88276 118273 25494 13901 234972 161390 82197 -56402 56572 -37234 107990
13990 107990 240411 158819 -50276 7883 131513 120253 72678 -15456 53229 -121216 -188100
13979 -188100 39576 38077 85412 62273 97201 34341 -25099 75136 89613 150814 248091
13968 248091 252818 226637 213061 250250 349253 401599 354343 127103 99254 156778 193627
13957 193627 204198 191691 231292 141692 26515 94250 250863 181868 61073 27777 -116396
13946 -116396 177571 63071 44145 -95 -168006 -138677 -12723 -7384 78370 -52995 47217
13935 47217 173541 247781 263837 32181 43201 51765 126828 187499 153846 101340 86536
13924 86536 301183 272372 199916 229434 99205 52473 97077 48258 31778 -21979 130706
13913 130706 458749 396675 291986 254807 217944 33970 -110382 101910 11725 -109142
13903 -109142 -251563 -191984 -67704 -148666 69430 38638 -106634 -77240 -8273 -41369 118401
13892 118401 162676 56319 42529 107664 49520 -42483 112169 -92215 -127986 -28811 199896
13881 199896 224164 -135974 -222612 -281020 -257635 -130674 -14284 -96201 42237 195983
13871 195983 309703 105769 93115 -48285 130708 368669 403996 173758 -109504 -70757
13861 -70757 -48860 172053 -102870 -148442 -75529 199262 231931 222561 190268 162441 353745
13850 353745 74744 100952 -70263 10979 -80513 -52602 3318 -33417 -79384 -128329 160220
13839 160220 127367 -42004 -65682 -54933 42846 206997 273986 33632 97491 317503 246410
13828 246410 201413 -39014 -137449 72793 178333 298372 182679 -161306 -71275 -30377
13818 -30377 150563 10761 108299 236245 276349 13201 114290 128880 -4422 129814
13808 129814 -49393 -173047 -52106 837 -63426 -28031 -70189 -39982 103518 28751 16065
13797 16065 -58369 -60374 -103073 118878 217877 195557 -79863 -68160 -168708 -148489 -151159
13786 -151159 -308161 -48554 -84208 92495 117511 29550 165828 196317 145378 202795 324995
13775 324995 297071 46486 -227292 -239142 -128097 71306 36331 -33243 -95219 -154561 161505
13764 161505 91374 71154 14771 -47602 -52307 368033 232614 181376 102459 178058 210593
13753 210593 4187 27736 7649 206157 329 -175623 -22702 23840 88153 92974 99790
13742 99790 221078 136038 -43810 109668 158159 -123360 -102712 -92728 21052 10750 172384
13731 172384 170375 54932 67134 137779 373197 387053 209950 79073 -236888 -227963 172564
13720 172564 71348 174487 31638 145886 223340 274116 384301 116454 -119851 -67095
13710 -67095 64814 29036 9792 -27885 -182295 -68227 170621 -8312 47388 301430
13700 301430 106993 66149 195335 44366 -63650 40822 299302 425304 131939 -45808
13690 -45808 -106911 185993 288025 61648 110478 297667 164541 51836 -99900 91024
13680 91024 19796 -86728 -70919 -130116 -214448 -37273 35044 -49286 23960 81670 17243
13669 17243 146394 217365 113543 211579 150646 90316 8832 -18353 37507 24063 100833
13658 100833 154520 63375 -49616 -179654 -128193 26244 -83157 -149237 20958 -316892
13648 -316892 -348103 -44617 123343 173342 42708 83724 166126 -191144 -258325 -52189
13638 -52189 20363 117804 227811 192019 56169 91875 -27629 -25712 -42870 -242323 68619
13627 68619 407436 437796 298574 171536 19273 36808 -85658 -120559 -338159 -53706
13617 -53706 10210 -104822 -48337 -66402 -5789 183661 -42205 -201600 -278032 -181736 -70010
13606 -70010 81269 -153616 -210201 -316017 -395742 -457790 -183185 -85079 -24839 110328 229852
13595 229852 145931 -23052 14374 24076 20128 -103739 -96417 126831 67947 111558 213006
13584 213006 174787 132617 7970 98214 192532 96682 15548 -51526 -208587 -259589 -33076
13573 -33076 179150 35172 179808 96302 243439 118986 324158 111586 70474 164682
13563 164682 370782 170661 48048 164847 216572 54309 -127660 -97172 -66539 -219560
13553 -219560 78691 335323 178713 258158 254449 183028 83374 132068 -20765 -185496 -148038
13542 -148038 -168051 -218686 80974 103130 90271 342701 374839 258024 118161 49970 -13527
13531 -13527 105908 234475 60043 56502 -134876 -172027 -26399 58120 116293 -13219 -256188
13520 -256188 22237 193259 195419 62697 20903 198024 -79540 -65985 79478 44268
13510 44268 288005 272253 399810 249348 200694 456830 267739 129562 -55953 -15222
13500 -15222 89309 -65212 -88871 -10084 47257 59075 -201862 -78664 15061 180396 101188
13489 101188 184261 197346 47759 7410 58406 -38593 205762 121259 147180 199450 264925
13478 264925 156489 97559 216430 142964 201344 98725 140887 167796 109435 154832 -73291
13467 -73291 -82554 120344 215840 281399 156769 86593 291666 95509 142130 157474 52546
13456 52546 -16744 -28108 87212 259046 144828 -47277 112260 57846 141074 12326
13446 12326 -116913 84107 206231 52240 -80835 77115 109765 93980 -2030 -34277
13436 -34277 24402 119694 -574 -47665 16376 -114261 -140533 40226 274328 195793 148537
13425 148537 -230710 -252515 -275264 -24959 -44621 195439 151462 8762 -20936 -151706
13415 -151706 -129216 58441 8865 -100140 -131352 42470 145011 162883 -4230 -151542
13405 -151542 36954 -52290 -18986 199171 193047 165391 121159 126438 222935 385695 294586
13394 294586 270993 334058 87516 150748 -6021 -65948 171921 -45604 -22864 123978
13384 123978 25065 -105571 103460 69751 -46405 -128276 -146009 -112319 -52435 -100872 72964
13373 72964 167937 210149 12663 -167881 -51294 173692 279490 269082 175983 161544 195568
13362 195568 238407 214540 97987 -25879 235892 470854 327052 186004 -113986 -117656
13352 -117656 115144 88669 -128190 -145549 54707 143868 52138 45359 127070 5290 104468
13341 104468 167400 139875 6107 -190325 -121081 -72099 -130967 -227629 -114861 -70112 36202
13330 36202 16672 -197027 -66114 47756 175562 237988 214618 207347 277545 339431 239086
13319 239086 294507 102163 93384 15834 -54399 -110275 -30093 -46566 -29390 10793 -63447
13308 -63447 -248133 80334 50063 45792 117775 215287 -976 -104582 -114127 122697 28722
13297 28722 80254 133549 62428 224719 228158 263293 236671 5147 62021 -130828 -140902
13286 -140902 -59689 10399 86353 155909 -99551 -81529 -48583 -77122 3145 -3033 -40772
13275 -40772 -3353 -105375 -9207 257657 249363 -165993 -54682 116955 10185 -13259 -83805
13264 -83805 296571 288686 75633 192065 296816 212846 178333 5762 101708 113383 212803
13253 212803 48879 130806 92849 211373 342753 325677 411737 235658 -86600 -121957
13243 -121957 -163972 -3439 46182 -115960 -259113 119677 91384 63767 34294 -96170
13233 -96170 -43107 -61554 -26486 71727 209381 3182 53937 294232 394010 456091 339236
13222 339236 441544 297178 115468 128110 47719 67520 20035 217048 239099 119834
13212 119834 15649 -13172 -203275 -103863 -3554 -293840 -177448 -175606 -132491 43761
13202 43761 95425 -110150 -143337 -146285 -151987 36443 241462 284146 41824 -24535 147640
13191 147640 -41437 -170614 -109277 -23170 -50391 51230 37317 -138171 -88699 131384
13181 131384 -59147 -278116 -130296 -166926 -164415 -160832 21872 73729 -56027 -53464 68051
13170 68051 22151 54493 -1770 3222 200514 22584 -67497 -2912 -2524 -167818 -45567
13159 -45567 -176825 -38056 6061 21108 175239 386054 337601 298481 304092 50488 -59048
13148 -59048 105881 175402 10282 13253 249474 246746 140319 -96270 -125490 90902 132304
13137 132304 95012 -15556 -75530 -152127 -111256 -138512 -27313 253168 220660 238295 149704
13126 149704 -15279 195225 224395 -51266 -48654 159261 298749 274490 157968 153460 -65601
13115 -65601 32341 201994 114364 -27581 99692 349021 283254 170280 -120736 -271782
13105 -271782 -157289 -54331 -171407 -100175 94306 110639 16188 -5504 164817 15380
13095 15380 -49946 -18995 100862 -39950 77680 150162 68981 187058 376101 179423
13085 179423 34776 -39835 406312 243474 146347 8671 83276 -120008 -18420 88184
13075 88184 18900 -93820 94176 150945 194327 332888 64994 -60592 133726 256937
13065 256937 108017 82808 -62033 -52545 -8461 55941 6355 -70098 -68097 161439 58552
13054 58552 121891 -154242 -247732 -25102 17715 63773 142761 121868 28294 267172 109562
13043 109562 -15574 51255 167085 109696 151456 310668 114692 202607 100343 193309
13033 193309 90533 -54495 -34341 -113572 -69997 3905 190313 187695 64429 192876 212220
13022 212220 243769 -73348 2559 152361 -4238 -50626 31701 274778 197916 68982
13012 68982 -185513 -63399 62850 92879 183269 176950 58474 122153 208487 240467 73622
13001 73622 24474 126740 9934 161550 353967 458223 200465 291595 231304 239320 81134
12990 81134 -95090 -23866 -41217 -24550 -51871 -25997 157018 -57407 -40423 -195056 -245584
12979 -245584 -16200 -35378 -58037 -33936 64627 97627 375368 376068 220045 -118307 -32852
12968 -32852 -16315 -176416 -26290 -35157 151889 -224308 -50894 119415 49906 105813 54726
12957 54726 59179 -13870 -60750 -72282 92182 218740 197125 249580 260823 230034 325176
12946 325176 254028 159656 -84736 -297393 10006 -41193 -98209 -84506 115139 185280 73180
12935 73180 84270 -166575 -3337 19255 63602 180059 215607 29972 -175234 -101050 159086
12924 159086 124282 35301 152347 275897 280363 229049 -1599 -331320 -116181 -158
12914 -158 81978 37974 -251549 -8037 7277 -154093 147942 98529 86125 -162282 -124282
12903 -124282 152969 44981 37368 28692 94090 13162 108771 142052 85227 2424 -103090
12892 -103090 -3686 191443 108579 189535 -74747 -195530 -309390 -346814 -105586 42081
12882 42081 -91254 -114596 -23146 24086 265127 98919 103454 87999 201187 -3176 48771
12871 48771 -25168 50437 85574 -26898 -32721 48154 177390 102034 -132855 -78971 -22600
12860 -22600 -148580 -13763 -29496 225206 155892 -8430 -80528 45821 -554 128750
12850 128750 4094 -166408 -222695 -91278 69635 146434 164230 -1302 80997 370785
12840 370785 116286 98846 188729 194876 45874 132906 -30757 -87001 -47511 1670 -20486
12829 -20486 23797 46251 -645 260790 184821 44844 289076 219680 59896 -57474 160409
12818 160409 391017 283017 334166 120339 33825 136347 145821 28288 -44448 -6060 206754
12807 206754 177540 46005 -121151 164057 -2197 -53089 96539 11113 -18449 166034
12797 166034 -94703 -183506 106751 51270 -158455 -319763 -257736 -112239 285508 286748
12787 286748 134820 -39441 82671 152347 204954 109475 -72979 94470 -112652 -151518
12777 -151518 -36689 -96647 -26704 -257767 -171268 -165144 -223625 -5925 -23644 -143617 106706
12766 106706 289708 111354 78827 182471 198400 -6797 -38182 -140587 12415 75077
12756 75077 -21521 -93669 17795 -72664 -68811 77050 145533 -45275 -71632 -34608 -3588
12745 -3588 26533 109955 -76888 98653 224775 213708 101987 63821 116849 93650 69164
12734 69164 -63195 12611 80964 -130399 -48249 172734 72867 178140 291797 194246 196345
12723 196345 -93857 -91728 35633 11525 -10049 76447 15344 19156 190332 30372 -82465
12712 -82465 -225621 56994 213454 -21689 -80692 -101643 -112223 -51050 154802 214102 -51347
12701 -51347 -69899 26274 101512 187078 129857 141482 22539 107588 70471 -103227 -122642
12690 -122642 -117663 -192392 -6160 161433 23271 -15499 -175235 -103663 -73085 -12668 227843
12679 227843 114924 -77377 -40492 152252 100421 -1251 184844 157428 109047 -84688
12669 -84688 10275 -43327 -31918 9598 87462 -19135 98632 195965 10728 -191941 -44178
12658 -44178 -78653 -142949 -131363 -102412 -29864 -167384 -111626 60330 107288 227721 302120
12647 302120 143849 -32506 -91114 -197647 -248266 -72345 -132218 59647 85638 197246
12637 197246 177656 200928 191801 30192 254843 199041 127701 68410 12735 -11156 158690
12626 158690 55818 116449 59962 -276596 -240012 25835 -129065 -385212 -142762 -141220
12616 -141220 -296609 -61273 164883 33539 -3023 -62432 -204216 -221170 -126085 -87996
12606 -87996 98103 268020 217516 66179 -243004 -205234 -193810 -120464 -23281 127147 43078
12595 43078 138046 194195 120291 153359 158555 271107 213273 115028 4532 -192300 195167
12584 195167 -34784 112275 352657 219598 85720 -133647 -41620 -13831 -155632 -232389
12574 -232389 -74849 -80980 -110322 -9831 214693 57827 -45118 157018 52458 -3120
12564 -3120 -3833 -75985 -82475 -14515 109040 172224 172276 -171104 -43079 -5247 20127 -7164
12552 -7164 5057 49731 77152 -10631 -86111 -6086 27798 -155853 -93279 -94011 -155748 -185148
12540 -185148 -144474 -144244 88631 364318 316900 291134 378806 285012 205726 146714 23357
12529 23357 1564 -28091 -54434 -3202 -247775 -102725 118815 346193 72426 -23916 307630
12518 307630 319818 127263 31717 42758 56303 -159931 -206232 -233750 272204 243619 -88875
12507 -88875 -98908 -133796 -327783 -269163 -49371 30503 15140 56213 -34434 -201183 -77211
12496 -77211 59241 102673 13534 -47509 -92453 -147692 -26253 180875 287887 76141 -48524
12485 -48524 126308 211643 204955 108300 204221 -43004 -89758 -252593 -151034 19221 26304
12474 26304 78809 47281 -121478 -247853 -174711 114861 -55475 -85379 119689 106548 61492
12463 61492 -83875 48966 116495 20858 4246 -78712 -108114 -89242 71274 84376 32103
12452 32103 -143497 -11831 7210 -11385 -21399 11758 -23101 -12056 -9994 38550 -96900
12441 -96900 159420 54012 224591 221469 109235 -16311 15972 -109774 -128437 -52388 -210888
12430 -210888 -81639 -106680 81170 22 -153912 61113 32198 140606 89748 96612 288604
12419 288604 315795 29586 -205347 -79486 -255686 -49078 28584 113076 -51676 -270005
12409 -270005 -15703 -17541 216338 321375 164176 171076 215542 4132 16274 -11176 -104674
12398 -104674 94014 -68642 -122317 -39105 118964 166797 340929 234126 43252 76942
12388 76942 126736 94179 155702 162171 58411 -56649 69687 134146 118675 -109555 -15284
12377 -15284 169729 8193 -148119 222454 254012 -133858 -182056 119011 23058 -57071
12367 -57071 65336 -38887 -195150 -134423 -26773 -34714 245136 152493 -11894 -42983 88675
12356 88675 297216 173327 64558 83048 -48679 -101288 71136 64998 97483 68211 -301562
12345 -301562 -248643 71424 64542 -223280 -50729 53942 137841 108392 222494 7557
12335 7557 104070 207150 -48385 -19642 93360 107595 -209713 282 -20971 29370 19694
12324 19694 103972 156725 171089 201567 194794 24938 210536 298365 403666 233067 67827
12313 67827 91948 -22602 -23293 124242 -130480 -194131 -144616 -30648 -153553 -91606 -89955
12302 -89955 -5904 224512 251979 116648 250753 194024 -185245 -1577 83618 146897 67757
12291 67757 -132192 136977 74256 -49070 18772 -39805 172451 233785 148676 166611 190832
12280 190832 2425 2979 154068 241825 -53211 -36621 40580 117226 4893 88877 94606
12269 94606 141648 166580 45717 -14381 62025 122284 143181 186927 34721 -13076 183514
12258 183514 143349 15312 123094 245882 24329 193427 -33962 -72645 -212292 -206890
12248 -206890 -68028 -67712 -20545 137923 165972 196395 125514 150739 194396 40964 109647
12237 109647 149549 128320 75677 14644 -116877 -232014 -290987 -119264 18259 -168273
12227 -168273 -404576 -259240 64863 24543 35911 -78827 56839 136862 -257311 -176472
12217 -176472 -178962 3884 125348 -126492 -171480 -146485 -176617 -63856 -132094 -220976 -150684
12206 -150684 -287946 -283148 -201321 -24567 -51731 -561749 -339064 -70997 51629 -32811
12196 -32811 -155950 47542 24479 20852 -24216 42841 -27009 -61156 56753 8691 217042
12185 217042 466980 230078 88726 209950 45405 -94016 -58815 187383 57208 3866
12175 3866 25996 -156699 42643 -63897 -285502 -148864 -48552 -7471 -47828 -57723 -193531
12164 -193531 -155698 -55288 43053 -9261 154820 175243 130967 195182 231255 208335 316581
12153 316581 317637 422222 250298 193943 -154890 -13338 99913 82014 68936 -229179
12143 -229179 52764 42480 -912 29829 20433 54102 41492 -35215 -75547 -83909 13578 -80868
12131 -80868 103571 89670 -54616 29799 34553 -76083 -21411 -58329 101291 164951 145182
12120 145182 -17234 -81351 11586 -24584 -55136 -54528 -53373 47249 65839 -30058 23218 94014
12108 94014 129194 3535 149072 -48372 -156346 180235 230334 60954 -120085 -165695
12098 -165695 -173245 -50990 15950 41278 38555 -30171 -155753 -104041 -43814 -13814 -30497
12087 -30497 119036 197580 136511 161224 916 -36994 -177907 -63718 -188232 -114008 -71806
12076 -71806 -14624 237877 205096 110997 52734 -303600 -85816 22980 -183612 -171995 40106
12065 40106 284222 143403 174598 105053 -63347 -107180 -164923 -82880 49595 83135 181168
12054 181168 -2628 71997 -83574 -39268 -38620 -79218 -171973 -15042 -145878 -48865 -91781
12043 -91781 2194 -117842 6210 215956 -62097 -180062 -195561 -104436 -129875 -131672 133251
12032 133251 125954 78696 37692 80712 -75959 -101666 146047 178029 237024 87345 -69933
12021 -69933 -120180 54567 -62212 33217 -133611 -310126 -301685 -144645 -33022 170373
12011 170373 96741 177252 153822 -33054 -162163 -247306 -135104 -154958 -71551 269533 320697
12000 320697 260422 87269 67853 7114 150344 -77190 -57648 -109982 -98844 6605 -43053
11989 -43053 61968 -56400 -217581 -236121 -15050 -135084 93260 205132 63970 35374
11979 35374 289552 179057 231589 10802 -4606 387624 230293 11502 -21302 -101125
11969 -101125 -45665 202527 218385 227173 103088 -26798 7415 -17912 141053 48892 -88567
11958 -88567 70895 247880 -65450 29698 200116 -32859 -38188 -99952 46068 -36837 -35201
11947 -35201 -42925 -134100 -113338 -96969 -154476 32610 177769 230597 204444 157787 125712
11936 125712 92673 68625 133986 -7355 26826 -112510 -173673 -156307 -58335 -144725 -390813
11925 -390813 -115323 -111248 -121614 -209022 -100419 37458 -82231 -25146 96290 123509 71897
11914 71897 -49786 -179232 -176057 -48806 64446 62348 -1156 37047 137095 208956 -12578
11903 -12578 -133307 -7689 10386 81320 111112 -58412 -48414 -39885 -28322 -3722 -65783
11892 -65783 -73677 -14626 63991 -11897 -165320 -135960 -236868 -287155 -232040 -124247 -197535
11881 -197535 -192668 17451 -38347 77669 -39594 -418091 -265885 881 106318 -89430
11871 -89430 248626 88375 -144015 -77232 50296 -88144 -224593 59416 58716 -54605
11861 -54605 -169452 24184 -109234 -64626 -87933 75100 262886 103337 149769 205636
11851 205636 301508 82142 8638 189129 86476 -11929 17680 65779 1510 -17563 12663
11840 12663 199761 -137373 -61580 85006 -3868 74109 7876 52062 251773 143561 4710
11829 4710 -52982 -120569 -148585 -130232 -85633 180469 193554 203642 150088 103490 -173351
11818 -173351 -278500 -60187 -185639 9559 -29139 26015 -20134 17305 72573 52549 -54377
11807 -54377 -147304 -141210 -151881 13777 -326 -59996 27796 -149752 -148610 -192139 -83339
11796 -83339 33042 -127093 49026 148677 -72827 -137525 -102191 -166071 -87947 129708 -6158
11785 -6158 102808 -39399 -271385 37583 157192 -58747 -939 -45991 133067 193707
11775 193707 110228 54256 -25789 -54631 145491 102657 170287 107185 -32646 118740 88847
11764 88847 46122 50729 176648 -61420 -198277 -85602 -88987 -25678 14500 87543 252486
11753 252486 236510 200385 -59509 -84504 154614 89396 -185871 -443659 -415728 191666
11743 191666 128207 -175657 -253235 57940 206701 105351 283645 210229 159768 371137
11733 371137 61859 10464 -29731 -127980 -68939 -116465 62192 51128 162575 198988 51849
11722 51849 63818 -56244 118216 56810 185822 117968 -118890 -267579 -99682 38937
11712 38937 -122877 -45465 -199103 -153073 -48327 -133184 -86729 36090 22176 -155942 -51781
11701 -51781 -53565 -102944 -92820 -191335 -150211 53719 71481 -10638 102221 13853 31700
11690 31700 44902 123156 159983 -20863 -211715 -149856 125236 -97094 142002 330136
11680 330136 253793 189298 -69841 -178875 -126665 83385 36475 160241 -106094 -161557
11670 -161557 -268147 -80475 35303 -101275 124783 65048 -31316 -143001 64054 293582
11660 293582 176195 92187 221411 17522 195257 280804 104546 -67507 -143781 6617
11650 6617 135931 281831 37674 34028 14348 -34934 -79948 28984 215477 89144 -131818
11639 -131818 103225 172786 96757 -64728 -113485 43294 -157034 -159339 -21130 -30918 153827
11628 153827 -56841 -127682 -49709 203009 74525 -21087 67073 -18724 -103436 -188410 -215043
11617 -215043 -221640 -243192 -11846 57589 63583 -339277 -133126 -249321 -270987 -224768 -194857
11606 -194857 201311 81298 -29195 -108606 307 251658 251593 -55895 -201985 -144312 -146521
11595 -146521 -249767 -23796 -164171 -126893 -102435 -152430 -133373 -50525 -31225 17308 -163186
11584 -163186 -26477 -72643 -100480 18501 -180490 -293187 45244 -112910 -27182 69195
11574 69195 97177 31268 -119565 -126395 98442 204302 125973 118894 65537 -10723 -24663
11563 -24663 -65885 -62478 5171 -29225 81919 181514 175420 -28008 -57865 -165123 -41977
11552 -41977 -18515 99950 76115 -86070 69025 31655 78574 79782 37922 227589 165968
11541 165968 -44274 -119260 116324 7978 -103127 68540 54631 -52094 -111156 -83793
11531 -83793 -257069 -128293 -40229 40024 85106 -2406 -184965 -359790 -254615 -155185 -137758
11520 -137758 -145016 -69781 3403 -17126 238858 155157 -58843 -72222 -64612 -11649 -112266
11509 -112266 -29053 -56469 16951 146627 316 140548 319394 342901 276294 36955
11499 36955 50845 -166951 -257958 -191750 -277861 106854 -170656 -276054 -16643 67329 -2644
11488 -2644 69700 88162 -44342 15018 166436 86280 107152 355920 325714 143653 72804
11477 72804 34277 -112662 -139519 -162775 -120452 6853 122056 165756 254530 76218 -39428
11466 -39428 -124033 59433 191804 98442 -84266 -5090 -10686 18296 44242 -18834 -59239
11455 -59239 -105462 -98522 -1077 66187 94161 -201049 -83825 -105846 39520 230938 132925
11444 132925 108800 -4985 2801 482 -36321 -182619 -197285 -129214 -263665 -299726 -151894
11433 -151894 -258831 -201143 -79066 -51134 -145039 -75971 -246605 -321248 -187511 -168705 -101200
11422 -101200 -15604 158371 171253 36435 21381 221920 282060 172338 -5028 -78177
11412 -78177 -19395 51641 20729 19394 -93503 -88042 -137096 -150358 -179607 -105388 -47892 -114754
11400 -114754 3903 -63585 -34920 -139608 -228161 -65285 -321387 -309827 -177132 -113045
11390 -113045 100629 109371 37577 -256916 -205205 -157767 -241922 -115784 79282 137163 154472
11379 154472 -12710 -35461 -205695 -333562 -259663 -183774 -310242 -226478 5068 76812
11369 76812 23857 81100 -259 169888 73245 -102244 -102857 -154952 -5790 -189550 -148990
11358 -148990 -252845 -356054 -424537 -325259 -334994 -127625 44356 -283688 -180775 -175976 -419246
11347 -419246 -239061 70290 -88905 -57887 -68266 -135575 198188 241796 -31251 -373602
11337 -373602 -368939 -75687 -56572 -97646 -172121 32764 -12959 -225229 -209881 -26016 20484
11326 20484 -188537 20360 -145677 19116 159068 58742 52458 52655 84593 -22935 13954
11315 13954 -9178 7648 -43476 -49862 -90705 -16190 23515 -217937 -411016 -447257 -264641
11304 -264641 -108361 108955 -57044 -96582 -84062 13886 96614 -138984 -163315 -303666
11294 -303666 -211025 -289640 -227533 -232532 -161861 -134608 -98129 -39530 -79547 68844 8523
11283 8523 -45255 -1879 -37527 39762 80008 22085 20089 -79490 -508 135899 -36961 -336817
11271 -336817 -303078 -14599 138119 112101 52725 48015 47390 -119595 -217073 -137415 185569
11260 185569 120705 -54347 -158123 78464 112422 52093 173129 1834 -1428 132561
11250 132561 55899 -216592 -131886 -192659 -125536 -159434 -276706 -175113 -89957 -194097 -68170
11239 -68170 65410 -154377 -117280 53649 -120211 -127965 -129518 -212229 -43117 -185032 -137971
11228 -137971 98144 127317 52756 86839 274232 102072 5910 -17916 -249319 -270759 -302790
11217 -302790 -229843 -225174 -235633 -486367 -367562 -200376 -250637 -171857 -154194 24356 20119
11206 20119 -1434 165844 -83782 -178982 -254460 -71669 -26745 98697 185539 178603 130644
11195 130644 51116 -108362 -189507 -62593 -57519 42087 -103619 -326505 -259489 -90338 -85374
11184 -85374 -112348 -119253 -160692 -311990 -94145 -31728 -129199 -227821 -79101 -189539 -6461
11173 -6461 -169437 -438860 -135443 -43050 -108892 -112373 78815 111582 -57402 -55399 -188817
11162 -188817 -157749 14200 131657 171958 95315 -254585 -303147 -204228 -138095 -63468 -111563
11151 -111563 -261562 -58837 -145136 -293190 -138571 -123534 11223 33447 -26611 -152411
11141 -152411 -173272 -179396 -201983 26997 157896 22233 -123505 -458957 -273763 -186286
11131 -186286 -247917 -171759 -122757 -198136 -126844 -339032 -307983 -231593 -49865 -52430 -167853
11120 -167853 82023 113417 -47141 -180227 -71355 -110657 -282208 -215642 -67038 -105811
11110 -105811 -233337 -247762 -43220 94864 327329 270829 -59658 -233765 -217537 -166527
11100 -166527 62499 -18213 -211504 -231583 110668 1218 17700 224445 4832 -50901
11090 -50901 -22131 -47458 -177439 -330764 -212987 56395 22166 -99047 -101491 53817 -233608
11079 -233608 -292801 -189748 -63920 -302574 -202622 3648 -72938 19078 -97148 -254602
11069 -254602 -85288 11585 -27075 -222522 -60815 -20988 150872 152814 -14868 -189962
11059 -189962 -318143 -499181 -381360 -222902 -214365 -155517 -112418 -105354 -113474 -29143 -137689
11048 -137689 -43289 -72810 -57861 -88364 -112634 -185540 -106533 -134982 -122597 -54867 -126047
11037 -126047 -91840 -85193 -159254 -104432 6171 -34689 -224838 -37002 -95894 29338 -131202
11026 -131202 101181 146380 108914 144917 98466 -84507 -66712 -82806 -80636 -84035 -160459
11015 -160459 -79464 -68194 -147379 -307923 -253838 -184415 72478 -36500 -460296 -428069 -168278
11004 -168278 -118765 -163051 -164208 301 57000 -50197 -67346 -1353 -64157 -252055 -110590
10993 -110590 -145418 -48552 203990 -49505 45117 -40589 -74272 66682 -76360 -146607 -171967
10982 -171967 -207194 -164366 -90286 33911 96808 273336 244752 -62956 69469 27153 -35782
10971 -35782 53567 79369 272149 -85357 -88872 105135 4036 -247182 -227111 -38851 -30607
10960 -30607 -34947 -100893 -121621 -151862 -118633 -282909 -262862 -79875 107484 67528 -69454
10949 -69454 -17777 -151332 91702 267093 127851 -206470 -357800 -294135 -205722 -301809
10939 -301809 -199613 -172350 -479584 -178014 -180413 -176596 -83304 -227723 -219122 -212723 -141749
10928 -141749 54402 68898 -106662 82261 195769 10269 -101111 -95293 26174 20834
10918 20834 -30686 -172320 -474692 -412039 -309479 -73980 -131436 -310703 -287872 86165
10908 86165 22920 78171 -62240 -168002 -64317 -138808 -166902 -78593 -60165 -94061 31383
10897 31383 -3089 -39749 -68293 -74654 -133061 -275119 -317664 -77886 80986 153169 135505
10886 135505 -190004 -248266 -237088 -228090 -192725 -112854 -16911 -89658 -80150 -173380 -379404
10875 -379404 -276960 -107505 -122209 -54272 -130825 13356 -111561 -662 50703 -241494
10865 -241494 -284178 -188260 -123446 -6807 42165 -86692 2013 117802 -88666 -138526 -26902
10854 -26902 -41294 -150962 -179639 55154 -53388 -195940 -38217 -131356 -241541 -234995 -186905
10843 -186905 -235325 -167612 -467845 -364788 -166548 103869 833 -202015 -37052 17031
10833 17031 104818 30499 44319 11714 155304 68491 140617 4683 55263 -76129 -337707
10822 -337707 -86749 -204219 -297551 -177427 -84893 -23910 78075 22903 6830 -157412
10812 -157412 -188465 -164947 89116 255913 87594 -55284 -20924 141233 -93559 -290542
10802 -290542 -328170 -347646 -146897 -115007 -91962 -246184 -239375 -259085 -234040 -297530 -227821
10791 -227821 -214589 -11481 -25021 -101867 86067 54971 -102022 -56708 -95783 -143841 -140377
10780 -140377 -133599 -304153 -409514 -342825 -384472 -80137 -34173 -300506 -454288 -230055
10770 -230055 -183629 -260596 -406841 -568036 -213167 -279440 -472933 -275013 16178 -62530
10760 -62530 -90978 -20581 -224557 -328295 -202375 -31862 50064 2369 -161241 60349
10750 60349 -63274 -126632 126443 43324 -24543 12684 109082 132061 -27709 94794 27973
10739 27973 -225942 -298084 -134931 -264055 -264088 -361179 -200658 -138569 39126 -25157 13877
10728 13877 -81300 -163137 -191948 -71954 13924 153077 59363 -38049 -178128 -292586 -151732
10717 -151732 -128036 -264037 -148433 -31356 -2493 -203373 -44872 137564 -93 -54556
10707 -54556 -192248 -83271 -58227 -99791 -1538 -43996 -100133 -62217 -249962 -130950 -17863
10696 -17863 57829 -60959 -276637 -200871 -190539 -151237 -105149 -296838 -369292 -263989 -124541
10685 -124541 -138256 -166215 -286691 -343989 -235649 -260618 -441902 -295162 -366942 -286338 -220634
10674 -220634 -164289 71686 -81566 -66383 -113938 73303 -99111 -257276 -61628 12238
10664 12238 176546 28004 -115508 -131792 -249484 -325312 -128806 -194798 3306 -74923
10654 -74923 -262726 -81754 25119 -120230 -250366 -272607 -92741 21683 -89364 -175123
10644 -175123 -158545 -238584 -206382 -45135 -87801 -288785 -327080 -195302 -61789 -245721
10634 -245721 -179114 -99020 -161655 -275368 -360327 -384363 -180726 -186625 -463692 -264030 -221828
10623 -221828 -224595 -116594 -50235 -105737 51827 85210 81930 56267 -132238 -7723 55431
10612 55431 37400 -42214 -13952 -169912 -497806 -293477 -194353 -2515 44569 -207117 -82001
10601 -82001 -103552 80136 -87797 -146607 -163530 -46244 -68751 -63878 -148239 -15534 -48231
10590 -48231 -258564 -286453 -321134 -359251 -310664 -321677 -260496 -221192 -221757 -158471 -146407 -186166
10578 -186166 57350 79924 2553 48272 -132806 -30942 -158883 -135458 -158655 -89911 -52584
10567 -52584 8925 -68162 -181354 -176767 80315 61184 31671 -125367 -200202 -65787 -53051
10556 -53051 -28477 -29674 -178063 -296162 -143040 -71932 -301183 -212778 -132644 -67645 -37372
10545 -37372 -50327 -217685 -187090 65621 93603 32838 -197329 -323605 -400658 -292075 -368865
10534 -368865 -528375 -369943 -182380 -209073 -169951 -311102 -385431 -65348 -117428 -259403
10524 -259403 -228945 -225733 -256919 -153304 -65824 -207335 -124232 -288952 -470673 -261478 -259575
10513 -259575 -182038 -145383 -64278 -69612 215785 141852 -122929 -316080 -117491 -129462 -269077
10502 -269077 -184966 -173021 27160 79102 -158343 -225470 -139974 -92391 -40550 -15375 -112129
10491 -112129 -79510 -27363 -220496 -263086 1385 48112 -38683 -172971 -284710 -255724 -271765
10480 -271765 -324562 -218979 -68608 -37326 -129274 -121581 -40149 -141503 -16611 -197132 -222165
10469 -222165 -56626 -73059 -174940 -171343 -16687 -40914 -357565 -482750 -343182 -280259
10459 -280259 -140586 -76018 -99960 -185634 -134968 -13930 -71123 -89537 -188125 -312782 -184327
10448 -184327 -205728 -103203 -116254 -197841 -43483 83112 -34836 -85579 -212179 -179703
10438 -179703 -209416 -241788 -185698 -124621 -86079 -173796 -120640 -105771 -82814 -295567 -315092
10427 -315092 -228519 -297251 -352333 -462442 -574738 -268948 -200088 -15121 -219940 -215672 -275060
10416 -275060 -264229 -279249 -203187 33499 -17808 -93312 1833 -209987 -187029 45778 -213929
10405 -213929 -434716 -449789 -181029 -222238 -177847 -224134 -177575 -106159 -177897 -191730 -268878
10394 -268878 -277713 -315196 -393552 -432289 -247718 -135453 -321281 -322132 -199830 -252205 -88478
10383 -88478 -126213 -205168 -289034 -256976 -226355 -220474 -263335 -277227 -465444 -196530 -265192
10372 -265192 -311089 -287442 -141772 -147299 -289981 -160519 -36035 -164368 -259244 -145752
10362 -145752 -129748 -54649 29468 5072 -132630 -103241 -144323 -161124 66933 -160999 -395391
10351 -395391 -133277 13303 -80956 -197054 68633 52230 -17728 -133766 -74798 118034
10341 118034 150230 -38176 137238 97829 -27322 -993 -151118 -317150 -322437 -250635 -491690
10330 -491690 -209151 83058 -148405 -110253 -48833 -100607 -222815 -331370 -76372 -3108
10320 -3108 13047 29821 -121229 -151855 -140159 -35524 -70695 -254411 -265348 -36123 37893
10309 37893 126571 -222203 -287479 -260106 -240753 -357753 -158386 -196422 -178405 -59676 14708
10298 14708 65389 -92805 -193397 -285404 -394084 -230632 -272767 -323263 -368074 -389484 -239716
10287 -239716 -181737 -239180 -200567 -118774 -33275 -29098 -23387 130147 -116154 -189867 -21750
10276 -21750 -138707 -115921 -143985 -215368 -206801 -247592 -197263 23653 -118918 42182 -76181
10265 -76181 -135370 -77959 123172 907 -293583 -160361 -73332 -55992 -195864 -361213
10255 -361213 -315209 -315148 -103937 -50973 -118242 -148377 -489490 -221393 -151863 -229656 -116357
10244 -116357 -129584 -297210 -165864 -216339 -89703 -99449 -193972 -58322 -87934 -9874 13579
10233 13579 32604 -4352 -36272 249004 175662 -70753 -136658 -40402 -5734 63951 -44275
10222 -44275 75766 -81489 -48788 -98809 -117954 -273613 -247286 -163234 -173676 -167891 -57516
10211 -57516 -131715 -185970 -337360 -451560 -379772 -134301 -28315 -196135 -81194 105451
10201 105451 53513 204077 161896 -99972 19701 50446 -74636 -24339 -8173 14501 -148143
10190 -148143 46815 -51995 58151 34448 -32354 -95816 -70067 64932 95209 198522 237484
10179 237484 100111 -65662 -215532 -200925 -20724 -127159 80867 15337 -181085 -224792
10169 -224792 -110956 -32389 -139330 -121594 133183 161100 10363 -51162 58105 48394 25009
10158 25009 71465 171538 -1904 -74714 -38965 -54380 -221679 -91890 -34889 -38370 15360
10147 15360 29727 106249 -109417 -186114 -27302 6376 -345073 -305300 9555 -161166 -113791
10136 -113791 -226264 -64015 -99320 7770 -85617 -7291 -62010 72530 66617 -167021 -77613
10125 -77613 170833 217289 102089 -117847 -99016 -169739 -198831 -83956 -195635 -188659 -11874
10114 -11874 -105850 -372570 -308967 -255461 -310158 -329372 -293749 -411928 -204498 126715 -2562
10103 -2562 -272113 -114358 -66339 105390 -43575 -159570 -78987 -246929 -113072 -93636
10093 -93636 -71903 -24728 -15097 69507 31849 -195567 -81856 -111915 67109 3529 181456
10082 181456 318356 95014 46439 -113418 -339889 -252059 -164442 -361190 -293738 -382016
10072 -382016 -425315 -368079 -38401 -49736 51929 -87577 -100297 -55306 128312 -153229
10062 -153229 -115273 12658 33319 -108862 -110147 53917 -141390 -273492 -303237 -289060 -138435
10051 -138435 -233561 -143203 36128 -78758 -26405 -81749 -193984 -103799 -246041 -360508
10041 -360508 -239651 -101969 -10488 -9524 114823 13824 56412 -116998 70551 106254 61859
10030 61859 11545 -176447 -101610 -51152 -108553 -107630 -8894 15907 54251 -56698 -210724
10019 -210724 -240773 -127614 81703 257592 -39266 -91714 -22777 -102585 -76069 -160876 158695
10008 158695 41457 -126791 -119334 -172709 -225060 -201955 49089 103389 -87859 -43909 -26090
9997 -26090 -186368 -111020 81995 -58945 38279 31052 -248691 -288108 -477625 -316852 -93535
9986 -93535 -224426 -100690 145140 190817 238640 27714 -91613 -100377 -182545 -54155 -79302
9975 -79302 -119705 -212288 -135248 -30089 -466807 -266986 -51067 53081 237963 141646 89290
9964 89290 138121 37323 -60516 -37360 255642 275459 101509 -107718 55642 -50925 -155362
9953 -155362 -20318 -205956 -300693 -182171 -126336 -43085 -135222 -200523 51673 120474 -9288
9942 -9288 -106489 -22671 -34857 -222848 -83625 178169 -110514 -53171 20758 -53392 -1560
9931 -1560 18715 98302 243688 -1409 -51387 -129530 -115958 -261470 -274156 -58932 -50797
9920 -50797 -122967 -122182 -218673 -44343 -35549 -100858 -166327 1714 -28135 -72718 -175283 -80346
9908 -80346 62378 57118 -111964 -174894 -191356 -232412 -90329 -36609 137500 99788 -21951
9897 -21951 -43769 -38239 -138498 -135499 -145885 -136991 -166774 -7031 -51442 -117076 32048 34317
9885 34317 -101594 -108649 -178053 -170624 -80518 -101605 -104454 -5789 -134141 -92122 110754 56686
9873 56686 -200050 -150432 -349990 -102702 80017 -4484 86108 131152 97701 17629 -272832
9862 -272832 -366956 -173169 -182960 -98666 126820 27723 -45711 19789 25041 -243288 -75408
9851 -75408 -6064 -13364 -180406 -235486 -27724 -172923 -181411 -46258 -23864 -3154 -93129
9840 -93129 -119708 -102218 -189846 -266047 -142898 14262 2136 -180629 -214051 -70301 36001
9829 36001 23280 26017 221331 144928 -65417 -96293 -76685 -112189 -175515 -111245 -182270 -338857
9817 -338857 -241113 -144269 -2381 -38127 -69207 -104048 -51645 -193330 -2392 -65842 -179432
9806 -179432 -223649 -232542 -18578 -15968 -257952 -160496 -149332 -146320 -37838 -194000 -101546
9795 -101546 -39405 -159555 -250658 -209266 73549 92563 115386 113298 83155 -134087 -46540
9784 -46540 -129241 -164490 -78508 -39296 -174447 47139 2059 -194521 -98999 -145834 -104101
9773 -104101 -132776 -328654 -347550 -246652 -90422 -210191 -80295 86551 181274 127470
9763 127470 42269 71170 -145268 -189149 -237268 2368 167561 123364 12581 -124234 -117916
9752 -117916 -133513 -278021 -173282 -182484 -269969 -245754 -74225 -91939 70543 72037 -66039
9741 -66039 224053 42037 -14490 90154 75571 103139 34641 21187 74355 74642 -190240
9730 -190240 -39071 167143 20321 -95469 119750 18311 131451 43437 -128939 -242706
9720 -242706 -201468 -138765 -210755 -292795 -57453 -89940 -261905 -21112 64622 123022 138484
9709 138484 113904 222540 186226 -4190 40963 53261 -18712 132367 281815 298838 107142
9698 107142 207307 159399 21593 -102796 -115465 46255 -13204 69614 150313 112394 102107
9687 102107 -132309 -67758 217266 158897 153699 -76313 34965 14163 -32995 204988 112559
9676 112559 263702 193654 90361 396167 254294 -63889 -159918 -120461 173667 -110306
9666 -110306 85530 97212 88578 298865 338169 346553 297022 354858 249037 330603 337747 258794
9654 258794 193246 2930 167206 201317 -1137 -109995 5188 106203 221765 158588
9644 158588 104391 387865 329350 105225 -21403 130801 143660 67771 125491 77489 55274
9633 55274 229284 170404 182686 82294 75019 27774 71983 -53546 -70701 16803 24031 83504
9621 83504 33527 55673 -13960 128690 222374 274604 206977 84216 205032 110115 220267
9610 220267 -90762 107310 199545 265191 73909 136488 388164 106307 6225 181402
9600 181402 292146 107733 -57834 -79678 102611 43422 -34439 34272 -44205 -18254 69089
9589 69089 149067 153350 88849 131181 238777 146671 8439 -158360 -17891 208450 36338
9578 36338 150378 -37908 77818 192562 169344 189370 131137 327084 204945 204140 169605
9567 169605 142341 224675 51177 29620 -17409 -69933 35842 39087 150117 157357 178896
9556 178896 385796 268653 200442 305022 302975 234585 84418 61859 72926 50896 176942
9545 176942 344009 464587 482824 321142 240766 139911 142515 302728 268295 514609 605965
9534 605965 596770 481149 270187 385398 784143 832174 738757 694475 604012 731576 696126
9523 696126 773482 935345 844317 1076093 1607672 1547512 1357814 1671163 1805269 1758953
9513 1758953 2122070 2173029 1889300 1680414 1775151 1371627 1058707 936373 909703 787485
9503 787485 683570 684295 481993 677563 549955 611506 593476 539197 557314 630846 587898
9492 587898 444314 380720 331138 470894 451629 324770 492197 463018 447170 623972 558669
9481 558669 522417 553736 429971 397979 305707 325484 424756 480408 569740 555402 483846
9470 483846 564998 434311 509185 658703 506316 520377 548402 226400 178394 241748 452194
9459 452194 396590 503316 390814 384056 548899 431517 347546 302680 461222 607924 499374
9448 499374 238468 55970 426622 429378 555279 573394 414440 243663 205888 276446 437846
9437 437846 408963 225145 290298 402447 383249 243400 333180 346196 402065 312792 503504
9426 503504 518079 286310 87366 188440 155641 140695 129798 102150 294413 292477 19387
9415 19387 366057 432721 504399 464020 441829 376084 197204 221247 332639 400731 342887
9404 342887 318724 354075 378433 630856 619657 324110 271765 278553 211975 384489 358970
9393 358970 248656 139800 461793 657399 353815 444187 522891 538666 583737 399917
9383 399917 411449 315301 332371 232009 323621 321997 124859 78331 7697 309380 484388
9372 484388 580829 571632 653814 750234 619936 626152 544555 563149 623486 371100 446981 567135
9360 567135 637216 449761 249691 364776 506492 435884 430267 551785 470817 487984 517040
9349 517040 467683 463788 536237 438442 605611 721750 527698 287834 581597 472914 609575
9338 609575 639526 547886 353509 471923 577437 755555 624275 320775 503138 622568
9328 622568 630217 725449 617682 309967 567503 502811 499544 569960 728248 836554 702260
9317 702260 474477 678662 555527 792399 799071 952405 858088 1003111 1020601 1059323 1038053
9306 1038053 1086671 940145 1044003 1309971 1403789 1251612 962317 693968 805803 879920
9296 879920 751612 963199 823184 656948 537726 502569 733458 848500 760899 751061
9286 751061 676360 646404 509325 554421 353850 461397 431206 675526 657480 537367 804535
9275 804535 675860 861353 723008 971609 1104761 992234 960377 947072 860299 990392
9265 990392 1084076 1162268 1241466 1176828 1053175 1016115 1043523 924796 1021906 907828 859703
9254 859703 626829 864252 782948 872683 897659 790165 761946 830614 1000059 801199 575685
9243 575685 611443 770953 816550 503585 380066 522057 672979 736747 633065 433497
9233 433497 633211 637530 787015 741775 591747 641070 770812 798646 715355 671978 797481
9222 797481 907960 700350 681150 689252 621174 483103 674232 807285 925541 865556 975970
9211 975970 859967 760226 713624 542837 570784 661443 688392 812415 989003 1137170 1011018
9200 1011018 966100 678523 745214 779164 947145 933107 1078857 1050137 1078986 1173737 1075137
9189 1075137 1181277 1310306 1513532 2006029 2187429 2046304 2412689 2262121 2039593 1784168
9179 1784168 1527770 1342631 1173323 1091917 1165702 1005254 903475 932286 942626 1073707
9169 1073707 909454 993635 878438 725432 739622 902014 881247 756523 822864 702268
9159 702268 814584 860214 667936 748469 900681 925095 881438 690870 570349 749078
9149 749078 928695 707876 776140 760200 792907 674773 800874 839833 784162 789277 617420
9138 617420 510903 523401 585108 881986 794080 833722 938986 877179 996878 997448 920682
9127 920682 699264 674452 877213 911133 891553 913255 720498 694528 878447 652034 915488
9116 915488 749073 931136 734896 723358 849143 829534 934234 729002 692126 810995
9106 810995 783403 683942 711825 704131 771283 728624 735436 830682 934806 925139 884143 1000284
9094 1000284 1123730 975309 826617 964668 883212 822136 1009935 906698 1076315 1002763
9084 1002763 985396 974194 993519 1029444 1103459 1068874 882485 856500 845914 764172 1032904
9073 1032904 998528 954252 890551 943509 1103031 1094596 921859 819532 890977 847874 739533
9062 739533 721981 747487 706631 889890 951223 901570 999635 916574 997375 790996 807639
9051 807639 939914 1087756 1054145 975787 780725 972451 1013551 1090014 1172433 918475 977668
9040 977668 992055 947653 893563 865127 919080 712186 745900 880682 951610 1048394 946063
9029 946063 1144537 847486 979134 1061770 1097991 1152959 1197149 1129274 867460 1107990 1246481
9018 1246481 1096316 1004024 1178544 1083348 980943 1056299 1241925 1039471 1057349 977673
9008 977673 1071271 1019855 1017745 1067570 961608 1053209 1177292 1286894 1241740 1301157 1292848
8997 1292848 1344097 1380242 1283986 1053440 1077467 1303642 1496674 1570891 1544670 1548731 1471142
8986 1471142 1415898 1444059 1376419 1439003 1335240 1445782 1409670 1232645 1267790 1347905 1449764
8975 1449764 1675421 1667463 1600536 1590789 1545219 1619473 1678525 1713967 1669379 1616149 1652493 1620958
8963 1620958 1603969 1702665 1683516 1706552 1817308 1690738 1606465 1554683 1594616 1770941 1750308
8952 1750308 1925239 1830285 1820640 2022273 2005650 2068256 2013892 1947938 1932312 1855380 1881797
8941 1881797 2029602 2058588 1946733 1927991 2051802 2030909 2242951 2111558 2231254 2176509
8931 2176509 2172511 2176116 2121132 2053071 2082757 2050445 1910099 1962184 2122700 2078633 2107229
8920 2107229 2311960 2559165 2456965 2157455 2231906 2087234 2297919 2400159 2396278 2374015
8910 2374015 2175639 2183470 2039751 2148705 2021148 2126047 2284256 2272601 2137248 2242381
8900 2242381 2265864 2343077 2400011 2265910 2293691 2264407 2446704 2497379 2675958 2662868 2533608
8889 2533608 2491110 2407057 2578350 2532574 2508885 2488598 2439683 2703122 2565025 2625142 2712356
8878 2712356 2669108 2560430 2464475 2509126 2656751 2614360 2546969 2394460 2532559 2488864 2364869
8867 2364869 2610691 2683350 2780501 2920173 2893030 2982081 2828752 2681872 2563303 2589945
8857 2589945 2608539 2626921 2543761 2635556 2513443 2741392 2831241 2770400 2655165 2499157 2562216
8846 2562216 2757164 2728801 2848629 2892593 2922925 2960565 2931922 2849306 2790346 2889132 3005705
8835 3005705 3030324 2948162 3150204 3103120 3254229 3110169 2940692 2788147 3158329 3371198
8825 3371198 3272055 3138626 3205233 3034557 3150447 3241822 3472407 3452572 3249926 3298176
8815 3298176 3431915 3444324 3562700 3632368 3591803 3460266 3515989 3470196 3572926 3380430
8805 3380430 3271225 3556229 3620178 3693138 3767124 4033032 3861841 3958240 4281290 4453154
8795 4453154 4367294 4339653 4487456 4802800 4881449 5010337 4940745 5026964 5234576 5254496 5400590
8784 5400590 5800987 5988334 6149629 6188909 6326427 6390107 6390073 6482603 6607133 6814163 6859227
8773 6859227 6941086 7256497 7382672 7621192 7654025 7783906 8042958 8188182 8379615 8842797
8763 8842797 8835089 9291976 9734985 9909938 10190063 10515729 10739472 10788223 11061593 11284496
8753 11284496 11485867 11769567 12160140 12634620 13245350 13574545 14002742 14614414 15127580
8744 15127580 16173834 16767776 17236872 17887085 18733950 19572950 20417052 21311468 22483718
8735 22483718 23518833 24830433 26269978 27868254 29786959 31824326 34182380 37294895
8727 37294895 40460439 44024982 48463118 54449558 61866233 70789816 81533442 93624326
8719 93624326 107790140 125256138 145027430 166494153 190796977 221721938 259506243
8712 259506243 296116999 318296915 296059335 241500248 187263579 148151375 122427167
8705 122427167 104086990 90415626 79987146 71842605 65164083 59523208 54776253 50517275
8697 50517275 46847629 43731777 40887720 38744376 36565818 34654158 32979449 31544096
8689 31544096 30120252 29070216 27822011 26712566 25918735 25047091 24011265 23358619 22750271
8680 22750271 22197822 21419960 20740268 20049269 19677632 18986520 18232421 17460773 17064010
8671 17064010 16179278 15616601 15027409 14320689 13840191 13392370 12921075 12530086 12194194
8662 12194194 12020954 11406923 11022041 10709749 10505343 10130409 9911140 9473475 9240450
8653 9240450 9330586 9142341 8860291 8602211 8483831 8364625 8371476 7921691 7612516 7531215
8643 7531215 7510397 7343659 7009894 6957324 7047454 7012886 6792387 6705937 6497606 6217760
8633 6217760 6229370 6187221 6214856 6074970 5765760 5794529 5675773 5712578 5657659 5694013 5477920
8622 5477920 5373755 5433241 5366802 5354342 5257974 5330688 5075213 4853695 4777507 4873784 4973338
8611 4973338 5017321 4985527 4970625 4906202 4564337 4533582 4654408 4481993 4412073 4450802 4196807
8600 4196807 4345301 4511452 4358618 4287592 4165384 4107275 4298178 4349476 4240542 4388769
8590 4388769 4220670 4094191 3873449 3934752 4533567 4438008 4100481 4229940 4285519 4325799
8580 4325799 4309156 4319258 4192736 3951989 3920523 3937543 3951244 3985489 4039882 4202958 4156444
8569 4156444 3983463 4021199 3811250 3739176 3938560 3989513 3908716 4010821 3888400 3860811
8559 3860811 3980857 3834919 4025845 4121345 3982657 3844651 4053014 4203043 4181315 3972336
8549 3972336 3965563 3970151 3876177 3944974 3980348 4048803 4065777 3936072 4050984 4029183 3999241
8538 3999241 4085287 4081693 4062869 3998643 3960130 3875642 4080106 4289139 3967650 3922750 3974342
8527 3974342 3974912 4162008 4075092 4111810 4334535 4499490 4444145 4399795 4497996 4340183 4232199
8516 4232199 4198984 4245023 4537508 4551808 4417923 4552547 4366293 4156222 4206193 4187770
8506 4187770 4295755 4211750 4379629 4231529 4207618 4140875 4209475 4454538 4308816 4450576
8496 4450576 4621783 4350116 4298579 4412621 4257167 4171669 4093651 4129514 4298516 4390260
8486 4390260 4353992 4174363 4152695 4301283 4200291 4349519 4417829 4298385 4448063 4320962
8476 4320962 3958260 4067374 4112737 4276014 4459319 4308734 4344123 4247399 4113597 4071051
8466 4071051 4060871 4067513 3980883 3780029 3833556 4098607 3910581 3811210 3884099 3768455 3770975
8455 3770975 3706349 3768354 3872263 3885216 3739709 3658684 3610878 3375344 3377125 3523548 3722844
8444 3722844 3886751 3782763 3463764 3349800 3259770 3500358 3515075 3568416 3326683 3457710
8434 3457710 3303576 3225245 3440177 3274024 3425847 3415456 3345307 3347091 3217840 3141485 3041608
8423 3041608 3171991 3317374 3465351 3396086 3342779 3291083 3343287 3244751 3078170 3131965 3115724
8412 3115724 3280320 2965226 3045276 2985734 3022493 2884942 2903539 2873363 2736716 2898598
8402 2898598 2911333 2661677 2785551 2839144 2643044 2610210 2466862 2738285 3130448 3198320
8392 3198320 3170224 3029925 2815144 2765830 2907389 2894045 2997619 2818664 2818728 2996748 2903944
8381 2903944 3091504 3105469 3045678 3056094 2963839 2925998 2894264 2730769 2776206 2813015 2885246
8370 2885246 2843014 2790124 2691870 2609488 2747862 2708792 2791405 2606608 2725625 2812424 2900869
8359 2900869 2902210 3060742 3181290 3056290 3052906 2810856 2561184 2684600 2751831 2731000 2769683
8348 2769683 2787529 3008646 2952281 2838210 2843682 2976027 2953708 2895259 3081960 2979662 2762508
8337 2762508 2854114 2795057 2783149 2979510 2808201 2758091 2785451 2612135 2622171 2580967 2593917
8326 2593917 2597454 2905308 2630319 2546867 2667511 2596272 2694447 2839328 2909866 2592433 2505056
8315 2505056 2445767 2510642 2526811 2565452 2639576 2692374 2285119 2515921 2580729 2553835 2893849
8304 2893849 2852971 2674652 2845481 2666836 2517554 2695964 2853696 2743550 2661553 2871433
8294 2871433 2805681 2896602 2725543 2446752 2431770 2463452 2577408 2835832 2659684 2590578
8284 2590578 2671836 2795033 2724098 2777275 2878106 3022425 2818688 2817281 2688185 2950725
8274 2950725 2984704 2903494 2560563 2527388 2564450 2595412 2811964 2722679 2873735 2686351 2530524
8263 2530524 2651479 2646085 2543318 2640771 2682365 2693931 2829139 2946128 3086638 3073958 3044246
8252 3044246 3144987 3247074 3261117 3390992 3357850 3508118 3669144 3535463 3639739 3668759
8242 3668759 3674323 3581563 3880650 3834630 3869016 4113087 4302506 4244584 4256905 4293977 3963239
8231 3963239 3827364 3519222 3328076 3343985 3290493 3101644 3079118 3095457 3142359 3140585 3205033
8220 3205033 3241814 3243967 3365156 3292900 3217503 3221029 3419335 3321500 3404717 3578875 3563054
8209 3563054 3326802 3174297 3243999 3489127 3381675 3432480 3219131 3206642 3205691 3237105 3356868
8198 3356868 3491131 3281803 3089817 3166500 3298645 2545555 2758248 3802693 3280741 3195139
8188 3195139 3423008 3425250 3311618 3059144 3047370 3221036 3142363 3333605 3397411 3399379 3305446
8177 3305446 3430358 3378165 3335876 3406938 3456188 3357658 3337244 3279252 3376618 3364045 3382413
8166 3382413 3413246 3471569 3575941 3580025 3626258 3572593 3550606 3545732 3361967 3333358 3382669
8155 3382669 3319699 3474461 3648695 3512632 3586712 3684320 3664384 3626729 3386027 3424259 3490743
8144 3490743 3580471 3586053 3381951 3416487 3461122 3317727 3403204 3467805 3525318 3552728 3614111
8133 3614111 3606076 3537992 3508755 3574454 3331236 3326322 3192385 3102225 3127327 3362861 3423920
8122 3423920 3445379 3456268 3359158 3476305 3146752 2997658 2995410 3250214 3398407 3243579
8112 3243579 3317818 3429460 3557382 3386333 3547636 3525211 3439792 3285119 3209220 3255735
8102 3255735 3383443 3468736 3287802 3170438 3088245 3116537 3227274 3216476 3106645 2975661
8092 2975661 2985798 3226210 3336963 3503001 3416851 3216868 3186872 3039052 2959691 3127534
8082 3127534 3004057 2940500 3001538 3065143 3077805 3089354 3054151 3259429 2949430 3004172 3016213
8071 3016213 3137345 2857157 2878936 3239039 3439482 3305729 3098139 3089883 3142120 2996901
8061 2996901 2836704 2953267 3081933 3057842 2855083 2993562 2992044 3139129 2962338 3052982
8051 3052982 2836508 2566617 2784117 2640094 2582895 2746616 2667660 2758734 2822841 2619051
8041 2619051 2599989 2713998 2532527 2487883 2652502 2610246 2607360 2905344 2583382 2569652 2620338
8030 2620338 2576762 2723637 2668254 2650943 2736597 2904053 2751219 2527654 2395254 2741047
8020 2741047 2754777 2686517 2830576 2621281 2506127 2589963 2723426 2702727 2642219 2561602 2633794
8009 2633794 2586009 2686779 2552789 2579045 2707694 2630246 2800001 2715050 2621030 2637985 2722351
7998 2722351 2831467 2722022 2791919 2773355 2926245 2941868 3054432 2963517 3013648 3170998
7988 3170998 3247571 3290053 3363657 3305939 3426020 3493320 3574076 3604230 3470323 3492993 3513667
7977 3513667 3591304 3576146 3733496 3785166 4047367 3657930 3786626 3991920 3981516 3801035
7967 3801035 3729185 3661016 3604879 3568683 3488847 3591901 3650743 3804134 3802580 3540178 3338730
7956 3338730 3346406 3289326 3391828 3521099 3365674 3449325 3161415 3010115 2756659 2639947
7946 2639947 2878643 3017428 2967174 2711647 2595104 2391512 2621805 2543074 2510794 2576140
7936 2576140 2353735 2205452 2175501 2274678 2310743 2423888 2378434 2362513 2491286 2423827 2473489
7925 2473489 2605277 2419445 2344198 2260159 2358281 2379683 2373353 2378929 2529635 2427402 2249956
7914 2249956 2206192 2191814 2387519 2249299 2074144 2069211 2173248 2141526 1992698 2298048
7904 2298048 2295284 2360534 2355336 2089801 2038453 2034928 2075622 2211250 2222582 2179287 2177287 2103097
7892 2103097 2066824 2048673 1982639 2007531 2082179 1993256 1859553 2020051 2249042 2172905 2140603
7881 2140603 2212633 2157058 2050375 2239893 2197832 2242789 2012592 1884438 1850130 1772991 1680906
7870 1680906 1844944 1847476 1841129 1854394 2038853 1912337 1976472 1991805 1891056 1747962 1611320
7859 1611320 1519612 1700967 1813617 1731302 1801821 1969428 1651300 1644257 1559251 1701115 1747018
7848 1747018 1747874 1995480 2172254 2157910 2053521 2072019 1921465 1824444 1671357 1787676 1744344
7837 1744344 1606807 1746932 1928949 1811634 1756707 1712066 1582400 1631233 1532546 1368797
7827 1368797 1687494 1608644 1672294 1600283 1708583 1630240 1526003 1502575 1567466 1403519 1501364
7816 1501364 1630222 1382679 1356211 1435343 1447485 1434555 1471922 1417932 1264493 1463896 1342622
7805 1342622 1406056 1451872 1209344 1172436 1415356 1585463 1535686 2216407 1933938 1378335
7795 1378335 1286476 1193749 1127543 1212399 1300281 1106458 1170006 893988 882388 982003 917995
7784 917995 1023945 1037610 1149078 1247523 1006137 928072 925313 1186396 1142775 1042764 1326100
7773 1326100 1389955 1328625 1242604 1181209 1034110 1027575 1129685 1091890 868235 985330 1141563
7762 1141563 1237863 1310180 1067433 862109 932739 940592 1049680 1097927 816320 698776 887402
7751 887402 973279 978524 764466 833896 1099530 1157144 1087656 1145947 1236590 1055984 1063354
7740 1063354 937725 803593 822113 659334 590954 765253 905797 1086086 923691 892395
7730 892395 1042644 1173072 1014154 779072 676749 944407 1001428 653341 636479 677368
7720 677368 634352 679135 823525 1022912 1023812 966152 860943 853234 946598 828808 935599
7709 935599 1120588 991281 664685 743455 821116 779893 725640 648200 702311 830315 1068393
7698 1068393 1009830 540618 372608 515208 664158 693790 780261 870259 784017 751041 877980
7687 877980 698711 500491 661290 778709 636099 569181 628598 469816 414704 371032
7677 371032 682107 527381 344542 467430 261280 392763 308938 534435 386604 96619
7667 96619 475011 402606 272409 264676 317432 407647 464143 412860 347546 562037 647266
7656 647266 357023 334539 436785 494869 489687 385229 539286 518745 477932 170615 125899
7645 125899 345405 305886 327537 606106 291042 281311 226603 317757 360294 433471 465406
7634 465406 343507 370231 418271 482702 396893 472730 505947 261565 190514 485975 436558
7623 436558 231024 143207 312805 454409 711628 681743 515342 326816 175271 327983
7613 327983 350445 380915 490543 390745 253761 236882 449267 449300 482668 492932 378307
7602 378307 533342 468170 238620 241132 407996 278772 214353 126359 19593 5235 308678
7591 308678 412091 312931 276609 325845 186326 192647 290757 345391 448581 289700 323686
7580 323686 185998 322585 236780 122260 233927 324853 277564 245768 296048 315956 349855
7569 349855 225834 267535 346584 218029 67793 57036 179668 134531 304122 245828 72248
7558 72248 68606 216609 108835 65784 224111 450300 324297 173107 202262 175053 129054
7547 129054 102625 164048 32639 166231 206622 275480 237967 140489 31382 174827 255644
7536 255644 297819 326128 182947 314647 135786 166342 316583 362741 450465 428131 274403
7525 274403 234633 245592 110247 180675 272330 250488 145650 123127 130184 112328 310645
7514 310645 206731 267520 389331 174799 42243 14235 -81634 -61524 -144143 -79196 200171
7503 200171 244795 -59625 -142602 -62694 108716 -40716 7071 -19068 97749 79765 139327
7492 139327 20784 24707 51012 47363 259366 538538 381390 234010 285063 162136 241092
7481 241092 41205 -62284 -182957 128398 62504 -73446 101133 62892 27071 124003
7471 124003 -118659 -53064 177994 275176 -18882 49953 119118 94714 -167791 -76585 66618
7460 66618 89611 59644 54727 89392 50449 30528 9401 60002 -141849 8718 -99133
7449 -99133 -94501 2931 -155524 -82087 -112780 -689 115002 -55080 -30434 -96586 -81763
7438 -81763 -34637 -46367 -20421 -29330 39726 -245102 -257277 -127580 53023 82986 4129
7427 4129 -104687 37040 184758 117505 -6278 224499 105061 3603 -15243 -11746 49549
7416 49549 115839 -9200 68923 147263 156313 21670 -52586 -87059 8074 293475 197710
7405 197710 53875 -78690 10005 193112 11736 -40512 11303 26587 139143 23523
7395 23523 -24567 172370 251940 46438 -298946 -206065 34673 58457 41278 63394 40765
7384 40765 -121905 4537 -51629 129146 -20323 -625 -31185 -140432 -8676 24040 -40268
7373 -40268 206601 235393 537298 469757 373364 405696 349481 385786 474640 681686 895040
7362 895040 971751 1007839 942013 852878 998767 842788 620061 679519 632605 941334 973143
7351 973143 791473 950768 950158 937918 856351 791931 562899 533439 342335 44844 247658
7340 247658 264825 167689 53713 9225 -142852 -43393 277556 247826 267601 420750 312086
7329 312086 107092 98491 99183 29493 -62252 107780 -46931 13057 261208 251502 205730 105664
7317 105664 -485 -103762 -43620 -176336 -149889 -102594 -188844 -115725 -166360 480 -16896
7306 -16896 -149471 -174412 -155791 -175279 -236834 -191227 -233309 7670 -330389 -352114 -252253
7295 -252253 -297803 -249211 -339809 -468533 -272619 -118185 -193690 -169238 -189936 -281901 -400405
7284 -400405 -193915 -134546 -164594 -350968 -322856 -319133 -443843 -292746 -236019 -442820 -226369
7273 -226369 -94570 -193978 -20336 -165159 -158165 -152583 -142500 -193290 -374229 -240859 -379705
7262 -379705 -494815 -407624 -279535 -285340 -303473 -175391 -346463 -311300 -296276 -538740 -375806
7251 -375806 -196641 -312214 -338083 -415202 -335758 -137480 -285623 -258707 -97150 16395
7241 16395 129265 -12378 -219286 -197443 -371621 -340338 -518147 -310030 -168927 -206178
7231 -206178 -242336 -319938 -408082 -256916 -346082 -426767 -314518 -552971 -501227 -196257 -149563
7220 -149563 -182396 -197517 -176745 -370126 -440832 -358713 -238024 -113954 -120090 -116190 -88203
7209 -88203 -167988 -213235 -155478 -208514 -267391 -201657 -192490 52504 26186 -160532 -292028
7198 -292028 -106689 -91320 -130435 19785 -114106 -141817 -196044 -254774 -415498 -414614 -595266
7187 -595266 -797516 -557870 -332023 -492523 -337140 -362159 -493083 -412297 -345442 -495493
7177 -495493 -419216 -517477 -328128 -144702 -328678 -348290 -196026 -380140 -376617 -253258 -88127
7166 -88127 170323 65419 -206210 -133881 -155501 -284073 -125472 -87178 -145696 -228642 -303048
7155 -303048 -91215 -67194 -256949 -226873 -312143 -303902 -269168 -295808 -275191 -164602 -491074
7144 -491074 -773504 -382233 -275208 -353826 -326690 -224407 -344953 -384766 -261747 -161364
7134 -161364 -86170 -221069 -288830 -243792 -291707 -353128 -318738 -489681 -375022 -469390 -386056
7123 -386056 -606016 -735007 -566377 -496673 -378165 -250871 -268261 -370225 -311081 -410945
7113 -410945 -436877 -538667 -550157 -463604 -424864 -254180 -48460 28667 -225427 -332687 -230870
7102 -230870 -164418 -173553 -217241 -272518 -340270 -401891 -542106 -449988 -538297 -680386 -535008
7091 -535008 -275706 -370805 -332542 -328803 -348396 -384500 -208361 -195653 -183690 -182335 -359856
7080 -359856 -613086 -718043 -608776 -373494 -403596 -430583 -352967 -597870 -582386 -325148
7070 -325148 -450695 -523830 -449651 -398548 -395140 -604337 -510901 -342400 -221495 -408327 -376465
7059 -376465 -300875 -171268 -273099 -153090 -348290 -330126 -454119 -432447 -442005 -356037 -168092
7048 -168092 -279577 -252074 -394980 -295457 -350037 -361268 -432591 -311071 -282701 -383943 -648770
7037 -648770 -541825 -540396 -314669 -342322 -329016 -342053 -187930 -386132 -543428 -369011 -372155
7026 -372155 -360396 -447301 -298600 -226788 -255981 -332321 -440206 -183014 -179637 -296925 -70182
7015 -70182 -267585 -627808 -587857 -484875 -447458 -251277 -173368 -25686 66372 83709 53066
7004 53066 -159471 -238836 -68853 -171478 -448423 -488332 -277171 -258167 -256030 -228445 -269176
6993 -269176 -194802 -99436 -234270 -353689 -279234 -208135 -391568 -287353 -326988 -322126 -297993
6982 -297993 65523 -224665 -394144 -306118 -172016 -363689 -219914 -95201 154946 -14258
6972 -14258 812 -166692 -268729 -196998 -305435 -347404 -608609 -449985 -444651 -401780 -420978
6961 -420978 -412649 -455446 -333614 -388925 -367496 -584913 -462951 -407868 -469154 -391725 -200314
6950 -200314 -121766 -34962 -142233 -194550 -272257 -263268 -225324 -91694 -186165 -344303 -325887
6939 -325887 -248932 -416576 -372413 -344031 -464237 -465348 -485872 -296654 -186457 -324404 -135681
6928 -135681 -259623 -284608 -152767 -216798 -82978 -236010 -481295 -362826 -301783 -450788
6918 -450788 -283991 -210521 -393354 -188952 -56784 -350269 -436343 -292450 148698 -43795
6908 -43795 -237634 -460023 -502649 -283418 -110974 -267137 -186200 -212137 -311271 -335625 -516947
6897 -516947 -435629 -414556 -259756 -401054 -494387 -313614 -326465 -401589 -472529 -435190 -560764
6886 -560764 -466811 -254544 -172686 -137396 -227416 -222438 -155677 -209770 -481292 -597004 -487882
6875 -487882 -380217 -340234 -213684 -463455 -472868 -368768 -171618 -197324 -315811 -184870
6865 -184870 -308817 -499838 -379626 -403016 -319022 -516111 -477653 -400304 -578718 -417155
6855 -417155 -560070 -626987 -582088 -347323 -222577 -455753 -467815 -473288 -375807 -421675 -453003
6844 -453003 -209342 -250796 -479611 -448024 -371991 -408879 -649314 -623669 -571259 -768570 -704128
6833 -704128 -343989 -384591 -477828 -578858 -362589 -59954 -212603 -213955 -213550 -339170 -271355
6822 -271355 -446032 -303471 -282632 -520665 -265533 -328994 -429666 -130391 -220685 -401011
6812 -401011 -241952 -394562 -273072 -480032 -641964 -315141 -241419 -188904 -150236 -283308
6802 -283308 -208155 -21657 -38806 -81802 -171267 -176514 -56546 -136230 -57367 -395398 -341929
6791 -341929 -101111 -86531 -204429 -204657 -340650 -259778 -9843 -248496 -147561 -55935 4812
6780 4812 -100205 -208362 -176589 -392924 -437498 -466491 -531707 -422100 -387103 -337941 -234889
6769 -234889 -209134 -191925 -209908 -167240 -165132 -159331 -659610 -655185 -321462 -491158 -448626 -353112
6757 -353112 -350298 -271821 35636 64476 -127058 -348964 -339875 -275078 -414453 -314047 -221321
6746 -221321 -291408 -340759 -484565 -540218 -390231 -377903 -438418 -455903 -285650 -201858 -260392
6735 -260392 -336232 -404320 -707962 -711293 -588975 -459120 -282634 -104445 -4101 -168961
6725 -168961 -456107 -272045 -169631 -286756 -539477 -402037 -493347 -453718 -407552 -392808
6715 -392808 -273101 -511938 -499074 -189604 97 -79170 -241080 -272307 -203882 -140975 -23150
6704 -23150 -222677 -577336 -478853 -251109 -307039 -288958 -314446 -429566 -435039 -426482 -439415
6693 -439415 -249801 -303984 -353486 -491736 -257881 -366654 -304131 -384913 -489286 -236498
6683 -236498 -283129 -100187 -101701 -301292 -257100 -188775 -225405 -339709 -621374 -535152 -188663
6672 -188663 -212635 -107308 -275911 -302490 -155164 -100725 -311748 -87943 -14113 -168250
6662 -168250 -166545 -226306 -186102 -76070 546 51420 -241675 -402395 -385426 -71982 -24585
6651 -24585 -2219 -42034 -109947 -176957 -256824 -43659 -126891 -227041 -246529 16921 -218494
6640 -218494 -346980 -41330 -38406 -147101 -162820 -297350 -275160 22130 -119538 115
6630 115 -329723 -266301 -190529 -357784 -417223 -189672 -87478 -188081 165267 247184 174302
6619 174302 50185 151776 -55892 -214653 -440761 -254555 119848 -19460 -175153 -99275
6609 -99275 -105460 -323258 -132397 -102383 -259460 -151236 -303379 -327322 -407191 -318993 -340290
6598 -340290 -293047 -167783 -165910 -34634 -135481 -218303 -275471 -290064 -90919 -63285 67356
6587 67356 153617 7111 32935 53147 -78793 -324257 -281049 -140393 68958 -28570 -309208
6576 -309208 -329328 -188211 -223797 -389032 -336663 -580865 -327768 -409981 -321191 -112213 -298530
6565 -298530 -384431 -286991 -226091 -336341 -86595 -29648 -253699 -264024 -149955 18424 101746
6554 101746 52661 -103311 192306 7816 39003 -63847 -138073 -101177 -128743 -95259 -341348
6543 -341348 -277833 -270604 -126029 83094 20843 -50010 -259761 -256417 -289212 -89668 -100246
6532 -100246 15737 -89774 -389557 -411370 -410853 -342937 -111560 74373 -21054 -104975 -62069
6521 -62069 -163802 -68032 43060 109082 126304 126154 73577 25503 53397 -75239 -129444 26976
6509 26976 -84864 -58904 112090 112060 84352 -91376 -41179 -34278 -18871 -172127 78558 84617
6497 84617 -13901 26245 -14164 -82993 -45176 -111721 13102 -53991 -201434 -145267 -30975
6486 -30975 -105163 -190810 -150202 101028 -68725 -65745 154522 2147 6760 143433 -23353
6475 -23353 -112634 -150187 50076 -19455 -40277 -79937 -140679 -178803 -101293 -269613 -102527
6464 -102527 -8203 82556 179457 153313 87629 97386 -19978 50468 156987 33206 40544
6453 40544 -156270 -118699 -123092 17341 141965 39292 -6293 49518 117443 268754 37550
6442 37550 81816 397686 206948 203351 227008 339754 333896 275735 410978 275518 235778
6431 235778 228485 367073 522384 561276 383788 281084 357031 507563 520237 501143 592306
6420 592306 508180 482559 475869 475498 620773 735472 794456 988844 1120907 1225379 1523250
6409 1523250 1783929 1781806 2118168 2173265 2453414 3009728 3387621 4116867 4269617 4358756
6399 4358756 4421296 3824923 3501001 3145872 2569506 2402598 2050758 1898541 1686731 1503126
6389 1503126 1455876 1343521 1374189 1124796 1216543 1402921 1103102 1034328 1057959 1032961 1166116
6378 1166116 1014241 789010 1044091 998128 953662 945122 1037841 1009985 1074377 1175604 1078122
6367 1078122 629378 693194 770716 932774 1003939 866509 929427 1170793 957033 921697
6357 921697 972669 1135070 1197417 979743 1018006 1186549 1395223 1349399 1270270 1316381 1376467
6346 1376467 1516585 1545293 1546289 1842923 2138238 2152628 2283069 2566000 2911374 3311154
6336 3311154 3753191 4215660 4668839 5270948 6025622 6849199 7261298 7394646 7320306 6691838
6326 6691838 5744074 4616608 3957855 3534201 3210347 3174216 2875369 2844286 2724592 2643543
6316 2643543 2779423 2734029 2763556 2634824 2437633 2323191 2173718 2062844 2017007 1969670
6306 1969670 1793667 1835645 1891876 1539239 1312237 1285342 942517 991304 1026517 1198509
6296 1198509 1161238 1094762 1292012 1272074 1019785 807641 888947 995611 956578 665718
6286 665718 667608 715973 583277 794802 700001 706223 657369 601443 759101 760336 361343
6275 361343 589611 651638 603404 594325 604052 513331 516599 408394 510925 390338 280744
6264 280744 287017 439430 408085 331755 475858 669352 449676 563795 569829 562625 652498
6253 652498 304749 450598 298542 190459 144507 197189 63453 153073 112907 153206 336450
6242 336450 341763 395488 327244 18709 263400 70346 183350 273176 286043 167666 241144
6231 241144 287838 113762 30041 -115086 -164286 26617 98832 -37464 135117 -13124
6221 -13124 40760 -81619 94719 235374 331513 265015 72949 104792 44858 141187 -24198
6210 -24198 -92584 -5453 147891 162260 163366 331977 84927 -10369 -250817 -203887 -85080
6199 -85080 -51265 49978 184360 301560 260493 61027 -32239 134412 106215 243570 155598
6188 155598 217426 159882 79608 176153 83464 311237 555438 567266 365415 166159 311589
6177 311589 331491 419828 445616 402656 153817 355294 262877 274737 198861 166133 182342
6166 182342 313210 590628 529900 333272 425379 255485 353238 244575 -34762 12866
6156 12866 328809 564683 413859 381774 249065 48673 -42582 32528 25862 320940 364845
6145 364845 390799 366967 263219 280850 203285 144826 203207 276652 139465 247667 327767
6134 327767 299865 371357 255413 224498 123842 168653 155595 287312 339419 358604 199485
6123 199485 391141 411617 231715 62961 172044 162733 398242 454114 552479 638164 441592
6112 441592 438292 404845 526479 722556 815266 767415 909622 847689 782316 732224 585600
6101 585600 539999 709209 658198 670862 693511 537136 467983 561926 745649 556736 406414
6090 406414 323237 457230 597052 447538 167831 271674 359576 313263 437405 569556
6080 569556 539514 570326 544795 450361 601321 810157 1008641 1025903 1221834 1394237 1327069
6069 1327069 1105194 1032492 1097163 881334 712913 856486 902083 865812 881963 866312 555223
6058 555223 513637 739501 700331 762699 677069 529302 646624 722548 896281 798753 333348
6047 333348 312165 586321 599557 662774 636236 770685 855953 859940 800396 1043869 981250
6036 981250 768655 657727 767155 861912 724139 759311 918800 859128 576726 612368
6026 612368 675520 667074 690137 600214 742413 699668 730214 570247 477137 361886 386972
6015 386972 534673 464281 752812 546392 687328 737577 731194 825767 821602 850250 895215
6004 895215 823566 699477 733673 1092981 843071 761250 774287 802210 700564 740996 1109699
5993 1109699 951281 933627 1077633 1276604 1212947 1159634 952902 796531 908409 1009286
5983 1009286 1034542 881927 1033076 1362734 1176616 1112445 1021270 962753 1219102 1090125
5973 1090125 1110750 1080546 1095289 1256393 1177001 1179959 1311780 1241906 1374203 1321280 1321723
5962 1321723 1231062 1349465 1242784 1222566 1433528 1210277 1240105 1327968 1373849 1350324 1357667
5951 1357667 1359906 1260764 1279146 1356485 1458571 1515505 1586888 1505591 1434052 1563532 1756182
5940 1756182 1571914 1637583 1608781 1438750 1502520 1289998 1502948 1652971 1414416 1058380
5930 1058380 1205185 1172269 1267408 1222783 1312044 1218774 1368420 1491276 1544013 1581755 1627867
5919 1627867 1445501 1838355 1926170 1932739 1963768 2039664 2110948 2151990 2275633 2345389 2259805
5908 2259805 2050898 1885925 1925384 1675519 1577644 1899777 1707589 1707169 1632633 1492503 1449810
5897 1449810 1497880 1034534 1295872 1483439 1393633 1424779 1365691 1435661 1187305 1250603 1483256
5886 1483256 1398135 1351948 1114221 1282329 1293089 1264143 1372707 1168652 1081377 1352024
5876 1352024 1530485 1448953 1569138 1587407 1481120 1280178 1440652 1639179 1624519 1784652
5866 1784652 1660044 1586539 1442080 1369840 1529663 1719743 1455666 1156479 1093716 1234209
5856 1234209 1179667 1358843 1342360 1282651 1473913 1728879 1540578 1417227 1473311 1534956
5846 1534956 1673842 1726105 1674304 1762056 1764558 1882408 1694052 1802257 1943346 2149257
5836 2149257 2318210 2316100 2404713 2683447 2912189 2985960 3111346 3580341 4142520 4659419
5826 4659419 5138370 5612581 6413857 7039791 7786851 8770450 10016456 10870534 10960250 9893893
5816 9893893 8315883 6707220 5693225 5102080 4589819 4064791 4038359 3777874 3649327
5807 3649327 3774317 3702331 3722785 3954936 3979794 4339310 4392565 4466604 4401424 4453292 4952381
5796 4952381 5296772 5644770 5664055 5908279 5979708 5257134 4449970 3897267 3393559 3027990
5786 3027990 3005796 2989404 2705153 2525765 2336930 2372196 2414062 2076539 2005026 2088877 2148283
5775 2148283 2100258 2188650 2163341 2188426 1988187 1878447 1786543 1811799 1708193 1669716 1861544
5764 1861544 1714093 1525637 1421580 1296737 1239264 1423837 1374838 1492762 1239132 1209731
5754 1209731 1313336 1457568 1320574 1094568 1188243 1121233 1121460 1166450 1357033 1286276 1301970
5743 1301970 1392217 1437380 1180960 1203840 1315007 1355917 1408952 1434406 1387618 1235369 1269606
5732 1269606 1359659 1275942 1245762 1260090 1123328 1108423 1320090 1566538 1438736 1563580
5722 1563580 1499391 1428037 1379563 1494203 1404459 1241214 1320014 1401130 1357817 1263583 1497525
5711 1497525 1631153 1439373 1369234 1493103 1618231 1631004 1468763 1397627 1312869 1412702
5701 1412702 1645290 1711020 1711911 1711813 1589614 1804387 2109811 2200923 2144244 2222153 2297677 2006505
5689 2006505 2020332 2175729 1979964 1777031 1997233 2078545 1889651 1882172 1998889 1989882 1969029
5678 1969029 1960052 2025646 2206117 2378955 2320095 2454688 2565953 2465624 2349021 2359351
5668 2359351 2205936 2309453 2237226 2147544 2234954 2229831 2295838 2166005 2177204 2351086 2525090
5657 2525090 2781735 2702829 2642816 2366681 2150272 2309561 2302146 2186966 2004006 2071573
5647 2071573 2131651 2194611 2159028 2005558 2095675 2192111 2483685 2510065 2471846 2417601 2486754
5636 2486754 2529713 2579689 2565554 2230396 2325917 2305015 2362356 2708402 2799294 2538470 2623225
5625 2623225 2782875 2856598 2932527 2901683 2935866 2712232 2800443 3009796 3105731 3232038 3079071
5614 3079071 3045199 3152798 3205299 3334840 3485326 3692605 3696767 3431304 3402760 3616108
5604 3616108 3670692 3698633 3787100 3810628 3900139 3945193 4223792 4418816 4438908 4534108 4730935
5593 4730935 4927332 5073263 5291367 5438055 5500833 5728820 5833511 5931825 6358957 7032311
5583 7032311 7692313 8152709 8728046 9535836 10141589 11186416 12496015 13807763 15416121
5574 15416121 17447241 19743095 21914702 22964559 22126169 20081598 18023349 16246365
5566 16246365 15219439 14751025 14726757 15123705 15668176 15978231 16370251 15758070 15017328
5557 15017328 13728796 12965385 12512615 12056707 12055682 12148308 12417592 12937610 13504007 14054528
5547 14054528 14964688 15839572 17020858 18366235 19825062 21337919 23045250 24493959
5539 24493959 25707599 26151517 25467210 24064469 22145698 20279936 18946216 18021303 17925717
5530 17925717 17704729 17827732 17869823 18278671 18664684 18889637 18757653 17338454 15564445
5521 15564445 14039703 13238302 12600146 12024992 11650245 11512893 11544510 11636293 11742263 12070233
5511 12070233 11944575 11637845 11217286 10795549 10511055 10242134 10330929 10299116 10510707 10501456
5501 10501456 10543370 10526681 10416157 9829762 9450752 9143704 8487756 8256654 8207041 8327750
5491 8327750 8408682 8295418 8066457 8349084 8775630 9095126 9665216 9882974 10426398 11154853
5481 11154853 11998216 12626825 13293091 13981455 14052662 13597674 12942360 11956236 11041538 10142071
5471 10142071 9347772 8541132 8155876 7501915 7200105 6970958 6829193 6538349 6335596
5462 6335596 6204180 6078285 5988070 5966566 5906122 5599106 5532120 5415683 5504815 5505721 5510830
5451 5510830 5459714 5467013 5459305 5556861 5546046 5356330 5185713 4855705 4859678 4844412 4600763
5440 4600763 4511513 4525904 4444545 4481411 4510080 4087887 3791656 4003715 4039234 4038468 4079797
5429 4079797 3833106 3730299 3757718 3805095 3848533 3839841 3413358 3522807 3288280 3477046
5419 3477046 3388544 3471324 3203226 3489878 3424341 3412151 3398735 3304660 3110554 3119228 3086585
5408 3086585 3044211 3185042 3163039 3177511 3095070 3132430 3050906 2896783 2840168 3003580 3021720
5397 3021720 3105688 3099265 3156455 3034370 2904876 3186531 3256058 3087504 3049761 3076492 3168117
5386 3168117 3022095 3213971 3097917 2974445 2795186 2986512 3054107 3029265 3206114 3202009
5376 3202009 3229331 3400064 3278880 3052403 3105372 2889838 2949215 2786383 2908688 3191903
5366 3191903 3057092 3227996 3392320 3313251 3142685 3055358 3059178 3260348 3329067 3187574
5356 3187574 3162262 3248132 3379498 3478027 3204623 3236259 3136809 3130307 3141981 3010413 2995512
5345 2995512 2979820 3126078 3061892 2855986 2859738 2784811 2887601 3131314 3111104 2936936 3031659
5334 3031659 2936498 2863509 2913977 2817450 3085380 2870559 2685104 2962767 2895089 3035111
5324 3035111 3089438 3024941 3146132 3207982 3178179 3285805 3384289 3313932 3072003 3163037 3232137
5313 3232137 3265340 3155154 3198101 3203189 3047875 3117152 3031522 3195448 3168174 3311045 3335635
5302 3335635 3342805 3561883 3649645 3615675 3360794 3700309 4071177 3970294 4439124 4798744
5292 4798744 4789797 4999697 5103678 5506868 5920228 6423963 6817910 7488336 8053546 8409945
5282 8409945 8508443 8165388 7405353 6537131 5948488 5439398 5255623 5022669 4980710 4776921
5272 4776921 4527102 4465742 4829370 4977705 4889416 4843229 5004453 4940582 4883812 5145845
5262 5145845 5566078 5652660 5713982 5980908 6143461 6728643 7324819 7721217 8392602 9112872
5252 9112872 10019004 10800178 10982272 10420198 9086839 7749720 7078756 6453234 5840764
5243 5840764 5525010 5356395 5425019 5198355 5179879 5208454 4919924 4847917 4980355 4707012
5233 4707012 4690623 4874171 4842084 4861543 4840555 4979096 4832795 4718859 4679220 4541814
5223 4541814 4459478 4500858 4288181 4056456 4221187 4274008 4269253 4354150 4287493 4375306 4098834
5212 4098834 4144667 4243558 4108569 4132939 4114170 4263707 4320010 4222348 4054685 4049160 3915664
5201 3915664 3938578 4068252 4089442 4051088 3915881 3798689 3874753 3596203 3524634 3522359 3493411
5190 3493411 3473562 3361739 3452005 3525568 3444920 3612743 3646704 3698967 3649596 3432354 3409538
5179 3409538 3592216 3642947 3918729 3879313 3593617 3529512 3409049 3594804 3777939 3545052
5169 3545052 3371851 3453797 3587654 3735735 3613277 3411564 3273549 3286538 3291421 3260457
5159 3260457 3225660 3376704 3481855 3391132 3498847 3347901 3075084 3412035 3249105 3191764
5149 3191764 3390798 3434445 3411062 3365977 3251997 3194723 3280045 3382618 3385498 3529078 3546544
5138 3546544 3423747 3541381 3513475 3517186 3754012 3864288 3895066 4003420 4032484 4315710
5128 4315710 4291531 4612569 4820223 4952841 5085238 5024324 4913040 4687336 4656624 4390958
5118 4390958 4219455 4137932 4456628 4309090 4127038 4127830 4158403 4129941 4194419 4338390 4814710
5107 4814710 4797695 4823957 5134799 5007597 4968574 5147717 5017234 5043931 5015976 5040793 5098804
5096 5098804 5000105 4915108 4662545 4788290 5027876 4898332 4629278 4769599 4852016 4744937
5086 4744937 4771738 4957548 4974874 5163520 5337741 5465552 5148907 5185666 5029481 5133083
5076 5133083 5628308 5676557 5811865 6079531 6367409 6568495 6928456 6889728 6863449 6469947
5066 6469947 6306971 6480438 6495027 6641199 6565316 6499679 6387078 6219909 6043876 5817636
5056 5817636 5520766 5601117 5519096 5190760 4954898 4977402 4920365 4918275 4867738 4979146 4739474
5045 4739474 4843517 5082644 5159453 4942807 4974163 5073023 4814161 4604744 4524652 4529588 4434702
5034 4434702 4240290 4292136 4582960 4320243 4277208 4586239 4595446 4519226 4495623 4672960 4345378
5023 4345378 4287858 4435265 4348604 4302776 4296140 4344423 4296725 4518735 4682748 4586127 4315080
5012 4315080 4095318 4044495 4197437 4265598 4519721 4388662 4387710 4341484 4472916 4543551 4596185
5001 4596185 4569756 4353052 4712404 4896678 4883480 4918124 5047825 5122412 4989945 5017530
4991 5017530 5239577 5263326 5343010 5614567 5685485 5669317 6100809 6363265 6219187 6304307
4981 6304307 6155998 6090623 6006599 5765231 5604969 5565074 5496433 5545805 5641066 5563942 5501514
4970 5501514 5839396 5766417 5551140 5675532 5981594 5993900 6203754 6238342 6352752 6524171
4960 6524171 6683535 6965445 7422211 7719982 7704034 8123871 8683227 9093382 9202727 9731163
4950 9731163 10512230 11108972 11912824 12505381 13006015 13712177 14000832 14178165 14339252 14528978
4940 14528978 14436606 14239667 14023225 14058567 14582147 14822665 15132660 15320252 15348778 15725330
4930 15725330 15689208 15322823 14712404 13824169 12750425 12169067 11215753 10397749 10000486
4921 10000486 9733264 9171000 8722413 8754954 8372773 8095111 7789458 7476182 7430002 7445826
4911 7445826 7469688 7107432 6853553 7062172 7093893 7233576 7037648 6978375 7093875 7015934
4901 7015934 7056976 7028779 6803966 6908069 6857988 6887972 7040871 7546282 7567873 7459020
4891 7459020 7318965 6763051 6463493 6471161 6323320 6096151 6302141 6288695 6346463 6437212
4881 6437212 6464652 6423083 6564654 6684707 6829461 6739641 6427058 6432473 6452707 6382510 6254885
4870 6254885 6196942 6315963 6233997 6148284 6114116 6174261 6197500 6291929 6101115 6117645 6074277
4859 6074277 5984875 5777786 5866926 5856784 6273867 6180625 5861700 6087917 6053626 5973761 6017666
4848 6017666 6226615 6373515 6438013 6760731 7192041 7317757 7480637 7341350 7195538 7110934
4838 7110934 7091064 6995397 7189596 7301622 7305416 7270907 7330131 7369331 7374076 7663544 7757537
4827 7757537 7935639 7919161 8042011 8293346 8264307 8420792 8545177 8575354 8332978 8410756
4817 8410756 8154012 8159189 8196951 8380919 8471442 8702761 8787922 8875857 8928483 8817571 8953422
4806 8953422 9383207 9583793 9409011 9435125 9477676 9835065 9999205 10163697 9934887 9865102
4796 9865102 10153301 9962295 10111209 10234876 10197746 10453759 10545330 10512270 10231149 10261901
4786 10261901 10417130 10182460 9961418 10032262 10042446 9913832 9895666 9847169 9663845 9633768
4776 9633768 9354075 9189539 9079691 9157606 9075525 8970392 8838558 8665410 9095376 8701859
4766 8701859 8299289 8639942 8598068 8308509 8180425 8208905 8223276 8163791 8272817 8215486
4756 8215486 8084776 8274518 8050085 7990940 8127493 8073674 8008684 8266657 8154718 8172755
4746 8172755 8254425 8301173 8229972 8072162 8009475 7989559 8067872 8331733 8438709 8502442 8448061
4735 8448061 8628248 8956446 9018037 9087341 9474303 9773765 9806450 9867412 10133648 10309158
4725 10309158 10358880 10807819 11078985 11499084 11735983 11639699 11524610 11442340 11421100 11536114
4715 11536114 11667383 11463596 11322033 11593090 11869268 12109298 12214833 12258511 12507553 12899349
4705 12899349 13279108 13787810 13647599 13369767 13004746 12489446 11991407 12145238 11927579
4696 11927579 11666677 11366020 11384089 11151400 11083897 10970646 10837396 10539468 10382787 10551901
4686 10551901 10218021 9833332 9891051 9802656 9644466 9697659 9500267 9447202 9209573 9160041
4676 9160041 8982779 9092267 8967357 8612447 8666524 8866178 8703954 8623961 8685445 8535779
4666 8535779 8442967 8254472 8283787 8255301 8253463 8141018 8071914 7813078 7621677 7674749 7885152
4655 7885152 8038967 8055715 8037372 7796474 7689539 7717953 7729752 7543416 7658061 7678202
4645 7678202 7559062 7444105 7390294 7458736 7481325 7088589 7042361 6928668 6957434 6947854 7028545
4634 7028545 6926223 6676971 6656862 6869487 6974268 6567934 6394279 6376497 6406709 6493258
4624 6493258 6231395 6043283 6174487 6029725 5907681 5872939 5807876 5861960 5745393 5637430
4614 5637430 5738582 5674142 5590228 5488879 5461499 5611712 5589246 5565169 5390602 5483781 5355540
4603 5355540 5253819 5316809 5325605 5102288 5192820 5286403 5153205 4880942 4944470 5018011 5202648
4592 5202648 5251833 4955075 4863373 4811778 4793095 4697283 4911965 4959328 4870462 4773785 4643018
4581 4643018 4692313 4858573 4722432 4815713 4910221 4706326 4725204 4466820 4416820 4454817 4632512
4570 4632512 4738821 4445234 4534835 4428970 4202884 4398453 4404320 4347226 4465685 4525385
4560 4525385 4358376 4345712 4323133 4240076 4403773 4300348 4055260 4225274 4187361 4265858
4550 4265858 4299516 4094150 4205500 4184238 4426256 4458038 4430856 4233354 4137608 4156188 4306255
4539 4306255 4317323 4216975 4182712 4087766 4015962 4113867 4172431 3924972 3974261 4136492 4279026
4528 4279026 4222421 4110856 4206591 4087921 3956775 3871597 4085557 4253127 4220301 4475835
4518 4475835 4567384 4607372 4786588 4844673 5017138 5238483 5407148 5341551 5192210 5109266
4508 5109266 5125715 5097180 5180213 5071721 5054517 5358836 5432012 5279815 5183520 4747007 4716415
4497 4716415 4939798 4810398 4595833 4972509 5067351 5497831 5423910 5495976 5474510 5596394
4487 5596394 5534912 5709650 5920262 6131186 6174199 5984333 6316157 6362804 6370494 6049851
4477 6049851 5770602 5414460 5144821 4871899 4797289 4690496 4454600 4264853 4270756 4444762
4467 4444762 4304236 4163153 4215791 4438697 4559623 4662076 4819706 4624397 4733004 4957352
4457 4957352 5057268 4966627 5223622 5202959 5418237 5759121 6096767 6720049 6972741 6995494
4447 6995494 7277421 7123482 6710988 6065427 5543358 5389603 5311558 4939898 4841593 4638249
4437 4638249 4515741 4539174 4627048 4661209 4526824 4460359 4435995 4480631 4622599 4379716 4338446
4426 4338446 4383344 4517287 4658293 4755963 4598682 4734567 5091468 5214601 5232112 5350726
4416 5350726 5206585 5423554 5342662 5251751 5178841 4919465 4653762 4559635 4271718 4066455
4406 4066455 4113488 3929646 3719294 3753029 3939778 3796429 3793205 3780176 3799617 3486011 3658935
4395 3658935 3919924 3894530 3823647 3746359 3907100 3956014 3801592 3882413 3861458 3816552 3718733
4384 3718733 3639082 3361045 3433139 3371022 3331912 3378753 3037960 3092599 3128669 3161361 3120106
4373 3120106 3151991 3119143 3068961 3053055 3084450 2934648 2790479 2643205 2697769 2996777 2958823
4362 2958823 3091547 2965680 3044744 3071951 2884201 2856880 3113053 3023027 3167912 3117535
4352 3117535 3154305 3118999 2981014 2811143 2773095 2856533 2754755 2693820 2790731 2673871 2860933
4341 2860933 2783936 2760316 2578454 2324449 2207471 2460282 2449586 2271945 2481140 2556111
4331 2556111 2721605 2379932 2281909 2376178 2523919 2493580 2277507 2302592 2422585 2340509
4321 2340509 2444538 2333274 2177217 2392342 2550950 2426762 2226463 2190579 2167465 2252859
4311 2252859 2280698 2393999 2384031 2177478 2313879 2339476 2296261 2399160 2433525 2415058 2346331
4300 2346331 2161225 2235612 2065474 2057501 2201300 2259579 2264794 2346474 2263726 2243152 2261072
4289 2261072 2223726 2196397 2249977 2339708 2208424 2320248 2263035 2302021 2293001 2239673 2075442
4278 2075442 2213383 2413924 2354157 2303311 2000363 2003288 2135461 2168417 2345359 2372400 2149862
4267 2149862 2233790 2271529 2257510 2360427 2118706 2294803 2383310 2414833 2250409 2318571 2323645
4256 2323645 2171409 2261974 2219533 2479339 2321110 2383726 2283884 2281899 2386789 2459171 2322988
4245 2322988 2399760 2494608 2379145 2321198 2142304 2179831 2442731 2404462 2188205 2185367 2365021
4234 2365021 2515572 2370381 2449928 2322938 2143926 2120376 2349171 2107499 2083077 2275026
4224 2275026 2248940 2270281 2398938 2546369 2379738 2316555 2454828 2487711 2266067 2636691
4214 2636691 2540232 2537276 2599215 2476756 2544074 2530928 2541054 2532739 2680527 2682169 2492758
4203 2492758 2471278 2655696 2903245 2667479 2454565 2519615 2521649 2572356 2517725 2292005 2264613
4192 2264613 2455196 2499378 2307922 2417113 2330200 2369898 2502279 2448596 2445871 2340475 2373314
4181 2373314 2362318 2284417 2421096 2583166 2611724 2619138 2806935 2851318 2953167 2844275 2505860
4170 2505860 2569919 2522232 2510007 2296065 2283093 2290873 2233341 2168816 2248891 2290117 2161720
4159 2161720 2183825 1860896 1884639 1936629 1857477 1960176 2019601 2138946 2164409 2186595 2103932
4148 2103932 1957735 2225092 2277265 2058813 1942030 1769533 2078277 2033714 1998585 2297439
4138 2297439 2321227 2370613 2391818 2216591 2297839 2257545 2198287 2002910 2073590 2256189 2158601
4127 2158601 2084673 2112671 1954354 1873305 1731033 1780220 1987966 1988863 2196847 2251769 2141109
4116 2141109 1979089 2044395 2133892 2184613 2102101 2008671 1987263 1879373 2015781 2026309 1865927
4105 1865927 1761383 1903915 2066842 1963253 1850115 2065750 1922056 1932480 1861649 1759367
4095 1759367 1908841 2056082 2209767 2092619 1977369 2212758 2280679 2517903 2557061 2284161
4085 2284161 2281687 2292179 2084778 2023152 2084521 2039276 2090388 1993517 1969848 1940687 1909838
4074 1909838 1934833 1877628 1706803 1621227 1402036 1637241 1712494 1692018 1651022 1555603 1687909
4063 1687909 1677661 1489581 1680301 1870181 1827547 1929119 1941017 2075523 1982878 2018052
4053 2018052 1971067 1811598 1977380 1894062 1703718 1883537 1976456 1650339 1819488 1824235
4043 1824235 1829160 1960867 1890898 1905041 1896750 1849864 1877106 1906825 1986321 1911837 2123420
4032 2123420 2370222 2296366 1994396 1825481 1844068 1929051 1725693 1817820 1881084 1796113 1814598
4021 1814598 1791717 1990372 2268353 2089021 2095973 2351763 2111376 2089195 1949105 2001842
4011 2001842 2126448 2335741 2465982 2187174 2298718 2519308 2671434 2552461 2560712 2805871
4001 2805871 2661349 2641512 2558472 2483573 2612495 2675897 2562861 2343015 2521332 2545747
3991 2545747 2391553 2137571 1912060 2107483 2235173 2347592 2578103 2559852 2501204 2697473
3981 2697473 2467156 2705065 2855444 2792526 2774447 2977520 3355634 3347444 3141042 2770819
3971 2770819 2524587 2513559 2534003 2884181 2760262 2643020 2696307 2783270 2993406 3178215
3961 3178215 3320387 3666000 3446299 3207396 3190163 3228548 3044650 2959324 2698998 2467472
3951 2467472 2606712 2390524 2535192 2398063 2493267 2423516 2626540 2529455 2586439 2652720
3941 2652720 2616821 2553857 2640520 2821764 2841091 2722509 2606966 2347346 2173556 2190247
3931 2190247 2232804 2171575 2096313 2040851 1934999 2221484 2261317 2341950 2295012 2294885 2419526
3920 2419526 2288122 2327559 2397995 2611406 2638977 2676006 2781354 2995813 3132454 3075200
3910 3075200 3229460 3273421 3283331 3421375 3265134 3051148 2934276 2896802 2982312 3088774
3900 3088774 2889694 2588720 2639342 2639558 2778819 2789698 2740401 2625048 2820345 2902689 2981448
3889 2981448 2937862 2936445 3156558 3294245 3243322 3548113 3738090 3874623 4102804 4117170
3879 4117170 4069598 4117584 4012414 3786507 3990844 3862818 3306041 3098514 3131682 3051787
3869 3051787 3013581 2783127 2667504 2739082 2669323 2712379 2646097 2730625 2592058 2645087 2754988
3858 2754988 2755713 2902890 2765980 2891740 2999050 3074031 3265463 3380009 3407866 3445421 3472908
3847 3472908 3308047 2979860 2898570 3069362 3057863 2862503 2805570 2556065 2288470 2244541
3837 2244541 2206350 2386421 2356925 2227202 2235657 2151613 2069531 2330187 2356559 2112992 2206237
3826 2206237 2143481 2188726 2102892 1978297 2259099 2216596 2115393 2180799 2045028 2011318 2131094
3815 2131094 2239872 1929065 2004905 1840331 1576190 1492106 1548332 1699839 1665855 1742647
3805 1742647 1756914 1787262 1949851 1987651 1806330 1584542 1693304 1770045 1597431 1666263
3795 1666263 1539112 1553717 1396231 1345292 1558512 1480504 1413309 1661305 1481612 1348853
3785 1348853 1421890 1350918 1298902 1236082 1374042 1343620 1343774 1281055 1320146 1464920 1308725
3774 1308725 1205725 1335109 1366348 1221211 1201630 1350265 1141883 1212743 1261813 1185829
3764 1185829 1103799 1085741 1085526 1150835 985161 947897 1142000 1247545 1315123 1017117 1102303
3753 1102303 1072946 1127232 1146269 1048802 928011 901539 908401 865214 1195513 1368034 1352706
3742 1352706 1221100 1077845 1098571 1014281 978841 1136741 1199689 1259436 1242835 1061575 1149437
3731 1149437 1190074 1227640 1290558 1097364 804269 949470 1109790 1044865 966508 852021
3721 852021 966327 925846 1142092 1182199 1240599 1409692 1260549 1115021 1168703 1199514 1051883
3710 1051883 861328 1132563 1388698 1212136 1114816 1245683 1161377 1097357 1075796 1074000 1156737
3699 1156737 1221352 1239298 1235023 1258614 1052712 1238335 1337035 1254137 1165929 1142568 1087266
3688 1087266 1322976 1446149 1191226 1245759 1332182 1395508 1365360 1177339 1282933 1146731
3678 1146731 1024047 955385 1004616 1092312 1049900 1291291 1199736 1271186 1082757 1256097 1271186
3667 1271186 989978 984321 872078 969153 1162338 1200000 1194441 1540230 1195235 1001965 1119389
3656 1119389 1084309 972746 1137939 1177106 1137500 1075591 1281015 1386128 1246267 1241201 1324569
3645 1324569 1316717 1216247 1049926 1024034 1081188 1008979 1141954 1306651 1651529 1584635 1421784
3634 1421784 1632325 1627283 1366356 1218596 1136819 1165088 1297609 1207284 1247452 1306512 1036804
3623 1036804 1066888 1092891 961471 1095007 1127420 1017572 1066839 1207373 1063951 1054841 1339627
3612 1339627 1393978 1141277 992957 922523 848197 1023344 1035318 988887 953422 1128660 1187007
3601 1187007 981751 1075110 1143892 1081520 1028690 1208629 1172181 1051903 944947 918178 962266
3590 962266 1120683 1110667 938779 1150033 924911 913748 956557 888685 864823 1053150 1016525
3579 1016525 871021 1140980 1329437 1042854 887823 796229 793386 824213 1035168 1167959
3569 1167959 947819 841221 975603 977101 755358 761927 802559 744866 791443 872172 909684
3558 909684 1031088 1188337 993960 1014739 1127872 995649 1176717 971780 870638 919156
3548 919156 912354 806370 953333 1109451 957221 974373 861254 718035 798075 796019 853177
3537 853177 885896 777416 854779 806698 915587 1066748 882789 772084 941749 983172
3527 983172 981731 1015451 1154836 1109277 928277 875261 766080 875425 987498 880087 911180
3516 911180 1040981 1086517 1061958 969540 1085797 1102498 1045652 1121418 1173849 1140860 1149981
3505 1149981 1268006 1147407 1107922 942703 721106 636910 789499 951933 1049398 972957
3495 972957 981629 928269 1033706 1488786 1238195 761884 473830 567130 796278 1016497
3485 1016497 1091202 820235 783278 1069902 1109109 965839 1003400 992059 922691 1051565 1015879
3474 1015879 894970 798988 878337 792060 674257 629104 687110 866141 999458 976913 880860
3463 880860 841288 706892 747674 856780 978512 987450 785612 528280 623662 750343 848204
3452 848204 973591 722126 751816 823099 764853 752649 812400 780886 851001 888622 996838
3441 996838 991858 934828 913389 854336 960410 903122 821146 891857 978538 972838 847561 679289
3429 679289 920184 997024 924437 940620 1044846 1175386 1105080 1156721 1116429 997689 872992
3418 872992 966912 1084647 1060876 778645 856173 1048479 1238089 1187029 1021566 999090 927503
3407 927503 919616 951723 820880 791152 857801 1162493 1108290 954565 1092774 1139990 1092473
3396 1092473 928535 1150273 1250883 1038446 1010424 1058448 1271742 1285831 1147388 1143847
3386 1143847 1085027 1126991 1271318 1212097 1050626 1179023 1046333 1151084 1293629 1258762
3376 1258762 1124908 1178449 1251396 1319969 1223143 1123467 1284817 1636528 1400826 1200822
3366 1200822 1213459 1312255 1328575 1705605 1663861 1682564 1566372 1539620 1644329 1520958 1343344
3355 1343344 1225242 1487781 1796581 1865116 2014746 1962141 1775293 2010176 2178393 1989453
3345 1989453 2108704 2137235 2008350 2214373 2542860 2589597 2568994 2641894 2583098 2776450
3335 2776450 2730040 2718304 2685189 2885813 2737796 2745525 2879153 3035096 2954833 2758570 2756107
3324 2756107 2699929 2856526 3051863 3126367 3309849 3271596 3557473 3633709 3745745 3871520
$$ [...]
##END NTUPLES=NMR SPECTRUM
##END=
