##TITLE=1H_CA-8946-1
 CDCl3
 8 sc, 
 8.11.2021
##JCAMPDX= 6.0         $$ Bruker NMR JCAMP-DX V2.0
##DATA TYPE= NMR SPECTRUM
##DATA CLASS= NTUPLES
##ORIGIN= UXNMR, Bruker Analytische Messtechnik GmbH
##OWNER= root
$$ XWIN-NMR		Version 3.5
$$ Mon Nov  8 11:22:23 2021 Russian Standard Time (UT+4h)  she@DPX200
##.OBSERVE FREQUENCY= 200.1313468511
##.OBSERVE NUCLEUS= ^1H
##.ACQUISITION MODE= SIMULTANEOUS
##.ACQUISITION SCHEME= undefined
##.AVERAGES= 8
##.DIGITISER RES= 18
##SPECTROMETER/DATA SYSTEM= spect
##.PULSE SEQUENCE= zg30
##.SOLVENT NAME= D2O
##.SHIFT REFERENCE= (INTERNAL, D2O, 0, 15.7491)
##AUDIT TRAIL= $$ (NUMBER, WHEN, WHO, WHERE, WHAT)
$$ ##TITLE= Audit trail, XWIN-NMR		Version 3.5
$$ ##JCAMPDX= 5.01
$$ ##ORIGIN= Bruker BioSpin GmbH
$$ ##OWNER= she
$$ F:/spectra/data/she/nmr/H-F/1/pdata/1/auditp.txt
$$ ##AUDIT TRAIL=  $$ (NUMBER, WHEN, WHO, WHERE, WHAT)
(   1,<2021-11-08 11:20:44.07 +0400>,<she>,<DPX200>,
      <created by zg, POWCHK disabled, PULCHK disabled
       configuration hash MD5:
       00 E9 B6 7A A2 85 ED C7 34 08 36 98 17 FE 4E 26
       data hash MD5: 16K
       A1 28 BE A2 22 AE 99 34 65 D8 25 9E 79 ED E0 7B>)
(   2,<2021-11-08 11:21:12.87 +0400>,<she>,<DPX200>,
      <Start of raw data processing
       efp BC_mod = 2 LB = 0.24 FT_mod = 6 PKNL = 1 PHC0 = -15152.36 PHC1 = 10.20082 SI = 16K 
       data hash MD5: 16K
       8F 02 F2 F1 5B 91 AB B5 B7 F0 E7 2E EB 5A 1C 7B>)
(   3,<2021-11-08 11:21:17.42 +0400>,<she>,<DPX200>,
      <abs ABSG = 5 
       data hash MD5: 16K
       D8 B5 05 72 CA A1 3D FA 6F 5C 89 4D 33 AC C3 C7>)
(   4,<2021-11-08 11:21:41.68 +0400>,<she>,<DPX200>,
      <pk PHC0 = -1.032419 PHC1 = -0.5999962 
       data hash MD5: 16K
       AF F8 E5 4A E8 D0 12 03 10 C3 75 A4 1B 72 9F A0>)
(   5,<2021-11-08 11:21:44.78 +0400>,<she>,<DPX200>,
      <abs ABSG = 5 
       data hash MD5: 16K
       7B D9 E5 21 54 02 A6 35 1D 4F CC 3E C0 F6 2F 0D>)
$$ ##END=
$$ 
$$ hash MD5
$$ AA C3 23 7B 5C 13 47 1D 30 6C EE 70 64 95 A3 48
##$RELAX= 
##$RELAX= 
##$RELAX= 
##$RELAX= 
##$RELAX= 
##$RELAX= 
$$ Bruker specific parameters
$$ --------------------------
##$DU= <F:/spectra>
##$EXPNO= 1
##$NAME= <H-F>
##$PROCNO= 1
##$TYPE= <nmr>
##$USER= <she>
##$AMP= (0..31)
100 100 100 100 100 100 100 100 100 100 100 100 100 100 100 100 100 100 
100 100 100 100 100 100 100 100 100 100 100 100 100 100 
##$AQSEQ= 0
##$AQ_mod= 1
##$AUNM= <au_zg>
##$AUTOPOS= <>
##$BF1= 200.13
##$BF2= 200.13
##$BF3= 200.13
##$BF4= 200.13
##$BF5= 200.13
##$BF6= 200.13
##$BF7= 200.13
##$BF8= 200.13
##$BYTORDA= 1
##$CFDGTYP= 0
##$CFRGTYP= 5
##$CHEMSTR= <none>
##$CNST= (0..31)
1 1 145 1 1 1 1 1 1 1 1 1 1 1 1 1 1 1 1 1 1 1 1 1 1 1 1 1 1 1 1 1 
##$CPDPRG= <>
##$CPDPRG1= <>
##$CPDPRG2= <>
##$CPDPRG3= <>
##$CPDPRG4= <mlev>
##$CPDPRG5= <mlev>
##$CPDPRG6= <mlev>
##$CPDPRG7= <mlev>
##$CPDPRG8= <mlev>
##$CPDPRGB= <>
##$CPDPRGT= <>
##$D= (0..31)
0 1.2 0 0 0 0 0 0 0 0.06 0 0.03 0 0 0 0 0.0002 0 0 0 0 0 0 0 0 0 0 0 0 
0 0 0 
##$DATE= 1636356043
##$DBL= (0..7)
$$ [...]
##$SUBNAM2= <"">
##$SUBNAM3= <"">
##$SUBNAM4= <"">
##$SUBNAM5= <"">
##$SUBNAM6= <"">
##$SUBNAM7= <"">
##$SUBNAM8= <"">
##$SUBNAM9= <"">
##$SW= 18.0517286264689
##$SWIBOX= (0..15)
0 0 2 0 0 0 0 0 0 0 0 0 0 0 0 0 
##$SW_h= 3612.71676300578
##$TD= 16384
##$TD0= 1
##$TE= 0
##$TE2= 300
##$TE3= 300
##$TEG= 300
##$TL= (0..7)
0 120 120 120 120 120 120 120 
##$TP= (0..7)
150 150 150 150 150 150 150 150 
##$TP07= 0
##$TPNAME0= <>
##$TPNAME1= <>
##$TPNAME2= <>
##$TPNAME3= <>
##$TPNAME4= <>
##$TPNAME5= <>
##$TPNAME6= <>
##$TPNAME7= <>
##$TPOAL= (0..7)
0.5 0.5 0.5 0.5 0.5 0.5 0.5 0.5 
##$TPOFFS= (0..7)
0 0 0 0 0 0 0 0 
##$TUNHIN= 0
##$TUNHOUT= 0
##$TUNXOUT= 0
##$USERA1= <user>
##$USERA2= <user>
##$USERA3= <user>
##$USERA4= <user>
##$USERA5= <user>
##$V9= 5
##$VALIST= <valist>
##$VCLIST= <CCCCCCCCCCCCCCC>
##$VD= 0
##$VDLIST= <DDDDDDDDDDDDDDD>
##$VPLIST= <PPPPPPPPPPPPPPP>
##$VTLIST= <TTTTTTTTTTTTTTT>
##$WBST= 1024
##$WBSW= 4
##$XGAIN= (0..3)
0 0 0 0 
##$XL= 0
##$YL= 0
##$YMAX_a= 177703
##$YMIN_a= -256642
##$ZGOPTNS= <>
##$ZL1= 120
##$ZL2= 120
##$ZL3= 120
##$ZL4= 120
##$ABSF1= 15.72375
##$ABSF2= -2.328099
##$ABSG= 5
##$ABSL= 3
##$ALPHA= 0
##$AQORDER= 0
##$ASSFAC= 0
##$ASSFACI= 0
##$ASSFACX= 0
##$ASSWID= 0
##$AUNMP= <proc_1d>
##$AZFE= 0.1
##$AZFW= 0.1
##$BCFW= 0
##$BC_mod= 2
##$BYTORDP= 0
##$COROFFS= 0
##$CY= -3
##$DATMOD= 1
##$DC= 0
##$DFILT= <>
##$DTYPP= 0
##$F1P= 0
##$F2P= 0
##$FCOR= 1
##$FTSIZE= 16384
##$FT_mod= 6
##$GAMMA= 0
##$GB= 0
##$INTBC= 1
##$INTSCL= 0
##$ISEN= 128
##$LB= 0.24
##$LEV0= 0
##$LPBIN= 0
##$MAXI= 10000
##$MC2= 0
##$MEAN= 0
##$ME_mod= 0
##$MI= 1.114404
##$NCOEF= 0
##$NC_proc= -7
##$NLEV= 6
##$NOISF1= 3.799351
##$NOISF2= 2.8
##$NSP= 0
##$NTH_PI= 0
##$NZP= 0
##$OFFSET= 15.74909
##$PC= 1
##$PHC0= -15153.39
##$PHC1= 9.600823
##$PH_mod= 1
##$PKNL= yes
##$PPARMOD= 0
##$PSCAL= 0
##$PSIGN= 0
##$REVERSE= no
##$SF= 200.130001343046
##$SI= 16384
##$SIGF1= 3
##$SIGF2= 2
##$SINO= 5.538805
##$SIOLD= 16384
##$SREGLST= <1H.CDCl3>
##$SSB= 0
##$STSI= 16384
##$STSR= 0
##$SW_p= 3612.71676300578
##$SYMM= 0
##$S_DEV= 0
##$TDeff= 16384
##$TDoff= 0
##$TI= <>
##$TILT= no
##$TM1= 0
##$TM2= 0
##$TOPLEV= 0
##$USERP1= <user>
##$USERP2= <user>
##$USERP3= <user>
##$USERP4= <user>
##$USERP5= <user>
##$WDW= 1
##$XDIM= 16384
##$YMAX_p= 279058164
##$YMIN_p= -396598
$$ End of Bruker specific parameters
$$ ---------------------------------
##NTUPLES= NMR SPECTRUM
##VAR_NAME=  FREQUENCY,     SPECTRUM/REAL,   SPECTRUM/IMAG
##SYMBOL=    X,             R,               I
##VAR_TYPE=  INDEPENDENT,   DEPENDENT,       DEPENDENT
##VAR_FORM=  AFFN,          ASDF,            ASDF
##VAR_DIM=   16384,         16384,           16384
##UNITS=     HZ,            ARBITRARY UNITS, ARBITRARY UNITS
##FACTOR=    0.220516191357247, 1,           1
##FIRST=     3151.86544181749, 0,            0
##LAST=      -460.851321188287, 0,           0
##MIN=       -460.851321188287, -396598,     0
##MAX=       3151.86544181749, 279058164,    0
$$ Real data points
##PAGE= N=1
##DATA TABLE= (X++(R..R)), XYDATA
$$ [...]
8088C129043J0591J60844o9920j30837R8136r534j7174k74423L0550J51789N9782
$$ 3129043 3139634 3300478 3230558 3099721 3197857 3188323 3171149 2896726 2927276 3079065 3138847
8077C138847k9386k27056J30302m0772P7926j9225m6623J14565J43995P5230p5996
$$ 3138847 3109461 2882405 3012707 2971935 3049861 3030636 2984013 3098578 3242573 3317803 3241807
8066C241807k15144N5097P8735q7563O0166J8764l6293o3290J02499j334j91171
$$ 3241807 3026663 3081760 3160495 3072932 3133098 3151862 3115569 3052279 3154778 3153444 2962273
8055B962273l4293j06986k4233J7424l404N929j0195m1895j11402J54699J00920
$$ 2962273 2927980 2820994 2796761 2814185 2810781 2816710 2806515 2764620 2653218 2807917 2908837
8044B908837n7864M885R4589q7380l64428p9522k1739J31841j014O9742p9181
$$ 2908837 2850973 2855858 2950447 2863067 2498639 2419117 2397378 2529219 2528205 2597947 2518766
8033B518766k4967K957J439o7487k1891P3571J8840n1447J5818J72519K0657O446
$$ 2518766 2493799 2496756 2498195 2430708 2408817 2482388 2501228 2449781 2465599 2638118 2658775 2665221
8021B665221l9681n2791k8398N2607m3108K19928m547k7697m3843k5367j31087
$$ 2665221 2625540 2572749 2544351 2596958 2553850 2773778 2769231 2741534 2697691 2672324 2541237
8010B541237J87238J83600P9303Q5471m0646P0367J4621r0127p6345K28888k1362
$$ 2541237 2728475 2912075 2991378 3076849 3036203 3106570 3121191 3031064 2954719 3183607 3162245
7999C162245J95758J7870p8008j4380J67993r0420J136l660P197L5776Q3531o8938
$$ 3162245 3358003 3375873 3297865 3283485 3451478 3361058 3362194 3358534 3365731 3401507 3485038 3416100
7987C416100j3289J01731p2434j2791j7601k55069k83866j1953l3045J50290R2617
$$ 3416100 3402811 3504542 3432108 3419317 3401716 3146647 2862781 2850828 2817783 2968073 3060690
7976C060690k7408N8791K7207k0529K07409P7760N4456l2660j42997O2213m003
$$ 3060690 3033282 3092073 3119280 3098751 3306160 3383920 3438376 3405716 3262719 3324932 3320929
7965C320929R5568J08291j6793J55903o3458n6206J4390N7124J608K14751J06777
$$ 3320929 3416497 3524788 3507995 3663898 3600440 3544234 3558624 3615748 3617356 3832107 3938884
7954C938884R4777L1087M6833n1447Q9397J35654p626J56211J27885Q1259J50795
$$ 3938884 4033661 4064748 4111581 4060134 4149531 4285185 4277559 4433770 4561655 4642914 4793709
7943D793709P3507k6906K00415K11307R5733J83082J75285J10722K20565L64372
$$ 4793709 4867216 4840310 5040725 5252032 5347765 5530847 5706132 5816854 6037419 6401791
7933F401791J11963J82031J46927M8109J81747q2860Q841m3656j77744Q2685P9167
$$ 6401791 6513754 6695785 6842712 6890821 7072568 6989708 6998549 6954893 6777149 6859834 6939001
7922F939001l02942q4753L9621j98400j64949q4580o6497j12851k63378r4654
$$ 6939001 6636059 6551306 6590927 6392527 6227578 6142998 6076501 5963650 5700272 5605618
7912E605618K9556j92375k69943p923o5456k05031K1644j04057j87372K3010O1623
$$ 5605618 5635174 5442799 5172856 5164933 5099477 4894446 4916090 4812033 4624661 4647671 4709294
7901D709294j38361k21632k3454m1639k88012K1489j70347j70424j51696k4718
$$ 4709294 4570933 4349301 4325847 4284208 3996196 4017685 3847338 3676914 3525218 3500500
7891C500500m3709l7422K1037r0246M942k10271o7485j0030p692p4201j14545
$$ 3500500 3456791 3419369 3440406 3350160 3355102 3144831 3077346 3067316 3059624 2985423 2870878
7880B870878K00342j55209n9678j6406j32194J60126j24461q0839Q9410K3702
$$ 2870878 3071220 2916011 2856333 2839927 2707733 2867859 2743398 2662559 2751969 2775671
7870B775671L4690k8984N0591n2312J03943R0498j06549j76276l5984J0303n6611
$$ 2775671 2810361 2781377 2831968 2779656 2883599 2974097 2867548 2691272 2655288 2665591 2608980
7859B608980n0194L5999r0489k56998R6404l3380k22596l1534J07083j31573J4517
$$ 2608980 2558786 2594785 2504296 2247298 2343702 2310322 2087726 2056192 2163275 2031702 2046219
7848B046219j48006j52595m9278J65234J19783j07439J8678L1217j85210J03168
$$ 2046219 1898213 1745618 1696340 1861574 1981357 1873918 1892596 1923813 1738603 1841771
7838A841771l4784o4046q0379n4896o843K6366q4884J91983j00341q2746n7981
$$ 1841771 1806987 1742941 1662562 1607666 1600823 1627189 1542305 1734288 1633947 1551201 1493220
7827A493220m8768K3396Q109M3113k35143J8345P0234L3577J04876J3387j24593
$$ 1493220 1444452 1467848 1475957 1519070 1283927 1302272 1372506 1406083 1510959 1524346 1399753
7816A399753q0688n2207l7777N4315N7007K035l505L0484J0857j99871R2496l4081
$$ 1399753 1319065 1266858 1229081 1283396 1340403 1342438 1338933 1369417 1380274 1180403 1272899 1238818
7804A238818m4569J40222k8259j38304J55100J36663l1565k81243n6081J59584
$$ 1238818 1194249 1334471 1306212 1167908 1323008 1459671 1428106 1146863 1090782 1250366
7794A250366j47443J04110J31562L5455J57945n6971N0331n0242q4226N3492k857
$$ 1250366 1102923 1207033 1338595 1374050 1531995 1475024 1525355 1475113 1390887 1444379 1441522
7783A441522j6410k5251R565J49596m1321k9467j02338n1593k5463m3965l5096
$$ 1441522 1425112 1399861 1409426 1559022 1517701 1488234 1385896 1334303 1308840 1264875 1229779
7772A229779K2573m6399j62863O0316J137l5654j5384k6307M4922J23939j15023
$$ 1229779 1252352 1205953 1043090 1103406 1104543 1068889 1053505 1027198 1072120 1196059 1081036
7761A081036p2546o6639M3150M0231O030j5906k6335j56680Q8915K22387q2773
$$ 1081036 1008490 941851 985001 1025232 1031262 1015356 989021 832341 921256 1143643 1060870
7750A060870j66146j64064j2283J34070J34157p6336q3177J8002j2598K0908M403
$$ 1060870 894724 730660 718377 852447 986604 910268 827091 845093 832495 853403 857806
7739H57806j59229J00366o2151J12089j81101J7234Q0817Q6727m6658n9615p0001
$$ 857806 698577 798943 736792 848881 667780 685014 765831 852558 805900 746285 676284
7728F76284p8722M162q2390L1171r3587J62028o0036k0259r0880l6891N5660k8404
$$ 676284 597562 601724 519334 550505 456918 618946 558910 538651 447771 410880 466540 438136
7716D38136M9122m437r9120n0219J50281Q8968j14816k2461m4134R370J07589
$$ 438136 487258 482821 383701 333482 483763 572731 457915 435454 391320 400690 508279
7705E08279J57263j82206P4265P3154j53233q2242j25254J55017N0619j23942
$$ 508279 665542 483336 557601 630755 477522 395280 270026 425043 475662 351720
7695C51720k5644R7128R9836P2813k15801j41840O3054R9313m7531K942N521j50142
$$ 351720 326076 423204 523040 595853 380052 238212 301266 400579 353048 355990 361511 211369
7683B11369N7958P9878J8751Q881k02034r8508J38126L028R1828J06546n2816
$$ 211369 269327 349205 367956 376837 174803 76295 214421 217449 309277 415823 363007
7672C63007k50823J42390L0823p6546J57769M8915q5011L2147j31368Q1617M13
$$ 363007 112184 254574 285397 208851 366620 415535 330524 362671 231303 312920 313333
7661C13333P7208M0541j46325j7239j12798J6460k1497l709M9377j7582m5564
$$ 313333 390541 431082 284757 267518 154720 171180 149683 145974 195351 177769 132205
7650A32205l9444o7855J3957R8596N0485J56941j63661p4649k0716J87678j64504
$$ 132205 92761 24906 38863 137459 187944 344885 181224 106575 85859 273537 109033
7639A09033j32290K89514l0355n6452r2265k6507L267R8606k0062J00529K9390
$$ 109033 -23257 266257 235902 179450 87185 60678 63945 162551 142489 243018 272408
7628B72408n0136q6143Q8947K5437m2249m4501r959N216O3441j38995o118p2474
$$ 272408 222272 136129 225076 250513 208264 163763 153804 159020 222461 83466 77348 4874
7616D874O4216L3551N1385j7556O4303o9884p98M3030q5245K0696k1878K49124
$$ 4874 69090 102641 154026 136470 200773 130889 130091 173121 87876 108572 86694 335818
7604C35818q2354o8761J25975P7782j38260j28822N9048J56385k750j53214P3228
$$ 335818 253464 184703 310678 388460 250200 121378 180426 336811 334061 180847 254075
7593B54075j1597l8102R4708O1171M2798m7748j33122P8430Q2237L1874K4957
$$ 254075 242478 204376 299084 360255 403053 355305 222183 300613 382850 414724 439681
7582D39681r3022j40524p6170k6664J25920q6987o0211J1072j2106J08245j77084
$$ 439681 346659 206135 129965 103301 229221 142234 82023 93095 80989 189234 12150
7571A2150P0931r0646l805J71453p1483J30871Q0882j06795r5259Q8913L5163
$$ 12150 83081 -7565 -11370 160083 88600 219471 300353 193558 98299 187212 222375
7560B22375l0240N8224N988J460j70316p0567M9655j08901n2015o6507Q0714J86750
$$ 222375 192135 250359 256347 257807 87491 16924 66579 -42322 -94337 -160844 -80130 106620
7548A06620O3964k4234J34621Q5818j02976j41240M9010l1585j35819O6632K28484
$$ 106620 170584 146350 280971 366789 263813 122573 171583 139998 4179 70811 299295
7537B99295P9632l27104l1072p3714J64286J2869J6025p576j33251J11519J23317
$$ 299295 378927 51823 20751 -52963 111323 124192 140217 132641 -610 110909 234226
7526B34226j7111j51587J5371L1771p4321J1189k3716j3942P8629J14835k8674
$$ 234226 217115 65528 80899 112670 38349 49538 25822 11880 90509 205344 176670
7515A76670m7236J3414j4629O5531P8617p6247j80852j8569J16085q669l5561
$$ 176670 129434 142848 128219 193750 272367 196120 15268 -3301 112784 104115 68554
7504F8554L3854O267K7246K0713M5524q7415O2457j0348J7807J71783j33700j04810
$$ 68554 102408 108675 135921 156634 202158 114743 177200 166852 184659 356442 222742 117932
7492A17932j7708J13257k538j8473n0778J920L5873Q4799N60J2208j15639j42271
$$ 117932 100224 213481 210943 192470 141692 143612 179485 264284 264844 277052 161413 19142
7480A9142K04226o6752k9582N2791J23879o3321N036K8987j11646k7625J2608
$$ 19142 223368 156616 127034 179825 303704 240383 245419 274406 162760 135135 147743
7469A47743J15313Q9153m1616q6958n0728j13764M9771q1479L9111q0339m644
$$ 147743 263056 352209 310593 223635 172907 59143 108914 27435 66546 -13793 -18437
7458a8437K5489o7521K4875J47603K4503j3201J52349r6377j69513N036J16193
$$ -18437 7052 -60469 -35594 112009 136512 123311 275660 179283 9770 14806 130999
7447A30999K7823O5146j22465J9365n0440J46146R7412J868j33728k1791N7733
$$ 130999 158822 223968 101503 120868 70428 216574 313986 315854 182126 160335 218068
7436B18068k7239j7096k1956N7987m1723L8456J19364K5207j33294p2630m8954
$$ 218068 190829 173733 151777 209764 168041 206497 325861 351068 217774 145144 96190
7425I6190J14369q6779k6826q398j63415J57473P8918j72820j3501K15647O0523
$$ 96190 210559 123780 96954 88556 -74859 82614 161532 -11288 -24789 190858 251381
7414B51381j623j04172K6834m7634K07929K2612k71646J63118J17368j34336K4887
$$ 251381 249758 145586 172420 124786 332715 355327 83681 246799 364167 229831 254718
7403B54718Q1633j42683j10113J55189M6428j43671J61054j86716n8279K53724
$$ 254718 336351 193668 83555 238744 285172 141501 302555 115839 57560 311284
7393C11284r4110N8734q5304p9326k9650L9470O0947k718J23093O6752j2995j51135
$$ 311284 217174 275908 190604 111278 81628 121098 182045 179327 302420 369172 356177 205042
7381B05042J9255K751m0703J42952n9618j7833Q0683j8086j35311l1561L2507
$$ 205042 224297 227048 186345 329297 269679 251846 332529 314443 179132 147571 180078
7370A80078r578Q689n2072l2577K05348J38264j48683j82549l2590K28465M1234
$$ 180078 170500 179189 127117 94540 299888 438152 289469 106920 74330 302795 344029
7359C44029k38782J20228j8292k6702P6664M8149p9694j12246J40540R0619m9557
$$ 344029 105247 225475 207183 180481 257145 305294 225600 113354 253894 344513 294956
7348B94956N0206M9324n0384p4123l1836J22857q3052j52142M196J39972N0730
$$ 294956 345162 394486 344102 269979 238143 361000 277948 125806 130002 269974 320704
7337C20704o046N5397l1522n9203J1656m8459J8445k5460J3227O6792o549O133
$$ 320704 314658 370055 338533 279330 290986 242527 260972 235512 248739 315531 308982 315115
7325C15115N59L8416M7936j45826J40476q6183P0697j62174o9510K57995j23253
$$ 315115 315674 354090 402026 256200 396676 310493 381190 219016 149506 407501 284248
7314B84248j86936N9354K5519K7972O5449q064n0208P2964k49286M5957J54667
$$ 284248 97312 156666 182185 210157 275606 267542 217334 290298 41012 86969 241636
7303B41636J17029m8250J9886r6806L3344J10192j51268Q4288k5591k33954j07717
$$ 241636 358665 310415 330301 233495 266839 377031 225763 310051 284460 50506 -57211
7292e7211Q0442J13856L5625j29801J25993q0305J6489r9657J2086J12629k3046
$$ -57211 23231 137087 172712 42911 168904 88599 105088 5431 17517 130146 107100
7281A07100M6195L5188j22504M2251J3713n7718O5685o9172R2701q5839q1460
$$ 107100 153295 188483 65979 108230 121943 64225 129910 60738 153439 67600 -13860
7270a3860P2313k1775q8557P1666R3276r2238p6760J77611J47538m5378K3342
$$ -13860 58453 36678 -51879 19787 113063 20825 -55935 121676 269214 223836 247178
7259B47178j89000p0200K91421l3203j79175O0664k12273R7976L2490J25586k0031
$$ 247178 58178 -12022 279399 246196 67021 127685 -84588 13388 45878 171464 151433
7248A51433j83040o1657R1558L3353p3610M1897L5180N4104q8483j42078M1485
$$ 151433 -31607 -93264 -1706 31647 -41963 -66 35114 89218 735 -141343 -99858
7237i9858M6683J27769j3537R0967Q3063j18599j02324K9479p8744j21464J22222
$$ -99858 -53175 74594 61057 152024 235087 116488 14164 43643 -35101 -156565 -34343
7226c4343n5609J04498m3509J72332n9354N3990Q2118o6237j16052k05818K96161
$$ -34343 -89952 14546 -28963 143369 84015 138005 220123 153886 37834 -167984 128177
7215A28177M9590p9727J3631l3166j23993R0661Q253K6391L044R42N3491j74334
$$ 128177 177767 98040 111671 78505 -45488 45173 53426 79817 82861 83803 137294 -37040
7203c7040J32609O0173j98949J45046m8175J61151K8462o3823j96673n2804K6249
$$ -37040 95569 155742 -43207 101839 53664 214815 243277 179454 -17219 -70023 -43774
7192d3774J4399O2424n6293r7549M4655P8512L5855N2526j96634j2191L3920Q4816
$$ -43774 -29375 33049 -23244 -120793 -76138 2374 38229 90755 -105879 -118070 -84150 666
7180F66R194R2296q3506J1800K4422K3671J59333n8492l2510O4535K4397p2599
$$ 666 9860 102156 18650 30450 54872 78543 237876 179384 146874 211409 235806 163207
7168A63207j22840M3112j4059K1930J64303k05985K7202j0143L2398J82959N7794
$$ 163207 40367 83479 69420 91350 255653 49668 76870 66727 99125 282084 339878
7157C39878l7915j42055N1595r2343q8224L3537j03297K48033r4556j09756K4194
$$ 339878 301963 159908 211503 119160 30936 64473 -38824 209209 114653 4897 29091
7146B9091m6634O4359j24217Q1005Q6460O8212O7605j5126j59263r1406p1240
$$ 29091 -17543 46816 -77401 3604 90064 158276 225881 210755 51492 -39914 -111154
7135a11154l8218j7023P4892N3476R8452N1590N2558j39585N2248j5676j54510
$$ -111154 -149372 -166395 -91503 -38027 60425 112015 164573 24988 77236 61560 -92950
7124i2950l3825J10560J15997o0255m7523M8903K23147M8713p9053P4288k18631
$$ -92950 -126775 -16215 99782 39527 -7996 40907 264054 312767 233714 308002 89371
7113H9371Q8044O6396n4725n6247M5842K3141J49773j10281p2529K8024j99362
$$ 89371 177415 243811 189086 132839 178681 201822 351595 241314 168785 196809 -2553
7102b553J55882R6233r2591j08500K4197J33070P6567J0106M9889k3961j57672
$$ -2553 153329 249562 156971 48471 72668 205738 282305 292411 342300 318339 160667
7091A60667q7181N7374k4435o7522k0798M2576N1009k3963K0127O7039j5646O1478
$$ 160667 73486 130860 106425 38903 18105 60681 111690 87727 107854 174893 159247 220725
7079B20725k6086J3842q6983k88824K16971K78485K9001j10283j80196j20104
$$ 220725 194639 208481 121498 -167326 49645 328130 357131 246848 66652 -53452
7069e3452J2840l1347R9759J63144J48717P1828k08296J24753Q0250M4586n0336
$$ -53452 -40612 -71959 27800 190944 339661 411489 203193 327946 408196 452782 402446
7058D02446n2414m7910j19971J88705J1047p7140J0699l5388j09061J00995q0433
$$ 402446 350032 302122 182151 370856 381903 304763 315462 280074 171013 272008 191575
7047A91575J53939N5402j67037l2298l9003q6138j1293K7017j6740N6481r6197
$$ 191575 345514 400916 233879 201581 162578 76440 65147 92164 75424 131905 35708
7036C5708J46022l8343J07613L8967r9062J20517K46278L6628j22084j07651j43017
$$ 35708 181730 143387 251000 289967 190905 311422 557700 594328 472244 364593 221576
7025B21576P1071Q4561K9520K6768p3507n0968p0502J91581j51813p8235k4330
$$ 221576 292647 377208 406728 433496 359989 309021 238519 430100 278287 200052 175722
7014A75722Q2702J93736j24399q4961J17886M95J77407j41829p0071J3236j06931
$$ 175722 258424 452160 327761 242800 360686 361181 538588 396759 326688 339924 232993
7003B32993l2194K6931K04068l1057N2164O5550j1881R5728j25082P4886R5212
$$ 232993 200799 227730 431798 400741 452905 518455 506574 602302 477220 552106 647318
6992F47318n0370m3203n9102k65314o5255K46437L9533j12885q1831O2279r294
$$ 647318 596948 553745 494643 229329 164074 410511 450044 337159 255328 317607 308313
6981C08313J22526k9696p3955K46607o4259j8736m5533j9568M5308p6703P0451
$$ 308313 430839 401143 327188 573795 509536 490800 445267 425699 471007 394304 464755
6970D64755J41133j05614l3061j02509O2749O2410n3837L7711J12660j7193n5141
$$ 464755 605888 500274 467213 364704 427453 489863 436026 473737 586397 569204 514063
6959E14063j0918j51583p2489J97159J96921Q499j25737j29385o1361n223J46974
$$ 514063 503145 351562 279073 476232 673153 681652 555915 426530 365169 359946 506920
6948E06920j14339J01435J66289j8230j57874L0936o7456P2531p8444r7459K0375
$$ 506920 392581 494016 660305 642075 484201 515137 447681 520212 441768 344309 364684
6937C64684J45461p6394j12381L0242K36284P7481j38340J7902l5086O9703J44447
$$ 364684 510145 433751 321370 351612 587896 665377 527037 544939 509853 579556 724003
6926G24003j52464L6897p2980q3901M6236m3533O4852N9045q9328L4925Q2639
$$ 724003 571539 608436 535456 451555 497791 454258 519110 578155 488827 523752 606391
6915F06391p3593j32813o4361n6916J47699Q1419j9633j87737n8304J15213J67726
$$ 606391 532798 399985 335624 278708 426407 507826 488193 300456 242152 357365 525091
6904E25091q4999j22491Q4925N1446n7998o2320O1315M9947n7112k3388j08324
$$ 525091 440092 317601 402526 453972 395974 333654 394969 444916 387804 364416 256092
6893B56092p1460j4154P1409J54169l7432j14851q6536J54425J00555N1436J04862
$$ 256092 184632 170478 241887 396056 358624 243773 157237 311662 412217 463653 568515
6882E68515j04057l261j16433J27691l7923q9172L0645J5003j8838o9177N5582
$$ 568515 464458 461197 344764 472455 434532 345360 376005 391008 372170 302993 358575
6871C58575m5267j7043j8670N6669N6586K01149l6362K3896j68908r1597R2028
$$ 358575 313308 296265 277595 334264 390850 591999 555637 579533 410625 319028 411056
6860D11056j5138o8036K6418q81K1616n274J16142J31272n2312m8154L7879P7292
$$ 411056 395918 327882 354300 353419 375035 369761 485903 617175 564863 516709 554588 631880
6848F31880j13164n0374J56230m4626j36394J53538l0201k08316K7146L2604O7781
$$ 631880 518716 468342 624572 579946 443552 597090 566889 358573 385719 418323 486104
6837D86104q7868L6537l1687R8549L0158r5399P2685J7270n2647N1253l9328q0268
$$ 486104 398236 434773 403086 501635 531793 436394 509079 526349 473702 524955 485627 405359
6825D05359l8502q618O3165L3986J39960j70124j27790R0375j50792J82544J31899
$$ 405359 366857 358239 421404 455390 595350 425226 297436 387811 237019 419563 551462
6814E51462j86919n175P7641J24059K932l9794l9575k537J25453j42940p4389
$$ 551462 364543 359368 437009 561068 564000 524206 484631 482094 607547 464607 390218
6803C90218J17487K29769j58347K0629J43396N4019n165j10782j82284r1335J05769
$$ 390218 507705 737474 579127 599756 743152 797171 792006 681224 498940 407605 513374
6792E13374n3516m604Q5237M927L5376m5637j4770j31472J48379P9994j35683
$$ 513374 459858 455254 540491 545418 580794 535157 520387 388915 537294 617288 481605
6781D81605j82605P7509J22021j64j965K8650m0940j5852R752j62034Q1347J67174
$$ 481605 299000 376509 498530 498366 496401 525051 484111 468259 478011 315977 397324 564498
6769E64498l5261M1553N521k19529l2185L3381q9757L0820J32758j46642Q5653
$$ 564498 529237 570790 576311 356782 324597 357978 268221 299041 431799 285157 370810
6758C70810K5119K7209l3316j6169J57004J17175o9445J35656j63603j21253J37997
$$ 370810 395929 423138 389822 373653 530657 647832 578387 714043 550440 429187 567184
6747E67184P1518j14083k22601P5488K0689N9177J65710j6496j05744P8431J46606
$$ 567184 638702 524619 302018 377506 398195 457372 623082 606586 500842 579273 725879
6736G25879M7761q3873j02862J30689l0373m460K6704o3892p3972K7327o389n6162
$$ 725879 773640 689767 586905 717594 687221 682761 709465 645573 571601 598928 592539 536377
6724E36377m105J42728K9250R8570p4400n1342K1862k5824Q904j20047o6334M245
$$ 536377 532272 675000 704250 802820 728420 677078 698940 673116 682020 561973 495639 499884
6712D99884M0463J74289p32J62776P0239P9236j46742j05489r4151Q9630k0498
$$ 499884 540347 714636 713904 876680 946919 1026155 879413 773924 679773 769403 748905
6701G48905n9189l2028q1585K02089O3913L6250o4057j6714l6756j74337J12812
$$ 748905 689716 657688 576103 778192 842105 878355 814298 797584 760828 586491 699303
6690F99303p3982j12676Q2722l6557J63921j20485o0653J11351N0047l6618j5416
$$ 699303 625321 512645 595367 558810 722731 602246 541593 652944 702991 666373 650957
6679F50957J62162M3666l64007Q3255P5657j69427m0307J82440m367k3062j1143
$$ 650957 813119 856785 492778 576033 651690 482263 441956 624396 620029 596967 585824
6668E85824m1632J30976p5248l3443J34691n2197M4125L0718p7633q7537n1878
$$ 585824 544192 675168 599920 566477 701168 648971 693096 723814 646181 558644 506766
6657E06766P4919j50639J80736K08720J136j2931j38590J8277J3032K4740J14772
$$ 506766 581685 431046 611782 820502 821638 808707 670117 688394 701426 726166 840938
6646H40938L3460k9850K9722o6317J04775q0241L2619M2602J42601r2035k21243
$$ 840938 874398 844548 874270 807953 912728 832487 865106 907708 1050309 958274 737031
6635G37031k8701N5310O9244P6729j07833N0357m1447j09036J49236O2891n9063
$$ 737031 708330 763640 832884 909613 801780 852137 810690 701654 850890 913781 854718
6624H54718j51923L8914l6641J12498J06227J19008m3625r6287K2291m1543r8045
$$ 854718 702795 741709 705068 817566 923793 1042801 999176 902889 925180 883637 785592
6613G85592J60576k1384q9809p0635R5185K434j96559n3569R739J07402N523J86800
$$ 785592 946168 924784 834975 764340 859525 861959 665400 611831 621570 728972 734495 921295
6601I21295j10323L0380n671J4049J29147k40862j0451m075O3146J24563o5149
$$ 921295 810972 841352 835681 849730 978877 738015 727564 723489 786635 911198 846049
6590H46049n835J51382J39036m2006m0629k5069j1900J3505j13500J35288n4807
$$ 846049 840214 991596 1130632 1088626 1047997 1022928 1011028 1024533 911033 1046321 991514
6579I91514k5289P0994K3417K305j33915M7518P0772M9240j9149O5427k39516
$$ 991514 966225 1037219 1060636 1062941 929026 976544 1047316 1096556 1077407 1142834 903318
6568I03318K6702p231Q2971p166R4880j06171p8915Q6971l4612N7459J03399K6028
$$ 903318 930020 922789 1005760 998594 1093474 987303 908388 995359 960747 1018206 1121605 1147633
6556A147633q578J98500N1628p197o4197N5863m1810k035J01805k4328k10852
$$ 1147633 1139055 1337555 1389183 1381986 1317789 1373652 1331842 1329807 1431612 1407284 1196432
6545A196432j79714J26557N4499K24798N9725n7255k6219p3234J61661p8309o8298
$$ 1196432 1016718 1143275 1197774 1422572 1482297 1425042 1398823 1325589 1487250 1408941 1340643
6534A340643j27039J11297N8476K11831m5276l6431q0436O4548N5817J51472Q5487
$$ 1340643 1213604 1324901 1383377 1595208 1549932 1513501 1433065 1497613 1553430 1704902 1790389
6523A790389o864K3579k7432L0834m2254p8357m148r290n6066J05609j19684Q3399
$$ 1790389 1783525 1807104 1779672 1810506 1768252 1689895 1685747 1676457 1620391 1726000 1606316 1689715
6511A689715j03491l7940J93138j69373R673J24769J73050j32845J31605J6817
$$ 1689715 1586224 1548284 1741422 1572049 1581722 1706491 1879541 1746696 1878301 1895118
6501A895118j78907q600J37869J04095j37689L9575j56474j2893P5708k4404O057
$$ 1895118 1716211 1707611 1845480 1949575 1811886 1851461 1694987 1682094 1757802 1733398 1739455
6490A739455J44223K5665N3961n287r2842n1632K6588M1799p1760l3144l4662
$$ 1739455 1883678 1909343 1963304 1958017 1865175 1813543 1840131 1881930 1810170 1777026 1742364
6479A742364m339J32474j24029j27315K0508R4968j0338P1576M5490p7855K0472
$$ 1742364 1738025 1870499 1746470 1619155 1639663 1734631 1724293 1795869 1841359 1763504 1783976
6468A783976m9200L1737r0599n4053k0030k2990J56257m2040p5240P1586j5108
$$ 1783976 1734776 1766513 1675914 1621861 1601831 1578841 1735098 1693058 1617818 1689404 1674296
6457A674296k7196J27733n2173j53470j01222n8681p7244Q448J52310k3760j20012
$$ 1674296 1647100 1774833 1722660 1569190 1467968 1409287 1332043 1340491 1492801 1469041 1349029
6446A349029Q6207p7922k1453J27192j11473r8601k1967M7023J9246P4058L8448
$$ 1349029 1435236 1357314 1335861 1463053 1351580 1252979 1231012 1278035 1297281 1371339 1409787
6435A409787K6036j99713K9508M4431j0092j35165J40979m476j75380J52638Q2690
$$ 1409787 1435823 1236110 1265618 1310049 1299957 1164792 1305771 1301295 1125915 1278553 1361243
6424A361243r6803m4727P8411j73873R0353k3302J20792J075K7014J5754J24777
$$ 1361243 1264440 1219713 1298124 1124251 1214604 1191302 1312094 1313169 1340183 1355937 1480714
6413A480714P912r8675M9944l578m5526j0286L7818r3220j54723L2633J60407
$$ 1480714 1488626 1389951 1439895 1436317 1390791 1380505 1418323 1325103 1170380 1203013 1363420
6402A363420q8267p3495P1213M2928l5261p989k2684j39160J46821P0175p4664
$$ 1363420 1275153 1201658 1272871 1315799 1280538 1272549 1249865 1110705 1257526 1327701 1253037
6391A253037P8961j20468J37542j26468J2267p5556p843O1386R1990p6084q1405
$$ 1253037 1331998 1211530 1349072 1222604 1234871 1159315 1151472 1212858 1304848 1228764 1147359
6380A147359J18847j03727m7963K7867J03090o3612j33650J34616L8247l163J37227
$$ 1147359 1266206 1162479 1114516 1142383 1245473 1181861 1048211 1182827 1221074 1217911 1355138
6369A355138n8435P946J03524Q486k16668R2595N3688M8292J64913J31235j05539
$$ 1355138 1296703 1304649 1408173 1416659 1199991 1292586 1346274 1394566 1559479 1690714 1585175
6358A585175L0849P6928N8476N7262j16684l9866N7785J141P5701J14060P2341
$$ 1585175 1616024 1692952 1751428 1808690 1692006 1652140 1709925 1711066 1786767 1900827 1973168
6347A973168l8279N752K8121j15802r4305m8272P0780J44962M3106Q6150J7495
$$ 1973168 1934889 1940641 1968762 1852960 1758655 1710383 1781163 1926125 1969231 2055381 2072876
6336B072876O9270M6507L0503J1437J13132J92572J68072R5574j45068k27195
$$ 2072876 2142146 2188653 2219156 2230593 2343725 2536297 2704369 2799943 2654875 2427680
6326B427680j36743l0805j32894j46494l0747j9179O9523r1620N7911J16454j47538
$$ 2427680 2290937 2260132 2127238 1980744 1949997 1930818 2000341 1908721 1966632 2083086 1935548
6315A935548j50295j12550M6673M8130n2010J21761J32084P5572J7845p4784m0047
$$ 1935548 1785253 1672703 1719376 1767506 1715496 1837257 1969341 2044913 2062758 1987974 1947927
6304A947927r0952J37842J46840J37474j0932K34686O0823P2085J56778n0670
$$ 1947927 1856975 1994817 2141657 2279131 2268199 2502885 2563708 2635793 2792571 2741901
6294B741901K00345J28001K17874k7980j74086R4166L459j67052m88814k79557
$$ 2741901 2942246 3070247 3288121 3260141 3086055 3180221 3183680 3016628 2527814 2248257
6284B248257j73596J6533O9943m8292r26o5068J6336k1195j03473j15030j9493
$$ 2248257 2074661 2091194 2161137 2112845 2111919 2046851 2063187 2041992 1938519 1823489 1803996
6273A803996J33501k1114J0300R7040O5789j11933j15308K2887K58490j29474
$$ 1803996 1937497 1916383 1926683 2023723 2089512 1977579 1862271 1885158 2143648 2014174
6263B014174p8178R8751J06216k0309Q9957n927J9233J80218J98579J9215q8212
$$ 2014174 1935996 2034747 2140963 2120654 2210611 2204684 2223917 2404135 2602714 2621929 2533717
6252B533717n3571k16145m1673p8011k58020j36888J88866q594k42280p1717k6164
$$ 2533717 2480146 2264001 2222328 2144317 1886297 1749409 1938275 1929681 1687401 1615684 1589520
6241A589520j50493J37813j7802P8793Q9178o9793j75147n2352J95262j09338
$$ 1589520 1439027 1576840 1559038 1637831 1727009 1657216 1482069 1429717 1624979 1515641
6231A515641o8316K6506j22310R4667J12775j73729O445O9034N9592K0053j31240
$$ 1515641 1447325 1473831 1351521 1446188 1558963 1385234 1391679 1460713 1520305 1540358 1409118
6220A409118L8808m8171Q8892M4194K952O8357J99940N4958o5177J3905m0729
$$ 1409118 1447926 1399755 1488647 1532841 1535793 1604150 1804090 1859048 1793871 1807776 1767047
6209A767047n7923o7394j35596K6942K6373m3454m192J8189L096J02251j73997
$$ 1767047 1709124 1641730 1506134 1533076 1559449 1515995 1511803 1529992 1533088 1635339 1461342
6198A461342k0599k9314j51979J34918J36642M1245l3843n8235j4620L9204j00951
$$ 1461342 1440743 1411429 1259450 1394368 1531010 1572255 1538412 1480177 1465557 1504761 1403810
6187A403810R1731J55225m7400j90198J04676J04319J8273k11421q5262m3441
$$ 1403810 1495541 1650766 1603366 1413168 1517844 1622163 1640436 1429015 1343753 1300312
6177A300312J26205K57411n9207r8943k8884J07683k4850J11378j052N2900j43874
$$ 1300312 1426517 1683928 1624721 1525778 1496894 1604577 1579727 1691105 1690053 1742953 1599079
6166A599079J6346m5173K3349R3258M7086j92574o1130Q5761j05957J67127N3107
$$ 1599079 1615425 1570252 1593601 1686859 1733945 1541371 1480241 1566002 1460045 1627172 1680279
6155A680279n8591J23942M6391j83859o7215N5840P5553j31325R1298O4599R601
$$ 1680279 1621688 1745630 1792021 1608162 1540947 1596787 1672340 1541015 1632313 1696912 1706513
6144A706513k3575N86J7074j34557M7747J43132m3110N3507r3076p9428J3566
$$ 1706513 1682938 1683524 1700598 1566041 1613788 1756920 1713810 1767317 1674241 1594813 1608379
6133A608379N54P8797Q7758J00435N3254r6954p4711j14234K9044Q716o1811J27022
$$ 1608379 1608933 1687730 1775488 1875923 1929177 1832223 1757512 1643278 1672322 1681038 1619227 1746249
6121A746249K03208k7232n8817j7139K5859q5721n1839J2601Q7939N5287o0927
$$ 1746249 1949457 1922225 1863408 1846269 1872128 1786407 1734568 1747169 1835108 1890395 1829468
6110A829468M0042r8048J05850M7059Q4147j16714O4537R3969K8601o3584O0423
$$ 1829468 1869510 1771462 1877312 1924371 2008518 1891804 1956341 2050310 2078911 2015327 2075750
6099B075750q2062P6466J06941p3492q3687J49463J01416l16373r6108J38060
$$ 2075750 1993688 2070154 2177095 2103603 2019916 2169379 2270795 1954422 1858314 1996374
6089A996374J23341J0551K62994q4307P739J29252J61733M2349J08252J75815
$$ 1996374 2119715 2130266 2393260 2308953 2316692 2445944 2607677 2650026 2758278 2934093
6079B934093N2018J49272r7909j73692j72370r6358m6454p9057J46281J00534
$$ 2934093 2986111 3135383 3037474 2863782 2691412 2595054 2548600 2469543 2615824 2716358
6069B716358j22088R060L7777p488j4930J62417q6385l6602p4850p2880K59292
$$ 2716358 2594270 2603330 2641107 2633619 2618689 2781106 2694721 2658119 2583269 2510389 2769681
6058B769681R4661K23883o5810J24781l5986j7055J16257J07580K47601J61746
$$ 2769681 2864342 3088225 3022415 3147196 3111210 3094155 3210412 3317992 3565593 3727339
6048C727339K15238L46940K0976q4256l81238j85119j70984j95449k76215j49944
$$ 3727339 3942577 4289517 4310493 4226237 3844999 3659880 3488896 3293447 3017232 2867288
6038B867288K1610j63895P6438N1690J44637q3442k48143M5433n16P5831J17096
$$ 2867288 2888898 2725003 2801441 2853131 2997768 2914326 2666183 2711616 2711100 2786931 2904027
6027B904027j91086l8484J60439O6733P355R0134M5942L08876K30155K9689o3248
$$ 2904027 2712941 2674457 2834896 2901629 2908984 2999118 3045060 3353936 3584091 3613780 3550532
6016C550532J57299K16970j59595k6030k61394j80789m7225k8375Q545j97364
$$ 3550532 3707831 3924801 3765206 3739176 3477782 3296993 3249768 3221393 3229938 3032574
6006C032574q1176J5241j5461k2705O3601N9944J40138j70503R3854M5609p5193
$$ 3032574 2951398 2966639 2951178 2928473 2992074 3052018 3192156 3021653 3115507 3161116 3085923
5995C085923O850R305p6077J48084J52595O1955K0218j0932o0722K2173J02557
$$ 3085923 3092773 3102078 3026001 3174085 3326680 3388635 3408853 3397921 3337199 3359372 3461929
5984C461929M4313R1712m2810k30370L5519n4597J04681P2317L0959J05599o851
$$ 3461929 3506242 3597954 3555144 3324774 3360293 3305696 3410377 3482694 3513653 3619252 3612401
5973C612401L5725K19429J77658l0851J82684J02158m9333J03430K01677J00987
$$ 3612401 3648126 3867555 4045213 4014362 4197046 4299204 4249871 4353301 4554978 4655965
5963D655965n3471J04250J37426m3145j78253j75198j00112k22770j61767J40788
$$ 4655965 4602494 4706744 4844170 4801025 4622772 4447574 4347462 4124692 3962925 4103713
5953D103713p3733l7986J28882j2631M8320P2163M885O4824K32938n1197k2131
$$ 4103713 4029980 3991994 4120876 4108245 4156565 4228728 4233613 4298437 4531375 4480178 4458047
5942D458047q0449J03982J21438K39688N9153l9289J63976K06002J77045o8453
$$ 4458047 4377598 4481580 4603018 4842706 4901859 4862570 5026546 5232548 5409593 5341140
5932E341140k91929r2564n9705n5131j96129j54326L3289Q1345J36883R6954P8929
$$ 5341140 5049211 4956647 4896942 4841811 4645682 4491356 4524645 4605990 4742873 4839827 4918756
5921D918756N7606r2620q9876r4753k14526l41737p2532j46361j5968K5503r1975
$$ 4918756 4976362 4883742 4793866 4699113 4484587 4142850 4070318 3923957 3907989 3933492 3841517
5910C841517P0572L3731J54830R9985j0030p2704j22052k2047J9908p3459R1379
$$ 3841517 3912089 3945820 4100650 4200635 4190605 4117901 3995849 3973802 3993710 3920251 4011630
5899D011630R1029L5411J92847J44947K01882q3752j50961N7287j33593j40473
$$ 4011630 4102659 4138070 4330917 4475864 4677746 4593994 4443033 4500320 4366727 4226254
5889D226254j03480J24010j09174k55075J63657p7381k45881L3740O996R9381
$$ 4226254 4122774 4246784 4137610 3882535 4046192 3968811 3722930 3756670 3763666 3863047
5879C863047Q1793j40111R0148r4813j22679J39844q9254n7393r3148J32701j26299
$$ 3863047 3944840 3804729 3894877 3800064 3677385 3817229 3727975 3670582 3577434 3710135 3583836
5868C583836J48721m7168K2854q6929j36972l4506k9016j01898o4423K8191r1963
$$ 3583836 3732557 3685389 3708243 3621314 3484342 3449836 3420820 3318922 3254499 3282690 3190727
5857C190727J42929m8755J5288J23894L4279j92084j984N1732k3465r9742j10749
$$ 3190727 3333656 3284901 3300189 3424083 3458362 3266278 3264294 3316026 3292561 3192819 3082070
5846C082070m5242J06191m4557L6828L0162L3949N4697l9260k41023j46538J85650
$$ 3082070 3036828 3143019 3098462 3135290 3165452 3199401 3254098 3214838 2973815 2827277 3012927
5835C012927K2034p8743J5922K4386J17273j31886J5439K5799O7567K8634j38794
$$ 3012927 3034961 2956218 2972140 2996526 3113799 2981913 2997352 3023151 3090718 3119352 2980558
5824B980558Q4353O2206J26491P0690p6200k20848J4930J31020Q0559j065K5988
$$ 2980558 3064911 3127117 3253608 3324298 3248098 3027250 3042180 3173200 3253759 3252694 3278682
5813C278682k5471o7538j86808L599j75008O0221J41557o2524K1712J13838J5265
$$ 3278682 3253211 3185673 2998865 3002464 2827456 2887677 3029234 2966710 2988422 3102260 3117525
5802C117525j38530M766L6151J43353k7435j1319j145j62720J48416m014j37049
$$ 3117525 2978995 2983761 3019912 3163265 3135830 3124511 3123366 2960646 3109062 3105048 2967999
5791B967999j4678K7710K58532j5151j71342l2218k3135j13433O8275O3089J8021
$$ 2967999 2953321 2981031 3239563 3224412 3053070 3020852 2997717 2884284 2952559 3015648 3033669
5780C033669m2073K3480m3190J02538o9108j16663N0647N136n0397J13332J70900
$$ 3033669 2991596 3015076 2971886 3074424 3005316 2888653 2939300 2944436 2894039 3007371 3178271
5769C178271P0984j04905P5670K9397l0933J77616l7614J50670r5917j37862J6152
$$ 3178271 3249255 3144350 3220020 3249417 3218484 3396100 3358486 3509156 3413239 3275377 3291529
5758C291529j07047N2348n8599k527m0847P8971k0792n5182J54067n6307l4663
$$ 3291529 3184482 3236830 3178231 3175704 3134857 3213828 3193036 3137854 3291921 3235614 3200951
5747C200951O9578O918M856k4229m6894j21268M9586J56216K5107L8851j60338
$$ 3200951 3270529 3277447 3282303 3258074 3211180 3089912 3139498 3295714 3320821 3359672 3199334
5736C199334Q9244J24347o2111j45069J33034O5045r0197o9481J35683R866l4028
$$ 3199334 3288578 3412925 3350814 3205745 3338779 3403824 3313627 3244146 3379829 3389695 3355667
5725C355667K1684J35296J89243q1967R3379k8907j13587P1439J29628p0164O6692
$$ 3355667 3377351 3512647 3701890 3619923 3713302 3684395 3570808 3642247 3771875 3701711 3768403
5714C768403l3916k42486J7085J75719N9192j83002J9364J30843L5878k6635L167
$$ 3768403 3734487 3492001 3509086 3684805 3743997 3560995 3580359 3711202 3747080 3720445 3723612
5703C723612J1011j0238O7170Q5429j95301J2639J70987M5084K6369j13508R1822
$$ 3723612 3734623 3724385 3791555 3876984 3681683 3694322 3865309 3910393 3936762 3823254 3915076
5692C915076P9084j01671O0735M957j17977J47207k8343L6396k0755p2728Q9419
$$ 3915076 3994160 3892489 3953224 3958181 3840204 3987411 3959068 3995464 3974709 3901981 3991400
5681C991400K0719N0470J01538j80n6401J19506j0495O3989k25143m1672k3428
$$ 3991400 4012119 4062589 4164127 4163947 4107546 4227052 4216557 4280546 4055403 4013731 3990303
5670C990303J10670J42989J10662k8355m5555J78720N8668L5234m2514N9047j24365
$$ 3990303 4100973 4243962 4354624 4326269 4280714 4459434 4518102 4553336 4510822 4569869 4445504
5659D445504O0805l9049J99293l7955j2190L3180J5187R2276j714J7964L3097
$$ 4445504 4506309 4467260 4666553 4628598 4616408 4649588 4664775 4757051 4755337 4773301 4806398
5648D806398J04173M239R6020J54728J8258j94593K9814K973J34164J21750L0423
$$ 4806398 4910571 4914810 5010830 5165558 5183816 4989223 5019037 5022010 5156174 5277924 5308347
5637E308347j09457J2759J06557J25831M5211p068J41411M7850J00528R8337K2205
$$ 5308347 5198890 5211649 5318206 5444037 5489248 5482180 5623591 5671441 5771969 5870306 5892511
5626E892511N0057J48749K4520n1160K07087J88408k3417M1952J37891J17671
$$ 5892511 5942568 6091317 6115837 6064677 6271764 6460172 6436755 6478707 6616598 6734269
5616F734269K56501J23016m4757K40391L858Q2671J15948J92968J95195O4308
$$ 6734269 6990770 7113786 7069029 7309420 7313278 7395949 7511897 7704865 7900060 7964368
5606G964368J98057Q8514P406o4545N1364j36824p2463Q719j15072K43347P5915
$$ 7964368 8162425 8250939 8258345 8193800 8245164 8108340 8035877 8044596 7929524 8172871 8248786
5595H248786L586p1848L2421k5028J1213J49890O8942j00150o1352J32003k62411
$$ 8248786 8252372 8180524 8212945 8187917 8199130 8349020 8417962 8317812 8256460 8388463 8126052
5584H126052m1000J75285R0211l09944K3926J99811j40023Q3929n5719N1829K7716
$$ 8126052 8085052 8260337 8350548 8040604 8064530 8264341 8124318 8208247 8152528 8204357 8232073
5573H232073J57704k5372l8902o5579j55307N3180J53602J79318J34516o2777
$$ 8232073 8389777 8364405 8325503 8259924 8104617 8157797 8311399 8490717 8625233 8562456
5563H562456L2690Q4691Q1415M6134J52804K4164m4374J92077M7449J2410Q8206
$$ 8562456 8595146 8679837 8761252 8807386 8960190 8984354 8939980 9132057 9179506 9191916 9280122
5552I280122J79481R049J17512K30108Q8656P0679M2315j8619K32176N5331j3851
$$ 9280122 9459603 9468652 9586164 9816272 9904928 9975607 10017922 9999303 10231479 10286810 10272959
5541A0272959j10670Q388L3612M8370o0148j13860O397o9509k08226j04030j6009
$$ 10272959 10162289 10170677 10204289 10252659 10192511 10078651 10085048 10015539 9807313 9703283 9687274
5530I687274N305k52518j03527n0741j47917j2817n969l5098p6009K7542k16975
$$ 9687274 9692579 9440061 9336534 9285793 9137876 9125059 9119090 9083992 9007983 9035525 8818550
5519H818550P8364O1263j83379Q282K9840n887R5482k7009M3515J72075M7935
$$ 8818550 8896914 8958177 8774798 8783080 8812920 8807033 8902515 8875506 8919021 9091096 9139031
5508I139031k08184j03264j9534l9230J0933L6633m2789J0844K4078j60444M2287
$$ 9139031 8930847 8827583 8808049 8768819 8779752 8816385 8773596 8784440 8808518 8648074 8690361
5497H690361O5831L7072p612L9168R5870K30909j6398q5415k34035J25330M279
$$ 8690361 8756192 8793264 8785652 8824820 8920690 9151599 9135201 9049786 8815751 8941081 8945360
5486H945360j22939J56529K1052l0934j44421N6129P1265m230J7456J10629R0093
$$ 8945360 8822421 8978950 9000002 8969068 8824647 8880776 8952041 8947811 8965267 9075896 9165989
5475I165989q5173j2376Q2569j99809j3170J13259K11865M9579K5798N5736q1222
$$ 9165989 9080816 9068440 9151009 8951200 8938030 9051289 9263154 9312733 9338531 9394267 9313045
5464I313045j8916k2099J62979O0605l2893J52061j36210j42188k2845N0594l5557
$$ 9313045 9294129 9272030 9435009 9495614 9462721 9614782 9478572 9336384 9313539 9364133 9328576
5453I328576o0840m0629j15397J35040J47512J41256J6845q3993O9735J60284
$$ 9328576 9267736 9227107 9111710 9246750 9394262 9535518 9552363 9468370 9538105 9698389
5443I698389Q4251J3226J18572n441m1835k02077j05009p6674J55580o9140j09045
$$ 9698389 9782640 9795866 9914438 9908997 9867162 9665085 9560076 9483402 9638982 9569842 9460797
5432I460797J66163j60082k2725r70K7942j26992n3967j27026m5442K03571k609
$$ 9460797 9626960 9466878 9444153 9443183 9471125 9344133 9290166 9163140 9117698 9321269 9318660
5421I318660m9169N7765N5378j41288O0402J3195P4661J51860L462m6382m8812
$$ 9318660 9269491 9327256 9382634 9241346 9301748 9314943 9389604 9541464 9544926 9498544 9449732
5410I449732p463j69956n3091j00876J63899r9470k14345J20145k5126Q4303k1258
$$ 9449732 9442269 9272313 9219222 9118346 9282245 9182775 8968430 9088575 9063449 9147752 9126494
5399I126494r0854j22002L5767L11365j65758n344L4755O6007J6420N6518N7991
$$ 9126494 9035640 8913638 8949405 9260770 9095012 9089668 9124423 9190430 9206850 9263368 9321359
5388I321359R8423l8602p5140L4464J91228P6421L6172O5994k54498r7096O6213
$$ 9321359 9419782 9381180 9306040 9340504 9531732 9608153 9644325 9710319 9455821 9358725 9424938
5377I424938m6388K1368J21241l2499J25366J9653J77497J67542J20899K56593
$$ 9424938 9378550 9399918 9521159 9488660 9614026 9633679 9811176 9978718 10099617 10356210
5367A0356210K57775L07123L45124J70101K15321L69320L67275J56528J34769
$$ 10356210 10613985 10921108 11266232 11436333 11651654 12020974 12388249 12544777 12679546
5358A2679546J99892J88320L104j27455k01597k56434k50812j58857m5776n0836
$$ 12679546 12879438 13067758 13070862 12943407 12741810 12485376 12234564 12075707 12029931 11979095
5348A1979095k8213J01571J84060J78210p4369L62334N11716M54605M39932L00783
$$ 11979095 11950882 12052453 12236513 12414723 12340354 12702688 13214404 13669009 14108941 14409724
5338A4409724N63910N21085N12091M88010J54088P667k16169l05183l63275m42398
$$ 14409724 14973634 15494719 16006810 16494820 16648908 16656575 16440406 16135223 15771948 15329550
5328A5329550l59625j66887l91277l79627l75100j69636m1375j1679M1325J27858
$$ 15329550 14969925 14803038 14411761 14032134 13657034 13487398 13446023 13434344 13475669 13603527
5318A3603527K20825K44275K77970K68288M06588J77787K55470K96502J34131
$$ 13603527 13824352 14068627 14346597 14614885 15021473 15199260 15454730 15751232 15885363
5309A5885363q08o4352n1642m75617n63053l70470n60239n63580l48642l31179
$$ 15885363 15884555 15820203 15768561 15292944 14729891 14359421 13799182 13235602 12886960 12555781
5299A2555781l10215j53320n8191j02957j12398m7174j382K10297R9276J03672
$$ 12555781 12245566 12092246 12034055 11931098 11818700 11771526 11770144 11980441 12079717 12183389
5289A2183389J43913J2938j0314j06603j24276k43189l26684k15223l45444k06353
$$ 12183389 12327302 12340240 12329926 12223323 12099047 11855858 11529174 11313951 10968507 10762154
5279A0762154j24513j48132r8382k6380j7223M4345j5466J949J50667O1870p5937
$$ 10762154 10637641 10489509 10391127 10364747 10347524 10391869 10376403 10378352 10529019 10590889 10514952
5268A0514952j5484J32412J66300L3433J55036M7810J21621L6650J27254R6395
$$ 10514952 10499468 10631880 10798180 10831613 10986649 11034459 11156080 11192730 11319984 11416379
5258A1416379J35674K26655M90779J57944j84522k17979M3047R4187K12459J39346
$$ 11416379 11552053 11778708 12269487 12427431 12242909 12024930 12067977 12162164 12374623 12513969
5248A2513969J36186J99092L29023J71827K14829K04683L65323M17421L7070J52909
$$ 12513969 12650155 12849247 13178270 13350097 13564926 13769609 14134932 14552353 14589423 14742332
5238A4742332K73410P1539q5057l8392O503j7264Q8675J93517Q144K88261L84339
$$ 14742332 15015742 15087281 15002224 14963832 14970335 14953071 15041746 15235263 15243407 15531668 15916007
5227A5916007L48440M48608J87458K42959N57615K89699N67392N00827M23959
$$ 15916007 16264447 16713055 16900513 17143472 17701087 17990786 18558178 19059005 19482964
5218A9482964M0147K56014L43359N23161N45004L07550M68433P25505J045051
$$ 19482964 19523111 19779125 20122484 20645645 21190649 21498199 21966632 22692137 23737188
5209B3737188R67906R55337J030525R58833J241331J523046K019205K360310K890635
$$ 23737188 24705094 25660431 26690956 27649789 28891120 30414166 32433371 34793681 37684316
5200C7684316L124005L437463L884538M141176M373221M549090M322316L634560
$$ 37684316 40808321 44245784 48130322 52271498 56644719 61193809 65516125 69150685
5192F9150685K305543M08860j410441l145565m492031m780409m156175l753100
$$ 69150685 71456228 71865088 70454647 67309082 62817051 58036642 53880467 50127367
5184E0127367k895738j829560j311426m43121N2463L54317P88112R73904J271014
$$ 50127367 47231629 45402069 44090643 43647522 43699985 44054302 44842414 45816318 47087332
5175D7087332J598810J686246J536478J297495Q20659k49632q32362r95314j215430
$$ 47087332 48686142 50372388 51908866 53206361 54027020 53777388 52945026 51949712 50734282
5166E0734282j076420j180271j424409j896828k657945k702644k513151k527226
$$ 50734282 49657862 48477591 47053182 45156354 42498409 39795765 37282614 34755388
5158C4755388k230454j897400j538973j056072q88730p43159n36274n06586l33082
$$ 34755388 32524934 30627534 29088561 28032489 27143759 26400600 25864326 25357740 25024658
5149B5024658k56772j53373J42132o394O7217J26735r6101j83966k22445l31117
$$ 25024658 24767886 24614513 24756645 24750251 24817468 24944203 24848102 24664136 24441691 24110574
5139B4110574l96947l50656k75274j76450N0835J78613n9890l7994K02538K43141
$$ 24110574 23713627 23362971 23087697 22911247 22962082 23140695 23080805 23042811 23245349 23488490
5129B3488490P2012K22682J15806P3013M58579K52973K80368L69485K91175O53169
$$ 23488490 23560502 23783184 23898990 23972003 24430582 24683555 24963923 25333408 25624583 26277752
5119B6277752M29132M25797M30856N67788L87671L95755O80485N80131P71954
$$ 26277752 26706884 27132681 27563537 28131325 28518996 28914751 29595236 30175367 30947321
5110C0947321Q03405R00388J233293J379868J498661J658715J983944K277819
$$ 30947321 31750726 32651114 33884407 35264275 36762936 38421651 40405595 42683414
5102D2683414K482211K828857L340871L640171M149810M434659L983074K417778
$$ 42683414 45165625 47994482 51335353 54975524 59125334 63559993 67543067 69960845
5094F9960845L61133k33094M35182l2434j931694l270757k762803j583845j91048
$$ 69960845 70321978 70088884 70524066 70491632 68559938 65289181 62526378 60942533 60751485
5085F0751485N92897J319272J799890J712582J931157K736489L609364M354728
$$ 60751485 61344382 62663654 64463544 66176126 68107283 70843772 74453136 78807864
5077G8807864N354247O257433P094490Q298543R487740J0302164J0440792Q021956
$$ 78807864 84162111 90419544 97514034 105812577 115300317 125602481 136043273 144065229
5069A44065229K595703j300998j455642j297154m122666p029530o363930l246894
$$ 144065229 146660932 145359934 143904292 142607138 138484472 131454942 125091012 121844118
5061A21844118J10549K648992M539622M859876K634842o9331K82170L012794O003304
$$ 121844118 121954667 124603659 129143281 134003157 136637999 136568668 136850838 139863632 145866936
5052A45866936Q803889J1466606J2859026J2631146J0275050R574990J2401202
$$ 145866936 154670825 166137431 178996457 191627603 201902653 211477643 223878845
5045B23878845J6260476J7189763J2088109O332699L308272j606916o684248n326280
$$ 223878845 240139321 257329084 269417193 275749892 279058164 277451248 270767000 265440720
5037B65440720j163577p85138j578925l693713j0035891j5072477j7504885j8215041
$$ 265440720 264277143 263492005 261913080 258219367 248183476 233110999 215606114 197391073
5029A97391073j5420203j0518169q969691j0306858r834689o864747l278224j048551
$$ 197391073 181970870 171452701 162483010 152176152 142341463 135476716 132198492 131149941
5021A31149941J205002K924236L752309K951536J117746k478893p536687j0203385
$$ 131149941 132354943 135279179 139031488 141983024 143100770 140621877 133085190 122881805
5013A22881805q629231n521249k503801o48493r9117j385991m040613m800859
$$ 122881805 114252574 108731325 106227524 105579031 105479914 104093923 100053310 95252451
5005I5252451l603503k056404r95564j540041l918871n153457m497203l050422
$$ 95252451 91648948 89592544 88596980 87056939 83138068 77984611 73487408 70436986
4997G0436986j708456o85982Q0197O48471R30321P01935j467332m852912n963881
$$ 70436986 68728530 68042548 68122745 68771216 69701537 70403472 68936140 64083228 58119347
4988E8119347n171329l656966k728572k176551j636975j451995j280111j060337
$$ 58119347 52948018 49291052 46562480 44385929 42748954 41296959 40016848 38956511
4980C8956511j076479p82066o13580p23684n66111m61428m64844n15458l35221
$$ 38956511 37880032 37097966 36484386 35760702 35194591 34733163 34268319 33752861 33417640
4971C3417640q7306k60317j78464p0841j56450j58080l1225j0505p8400j31913
$$ 33417640 33330334 33070017 32891553 32820712 32664262 32506182 32474957 32464452 32386052 32254139
4961C2254139k93844l63843m38178k36647j22977J4966q0717m4363j7118J59583
$$ 32254139 31960295 31596452 31158274 30921627 30798650 30813616 30732899 30688536 30671418 30831001
4951C0831001L26227K32727J15836J94570M44152N37961M77976N73304Q88835
$$ 30831001 31157228 31389955 31505791 31700361 32144513 32682474 33160450 33733754 34622589
4942C4622589P55262R86109J168163J286976J768391J982813K152196K660509
$$ 34622589 35377851 36363960 37532123 38819099 40587490 42570303 44722499 47383008
4934D7383008L085911L708396M415431N032960N968652O635105P190231O822676
$$ 47383008 50468919 54177315 58592746 63625706 69594358 76229463 83419694 90242370
4926I0242370N159514L951587M260819M130647P83833m767364q589807j0392291
$$ 90242370 95401884 99353471 103614290 107744937 108528770 103761406 95171599 84779308
4918H4779308j0305803q342101n709662l871945k805507k035537j218506r42396
$$ 84779308 74473505 66131404 60421742 56549797 53744290 51708753 50490247 49547851
4910D9547851o93836k46090J18269N42825O40608R30166J247509J397125J818480
$$ 49547851 48854015 48607925 48726194 49269019 49909627 50839793 52087302 53484427 55302907
4901E5302907K210771K771676L349632L696299L841278K644566P13433P31206
$$ 55302907 57513678 60285354 63634986 67331285 71172563 73817129 74530562 75261768
4893G5261768K003749L749832N048064O005094O868403O564329M645697M237880
$$ 75261768 77265517 81015349 86063413 92068507 98936910 105501239 110146936 114384816
4885A14384816N751857Q222301R765099Q909049K328533r241497j4724261j2423256
$$ 114384816 120136673 128358974 138124073 147033122 149361655 140120158 125395897 112972641
4877A12972641p990575m592622j721809N86879K519180M357934N822202P288595
$$ 112972641 104982066 100389444 98667635 99254514 101773694 106131628 111953830 119242425
4869A19242425Q016232P792946N435479k652715j2580878j5506604j1845130p400835
$$ 119242425 127258657 135051603 140487082 137834367 125253489 109746885 97901755 90500920
4861I0500920m751412l567712l682060m174723m058420l356388k306878j427732
$$ 90500920 85749508 82181796 78499736 74325013 70266593 66910205 64603327 63175595
4853F3175595j010446j113472j879717k554531j972329j709861j239188q40878
$$ 63175595 62165149 61051677 59171960 56617429 54645100 52935239 51696051 50855173
4845E0855173l94596n17903k83361r4443N9239M15769P01944J151403J261353
$$ 50855173 50460577 49942674 49659313 49564870 49624109 50039878 50741822 51893225 53154578
4836E3154578J617054J937682K534552K855751L379841M318449M954856N414706
$$ 53154578 54771632 56709314 59243866 62099617 65479458 69797907 74752763 80167469
4828H0167469N985016N901778M558288L144144K652414L521812N017337O495504
$$ 80167469 86152485 92054263 96612551 99756695 102409109 105930921 110948258 117443762
4820A17443762O855562N612174J54667m170924l394824l79697N86261r32849k984695
$$ 117443762 124299324 129911498 130066165 125895241 122500417 122120720 122706981 121774132 118789437
4811A18789437m113541l254925n46988K429305M637288O640191Q124457P783708
$$ 118789437 114675896 111420971 110873983 113303288 117940576 124580767 132705224 140488932
4803A40488932O285167N613441N223098N483717O923120P381172J478708q693297
$$ 140488932 146774099 152387540 157610638 163094355 170017475 177398647 178877355 170184058
4795A70184058j3621435j0749205n641514m187029m717820l764371j902377j395252
$$ 170184058 156562623 145813418 140171904 135984875 131267055 127502684 125600307 124205055
4787A24205055k381301j957887j049680j515750k488501j982957k74495Q04659
$$ 124205055 121823754 119865867 118816187 117300437 114811936 112828979 112554484 113359143
4779A13359143o92082k364210k096779k911444p422234j1385057j0858965p923116
$$ 113359143 112667061 110302851 108206072 105294628 97872394 86487337 75628372 67705256
4771F7705256n926336m402942l707253k950503k661844k021433j684951j536153
$$ 67705256 61778920 57375978 53668725 50718222 48056378 46034945 44349994 42813841
4763D2813841j478493j096255j340400j014822o42145r23326q72201p69018p23425
$$ 42813841 41335348 40239093 38898693 37883871 37241726 36318400 35446199 34677181 33953756
4754C3953756q16998p59348q17016o63807l79284o63820o11535n45145n62937
$$ 33953756 33136758 32377410 31560394 30896587 30517303 29853483 29241948 28696803 28133866
4745B8133866j70544l90418n36828m55608n59272m17138k41794m08651l86442
$$ 28133866 27963322 27572904 27036076 26580468 26021196 25604058 25362264 24953613 24567171
4736B4567171m69062k72606j80863k11729l37517k43725j02714k22505j18690
$$ 24567171 24098109 23825503 23644640 23432911 23095394 22851669 22748955 22526450 22407760
4727B2407760p8739J35826R4510j12129j76832Q2799J04287m5729k7877L28359
$$ 22407760 22329021 22464847 22559357 22447228 22270396 22353195 22457482 22411753 22383876 22712235
4717B2712235L28740O4844J95673J35869J31002J07263J83191K70631L13499M43906
$$ 22712235 23040975 23105819 23301492 23437361 23568363 23675626 23858817 24129448 24442947 24886853
4707B4886853M16469N11902O38226L86317K38953K27751K65272j7634j90884k35325
$$ 24886853 25303322 25815224 26453450 26839767 27078720 27306471 27571743 27554109 27363225 27127900
4697B7127900k37205m33443k42885l5278J23798N4743J51032N23802O32022L47945
$$ 27127900 26890695 26457252 26214367 26179089 26302887 26357630 26508662 27032464 27664486 28012431
4687B8012431M88718J39912N34719K88546N57648L04480L26895O8845l38885r69919
$$ 28012431 28501149 28641061 29175780 29464326 30021974 30326454 30653349 30722194 30383309 29413390
4677B9413390j190970j340990j125838q07071p50388q17119o44820n58919m32565
$$ 29413390 28222420 26881430 25755592 24948521 24198133 23381014 22736194 22177275 21744710
4668B1744710p9922j33108l9661m62821p1515K473J19726o2067m3491P5820P8385
$$ 21744710 21664788 21531680 21492019 21029198 20957683 20960156 21079882 21017815 20974324 21050144 21128529
4657B1128529Q0423J20422j51548j36032j42633q6456j55377l29062j62426M7370
$$ 21128529 21208952 21329374 21177826 21041794 20899161 20812705 20657328 20328266 20165840 20213210
4647B0213210n0949o0281k38105J00181j9460k40343o7959P4850Q0886j12522
$$ 20213210 20162261 20101980 19863875 19964056 19944596 19704253 19636294 19711144 19792030 19679508
4637A9679508j98543j15976M2512q7967j43049j92206k05567k40157l1537O1744
$$ 19679508 19480965 19364989 19407501 19319534 19176485 18984279 18778712 18538555 18507018 18568762
4627A8568762k00867j64237o1787o5975J6338j31039q1289r8943k34521n1375
$$ 18568762 18367895 18203658 18141871 18075896 18092234 17961195 17879906 17780963 17546442 17495067
4617A7495067l23114l23405j55086j05996k04211k23653l04383J267k82462l86760
$$ 17495067 17171953 16848548 16693462 16587466 16383255 16159602 15855219 15856486 15574024 15187264
4607A5187264r2658r2275l19604r6707j51960k37365k15652j88058j86974k95890
$$ 15187264 15094606 15002331 14682727 14586020 14434060 14196695 13981043 13792985 13606011 13310121
4597A3310121j57512P733k7170j41498j58817o9613m3452p0453j19301j64185
$$ 13310121 13152609 13160342 13133172 12991674 12832857 12763244 12719792 12649339 12530038 12365853
4587A2365853M303o1904j76072R2360Q3247j5317P9198J40453N1283j10671j98797
$$ 12365853 12370156 12308252 12132180 12224540 12307787 12292470 12371668 12512121 12563404 12452733 12253936
4576A2253936m7572q205Q0140J26405q6697O4241J44307Q1611k0959o2162l47953
$$ 12253936 12206364 12198159 12278299 12404704 12318007 12382248 12526555 12608166 12587207 12525045 12177092
4565A2177092l3764J00434p2874J42669J81986J60502O6481O653K2383Q1456J29278
$$ 12177092 12143328 12243762 12170888 12313557 12495543 12656045 12722526 12729179 12751562 12833018 12962296
4554A2962296J04216J37973O2498L6615K34334L15940J70983J09557L20034J36869
$$ 12962296 13066512 13204485 13266983 13303598 13537932 13853872 14024855 14134412 14454446 14591315
4544A4591315J31187M81078L73476K74147K70551K21683K01641K13233J06584
$$ 14591315 14722502 15203580 15577056 15851203 16121754 16343437 16545078 16758311 16864895
4535A6864895Q3886K65083J69491L19395M74309J70697L75395N25366M53670L70355
$$ 16864895 16948781 17213864 17383355 17702750 18177059 18347756 18723151 19248517 19702187 20072542
4525B0072542N34640L64452L46225M84741M57932L32198O74383N73843O94273
$$ 20072542 20607182 20971634 21317859 21802600 22260532 22592730 23267113 23840956 24535229
4516B4535229R66675P36022P78574J111427J107119J133668J476478J670836J507165
$$ 24535229 25501904 26237926 27016500 28127927 29235046 30368714 31845192 33516028 35023193
4507C5023193J971146K096856K448569K999133L690174M224970N016229N875184
$$ 35023193 36994339 39091195 41539764 44538897 48229071 52454041 57470270 63345454
4499F3345454O754459P902897Q955310R980187J1210928J2822972J3769765J1935688
$$ 63345454 70099913 78002810 86958120 96938307 108149235 120972207 134741972 146677660
4491A46677660O570058q63142p144971q258700n480248l19845L861904O825012
$$ 146677660 153247718 152384576 145239605 136980905 131500657 131180812 135042716 141867728
4483A41867728Q424950P964017K05924j1606872j6392933j2582595o848547k330131
$$ 141867728 150292678 158256695 158462619 146855747 130462814 117880219 111031672 108701541
4475A08701541Q63550L253725N576222P194375Q093147O762952K395197k856342
$$ 108701541 109565091 112818816 118395038 125589413 133682560 140445512 142840709 139984367
4467A39984367n307701l901695k650492j988750j24618J239154J42682k297775
$$ 139984367 134676666 130774971 128124479 126135729 126011111 127250265 127392947 125095172
4459A25095172o785069j3198372j6166561j3811853j0038550p287195n353421
$$ 125095172 118310103 105111731 88945170 75133317 65094767 57807572 52454151
4452E2454151m228700l504769l198737k660368k381344j862750j947039j652278
$$ 52454151 48225451 44720682 41521945 38861577 36480233 34617483 32670444 31018166
4444C1018166j504532j338533j179469j043267j019041q76852q83191p31698n49103
$$ 31018166 29513634 28175101 26995632 25952365 24933324 24056472 23173281 22441583 21892480
4435B1892480l69347n66250o42400m48571n05024n15084m79278o93927o07878
$$ 21892480 21523133 20956883 20314483 19865912 19360888 18845804 18366526 17672599 17064721
4426A7064721k59051l08206l12451m89625k99884r2212j75996l29393k71078k71761
$$ 17064721 16805670 16497464 16185013 15695388 15395504 15303292 15127296 14797903 14526825 14255064
4416A4255064k94329k88355j60277m9922k05624k07505l55139j78655r6306o0123
$$ 14255064 13960735 13672380 13512103 13462181 13256557 13049052 12693913 12515258 12418952 12358829
4406A2358829j3022o7738j33761j40074j47914j14357N4942l7869Q8608j37509
$$ 12358829 12345807 12278069 12144308 12004234 11856320 11741963 11796905 11759036 11847644 11710135
4396A1710135j19206k86247j13399k63196k30537l8521k59266k00178j20919o6029
$$ 11710135 11590929 11304682 11191283 10928087 10697550 10659029 10399763 10199585 10078666 10012637
4386A0012637k14275k08976k06783K2433j27576k17965Q945q8015m7365p892j00390
$$ 10012637 9798362 9589386 9382603 9405036 9277460 9059495 9068440 8980425 8933060 8925168 8824778
4375H824778l65241N9496J33685k8242l50561j84233o0836j6516j23393l4880
$$ 8824778 8459537 8519033 8652718 8624476 8273915 8089682 8028846 8012330 7888937 7854057
4365G854057j25390m3223o4328j76649k61500k59099k21813j10637k96087k40695
$$ 7854057 7728667 7685444 7621116 7444467 7182967 6923868 6702055 6591418 6295331 6054636
4355F054636j25988m8283k3894j04876j26252k32046p7327k19963M719J06185
$$ 6054636 5928648 5880365 5856471 5751595 5625343 5393297 5315970 5096007 5100726 5206911
4345E206911J13324j68412j83530N599K9206m6234o6532m5876l4065J8986j16579
$$ 5206911 5320235 5151823 4968293 4973892 5003098 4956864 4890332 4844456 4810391 4829377 4712798
4334D712798K65083J45932R0965K29360L8046j35390r7532Q4493j15710l7542
$$ 4712798 4977881 5123813 5214778 5444138 5482184 5346794 5249262 5333755 5218045 5180503
4324E180503k33944j85743k39032k69077o5988k0115k05623J78378m1274j14417
$$ 5180503 4946559 4760816 4521784 4252707 4186719 4166604 3960981 4139359 4098085 3983668
4314C983668m5041p7509P3049L3430o6140j26028r9400j43958R9218O6581K0439
$$ 3983668 3938627 3861118 3934167 3967597 3901457 3775429 3676029 3532071 3631289 3697870 3718309
4303C718309l0068P2940J1129j19902j19163j52031J09769j46475k7928R6653
$$ 3718309 3688241 3761181 3772310 3652408 3533245 3381214 3490983 3344508 3316580 3413233
4293C413233l9467n4440j24458k8954J34342r0424j10671j9875k0644n8954K3113
$$ 3413233 3373766 3319326 3194868 3165914 3300256 3209832 3099161 3079286 3058642 2999688 3022801
4282C022801R7877N2959j44426K1939J0919p5725j04095o3517J72716j7240j36904
$$ 3022801 3120678 3173637 3029211 3051150 3062069 2986344 2882249 2818732 2991448 2974208 2837304
4271B837304J4298j42252j0058L1841J63746J04382J8999Q512P0965K77728j25700
$$ 2837304 2851602 2709350 2699292 2731133 2894879 2999261 3018260 3026772 3097737 3375465 3249765
4260C249765j16144m0710o2251o7045J23368J85861L5877j79764P8435J38134
$$ 3249765 3133621 3092911 3030660 2963615 3086983 3272844 3308721 3128957 3207392 3345526
4250C345526J52132R4641J26104m982L414j5067R9943j4211n2314J77201J78353
$$ 3345526 3497658 3592299 3718403 3713421 3716835 3701768 3801711 3787500 3735186 3912387 4090740
4239D090740K56947J03736J55606O499L57582J63250O7427J24610K47694J05680
$$ 4090740 4347687 4451423 4607029 4613528 4971110 5134360 5201787 5326397 5574091 5679771
4229E679771Q8798K4206O3035O3775k34837J22506j23067k61749l9701j5199j84758
$$ 5679771 5768569 5792775 5855810 5919585 5684748 5807254 5684187 5422438 5382737 5367538 5182780
4218E182780j03277m3503N2246J07841j2663n3469l4552J36776P7153L3269J39919
$$ 5182780 5079503 5036000 5088246 5196087 5183424 5129955 5095403 5232179 5309332 5342601 5482520
4207E482520P1191J31580j37657J51910L27182N7008K70525J09195M6984J40090
$$ 5482520 5553711 5685291 5547634 5699544 6026726 6083734 6354259 6463454 6510438 6650528
4197F650528N8544J11028Q8723j98069J31187N4279j90593J05751L70j27558j86479
$$ 6650528 6709072 6820100 6908823 6710754 6841941 6896220 6705627 6811378 6811748 6684190 6497711
4186F497711j07295n8379j21075j61926q3966j81627J6394P5790o4507j95R7830
$$ 6497711 6390416 6332037 6210962 6049036 5965070 5783443 5799837 5875627 5811120 5810925 5908755
4175E908755J00073O7603O35m8800m3155M2216O0338J34150n4219r9442j74619
$$ 5908755 6008828 6076431 6077066 6028266 5985111 6027327 6087665 6221815 6167596 6068154 5893535
4164E893535j61918k69502j63954j85893j54792m9769j2598j40241O340o1287
$$ 5893535 5731617 5462115 5298161 5112268 4957476 4907707 4895109 4754868 4761208 4699921
4154D699921p3845L1291O3501j48996j02382K2924k13615j45943l49036j16052
$$ 4699921 4626076 4657367 4720868 4571872 4469490 4492414 4278799 4132856 3783820 3667768
4144C667768m6733n9021o9097j00665j22731q5559l6005l4009k42436o2009Q1854
$$ 3667768 3621035 3562014 3492917 3392252 3269521 3183962 3147957 3113948 2871512 2809503 2891357
4133B891357J02725j75692M6564J68039j04954Q1872M4452M2398r2345j42320
$$ 2891357 2994082 2818390 2864954 3032993 2928039 3009911 3054363 3096761 3004416 2862096
4123B862096J79798J36316J21222n0677q0831q1366P3656P1592m0164K8483j33921
$$ 2862096 3041894 3178210 3299432 3248755 3167924 3086558 3160214 3231806 3191642 3220125 3086204
4112C086204o2023J99189L8051j40263M0406p8051J783p1952m5069m0087p1695
$$ 3086204 3024181 3223370 3261421 3121158 3161564 3083513 3085296 3013344 2968275 2928188 2856493
4101B856493K8979J87247M6458l4890K8821J46229O7897O9329K32184K00506J16026
$$ 2856493 2885472 3072719 3119177 3084287 3113108 3259337 3327234 3396563 3628747 3829253 3945279
4090C945279J61581q1880j78207j8734J60112M87J58128J74992M6496J60330n0705
$$ 3945279 4106860 4024980 3846773 3828039 3988151 3988638 4146766 4321758 4368254 4528584 4477879
4079D477879n5767j35261K4226n9676L2239L7401J3394r0383J46801J56507r4617
$$ 4477879 4422112 4286851 4311077 4251401 4283640 4321041 4334435 4244052 4390853 4547360 4452743
4068D452743p9991p0619n0603j49716J41568J18543o417P3516J04929J50520m9751
$$ 4452743 4372752 4302133 4251530 4101814 4243382 4361925 4355508 4429024 4533953 4684473 4634722
4057D634722j2768Q4141r0519Q0801J06316P1480J24114n7525o5895K08931K38862
$$ 4634722 4621954 4706095 4615576 4696377 4802693 4874173 4998287 4940762 4874867 5083798 5322660
4046E322660r9639K95213J49628O8221J64696J35176K03037L28711L6940J10172
$$ 5322660 5223021 5518234 5667862 5736083 5900779 6035955 6238992 6567703 6604643 6714815
4036F714815O840l40644k09964j77322j73849r9761K8864J68215J40986L9723
$$ 6714815 6721655 6381011 6171047 5993725 5819876 5720115 5748979 5917194 6058180 6097903
4026F097903J64231J49505J66044J0649j5949q4945O9030K79443J09869L5778
$$ 6097903 6262134 6411639 6577683 6588332 6572383 6487438 6556468 6835911 6945780 6981558
4016F981558o5064K24884k42059n3262k07921n40776l21328j34216j85213q9021
$$ 6981558 6916494 7141378 6899319 6846057 6638136 6097360 5776032 5641816 5456603 5367582
4006E367582j19682j81252n5656j2601j2478k44721k17983j87417M214j05802
$$ 5367582 5247900 5066648 5010992 4998391 4985913 4741192 4523209 4335792 4340006 4234204
3996D234204n7933r9391J0161j65996j55127J4429j0946r3490j19536m0685Q5345
$$ 4234204 4176271 4076880 4087041 3921045 3765918 3780347 3769401 3675911 3556375 3515690 3601035
3985C601035J05910p427M0842Q1267j2475J17919Q4558r4401k1008M0165j86607
$$ 3601035 3706945 3699518 3740360 3821627 3809152 3927071 4011629 3917228 3896220 3936385 3749778
3974C749778j16178l5784K14202K1228j9016j78174O2083N0283n3004k4124k7771
$$ 3749778 3633600 3597816 3812018 3833246 3814230 3636056 3698139 3748422 3695418 3671294 3643523
3963C643523J29507J78784R701n3778K9847L1195O3961P6791j60128j5762J59307
$$ 3643523 3773030 3951814 3961515 3907737 3937584 3968779 4032740 4109531 3949403 3933641 4092948
3952D092948J35431J49741J15874o788j35178N4035N0813L5687J08669M6758K4917
$$ 4092948 4228379 4378120 4493994 4487206 4352028 4406063 4456876 4492563 4601232 4647990 4672907
3941D672907J05182R7176R3530n1272P5165K41318K56437K69886K15807J04471
$$ 4672907 4778089 4875265 4968795 4917523 4992688 5234006 5490443 5760329 5976136 6080607
3931F080607J12609M23460O13976O09810N27845N65245P83637P62184Q94829P63973
$$ 6080607 6193216 6616676 7230652 7840462 8368307 8933552 9717189 10479373 11374202 12138175
3921A2138175N41292P0963o43360j102794j250951r58192q25397p51790o17908
$$ 12138175 12679467 12750430 12107070 11004276 9753325 8795133 7969736 7217946 6600038
3912F600038k33582j60222k36020n5124r5882j01314j36247o7098k04983N2518
$$ 6600038 6366456 6206234 5970214 5915090 5819208 5717894 5581647 5514549 5309566 5362084
3902E362084j02716k7396M5769k61811M331m2866j4492Q60j02835r0006j5922
$$ 5362084 5259368 5231972 5277741 5015930 5020261 4977395 4962903 4963763 4860928 4770922 4755000
3891D755000M608j4852J3049J32261Q6419K0510l5663N983r9567N3754P0449j45028
$$ 4755000 4759608 4744756 4757805 4890066 4976485 4996995 4961332 4967315 4867748 4921502 4991951 4846923
3879D846923j5528K1225n4414P568q6685j10409N7137L2883k57742k3281Q0782
$$ 4846923 4831395 4852620 4798206 4805774 4719089 4608680 4665817 4698700 4440958 4417677 4498459
3868D498459j2458J86142j5365m9304q6228j1563l0981K32468Q830p1431m6242
$$ 4498459 4486001 4672143 4656778 4607474 4521246 4509683 4478702 4711170 4720000 4648569 4602327
3857D602327j43714o0613J3429J64889K9327l9710j7659j53175j10658M6770P6437
$$ 4602327 4458613 4398000 4411429 4576318 4605645 4565935 4548276 4395101 4284443 4331213 4407650
3846D407650O5294j01426j48003J29082L2318n0567q0863O1718m9697n6209N7201
$$ 4407650 4472944 4371518 4223515 4352597 4384915 4334348 4253485 4315203 4265506 4209297 4266498
3835D266498J8255j58136J3344K3763l3380k3868j89636j48749M5299P9858K9963
$$ 4266498 4284753 4126617 4139961 4163724 4130344 4106476 3916840 3768091 3813390 3893248 3923211
3824C923211o4743k5608J52292q679o6082J8362r6807n1084J4663q5699q4883
$$ 3923211 3858468 3832860 3985152 3976473 3910391 3928753 3831946 3780862 3795525 3709826 3624943
3813C624943L6859j20122j39472L1981m2561L9299O0640r0167k4441r0131j00122
$$ 3624943 3661802 3541680 3402208 3434189 3391628 3430927 3491567 3401400 3376959 3286828 3186706
3802C186706N2753k10294N7927k4587L844n2137j67828J03052n461j54082J82413
$$ 3186706 3239459 3029165 3087092 3062505 3066349 3014212 2846384 2949436 2943975 2789893 2972306
3791B972306l2817k6534J9374j08034m9533q4471O2331k9795m0809p5220L3954
$$ 2972306 2939489 2912955 2932329 2824295 2774762 2690291 2752622 2722827 2682018 2606798 2640752
3780B640752N3231j49782o7558K01654q5170n8541O6462q2210o4705J7664Q1752
$$ 2640752 2693983 2544201 2476643 2678297 2593127 2534586 2601048 2518838 2454133 2471797 2553549
3769B553549j04971j54282R5644j52863K0519Q9177j26365j55526M0743R4058
$$ 2553549 2448578 2294296 2389940 2237077 2257596 2346773 2220408 2064882 2105625 2199683
3759B199683j01544Q8038r9217n1118j05671Q9502K0208K2954j20766p6191N8726
$$ 2199683 2098139 2186177 2086960 2035842 1930171 2019673 2039881 2062835 1942069 1865878 1924604
3748A924604j16386P7105J1039k1042P9866j84414n6636N3837k2898m2167k2821
$$ 1924604 1808218 1885323 1896362 1875320 1955186 1770772 1714136 1767973 1745075 1702908 1680087
3737A680087k2667K7160J92295j59321L3302o6732L7764J20034M4950K9424j53777
$$ 1680087 1657420 1684580 1876875 1717554 1750856 1684124 1721888 1841922 1886872 1916296 1762519
3726A762519n2333j29053O2713L0630l871j38070j35783n9203K02239q0878r9978
$$ 1762519 1710186 1581133 1643846 1674476 1670605 1532535 1396752 1337549 1539788 1458910 1358932
3715A358932Q3516J08247K8957p6004k5810P4L3197L7287q2131N5337j01296J6166
$$ 1358932 1442448 1550695 1579652 1503648 1477838 1477912 1511109 1548396 1466265 1521602 1420306 1436472
3703A436472M8439m5749M0056M2744l2670k46502N2807m8903o4294L4723P8803
$$ 1436472 1484911 1439162 1479218 1521962 1489292 1242790 1295597 1246694 1182400 1217123 1295926
3692A295926l6982k5266J44825k02147l1891M5148R1093R6328j03219l9596J66804
$$ 1295926 1258944 1233678 1378503 1176356 1144465 1189613 1280706 1377034 1273815 1234219 1401023
3681A401023O0046k3620j57903M7923J68905j53672j9073r226M6620j93113J49227
$$ 1401023 1461069 1437449 1279546 1327469 1496374 1342702 1323629 1314403 1361023 1167910 1317137
3670A317137L5285o7958q4639n6803k4082J47168j1061j75357p7627Q7201R5112
$$ 1317137 1352422 1284464 1199825 1143022 1118940 1266108 1255047 1079690 1002063 1089264 1184376
3659A184376L3579j58010J35015J12552r5901j87954m5011K09004K8815p5321
$$ 1184376 1217955 1059945 1194960 1307512 1211611 1023657 978646 1187650 1216465 1141144
3649A141144k01830J77581j28858J55333L2906r3278K09301K5502n8732o7596
$$ 1141144 939314 1116895 988037 1143370 1176276 1082998 1292299 1317801 1259069 1191473
3639A191473L2606l149J37514n7123N861j7046m165j17750q1198K7811p1219J9520
$$ 1191473 1224079 1220930 1358444 1301321 1307182 1290136 1285971 1168221 1087023 1114834 1043615 1063135
3627A063135k8721P2851k1615q280N7700J7100K763n0342K7178R110p7702P6133
$$ 1063135 1034414 1107265 1085650 1077370 1135070 1152170 1154933 1104591 1131769 1140879 1063177 1139310
3615A139310k74p8781l5738J4693K20041P850j68963k2680n4152O0292R085o9288
$$ 1139310 1139036 1060255 1024517 1039210 1259251 1267101 1098138 1075458 1021306 1081598 1090683 1021395
3603A021395K02916q2551o7236n2789J86494o4931j87987j4578o646J8619J4488
$$ 1021395 1224311 1141760 1074524 1021735 1208229 1143298 955311 940733 934087 952706 967194
3592I67194j0732J41962n0491j4053o76L0993Q6957l9761j10804j64024O3388
$$ 967194 956462 1098424 1047933 1033880 1033204 1064197 1151154 1111393 1000589 836565 899953
3581H99953O750R7701j08420j22212j2753l5080Q4108O6920k2914J30407p414
$$ 899953 906703 1004404 895984 773772 761019 725939 810047 876967 854053 984460 977046
3570I77046j02260P687M2426j61974Q4080r887j33216O1332J1778O5395L7292
$$ 977046 874786 882473 924899 762925 847005 837118 703902 765234 777012 842407 879699
3559H79699k3209j0581j44844j6826J66394N018j68671Q0353J08L5486k2550j16067
$$ 879699 856490 845909 701065 684239 850633 855651 686980 767333 767441 802927 780377 664310
3547F64310N3598O9043j37708J23183K0297L8923r2387L6250r1510j17549R2932
$$ 664310 717908 786951 649243 772426 792723 831646 739259 775509 683999 566450 659382
3536F59382O7613Q7219r9872j01386K1999p6863m6081J08766M3845N3314q7590
$$ 659382 726995 814214 714342 612956 634955 558092 512011 620777 664622 717936 630346
3525F30346L8494O8480P6672k42n5982j0319J1509K206O699J1186N6923o8101
$$ 630346 668840 737320 813992 813750 757768 747449 758958 761164 767863 779049 835972 767871
3513G67871o5391R1478J60603K5269n0641j72407m9234J7429P701n1968j38253
$$ 767871 702480 793958 954561 979830 929189 756782 707548 724977 732678 680710 542457
3502E42457K7524P8917J25346R0011j17838P2522p7195o9691J79880l7419L4141
$$ 542457 569981 648898 774244 864255 746417 818939 741744 672053 851933 814514 848655
3491H48655k2164m9142J11995j24678r8801K4015R926K40249j1325p889j37225
$$ 848655 826491 777349 889344 764666 665865 689880 699806 940055 928730 920841 783616
3480G83616k20967r1744M7211J24298P1858p2643L0916J13112j70240q3237M9757
$$ 783616 562649 470905 518116 642414 714272 641629 672545 785657 615417 532180 581937
3469E81937K32706P384p1144o5067j23929J03784J35626m5809p6328N2114O179
$$ 581937 814643 822027 750883 685816 561887 665671 801297 755488 679160 731274 737453
3458G37453l4542k3717o4489O7298O8438l2035j99933O783L0324j8337M0534Q8033
$$ 737453 702911 679194 614705 682003 750441 718406 518473 525256 555580 537243 577777 665810
3446F65810r2930P850J10704J2763n0111p7137o9823P9784L3540L9286p369J8028
$$ 665810 572880 580730 691434 704197 654086 576949 507126 586910 620450 659736 652367 670395
3434F70395P4272R3823q2289j08198P7808r0060k5161O3535R3024O7299p050J02757
$$ 670395 744667 838490 756201 648003 725811 635751 610590 674125 767149 834448 827398 930155
3422I30155j51958o7952J80951r7343P9177N9975n5409r1616K123M7062n4975
$$ 930155 778197 710245 891196 793853 873030 933005 877596 785980 788103 835165 780190
3411G80190j0308J33404n7005p3421R3735R0495l6072k5720J00574J16684r4392
$$ 780190 769882 903286 846281 772860 866595 957090 921018 895298 995872 1112556 1018164
3400A018164M7506m0126L2528L5800q9188J14323J319j69906j21664J30405J16059
$$ 1018164 1065670 1025544 1058072 1093872 1004684 1119007 1120326 950420 828756 959161 1075220
3389A075220J3916L1639Q4904l4873k5371J19938k0980O5787j43891K948j4133
$$ 1075220 1089136 1120775 1205679 1170806 1145435 1265373 1244393 1310180 1166289 1169237 1155104
3378A155104P430K39753K8997J2507M3467j98257J2286N3609K0337K62590O125
$$ 1155104 1162534 1402287 1431284 1443791 1487258 1289001 1301287 1354896 1375233 1637823 1643948
3367A643948p7393J47083O0495j17544j19630q7490k4154o4834O3192o6289O8351
$$ 1643948 1566555 1713638 1774133 1656589 1536959 1449469 1425315 1360481 1423673 1357384 1425735
3356A425735N2834P243r3208l2246m997J99213p189l0748M1749j17488n0672m1813
$$ 1425735 1478569 1485812 1392604 1360358 1355361 1554574 1547385 1516637 1558386 1440898 1390226 1348413
3344A348413K76472Q2619j29681J25772N9287j1294J15688M691K504P6520r3487
$$ 1348413 1624885 1707504 1577823 1703595 1762882 1751588 1867276 1871967 1874471 1950991 1857504
3333A857504K1988J17067L8384K7965j04799N2530J61988J22002P493J2342N5903
$$ 1857504 1879492 1996559 2034943 2062908 1958109 2010639 2172627 2294629 2302122 2314464 2370367
3322B370367O9214j715N2480N7545m3268m9844M5109J66851j01278q6921j50255
$$ 2370367 2439581 2437866 2490346 2547891 2504623 2454779 2499888 2666739 2565461 2478540 2328285
3311B328285J24819L00168q7321K8091P4303j54325J4127J43432R2912K654N6484
$$ 2328285 2453104 2753272 2665951 2694042 2768345 2614020 2628147 2771579 2864491 2867145 2923629
3300B923629k1857q689Q5863J48472J14759O3838J59473K14208J53682L757J15269
$$ 2923629 2901772 2893083 2978946 3127418 3242177 3306015 3465488 3679696 3833378 3837135 3952404
3289C952404J55503l7166L3975k386j05860M6238j09456J32518K17571P1012J51401
$$ 3952404 4107907 4070741 4104716 4102330 3996470 4042708 3933252 4065770 4283341 4354353 4505754
3278D505754N6223k14558n0616J54330n6162n2409Q6824N0113J96709K10227J42828
$$ 4505754 4561977 4347419 4296803 4451133 4394971 4342562 4429386 4479499 4676208 4886435 5029263
3267E029263R5067l6131J15986J62491J50462N3722q6115K23652K18725O3191
$$ 5029263 5124330 5088199 5204185 5366676 5517138 5570860 5484745 5708397 5927122 5990313
3257E990313N4009k9452k2788K3142R7416Q0810j4753J57802j7801p8997J6070
$$ 5990313 6044322 6014870 5992082 6015224 6112640 6193450 6178697 6336499 6318698 6239701 6255771
3246F255771J86181J46482K06212Q4936L16712R7884Q9991J60776K85468L98457
$$ 6255771 6441952 6588434 6794646 6879582 7196294 7294178 7384169 7544945 7830413 8228870
3236H228870L26529J70889K20616L02047Q1706N8122J45298J38967J4162j02480
$$ 8228870 8555399 8726288 8946904 9248951 9330657 9388779 9534077 9673044 9687206 9584726
3226I584726l72385k13188l80139k66230m51939l42636k17535l48889l38939l01381
$$ 9584726 9212341 8999153 8619014 8352784 7900845 7558209 7340674 6991785 6652846 6351465
3216F351465k76471l6461l0093Q0204m2369j16179k06781k30928j61243j22553
$$ 6351465 6074994 6038533 6008440 6088644 6046275 5930096 5723315 5492387 5331144 5208591
3206E208591j21707j74411n1281j03073o4075J24418r2008j33860j35912k46165
$$ 5208591 5086884 4912473 4861192 4758119 4694044 4818462 4726454 4592594 4456682 4210517
3196D210517j72086m1257j05315J15381J60179j37140r2088J8604J64915k9311
$$ 4210517 4038431 3997174 3891859 4007240 4167419 4030279 3938191 3956795 4121710 4092399
3186D092399o9713p2026k47589k53884P428o8186J24403m5454k69889m0356J34004
$$ 4092399 4022686 3950660 3703071 3449187 3456615 3388429 3512832 3467378 3197489 3157133 3291137
3175C291137j06743m2483j00151k8635L5910j38755P1580j8583j97393j16789
$$ 3291137 3184394 3141911 3041760 3013125 3049035 2910280 2981860 2963277 2765884 2649095
3165B649095J3084R1855P3823j11133R5503k7668m6885j46858J8007m5290J6581
$$ 2649095 2662179 2754034 2827857 2716724 2812227 2784559 2737674 2590816 2608823 2563533 2580114
3154B580114p5817O2428K7670k3125P760r6189L9830j51202N9191J9627k05438
$$ 2580114 2504297 2566725 2594395 2571270 2579030 2482841 2522671 2371469 2430660 2450287 2244849
3143B244849r6338n8432O538K5541l0202k4489L905J02830j22129q3733O2946
$$ 2244849 2148511 2090079 2096617 2122158 2091956 2067467 2071372 2174202 2052073 1968340 2031286
3132B031286o9383j69800O9042l5274J9190J10889j6590j14366n0171P3971k2142
$$ 2031286 1961903 1792103 1861145 1825871 1845061 1955950 1939360 1824994 1774823 1848794 1826652
3121A826652Q5793J8354L2576r6959J2867R9607K35n9890j67047O2587O5292k7644
$$ 1826652 1912445 1930799 1963375 1866416 1879283 1978890 1979125 1919235 1752188 1814775 1880067 1852423
3109A852423R0379j04842j25713J42494j6731n7360P8669r47o2385L0362j3509
$$ 1852423 1942802 1837960 1712247 1854741 1838010 1780650 1859319 1858372 1795987 1826349 1812840
3098A812840P6652L7745j62280K1866M9514m6942J0076j11212j18719J5865M741
$$ 1812840 1889492 1927237 1764957 1786823 1836337 1789395 1799471 1688259 1569540 1585405 1590146
3087A590146j47315O7066j31739j20389L511N1091J52221j27930j57201n771k7401
$$ 1590146 1442831 1509897 1378158 1257769 1261280 1312371 1464592 1336662 1179461 1173690 1146289
3076A146289j18587l2811p4889L027J00671o417L6312k7062n4726K4390K3395
$$ 1146289 1027702 994891 920002 923029 1023700 1017283 1053595 1026533 971807 996197 1019592
3065A019592j1810N1325o8802k60978K34976K1676k88924R2962Q165k9172J12258
$$ 1019592 1007782 1059107 990305 729327 964303 985979 697055 790017 798182 769010 881268
3054H81268j38337O823J14557p2361k24186Q8815Q5159q6955N2378m3996j00538
$$ 881268 742931 749754 864311 791950 567764 656579 741738 654783 707161 663165 562627
3043E62627l6916j855J49742K5685L1399o5884K2406l5230j21978k4615N6314
$$ 562627 525711 523856 673598 699283 730682 664798 687204 651974 529996 505381 561695
3032E61695p694o9773L2305j505n6863k6603R1145j40184K16102q4095j04088
$$ 561695 554001 484228 516533 515028 458165 431562 522707 382523 598625 514530 410442
3021D10442K6413J41569P7625m762n0746r4928K7483j06274j02023K20060K1714
$$ 410442 436855 578424 656049 651287 600541 505613 533096 426822 324799 544859 566573
3010E66573k0284p0110M2052K869K0688J8061n2511q8208K9272J73294Q2903j19771
$$ 566573 546289 476179 518231 521100 541788 559849 507338 419130 448402 621696 704599 584828
2998E84828r0386M4286J8966j79556J77788M4641o9953J32990n7007O5632o7179
$$ 584828 494442 538728 557694 378138 555926 600567 530614 663604 606597 672229 605050
2987F05050j5467J28347r7455M342L1844k1204N5479p415k20422j0376J40435
$$ 605050 589583 717930 620475 624817 656661 635457 690936 683521 463099 452723 593158
2976E93158j69816J38945L7299J88643l0958J47283M7596j43191p6225J419M829
$$ 593158 423342 562287 599586 788229 757271 904554 952150 808959 732734 734153 738982
2965G38982O3273j48641R0576p8628J2833J4121J05352M2824r2346M6857M4417
$$ 738982 802255 653614 744190 665562 678395 692516 797868 840692 748346 795203 839620
2954H39620O9727l7607J48948j7174Q7289J81045r4762j66189P1266l7175P366
$$ 839620 909347 871740 1020688 1003514 1090803 1271848 1177086 1010897 1082163 1044988 1052354
2943A052354l3380Q0419J53476j46829j51594r6988p40P6456O839N8626L5989
$$ 1052354 1018974 1099393 1252869 1106040 954446 857458 856718 933174 940013 998639 1034628
2932A034628j58195O8181p4545J63809J11770K8156N0870P9960R3981M3644J19829
$$ 1034628 876433 944614 870069 1033878 1145648 1173804 1224674 1304634 1398615 1442259 1562088
2921A562088J3821K8187M2604o4572j3777J26294j52695J13981J75305p2094n9937
$$ 1562088 1575909 1604096 1646700 1582128 1568351 1694645 1541950 1655931 1831236 1759142 1699205
2910A699205P0381Q3092l2959m3698J75997q71J12450m5179Q2268n1214Q4817
$$ 1699205 1769586 1852678 1819719 1776021 1952018 1951147 2063597 2018418 2100686 2049472 2134289
2899B134289N0024O0534Q1841J42665K3412J589Q780r874R5492k5835R5384j36926
$$ 2134289 2184313 2244847 2326688 2469353 2492765 2494354 2503134 2493260 2588752 2562917 2658301 2521375
2887B521375j9268n0402J39857O9592j43157m7741R7654k23547m3439K15231J3154
$$ 2521375 2502107 2451705 2591562 2661154 2517997 2470256 2567910 2344363 2300924 2516155 2529309
2876B529309m4867P3734J2699L05952J67940j63241J44593R5486N9701J43625
$$ 2529309 2484442 2558176 2570875 2876827 3044767 2881526 3026119 3121605 3181306 3324931
2866C324931K8631J70827L0254J74985P3477M2455j48723k44115n5181p7013j432
$$ 3324931 3353562 3524389 3554643 3729628 3803105 3845560 3696837 3452722 3397541 3320528 3319096
2855C319096j37844o4117j84352l6940j44320j01838J15896k65174j51419o6797
$$ 3319096 3181252 3117135 2932783 2895843 2751523 2649685 2765581 2500407 2348988 2282191
2845B282191j61892M3308j68422p5708k16515j29540J2359J21327n9490n8209
$$ 2282191 2120299 2163607 1995185 1919477 1702962 1573422 1585781 1707108 1647618 1589409
2835A589409r7147j06481J00762J1431j13387P7138r2597k40545l4510j00073
$$ 1589409 1492262 1385781 1486543 1497974 1384587 1461725 1369128 1128583 1094073 994000
2825I94000K26304m8668j77775j01055k143L5352k9143J4975p8464p0292j64451
$$ 994000 1220304 1171636 993861 892806 890663 926015 896872 911847 833383 763091 598640
2814E98640k8676J16934o9271J4648O6632k5786m6029k11397L31M8831J11618
$$ 598640 569964 686898 617627 632275 698907 673121 627092 415695 416026 464857 576475
2803E76475p5950k2685k6468j12424M1541O9910l9915n9800k8162j35092j68089
$$ 576475 500525 477840 451372 338948 380489 450399 410484 350684 322522 187430 19341
2792A9341q8254K43367N4265k1573L7342l0227R3087j04502j73R0801J29874m9167
$$ 19341 -68913 174454 228719 207146 244488 214261 307348 202846 202673 293474 423348 374181
2780C74181N806M5082k21184j70478K0440k6382M0625o4355q1543L5402J19420
$$ 374181 379987 425069 203885 33407 53847 27465 68090 3735 -77808 -42406 77014
2769G7014J61675m1951N8505l6783q6867o4735K17005j9388l3014j28058K6703
$$ 77014 238689 196738 255243 218460 131593 66858 283863 264475 231461 103403 130106
2758A30106j8935L5843p5641l6641J33833k3358P7769o0396r5691J1753n253N3315
$$ 130106 111171 147014 71373 34732 168565 145207 222976 162580 66889 78642 73389 126704
2746A26704o2756n348Q2528k17910P7653j06362n4572j36109R4366K05781K9792
$$ 126704 63948 58600 141128 -76782 871 -105491 -160063 -296172 -201806 3975 33767
2735C3767R6601k3982n5124q1802n1493o67J36643j27107m3942M2104J38568N6518
$$ 33767 130368 106386 51262 -30540 -82033 -82700 53943 -73164 -117106 -75002 63566 120084
2723A20084j60061n3289M0761R30N2835l1826j52241L9696R102n1439N562P6716
$$ 120084 -39977 -93266 -52505 -51575 1260 -30566 -182807 -143111 -134009 -185448 -179886 -103170
2711a03170J17516J73769n1083r6278p4507K0074n3784j18022N6813J42223p1982
$$ -103170 14346 188115 137032 40754 -33753 -13679 -67463 -185485 -128672 13551 -58431
2700e8431k51539j8137J44413J10503o573p0741J122O0100L7276p9215Q7386Q6473
$$ -58431 -309970 -328107 -183694 -73191 -79764 -150505 -149383 -89283 -52007 -131222 -43836 42637
2688D2637m8961j22263K7610P1177r4918J29955p3156m0402k5850p4328J4423
$$ 42637 -6324 -128587 -100977 -29800 -124718 5237 -67919 -108321 -134171 -208499 -194076
2677a94076J40783j34299l6876n2055K086J51251N2850R5905k5158j69584r4448
$$ -194076 -53293 -187592 -224468 -276523 -274437 -123186 -70336 25569 411 -169173 -263621
2666b63621J91046K2987n9301j7613J6740K3026J5357P8470j99228J47786J2950
$$ -263621 -72575 -49588 -108889 -126502 -109762 -86736 -71379 7091 -192137 -44351 -31401
2655c1401k33013K6154N6309L729N1994m0324N8774K3747j66728m3847K36140
$$ -31401 -264414 -238260 -181951 -178222 -126228 -166552 -107778 -84031 -250759 -294606 -58466
2644e8466P112o4393q9858l7014r2953O1279j07789P1670J27468j7194O058n4734
$$ -58466 -51354 -115747 -205605 -242619 -335572 -274293 -382082 -310412 -182944 -200138 -194080 -248814
2632b48814N1288K837n7480J45112P2952m2935p5833o8456N3015j0769k2306M3578
$$ -248814 -197526 -194689 -252169 -107057 -34105 -77040 -152873 -221329 -168314 -179083 -201389 -157811
2620a57811J08321r9437J9584m0425o6765j14258J72807q4440P0798K00424l1254
$$ -157811 -49490 -148927 -129343 -169768 -236533 -350791 -177984 -262424 -191626 8798 -22456
2609b2456p9414m7896Q6573P9032n4261Q9166r2209q3524q6927K18649P786j06444
$$ -22456 -101870 -149766 -63193 15839 -38422 50744 -41465 -124989 -211916 6733 14519 -91925
2597i1925q1774P2851J7420J12286k022N9242j5614K1660j12464j20601J997M4121
$$ -91925 -173699 -100848 -83428 28858 26836 86078 70464 92124 -20340 -140941 -138944 -94823
2585i4823Q2025n0201J8740J1069M3542R0631j84397k55439J75971J18206J9720
$$ -94823 -12798 -62999 -44259 -33190 10352 100983 -83414 -338853 -162882 -44676 -24956
2574b4956N4416J11443q1774m4729p3069l9669J8203m0764K6800j01299L7250
$$ -24956 29460 140903 59129 14400 -58669 -98338 -80135 -120899 -94099 -195398 -158148
2563a58148l0041J71443k5917J9268j0606L7010M8104p9752r6828J6404R0144
$$ -158148 -188189 -16746 -42663 -23395 -34001 3009 51113 -28639 -125467 -109063 -18919
2552a8919J45345O6133p1919k9644j02216j14685L6003q08J76546j61628j22724
$$ -18919 126426 192559 120640 90996 -11220 -125905 -89902 -90710 85836 -75792 -198516
2541a98516J56716l0003o4525J05963O7259j42889J24879r9958Q6698j12189J15493
$$ -198516 -41800 -71803 -136328 -30365 36894 -105995 18884 -81074 5624 -106565 8928
2530H928r40J6422P6335J4266j61810r9181l8426M7509j74310J89506P0422J00152
$$ 8928 7988 24410 100745 115011 -46799 -145980 -184406 -136897 -311207 -121701 -51279 48873
2518D8873j42307J5039K1110K4854j30733P7709J71949k42690R924J4014L5870
$$ 48873 -93434 -78395 -57285 -32431 -163164 -85455 86494 -156196 -146272 -132258 -96388
2507i6388N4774j86259j18734N9267J55235q2999J10925L5439p7186p5448R0049
$$ -96388 -41614 -227873 -346607 -287340 -132105 -215104 -104179 -68740 -145926 -221374 -131325
2496a31325O8628N1195l5710j03374r570J6206k6147n9217L8660J3876L1996k7289
$$ -131325 -62697 -11502 -47212 -150586 -160156 -143950 -170097 -229314 -190654 -176778 -144782 -172071
2484a72071m2223P3164m1004k1896Q8433j1734Q230j44054O9200J0679J17415
$$ -172071 -214294 -141130 -182134 -204030 -115597 -127331 -119101 -263155 -193955 -183276 -65861
2473f5861q3891j2244l9182L95j41032J54320K17127n799j79055j54146k2349
$$ -65861 -149752 -161996 -201178 -200783 -341815 -187495 29632 23833 -155222 -309368 -331717
2462c31717K28778Q5157j45101J0304j56426l813J60336J69555M18j01204q7074
$$ -331717 -102939 -17782 -162883 -152579 -309005 -312818 -152482 17073 17491 -83713 -170787
2451a70787R2016R3614j20570J00603o0409p1251j10340p7975n9906O4738l239
$$ -170787 -78771 14843 -105727 -5124 -65533 -136784 -247124 -325099 -385005 -320267 -323506
2440c23506J13387K614o3312l220N4175J65083n3289J07511j28066r7699R8567
$$ -323506 -210119 -207505 -270817 -274037 -219862 -54779 -108068 -557 -128623 -226322 -127755
2429a27755M4893n0638k1878j39337K0963o4280m9510J76941J9503q5554k7084
$$ -127755 -82862 -133500 -155378 -294715 -273752 -338032 -387542 -210601 -191098 -276652 -303736
2418c03736K03609L4006j7226m3613p4415J00015r121r2596K15100o4464j06083
$$ -303736 -100127 -66121 -83347 -126960 -201375 -101360 -110481 -203077 12023 -52441 -158524
2407a58524j4654j86076J21729O2460L1936j46834m3400R0981k3655O5718J70269
$$ -158524 -173178 -359254 -237525 -175065 -143129 -289963 -333363 -242382 -266037 -200319 -30050
2396c0050J85796k20004k1262m459j58600M4181k0637r3391L3683k143n7527N7485
$$ -30050 155746 -64258 -85520 -89979 -248579 -204398 -225035 -318426 -284743 -286886 -344413 -286928
2384b86928L3860k7840J24816K2448J31110P45P1514j43913k3910j44679l3605
$$ -286928 -253068 -280908 -156092 -133644 -2534 -1789 69725 -74188 -98098 -242777 -276382
2373b76382J44970M3434N8188J8665J9997j02972n4754J55854L6484M971J29002
$$ -276382 -131412 -87978 -29790 -11125 8872 -94100 -148854 7000 43484 48455 177457
2362A77457k0301j19802j11486K04469K13843L3347j69065n0538M2943m6854k2704
$$ 177457 157156 37354 -74132 130337 344180 377527 208462 157924 200867 154013 131309
2351A31309r7393j20733J00900j23062j92517J23020L5681N3479n5603m8114Q5178
$$ 131309 33916 -86817 14083 -108979 -301496 -178476 -142795 -89316 -144919 -193033 -107855
2340a07855J2295J00634l7205j08915K9134p9278o699P0989R3880n9496j07241
$$ -107855 -95560 5074 -32131 -141046 -111912 -191190 -197889 -126900 -33020 -92516 -199757
2329a99757n678J510J05599L5763j18451j19909J40430q9758R0649Q40Q1181K3167
$$ -199757 -205435 -203925 -98326 -62563 -181014 -300923 -160493 -250251 -159602 -158762 -77581 -54414
2317e4414R1075q7065j75244J71793O5110k9211L8976k1500o6389r4408K2335
$$ -54414 36661 -50404 -225648 -53855 11255 -17956 21020 -480 -66869 -161277 -138942
2306a38942R8808j0477j3973Q3466J7404j95665J9035J70547r5466m5195K3092
$$ -138942 -40134 -50611 -64584 18882 36286 -159379 -140344 30203 -65263 -110458 -87366
2295h7366N6925J8429j6948j71702J37970L5478j47418L349j5692J65550K2838
$$ -87366 -30441 -12012 -28960 -200662 -62692 -27214 -174632 -171283 -186975 -21425 1413
2284A413j98263J03648J80364N222n8014Q5508o4268K4196j10198O3346j349k4685
$$ 1413 -196850 -93202 87162 92384 34370 119878 55610 79806 -30392 32954 31605 6920
2272F920J8077J08493J3434q9109j7216j5325J920l4566J48633j14441q6082J44322
$$ 6920 24997 133490 146924 57815 40599 25274 27194 -7372 141261 26820 -59262 85060
2260H5060L2054M8879p9057o7569J03847j88105o2218R7111j10315P6837P0195
$$ 85060 117114 165993 86936 19367 123214 -64891 -127109 -29998 -140313 -63476 6719
2249F719m3369K7319n1621L3731L5427j23683k3574K54291n097r1694n6102J93709
$$ 6719 -36650 -9331 -60952 -27221 8206 -115477 -139051 115240 110143 18449 -37653 156056
2237A56056j06464l8775j12142O2911J22314p9344j08887K23171J74179Q1577
$$ 156056 49592 10817 -101325 -38414 83900 4556 -104331 118840 293019 374596
2227C74596j00521N8639m2337o2471P2718j43967M559O373r9088J15256J74720
$$ 374596 274075 332714 290377 227906 300624 156657 161216 167589 68501 183757 358477
2216C58477l0275k04645j9660M3987Q5208J09529l6331n2674O1653N9741J3948
$$ 358477 328202 123557 103897 147884 233092 342621 306290 253616 315269 375010 388958
2205C88958o2142P2554j45049j61435o0769l9274J20805O8133R0874J1158M9342
$$ 388958 326816 399370 254321 92886 32117 -7157 113648 181781 272655 283813 333155
2194C33155P7217n5929o403J3120j12152K15739l9158L4396k7926m7193P612Q7067
$$ 333155 410372 354443 348040 361160 249008 464747 425589 459985 432059 384866 392478 479545
2182D79545J92266L8283N0382j15308P7578r582p1255q2145J70879k7192K6775
$$ 479545 671811 710094 760476 645168 722746 713164 641909 559764 730643 703451 730226
2171G30226P6469M9516L7451q3929J39930j01301M3232L1322R0362J33229k9249
$$ 730226 806695 856211 893662 809733 949663 848362 891594 922916 1013278 1146507 1117258
2160A117258R8817O0464O927J12961L9342q3164j02753J64093l1849R3807K25052
$$ 1117258 1216075 1276539 1283466 1396427 1435769 1352605 1249852 1413945 1382096 1475903 1700955
2149A700955k3854o8426L4528N6493J04640N8572N4475k8878J21468P2656J40373
$$ 1700955 1677101 1608675 1643203 1699696 1804336 1862908 1917383 1888505 2009973 2082629 2223002
2138B223002J54084P7411J08172N5144O0815l0286n9799P5312O1425J52484Q4311
$$ 2223002 2377086 2454497 2562669 2617813 2678628 2648342 2588543 2663855 2725280 2877764 2962075
2127B962075P5274J55637J63400J74493K44283o245J99006K86225K36509K42756
$$ 2962075 3037349 3192986 3356386 3530879 3775162 3768917 3967923 4254148 4490657 4733413
2117D733413J90222L98609M62361K11213L81891M36835K68204N84280P56185O58571
$$ 4733413 4923635 5322244 5784605 5995818 6377709 6814544 7082748 7667028 8423213 9081784
2107I081784P65702Q56478R13536J037235R91704J254784J509107K110791K339694
$$ 9081784 9847486 10703964 11617500 12654735 13646439 14901223 16410330 18521121 20860815
2098B0860815L033768L516987M028541M618916N266106N987317O791684O897849
$$ 20860815 23894583 27411570 31440111 36059027 41325133 47312450 54104134 61001983
2090F1001983O624752R66174r396152j3395061j0310655o961602m787301l331905
$$ 61001983 67626735 68592909 59196757 45801696 35491041 28529439 23742138 20410233
2082B0410233k627680j799388j377383j206966r67503r92872p81068m78401m98691
$$ 20410233 17782553 15983165 14605782 13398816 12431313 11438441 10657373 10178972 9680281
2073I680281q29532p47905o38490n77863n62231m55591j79926j39617k14927m29201
$$ 9680281 8850749 8102844 7464354 6886491 6324260 5868669 5688743 5549126 5334199 4904998
$$ [...]
##END NTUPLES=NMR SPECTRUM
##END=
