##TITLE=1H_CA-8944-2
 CDCl3,8 sc, 
 25.10.2021
##JCAMPDX= 6.0         $$ Bruker NMR JCAMP-DX V2.0
##DATA TYPE= NMR SPECTRUM
##DATA CLASS= NTUPLES
##ORIGIN= UXNMR, Bruker Analytische Messtechnik GmbH
##OWNER= root
$$ XWIN-NMR		Version 3.5
$$ Mon Oct 25 10:34:00 2021 Russian Standard Time (UT+4h)  she@DPX200
##.OBSERVE FREQUENCY= 200.1313468511
##.OBSERVE NUCLEUS= ^1H
##.ACQUISITION MODE= SIMULTANEOUS
##.ACQUISITION SCHEME= undefined
##.AVERAGES= 8
##.DIGITISER RES= 18
##SPECTROMETER/DATA SYSTEM= spect
##.PULSE SEQUENCE= zg30
##.SOLVENT NAME= D2O
##.SHIFT REFERENCE= (INTERNAL, D2O, 0, 15.7193)
##AUDIT TRAIL= $$ (NUMBER, WHEN, WHO, WHERE, WHAT)
$$ ##TITLE= Audit trail, XWIN-NMR		Version 3.5
$$ ##JCAMPDX= 5.01
$$ ##ORIGIN= Bruker BioSpin GmbH
$$ ##OWNER= she
$$ F:/spectra/data/she/nmr/H-F/1/pdata/1/auditp.txt
$$ ##AUDIT TRAIL=  $$ (NUMBER, WHEN, WHO, WHERE, WHAT)
(   1,<2021-10-25 10:32:15.82 +0400>,<she>,<DPX200>,
      <created by zg, POWCHK disabled, PULCHK disabled
       configuration hash MD5:
       00 E9 B6 7A A2 85 ED C7 34 08 36 98 17 FE 4E 26
       data hash MD5: 16K
       D3 17 24 55 66 D3 5E CD DD 7C F8 EF D7 23 7F 57>)
(   2,<2021-10-25 10:32:18.48 +0400>,<she>,<DPX200>,
      <Start of raw data processing
       efp BC_mod = 2 LB = 0.24 FT_mod = 6 PKNL = 1 PHC0 = -15058.85 PHC1 = 4.800829 SI = 16K 
       data hash MD5: 16K
       4E 1D 2B B8 E3 B0 09 D5 8F A9 35 47 12 F3 B2 20>)
(   3,<2021-10-25 10:32:54.42 +0400>,<she>,<DPX200>,
      <pk PHC0 = -107.3057 PHC1 = 23.8 
       data hash MD5: 16K
       60 A7 BE FD DB 71 16 9A 2D 13 8A 5C 80 5B 9E A8>)
(   4,<2021-10-25 10:32:58.14 +0400>,<she>,<DPX200>,
      <abs ABSG = 5 
       data hash MD5: 16K
       7C 56 2D EB 4D 01 0D ED 96 32 FE D0 1D C1 88 E7>)
$$ ##END=
$$ 
$$ hash MD5
$$ B2 44 F3 66 7C 3F 55 90 68 6E 11 D8 38 66 41 0F
##$RELAX= 
##$RELAX= 
##$RELAX= 
##$RELAX= 
##$RELAX= 
##$RELAX= 
$$ Bruker specific parameters
$$ --------------------------
##$DU= <F:/spectra>
##$EXPNO= 1
##$NAME= <H-F>
##$PROCNO= 1
##$TYPE= <nmr>
##$USER= <she>
##$AMP= (0..31)
100 100 100 100 100 100 100 100 100 100 100 100 100 100 100 100 100 100 
100 100 100 100 100 100 100 100 100 100 100 100 100 100 
##$AQSEQ= 0
##$AQ_mod= 1
##$AUNM= <au_zg>
##$AUTOPOS= <>
##$BF1= 200.13
##$BF2= 200.13
##$BF3= 200.13
##$BF4= 200.13
##$BF5= 200.13
##$BF6= 200.13
##$BF7= 200.13
##$BF8= 200.13
##$BYTORDA= 1
##$CFDGTYP= 0
##$CFRGTYP= 5
##$CHEMSTR= <none>
##$CNST= (0..31)
1 1 145 1 1 1 1 1 1 1 1 1 1 1 1 1 1 1 1 1 1 1 1 1 1 1 1 1 1 1 1 1 
##$CPDPRG= <>
##$CPDPRG1= <>
##$CPDPRG2= <>
##$CPDPRG3= <>
##$CPDPRG4= <mlev>
##$CPDPRG5= <mlev>
##$CPDPRG6= <mlev>
##$CPDPRG7= <mlev>
##$CPDPRG8= <mlev>
##$CPDPRGB= <>
##$CPDPRGT= <>
##$D= (0..31)
0 1.2 0 0 0 0 0 0 0 0.06 0 0.03 0 0 0 0 0.0002 0 0 0 0 0 0 0 0 0 0 0 0 
0 0 0 
##$DATE= 1635143535
##$DBL= (0..7)
120 120 120 120 120 120 120 120 
##$DBP= (0..7)
150 150 150 150 150 150 150 150 
##$DBP07= 0
##$DBPNAM0= <>
##$DBPNAM1= <>
##$DBPNAM2= <>
##$DBPNAM3= <>
##$DBPNAM4= <>
$$ [...]
##$SUBNAM2= <"">
##$SUBNAM3= <"">
##$SUBNAM4= <"">
##$SUBNAM5= <"">
##$SUBNAM6= <"">
##$SUBNAM7= <"">
##$SUBNAM8= <"">
##$SUBNAM9= <"">
##$SW= 18.0517286264689
##$SWIBOX= (0..15)
0 0 2 0 0 0 0 0 0 0 0 0 0 0 0 0 
##$SW_h= 3612.71676300578
##$TD= 16384
##$TD0= 1
##$TE= 0
##$TE2= 300
##$TE3= 300
##$TEG= 300
##$TL= (0..7)
0 120 120 120 120 120 120 120 
##$TP= (0..7)
150 150 150 150 150 150 150 150 
##$TP07= 0
##$TPNAME0= <>
##$TPNAME1= <>
##$TPNAME2= <>
##$TPNAME3= <>
##$TPNAME4= <>
##$TPNAME5= <>
##$TPNAME6= <>
##$TPNAME7= <>
##$TPOAL= (0..7)
0.5 0.5 0.5 0.5 0.5 0.5 0.5 0.5 
##$TPOFFS= (0..7)
0 0 0 0 0 0 0 0 
##$TUNHIN= 0
##$TUNHOUT= 0
##$TUNXOUT= 0
##$USERA1= <user>
##$USERA2= <user>
##$USERA3= <user>
##$USERA4= <user>
##$USERA5= <user>
##$V9= 5
##$VALIST= <valist>
##$VCLIST= <CCCCCCCCCCCCCCC>
##$VD= 0
##$VDLIST= <DDDDDDDDDDDDDDD>
##$VPLIST= <PPPPPPPPPPPPPPP>
##$VTLIST= <TTTTTTTTTTTTTTT>
##$WBST= 1024
##$WBSW= 4
##$XGAIN= (0..3)
0 0 0 0 
##$XL= 0
##$YL= 0
##$YMAX_a= 754439
##$YMIN_a= -694863
##$ZGOPTNS= <>
##$ZL1= 120
##$ZL2= 120
##$ZL3= 120
##$ZL4= 120
##$ABSF1= 15.71604
##$ABSF2= -2.33581
##$ABSG= 5
##$ABSL= 3
##$ALPHA= 0
##$AQORDER= 0
##$ASSFAC= 0
##$ASSFACI= 0
##$ASSFACX= 0
##$ASSWID= 0
##$AUNMP= <proc_1d>
##$AZFE= 0.1
##$AZFW= 0.1
##$BCFW= 0
##$BC_mod= 2
##$BYTORDP= 0
##$COROFFS= 0
##$CY= -3
##$DATMOD= 1
##$DC= 0
##$DFILT= <>
##$DTYPP= 0
##$F1P= 0
##$F2P= 0
##$FCOR= 1
##$FTSIZE= 16384
##$FT_mod= 6
##$GAMMA= 0
##$GB= 0
##$INTBC= 1
##$INTSCL= 0
##$ISEN= 128
##$LB= 0.24
##$LEV0= 0
##$LPBIN= 0
##$MAXI= 10000
##$MC2= 0
##$MEAN= 0
##$ME_mod= 0
##$MI= 1.114404
##$NCOEF= 0
##$NC_proc= -5
##$NLEV= 6
##$NOISF1= 3.799351
##$NOISF2= 2.8
##$NSP= 0
##$NTH_PI= 0
##$NZP= 0
##$OFFSET= 15.71934
##$PC= 1
##$PHC0= -15166.16
##$PHC1= 28.60083
##$PH_mod= 1
##$PKNL= yes
##$PPARMOD= 0
##$PSCAL= 0
##$PSIGN= 0
##$REVERSE= no
##$SF= 200.130007296617
##$SI= 16384
##$SIGF1= 3
##$SIGF2= 2
##$SINO= 5.538805
##$SIOLD= 16384
##$SREGLST= <1H.CDCl3>
##$SSB= 0
##$STSI= 16384
##$STSR= 0
##$SW_p= 3612.71676300578
##$SYMM= 0
##$S_DEV= 0
##$TDeff= 16384
##$TDoff= 0
##$TI= <>
##$TILT= no
##$TM1= 0
##$TM2= 0
##$TOPLEV= 0
##$USERP1= <user>
##$USERP2= <user>
##$USERP3= <user>
##$USERP4= <user>
##$USERP5= <user>
##$WDW= 1
##$XDIM= 16384
##$YMAX_p= 366989910
##$YMIN_p= -164242
$$ End of Bruker specific parameters
$$ ---------------------------------
##NTUPLES= NMR SPECTRUM
##VAR_NAME=  FREQUENCY,     SPECTRUM/REAL,   SPECTRUM/IMAG
##SYMBOL=    X,             R,               I
##VAR_TYPE=  INDEPENDENT,   DEPENDENT,       DEPENDENT
##VAR_FORM=  AFFN,          ASDF,            ASDF
##VAR_DIM=   16384,         16384,           16384
##UNITS=     HZ,            ARBITRARY UNITS, ARBITRARY UNITS
##FACTOR=    0.220516191357247, 1,           1
##FIRST=     3145.91169382055, 0,            0
##LAST=      -466.805069185231, 0,           0
##MIN=       -466.805069185231, -164242,     0
##MAX=       3145.91169382055, 366989910,    0
$$ Real data points
##PAGE= N=1
##DATA TABLE= (X++(R..R)), XYDATA
$$ [...]
$$ plain form
6461 1485267 1625953 1705045 1803285 1834316 1817586 1759670 1603637 1524473 1402683 1304044 1261186
6450 1261186 1230394 1153009 1069267 997175 957954 847955 761647 673063 616002 585330 517305
6439 517305 444137 451503 425487 419786 421075 362160 324037 255466 312242 281638 235849 229923
6427 229923 244064 249113 222023 202524 174439 188624 199052 166122 192761 176733 168685 176713
6415 176713 197889 255204 226197 222039 199342 165616 183446 145767 181745 149956 110971 177844
6403 177844 191825 192156 152664 149103 154306 182951 173151 124785 103634 88302 99902 124110 174606
6390 174606 113093 115312 188438 194995 168486 130092 119032 174365 139243 121203 94784 104816
6378 104816 81217 129531 191938 152955 166346 138510 162812 128231 131510 118226 51885 85631
$$ packed form
6461A485267J40686P9092R8240L1031j6730n7916j56033p9164j21790r8639m2858
6450A261186l0792p7385q3742p2092l9221j09999q6308q8584n7061l0672o8025
6439E17305p3168P366k6016n701J289n8915l8123o8571N6776l0604m5789n926
6427B29923J4141N049k7090j9499k8085J4185J0428l2930K6639j6028q048Q028
6415A76713K1176N7315k9007m158k2697l3726J7830l7679L5978l1789l8985O6873
6403A77844J3981L31l9492l561N203K8645r800m8366k1151j5332J1600K4208N0496
6390A74606o1513K219P3126O557k6509l8394j1060N5333l5122j8040k6419J0032
6378A04816k3599M8314O2407l8983J3391k7836K4302l4581L279j3284o6341L3746
$$ plain form
6366 85631 105090 110899 108510 123889 125777 129843 174348 117365 131689 117280 82209 56025 35457
6353 35457 48768 123323 110988 110303 90927 97992 88769 83506 89219 133156 113349 131732 178643
6340 178643 196711 152766 119801 126858 106544 115010 112275 134352 121009 73872 54812 95565
6328 95565 99140 125155 112953 112635 143914 155354 143815 129761 89657 66758 127844 147682
6316 147682 155333 155794 132211 90203 96655 146442 145603 150670 164599 185992 183837 187089 195434 148008
6302 148008 153240 148586 165144 186466 188386 146688 132583 147644 172045 155426 210796 196384
6290 196384 192352 171593 120700 113740 118380 117082 34736 66184 93767 109267 133870 117811
6278 117811 110448 93616 90891 109289 83449 143896 150984 140972 123708 124010 150729 161174 128566
$$ packed form
6366H5631J9459N809k389J5379J888M066M4505n6983J4324j4409l5071k6184k0568
6353C5457J3311P4555j2335o85j9376P065r223n263N713M3937j9807J8383M6911
6340A78643J8068m3945l2965P057k0314Q466k735K2077j3343m7137j9060M0753
6328I5565L575K6015j2202l18L1279J1440j1539j4054m0104k2899O1086J9838
6316A47682P651M61k3583m2008O452M9787q39N067J3929K1393k155L252Q345m7426
6302A48008N232m654J6558K1322J920m1698j4105J5061K4401j6619N5370j4412
6290A96384m032k0759n0893o960M640j298q2346L1448K7583J5500K4603j6059
6278A17811p363j6832k725J8398k5840O0447P088j0012j7264L02K6719J0445l2608
$$ plain form
6265 128566 122016 145227 168295 143300 121007 114792 112403 179491 228399 203409 163448 202297
6253 202297 175701 122115 137746 171745 173537 134552 123215 149900 149573 168724 166971 135610
6241 135610 189614 156711 142454 150011 162164 181758 180622 185327 275902 297748 290278 292066 263117
6228 263117 224339 210470 176418 208220 242681 259415 248137 244722 250624 243151 264618 225802
6216 225802 208215 272726 280394 211806 168816 188451 254936 284964 290456 298182 259456 245781
6204 245781 210505 210519 242275 261848 297784 302656 278249 230164 216522 244009 269288 258380
6192 258380 253331 299629 274337 229309 229685 248146 269595 289052 236567 206250 220100 207637
6180 207637 212266 216522 185983 193863 225253 262030 286290 225112 265024 292697 211348 224005
$$ packed form
6265A28566o550K3211K3068k4995k2293o215k389O7088M8908k4990l9961L8849
6253B02297k6596n3586J5631L3999J792l8985j1337K6685l27J9151j753l1361
6241A35610N4004l2903j4257P557J2153J9594j136M705R0575K1846p470J788k8949
6228B63117l8778j3869l4052L1802L4461J6734j1278l415N902p473K1467l8816
6216B25802j7587O4511P668o8588m2990J9635O6485L0028N492P726l8726j3675
6204B45781l5276J4L1756J9573L5936M872k4407m8085j3642K7487K5279j0908
6192B58380n049M6298k5292m5028L76J8461K1449J9457n2485l0317J3850j2463
6180B07637M629M256l0539P880L1390L6777K4260o1178L9912K7673q1349J2657
$$ plain form
6168 224005 235734 263276 252738 266755 268300 262956 325255 310316 332581 302175 255137 290306
6156 290306 280247 262128 246415 269673 228086 188160 234534 268083 256298 237913 270846 235653
6144 235653 274122 295277 282014 268241 295388 303425 313063 303360 355416 329046 355906 345792
6132 345792 334933 377981 388599 417315 471229 386996 387833 412318 422819 414275 444160 485692
6120 485692 537607 571108 597458 639393 658610 685091 732434 781485 813878 833143 875630 939222
6108 939222 952679 987877 1005450 995360 1049035 1081621 1120832 1050865 1020596 956658 900351 938095
6096 938095 966867 933661 946804 997893 1053823 1045963 1083517 1146086 1192817 1284085 1328096 1320515
6084 1320515 1295063 1322608 1216762 1155555 1113311 1134228 1125561 1178368 1129470 1158951 1231490
$$ packed form
6168B24005J1729K7542j0538J4017J545n344O2299j4939K2265l0406m7038L5169
6156B90306j0059j8119j5713K3258m1587l9926M6374L3549j1785j8385L2933l5193
6144B35653L8469K1155j3263j3773K7147Q037R638r703N2056k6370K6860j0114
6132C45792j0859M3048J0618K8716N3914q4233Q37K4485J0501q544K9885M1532
6120D85692N1915L3501K6350M1935J9217K6481M7343M9051L2393J9265M2487O3592
6108I39222J3457L5198J7573j0090N3675L2586L9211o9967l0269o3938n6307L7744
6096I38095K8772l3206J3143N1089N5930p860L7554O2569M6731R1268M4011p581
6084A320515k5452K7545j05846o1207m2244K0917q667N2807m8898K9481P2539
$$ plain form
6073 1231490 1271913 1312711 1399602 1503975 1461093 1325794 1215885 1129853 1126292 1114596 1124882
6062 1124882 1068859 1063638 1020978 963514 946298 898418 845096 773102 728393 697893 663408 631037
6050 631037 590873 598846 627985 615068 620254 627792 641580 702040 745049 711291 718140 760499
6038 760499 735949 668166 649740 634764 542670 542454 534374 496887 445881 444886 409220 391258 405327
6025 405327 370512 389225 374801 359614 394424 380442 325103 368297 352088 267525 268521 290891
6013 290891 315978 341542 370964 333431 331243 347762 335184 350811 308352 340657 412245 361298
6001 361298 352684 368582 370654 377186 368913 352813 352984 377182 379842 338361 380895 393292 366952
5988 366952 356965 410130 449131 432055 393809 343122 363401 366506 351792 363554 354557 351543
$$ packed form
6073A231490M0423M0798Q6891J04373m2882j35299j09909q6032l561j1696J0286
6062A124882n6023n221m2660n7464j7216m7880n3322p1994m4709l0500l4485l2371
6050F31037m0164P973K9139j2917N186P538J3788O0460M3009l3758O849M2359
6038G60499k4550o7783j8426j4976r2094k16q080l7487n1006r95l5666j7962J4069
6025D05327l4815J8713j4424j5187L4810j3982n5339M3194j6209q4563R96K2370
6013B90891K5087K5564K9422l7533k188J6519j2578J5627m2459L2305P1588n0947
6001C61298q614J5898K072O532q273j6100J71K4198K660m1481M2534J2397k6340
5988C66952r987N3165L9001j7076l8246n0687K0279L105j4714J1762q997l014
$$ plain form
5976 351543 393203 361359 324283 340895 387944 368952 358527 367866 405583 393777 395059 422026
5964 422026 442724 449001 431403 406109 428411 407261 441630 445008 454399 477775 465979 405531
5952 405531 381219 408567 404901 475895 497704 476524 481740 457009 438430 430241 509178 465759
5940 465759 449695 433122 433963 466330 451770 467858 449699 455321 434363 422498 424958 398430
5928 398430 416311 444925 475731 508954 513575 503468 489619 485631 524567 560186 550629 535596
5916 535596 503011 492672 561696 576726 559863 571846 619454 570161 557301 557508 527805 550463
5904 550463 541615 560025 542743 531153 516884 555231 540817 546733 512349 527493 542865 554911
5892 554911 552309 541046 531643 552755 598400 616127 684162 732496 756599 775029 801854 808588
$$ packed form
5976C51543M1660l1844l7076J6612M7049j8992j0425R339L7717j1806J282K6967
5964D22026K0698O277j7598k5294K2302k1150L4369L378R391K3376j1796o0448
5952D05531k4312K7348l666P0994K1809k1180N216k4731j8579q189P8937m3419
5940D65759j6064j6573Q41L2367j4560J6088j8159N622k0958j1865K460k6528
5928C98430J7881K8614L0806L3223M621j0107j3849l988L8936L5619r557j5033
5916E35596l2585j0339O9024J5030j6863J1983M7608m9293j2860K07k9703K2658
5904E50463q848J8410j7282j1590j4269L8347j4414N916l4384J5144J5372J2046
5892E54911k602j1263r403K1112M5645J7727O8035M8334K4103J8430K6825O734
$$ plain form
5880 808588 837959 883199 937429 986656 1020938 1032421 1050262 1082519 1121780 1173563 1259856 1297616
5868 1297616 1366573 1384113 1434237 1533493 1544507 1457906 1318086 1229825 1155267 1156778 1109329
5857 1109329 1051460 995798 989341 1003943 1013902 994732 1009622 1032739 1049371 1035340 1069733 1070854
5845 1070854 1116990 1214737 1210447 1212559 1252341 1289466 1235384 1209007 1102723 1042949 921998
5834 921998 859559 809864 750152 719635 688665 658456 652701 702855 661314 648421 637962 605844
5822 605844 602074 590831 593835 563777 590550 613515 597887 633207 571498 595590 646713 590580
5810 590580 567067 600695 622029 607984 603621 644839 624781 652248 697591 694948 682520 655524
5798 655524 717365 778507 820510 838869 876627 927766 957755 1038136 1151647 1206386 1225603
$$ packed form
5880H08588K9371M5240N4230M9227L4282J1483J7841L2257L9261N1783Q6293L7760
5868A297616O8957J7540N0124R9256J1014q6601j39820q8261p4558J511m7449
5857A109329n7869n5662o457J4602R959j9170J4890K3117J6632j4031L4393J121
5845A070854M6136R7747m290K112L9782L7125n4082k6377j06284n9774j20951
5834I21998o2439m9695n9712l0517l0970l0209n755N0154m1541j2893j0459l2118
5822F05844l770j1243L004l0058K6773K2965j5628L5320o1709K4092N1123n6133
5810E90580k3513L3628K1334j4045m363M1218k0058K7467M5343k643j2428k6996
5798F55524O1841O1142M2003J8359L7758N1139K9989Q0381J13511N4739J9217
$$ plain form
5787 1225603 1233493 1216528 1185309 1102399 1055939 981332 989414 983824 978971 955187 1007558 1019854
5775 1019854 981821 995586 988510 917030 947672 982934 1013687 1048564 1088776 1108778 1169044 1211856
5763 1211856 1153076 1113448 1155725 1118012 1008511 948441 896638 834618 886995 892377 809411
5752 809411 776619 779149 787583 723871 651100 620651 648062 638470 589477 615462 613446 630052
5740 630052 636994 639198 625057 600109 608635 616881 632286 623328 662497 642407 635382 603981 605886
5727 605886 519640 571792 606055 599537 634631 631676 587394 601282 595008 570796 606777 629475
5715 629475 576219 628515 636523 670736 677012 658700 685766 693009 681950 679420 679162 718484 637575
5702 637575 644333 697870 731616 715209 698885 703487 712347 684276 695047 702869 711919 739370 761831
$$ packed form
5787A225603P890j6965l1219q2910m6460p4607Q082n590m853k3784N2371J2296
5775A019854l8033J3765p076p1480L0642L5262L0753L4877M0212K0002O0266M2812
5763A211856n8780l9628M2277l7713j09501o0070n1803o2020N2377N382q2966
5752H09411l2792K530Q434o3712p2771l0449K7411r592m8993K5985k016J6606
5740F30052O942K204j4141k4948Q526Q246J5405q958L9169k0090p025l1401J905
5727F05886q6246N2152L4263o518L5094k955m4282J3888o274k4212L5981K2698
5715F29475n3256N2296Q008L4213O276j8312K7066P243j1059k530k58L9322q0909
5702F37575O758N3537L3746j6407j6324M602Q860k8071J0771P822R050K7451K2461
$$ plain form
5689 761831 755532 768250 784542 789809 744658 717531 773287 788821 774436 739585 767125 805952
5677 805952 842598 878791 880809 837796 831043 835128 884119 817415 835656 876353 897109 914068
5665 914068 901796 855433 874917 931485 975350 956507 980762 996960 953001 950610 979484 959054
5653 959054 962022 936990 962307 990766 1046227 1076083 1077013 1074958 1084910 1128528 1136638 1175370 1194437
5640 1194437 1218343 1264535 1309470 1312281 1302536 1372839 1383596 1380689 1358163 1333861 1354702 1357398
5628 1357398 1368396 1406164 1388114 1387803 1428930 1381657 1333588 1311459 1276750 1295392 1275733 1287904
5616 1287904 1349411 1399136 1422299 1373953 1319481 1360108 1369668 1432976 1457230 1507544 1515722 1494138
5604 1494138 1538712 1537856 1570598 1591382 1589881 1504247 1493070 1520744 1502444 1534588 1501505 1410693
$$ packed form
5689G61831o299J2718J6292N267m5151k7127N5756J5534j4385l4851K7540L8827
5677H05952L6646L6193K018m3013o753M085M8991o6704J8241M0697K0756J6959
5665I14068j2272m6363J9484N6568M3865j8843K4255J6198m3959k391K8874k0430
5653I59054K968k5032K5317K8459N5461K9856R30k055R952M3618Q110L8732J9067
5640A194437K3906M6192M4935K811r745P0303J0757k907k2526k4302K0841K696
5628A357398J0998L7768j8050l11M1127m7273m8069k2129l4709J8642j9659J2171
5616A287904O1507M9725K3163m8346n4472M0627R560O3308K4254N0314Q178k1584
5604A494138M4574q56L2742K0784j501q5634j1177K7674j8300L2144l3083r0812
$$ plain form
5592 1410693 1401330 1342938 1371346 1390880 1386259 1371862 1337726 1330007 1352316 1421457 1358647 1326343
5580 1326343 1368907 1383233 1373546 1351262 1379612 1378403 1360418 1371695 1367682 1328120 1339707 1412494
5568 1412494 1376477 1286712 1295457 1360759 1417056 1455557 1421955 1432341 1408699 1425219 1441680 1398180
5556 1398180 1422933 1509305 1522902 1507123 1527805 1527771 1564484 1556057 1545432 1561224 1571915 1577654
5544 1577654 1594093 1590912 1589749 1586465 1585612 1608894 1684035 1684521 1680627 1732318 1730799 1702657 1714296
5531 1714296 1706605 1739534 1783584 1792251 1815146 1872793 1876861 1855034 1893013 1932822 1944661 1987623
5519 1987623 2102665 2154768 2157986 2175451 2092203 2104281 2126639 2075141 2009885 2015248 2034772 1999506
5507 1999506 2011054 2050438 2051353 2061944 2076039 2008498 2048808 2127383 2139661 2198959 2250005 2258523
$$ packed form
5592A410693r363n8392K8408J9534m621j4397l4136p719K2309O9141o2810l2304
5580A326343M2564J4326r687k2284K8350j209j7985J1277m013l9562J1587P2787
5568A412494l6017q9765Q745O5302N6297L8501l3602J0386k3642J6520J6461m3500
5556A398180K4753Q6372J3597j5779K0682l4L6713q427j0625J5792J0691N739
5544A577654J6439l181j163l284q53K3282P5141M86l894N1691j519k8142J1639
5531A714296p691L2929M4050Q667K2895N7647M068k1827L7979L9809J1839M2962
5519A987623J15042N2103L218J7465q3248J2078K2358n1498o5256N363J9524l5266
5507A999506J1548L9384R15J0591J4095o7541M0310P8575J2278N9298N1046Q518
$$ plain form
5495 2258523 2258444 2323898 2391015 2459861 2574737 2662087 2736751 2834837 2795495 2821115 2831035 2780235
5483 2780235 2688806 2650596 2643560 2560873 2480240 2425973 2408084 2395806 2412164 2398099 2422834 2451172
5471 2451172 2471714 2503797 2514600 2484002 2477779 2507363 2466598 2511202 2503116 2469921 2469314 2465190
5459 2465190 2458471 2392276 2367982 2332585 2242062 2155315 2147710 2077262 2053597 2019035 2028220 1984986
5447 1984986 1928658 1957366 1958569 1888733 1859174 1768168 1765189 1770414 1684527 1694381 1693878 1672403 1643275
5434 1643275 1621698 1648330 1628856 1593604 1539516 1498045 1507648 1478526 1510015 1485097 1443206 1401117
5422 1401117 1388054 1415352 1421529 1392546 1389606 1346331 1329170 1335447 1284174 1328131 1335378 1296846
5410 1296846 1259024 1286724 1320365 1370050 1358869 1361535 1353624 1353513 1406562 1424059 1465210 1521281
$$ packed form
5495B258523p9O5454O7117O8846J14876Q7350P4664R8086l9342K5620R920n0800
5483B780235r1429l8210p036q2687q0633n4267j7889j2278J6358j4065K4735K8338
5471B451172K0542L2083J0803l0598o223K9584m0765M4604q086l3195o07m124
5459B465190o719o6195k4294l5397r0523q6747p605p0448k3665l4562R185m3234
5447A984986n6328K8708J203o9836k9559r1006k979N225q5887R854n03k1475k9128
5434A643275k1577K6632j9474l5252n4088m1471R603k9122L1489k4918m1891m2089
5422A401117j3063K7298O177k8983k940m3275j7161O277n1273M3957P247l8532
5410A296846l7822K7700L3641M9685j1181K666p911j11N3049J7497M1151N6071
$$ plain form
5398 1521281 1513786 1496788 1509613 1461294 1539398 1564811 1535737 1546617 1571359 1566716 1529410 1546045
5386 1546045 1585277 1619454 1637322 1681875 1735644 1756662 1752311 1786725 1858986 1960863 2018858
5375 2018858 2103605 2110367 2116858 2128245 2183360 2170884 2154766 2127782 2102271 2083494 2072619 2045372
5363 2045372 2025775 1963654 2023091 2078290 2094560 2168216 2222951 2218650 2292151 2412147 2497114
5352 2497114 2629177 2751586 2851720 2862297 2910850 3004748 2994955 2902451 2908295 2827266 2750152
5341 2750152 2699672 2663188 2565557 2462027 2397360 2321727 2270481 2294661 2285468 2348093 2367410
5330 2367410 2393696 2456745 2466775 2504873 2558606 2583981 2673160 2675920 2669669 2678622 2677225 2620737
5318 2620737 2482679 2378957 2282983 2227556 2086099 2024144 1966156 1868481 1858796 1837667 1836122
$$ packed form
5398A521281p495j6998J2825m8319P8104K5413k9074J0880K4742m643l7306J6635
5386A546045L9232L4177J7868M4553N3769K1018m351L4414P2261J01877N7995
5375B018858Q4747O762O491J1387N5115j2476j6118k6984k5511j8777j0875k7247
5363B045372j9597o2121N9437N5199J6270P3656N4735m301P3501J19996Q4967
5352B497114J32063J22409J00134J0577M8553R3898r793r2504N844q1029p7114
5341B750152n0480l6484r7631j03530o4667p5633n1246K4180r193O2625J9317
5330B367410K6286O3049J0030L8098N3733K5375Q9179K760o251Q953j397n6488
5318B620737j38058j03722r5974n5427j41457o1955n7988r7675r685k1129j545
$$ plain form
5307 1836122 1828998 1855294 1812820 1828972 1835375 1872163 1897779 1883871 1895310 1849560 1785454 1792112
5295 1792112 1755534 1743230 1680779 1655180 1604192 1547520 1540387 1545826 1589264 1540536 1516534 1513029
5283 1513029 1538355 1516561 1517211 1562855 1596995 1609409 1625682 1672320 1666154 1753716 1767367 1745443
5271 1745443 1865852 1900300 1896988 1937988 1923423 1972715 2052838 2110585 2125970 2093302 2108835
5260 2108835 2102114 2098091 2075319 2044994 2098345 2105751 2105636 2219644 2264740 2348387 2387931 2430085
5248 2430085 2482682 2576415 2648729 2745330 2838816 2957283 3026166 3101653 3244484 3335729 3438689
5237 3438689 3543508 3752543 3936729 4148309 4461033 4790639 5212892 5572919 6080783 6672428
5227 6672428 7318990 8062608 8830758 9826320 10895863 12022582 13249392 14565105 15864185
$$ packed form
5307A836122p124K6296m2474J6152O403L6788K5616j3908J1439m5750o4106O658
5295A792112l6578j2304o2451k5599n0988n6672p133N439M3438m8728k4002l505
5283A513029K5326k1794O50M5644L4140J2414J6273M6638o166Q7562J3651k1924
5271A745443J20409L4448l312M1000j4565M9292Q0123N7747J5385l2668J5533
5260B108835o721m023k2772l0325N3351P406j15J14008M5096Q3647L9544M2154
5248B430085N2597R3733P2314R6601R3486J18467O8883P5487J42831R1245J02960
5237C438689J04819K09035J84186K11580L12724L29606M22253L60027N07864N91645
5227F672428O46562P43618P68150R95562J069543J126719J226810J315713J299080
$$ plain form
5218 15864185 16704225 16687129 15663808 14216001 12728775 11338316 10211664 9412669 8841298
5209 8841298 8465789 8230784 8110881 8095358 8141286 8323895 8558543 8896166 9316466 9779752
5199 9779752 10334065 10779996 11096551 11230710 11135215 10928070 10606162 10157976 9611403 8893719
5189 8893719 8224101 7621480 6923929 6271036 5757031 5278943 4841424 4516454 4279211 4050840
5179 4050840 3856070 3708412 3522921 3388562 3329775 3275273 3169558 3078325 2954104 2875013
5169 2875013 2810047 2754410 2655946 2535395 2515356 2443540 2361487 2355344 2340079 2250479 2234050
5158 2234050 2283176 2299049 2274366 2237339 2224512 2179684 2182275 2167355 2192685 2176360 2228027 2239844
5146 2239844 2179331 2220231 2257709 2248732 2282484 2339785 2391991 2384396 2412560 2541274 2638092 2656722
$$ packed form
5218A5864185Q40040j7096j023321j447807j487226j390459j126652p98995n71371
5209H841298l75509k35005j19903j5523M5928J82609K34648L37623M20300M63286
5199I779752N54313M45931L16555J34159r5495k07145l21908m48186n46573p17684
5189H893719o69618o02621o97551o52893n14005m78088m37519l24970k37243k28371
5179D050840j94770j47658j85491j34359n8787n4502j05715r1233j24221p9091
5169B875013o4966n5637r8464j20551k0039p1816q2053o143j5265q9600j6429
5158B234050M9126J5873k4683l7027j2827m4828K591j4920K5330j6325N1667J1817
5146B239844o0513M0900L7478q977L3752N7301N2206p595K8164J28714R6818J8630
$$ plain form
5134 2656722 2706087 2833268 2929571 3035201 3224107 3381380 3545948 3626326 3607742 3608580 3599331
5123 3599331 3577653 3526416 3352693 3230978 3159451 3088942 3010760 2999434 3068846 3145344 3341887
5112 3341887 3484403 3574482 3664671 3879173 4098516 4340203 4577917 4943941 5344230 5759157
5102 5759157 5977865 5949875 5980088 6006543 5860727 5540567 5187383 4878928 4701962 4546057
5092 4546057 4538122 4537628 4614472 4808920 4998651 5216196 5539350 5937036 6267822 6484107 6522188
5081 6522188 6682873 6912414 7277318 7812322 8437673 9071977 9503550 10092970 10759526 11418998
5071 11418998 11888317 11997287 11690752 11263269 10948468 10911457 10810121 10388200 9792445 9280992
5061 9280992 8988426 8622537 8148257 7679896 7160980 6676044 6329752 6156648 6082182 6042285
$$ packed form
5134B656722M9365J27181R6303J05630J88906J57273J64568Q0378j8584Q38r249
5123C599331k1678n1237j73723j21715p1527p0509p8182j1326O9412P6498J96543
5112C341887J42516R0079R0189K14502K19343K41687K37714L66024M00289M14927
5102E759157K18708k7990L0213K6455j45816l20160l53184l08455j76966j55905
5092D546057p935m94P6844J94448J89731K17545L23154L97686L30786K16285L8081
5081F522188J60685K29541L64904N35004O25351O34304M31573N89420O66556O59472
5071A1418998M69319J08970l06535m27483l14801l7011j01336m21921n95755n11453
5061I280992k92566l65889m74280m68361n18916m84936l46292j73104p4466l9897
$$ plain form
5051 6042285 5890536 5640607 5434479 5336633 5312755 5257189 5270679 5322592 5369502 5368634 5292529
5040 5292529 4965192 4598639 4368946 4197093 4027387 3986566 3963481 3995658 3920520 3757321
5030 3757321 3671788 3651961 3646211 3653685 3488691 3292489 3144239 3059465 2959981 2881289 2900143
5019 2900143 2947381 2965954 2999580 3007644 2856986 2695386 2455852 2246771 2116278 2041155 1937996
5008 1937996 1891499 1851925 1800297 1784721 1783016 1796967 1785907 1748439 1759683 1692666 1621678 1622088
4996 1622088 1601321 1569695 1580808 1585382 1593297 1576230 1503411 1491829 1466968 1464612 1415653 1393714
4984 1393714 1405097 1386933 1364854 1386183 1385591 1387567 1425069 1378952 1337520 1398356 1417920 1361764
4972 1361764 1353031 1379271 1339833 1375572 1399697 1397256 1441475 1383355 1337680 1356711 1363617 1339705
$$ packed form
5051F042285j51749k49929k06128r7846k3878n5566J3490N1913M6910q68p6105
5040E292529l27337l66553k29693j71853j69706m0821k3085L2177p5138j63199
5030C757321q5533j9827n750P474j64994j96202j48250q4774r9484p8692J8854
5019B900143M7238J8573L3626Q064j50658j61600k39534k09081j30493p5123j03159
5008A937996m6497l9574n1628j5576j705J3951j1060l7468J1244o7017p0988M10
4996A622088k0767l1626J1113M574P915j7067p2819j1582k4861k356m8959k1939
4984A393714J1383j8164k2079K1329n92J976L7502m6117m1432O0836J9564n6156
4972A361764q733K6240l9438L5739K4125k441M4219n8120m5675J9031O906k3912
$$ plain form
4960 1339705 1411846 1467009 1485301 1508825 1523057 1515773 1547905 1580361 1602791 1648100 1667382 1725926
4948 1725926 1792938 1872603 1886191 1979514 2054485 2153844 2280379 2405612 2606943 2815344 2999494
4937 2999494 3088896 3169177 3306832 3504826 3753186 3841998 3773907 3662276 3528503 3280288
4927 3280288 3005678 2777530 2584784 2515249 2412784 2291688 2248362 2275448 2300066 2291745 2338358
4916 2338358 2445126 2513972 2648470 2760568 2801363 2931425 3121834 3333903 3434915 3374168
4906 3374168 3383951 3392721 3456272 3615430 3771527 3841574 3816403 3829672 3815591 3878539 4046409
4895 4046409 4188416 4466072 4809003 5136720 5544747 6071907 6359514 6060542 5521961 5084115
4885 5084115 4756078 4498487 4363221 4353621 4381801 4547807 4740071 5014440 5322397 5744501
$$ packed form
4960A339705P2141N5163J8292K3524J4232p284L2132L2456K2430M5309J9282N8544
4948A725926O7012P9665J3588R3323P4971R9359J26535J25233K01331K08401J84150
4937B999494Q9402Q0281J37655J97994K48360Q8812o8091j11631j33773k48215
4927C280288k74610k28148j92746o9535j02465j21096m3326K7086K4618q321M6613
4916B338358J06768O8846J34498J12098M0795J30062J90409K12069J01012o0747
4906C374168R783Q770O3551J59158J56097P0047k5171J3269j4081O2948J67870
4895D046409J42007K77656L42931L27717M08027N27160K87607k98972n38581m37846
4885E084115l28037k57591j35266r600K8180J66006J92264K74369L07957M22104
$$ plain form
4875 5744501 6150552 6122364 5710080 5250598 4809473 4441102 4117244 3929764 3853612 3777598
4865 3777598 3740262 3800282 3824276 3806647 3777877 3732779 3636951 3581577 3603622 3634015 3680207
4854 3680207 3621564 3590593 3585445 3622633 3688860 3803941 3949685 4193309 4443091 4673593 4992055
4843 4992055 5446788 5824353 5854470 5774707 5807159 5916181 5999453 6064745 6148317 6250348 6177720
4832 6177720 6119917 6093756 6128806 6247576 6328227 6448158 6711156 7020060 7109032 7259141
4822 7259141 7628140 8043241 8104014 7624760 7164375 6858136 6571749 6346381 6041657 5876420
4812 5876420 5860595 5915763 6045569 6070976 5881838 5654969 5536647 5563197 5574922 5662600 5644701
4801 5644701 5633071 5689824 5747047 5512602 5053175 4653807 4274229 3969744 3719480 3508004
$$ packed form
4875E744501M06051k8188m12284m59482m41125l68371l23858j87480p6152p6014
4865C777598l7336O0020K3994j7629k8770m5098r5828n5374K2045L0393M6192
4854C680207n8643l0971n148L7188O6227J15081J45744K43624K49782K30502L18462
4843D992055M54733L77565L0117p9763L2452J09022Q3272O5292Q3572J02031p2628
4832F177720n7803k6161L5050J18770Q0651J19931K62998L08904Q8972J50109
4822G259141L68999M15101O0773m79254m60385l06239k86387k25368l04724j65237
4812E876420j5825N5168J29806K5407j89138k26869j18322K6550J1725Q7678j7899
4801E644701j1630N6753N7223k34445m59427l99368l79578l04485k50264k11476
$$ plain form
4791 3508004 3437780 3372605 3296211 3221254 3197574 3145439 3053849 2980749 2898215 2828231 2755847
4780 2755847 2673693 2653052 2602035 2566318 2608216 2565358 2553573 2538611 2488086 2531191 2483259
4769 2483259 2364858 2279227 2166727 2074141 2011660 1971958 1949588 1923463 1880914 1873170 1831674
4758 1831674 1777140 1793977 1819538 1808013 1781458 1758898 1759966 1757249 1824785 1828702 1798357 1798811
4746 1798811 1826350 1757439 1797417 1834801 1864872 1881387 1884959 1930412 1969217 1881328 1896689 1936967
4734 1936967 1925053 1923168 1941812 1880871 1889328 1922655 1874049 1926813 1961344 1924165 1864232 1909151
4722 1909151 1957701 2014321 2052218 2127552 2151686 2178423 2167175 2175307 2151850 2072767 2093410 2090588
4710 2090588 2096224 2121261 2119231 2103737 2072495 2071560 1990313 1895094 1834041 1799386 1832481 1789835
$$ packed form
4791C508004p0224o5175p6394p4957k3680n2135r1590p3100q2534o9984p2384
4780B755847q2154k0641n1017l5717M1898m2858j1785j4962n0525M3105m7932
4769B483259j18401q5631j12500r2586o2481l9702k2370k6125m2549p744m1496
4758A831674n4534J6837K5561j1525k6555k2560J068k717O7536L917l0345M54
4746A798811K7539o8911L9978L7384L0071J6515L572M5453L8805q7889J5361M0278
4734A936967j1914j885J8644o0941Q457L3327m8606N2764L4531l7179n9933M4919
4722A909151M8550N6620L7897P5334K4134K6737j1248Q132k3457p9083K0643k822
4710B090588N636K5037k030j5494l1242r35q1247r5219o1053l4655L3095m2646
$$ plain form
4698 1789835 1743473 1701677 1679402 1722669 1704116 1706873 1686688 1713219 1716877 1723032 1735838 1720188
4686 1720188 1751573 1818188 1817259 1846935 1874987 1930913 1927440 1846398 1872497 1904886 1918761 1928749
4674 1928749 1861648 1792334 1756068 1702735 1666412 1621248 1574405 1490329 1477498 1380422 1364488
4663 1364488 1424179 1433671 1386211 1365739 1312519 1315996 1310623 1269125 1242170 1221142 1215912 1178393
4651 1178393 1210486 1194468 1192433 1200542 1177460 1207955 1162762 1129682 1103880 1105087 1104802 1100227 1113110
4638 1113110 1121155 1088733 1062347 1065738 1081564 1081162 1091971 1093030 1068072 1094835 1099455 1076553 1088108
4625 1088108 1072814 1068088 1032129 1046776 1109860 1114061 1059430 1036507 1022580 1023364 1055494 1062555
4613 1062555 1054052 1064893 1038042 966500 1009060 975408 1036453 1056551 1037634 1027296 1043410 1013647
$$ packed form
4698A789835m6362m1796k2275M3267j8553K757k0185K6531L658O155J2806j5650
4686A720188L1385O6615r29K9676K8052N5926l473q1042K6099L2389J3875R988
4674A928749o7101o9314l6266n3333l6323m5164m6843q4076j2831r7076j5934
4663A364488N9691R492m7460k0472n3220L477n373m1498k6955k1028n230l7519
4651A178393L2093j6018k035Q109k3082L0495m5193l3080k5802J207k85m575J2883
4638A113110Q045l2422k6386L391J5826m02J0809J059k4958K6763M620k2902J1555
4625A088108j5294m726l5959J4647O3084M201n4631k2923j3927P84L2130P061
4613A062555q503J0841k6851p1542M2560l3652O1045K0098j8917j0338J6114k9763
$$ plain form
4601 1013647 1029027 1024752 1011157 1057162 1048800 1037969 1043137 1092009 1106218 1070707 1075587 1068434
4589 1068434 1093530 1136170 1106293 1086213 1129219 1145349 1171409 1221834 1187499 1166655 1219612
4578 1219612 1235613 1306951 1278470 1284657 1307447 1324030 1352228 1396826 1424097 1434691 1438983 1413562
4566 1413562 1418892 1452235 1501404 1476986 1432097 1484310 1523695 1598895 1588660 1571208 1636587 1646734
4554 1646734 1623612 1599493 1651075 1643893 1680482 1747321 1789489 1839239 1813871 1812796 1830132 1826129
4542 1826129 1875509 1896071 1948894 1939752 1998626 2025896 2056422 2031650 1997365 2058825 2123515 2196514
4530 2196514 2245043 2338538 2382762 2407699 2556385 2632339 2748958 2826138 2991973 3220200 3379790
4519 3379790 3569730 3764621 4061284 4416410 4793671 5265008 5824034 6403649 6825801 7016524
$$ packed form
4601A013647J5380m275j3595M6005q362j0831N168M8872J4209l5511M880p153
4589A068434K5096M2640k9877k0080M3006J6130K6060N0425l4335k0844N2957
4578A219612J6001P1338k8481O187K2790J6583K8198M4598K7271J0594M292k5421
4566A413562N330L3343M9169k4418m4889N2213L9385P5200j0235j7452O5379J0147
4554A646734k3122k4119N1582p182L6589O6839M2168M9750k5368j075J7336m003
4542A826129M9380K0562N2823r142N8874K7270L0526k4772l4285O1460O4690P2999
4530B196514M8529R3495M4224K4937J48686P5954J16619P7180J65835K28227J59590
4519C379790J89940J94891K96663L55126L77261M71337N59026N79615M22152J90723
$$ plain form
4509 7016524 7014229 6931730 6671467 6474503 6428026 6550098 6822969 7194713 7482185 7313803
4499 7313803 6823845 6297573 5942970 5655869 5488740 5484587 5639078 5859574 6144978 6450656
4489 6450656 6741471 6825289 6656085 6473078 6418333 6460796 6492353 6395051 6229505 6206301 6164940
4478 6164940 5897104 5419814 4825555 4338663 3926747 3572078 3348819 3137033 3017062 2955785
4468 2955785 2861066 2749613 2630204 2537246 2437321 2405055 2376274 2345516 2304035 2278080 2267323
4457 2267323 2241993 2172231 2137655 2099470 2052981 2098509 2064094 2014021 2012312 1979037 1947104 1948958
4445 1948958 1942492 1897084 1878854 1852804 1900158 1929883 1936485 1909054 1888699 1953231 1945270 1955874
4433 1955874 1975544 1985804 2101994 2096678 2074489 2099058 2106248 2120939 2125055 2145875 2137212 2103709
$$ packed form
4509G016524k295q2499k60263j96964m6477J22072K72871L71744K87472j68382
4499G313803m89958n26272l54603k87101j67129m153J54491K20496K85404L05678
4489F450656K90815Q3818j69204j83007n4745M2463L1557r7302j65546k3204m1361
4478F164940k67836m77290n94259m86892m11916l54669k23259k11786j19971o1277
4468B955785r4719j11453j19409r2958r9925l2266k8781l0758m1481k5955j0757
4457B267323k5330o9762l4576l8185m6489M5528l4415n0073j709l3275l1933J854
4445A948958o466m5408j8230k6050M7354K9725O602k7431k0355O4532p961J0604
4433A955874J9670J0260J16190n316k2189K4569P190J4691M116K0820q663l3503
$$ plain form
4421 2103709 2078292 2016885 1916597 1905303 1904466 1871642 1852298 1877588 1906431 1937020 1882658 1931236
4409 1931236 1959616 1942652 1964450 1948715 1932786 2029634 2053455 2052150 2054755 2140321 2191261 2183928
4397 2183928 2256755 2313756 2387570 2428764 2476410 2502764 2500301 2469553 2471857 2433622 2389210 2335668
4385 2335668 2208654 2112612 2042118 1956621 1892296 1863836 1834736 1819760 1772146 1766374 1801747
4374 1801747 1806716 1838783 1869412 1873281 1928443 1922024 1958614 2006839 1994796 1965314 1931762 1921873
4362 1921873 1893117 1937547 1949784 1999717 1999640 1976822 2015630 2044281 1974687 1868345 1856705 1848315
4350 1848315 1798031 1767539 1654076 1606589 1553753 1519837 1522807 1523912 1482412 1454613 1519270 1547764
4338 1547764 1550456 1513778 1528026 1487068 1476402 1447727 1354652 1377073 1381258 1378975 1368638 1313558
$$ packed form
4421B103709k5417o1407j00288j1294q37l2824j9344K5290K8843L0589n4362M8578
4409A931236K8380j6964K1798j5735j5929R6848K3821j305K605Q5566N0940p333
4397B183928P2827N7001P3814M1194M7646K6354k463l0748K304l8235m4412n3542
4385B335668j27014r6042p0494q5497o4325k8460k9100j4976m7614n772L5373
4374A801747M969L2067L0629L869N5162o419L6590M8225j2043k9482l3552r889
4362A921873k8756M4430J2237M9933p7k2818L8808K8651o9594j06342j1640q390
4350A848315n0284l0492j13463m7487n2836l3916K970J105m1500k7799O4657K8494
4338A547764K692l6678J4248m0958j0666k8675r3075K2421M185k283j0337n5080
$$ plain form
4326 1313558 1245603 1223373 1193468 1220230 1183379 1205826 1240640 1190976 1201932 1234548 1214249
4315 1214249 1185624 1144397 1176721 1159954 1195706 1173796 1119006 1120283 1158235 1200556 1171731 1196733
4303 1196733 1211859 1222258 1184424 1148745 1175438 1176363 1189559 1159890 1116731 1152051 1130633 1147222
4291 1147222 1147798 1173263 1148931 1205427 1170643 1140699 1103986 1083670 1124682 1132052 1136979 1127851
4279 1127851 1112260 1151695 1164829 1193176 1193285 1149719 1112904 1127278 1154465 1137377 1101212 1120577
4267 1120577 1125908 1119573 1110308 1091068 1116802 1140046 1170836 1130435 1158162 1193993 1191557 1224812
4255 1224812 1198134 1224076 1237393 1193507 1204237 1203925 1246491 1234271 1247319 1282062 1215780 1200885
4243 1200885 1218425 1227442 1231206 1250497 1217528 1207848 1249724 1224175 1178109 1127680 1117255 1127606
$$ packed form
4326A313558o7955k2230k9905K6762l6851K2447L4814m9664J0956L2616k0299
4315A214249k8625m1227L2324j6767L5752k1910n4790J277L7952M2321k8825K5002
4303A196733J5126J0399l7834l5679K6693R25J3196k9669m3159L5320k1418J6589
4291A147222N76K5465k4332N6496l4784k9944l6713k0316M1012P370M927r128
4279A127851j5591L9435J3134K8347J09m3566l6815J4374K7187j7088l6165J9365
4267A120577N331o335r265j9240K5734K3244L0790m0401K7727L5831k436L3255
4255A224812k6678K5942J3317m3886J0730l12M2566j2220J3048L4743o6282j4895
4243A200885J7540R017L764J9291l2969r680M1876k5549m6066n0429j0425J0351
$$ plain form
4231 1127606 1164041 1202406 1174806 1179260 1167276 1172481 1237662 1301603 1249457 1248842 1265349 1252301
4219 1252301 1276288 1317708 1351072 1339016 1355573 1333817 1333770 1322348 1348113 1409070 1374736 1349270
4207 1349270 1384570 1413524 1382507 1328255 1271664 1260191 1222834 1183997 1201554 1181133 1183721 1200101
4195 1200101 1191760 1222689 1212056 1153776 1184580 1159526 1155956 1182025 1209447 1190994 1215714 1253871
4183 1253871 1250524 1274896 1273631 1286894 1394782 1382679 1398743 1432459 1480896 1524228 1481396 1478858
4171 1478858 1457906 1392509 1424898 1373419 1313228 1248446 1224737 1255779 1264216 1208023 1196282 1207492
4159 1207492 1194133 1198101 1217008 1237592 1214312 1152035 1151572 1192912 1191051 1179173 1267375 1344139
4147 1344139 1285175 1248976 1268194 1294847 1331494 1365926 1352205 1359123 1347315 1387388 1373883 1351593
$$ packed form
4231A127606L6435L8365k7600M454j1984N205O5181O3941n2146o15J6507j3048
4219A252301K3987M1420L3364j2056J6557k1756m7j1422K5765O0957l4334k5466
4207A349270L5300K8954l1017n4252n6591j1473l7357l8837J7557k0421K588J6380
4195A200101q341L0929j0633n8280L0804k5054l570K6069K7422j8453K4720L8157
4183A253871l347K4372j265J3263J07888j2103J6064L3716M8437M3332m2832k538
4171A478858k0952o5397L2389n1479o0191o4782k3709L1042Q437n6193j1741J1210
4159A207492j3359L968J8907K0584k3280o2277m63M1340j861j1878Q8202P6764
4147A344139n8964l6199J9218K6653L6647L4432j3721O918j1808M0073j3505k2290
$$ plain form
4135 1351593 1326688 1277598 1305124 1342197 1357655 1347383 1314339 1345790 1363002 1369768 1359753 1390814
4123 1390814 1364895 1348888 1333584 1344295 1357168 1362414 1346317 1338013 1341492 1321821 1344504 1338020
4111 1338020 1319512 1333397 1329585 1300227 1308102 1352655 1344957 1385971 1400899 1391726 1385141 1453974
4099 1453974 1508483 1489310 1476484 1471843 1431417 1433481 1479299 1498880 1501475 1522595 1529117 1527525
4087 1527525 1539673 1539737 1506868 1502155 1509050 1480970 1468849 1444031 1386072 1415470 1448562 1398939
4075 1398939 1361431 1346603 1375035 1385158 1424333 1449374 1391848 1418974 1394307 1460720 1483529
4064 1483529 1467069 1494937 1504550 1511333 1484837 1487072 1559443 1547586 1494550 1490820 1436823 1481166
4052 1481166 1493504 1505259 1479262 1458452 1412477 1426613 1432145 1456321 1429633 1411145 1468412 1485086
$$ packed form
4135A351593k4905m9090K7526L7073J5458j0272l3044L1451J7212O766j0015L1061
4123A390814k5919j6007j5304J0711J2873N246j6097q304L479j9671K2683o484
4111A338020j8508J3885l812k9358P875M4553p698M1014J4928r173o585O8833
4099A453974N4509j9173j2826m641m0426K064M5818J9581K595K1120O522j592
4087A527525J2148O4l2869m713O895k8080j2121k4818n7959K9398L3092m9623
4075A398939l7508j4828K8432J0123L9175K5041n7526K7126k4667O6413K2809
4064A483529j6460K7868R613O783k6496K235P2371j1857n3036l730n3997M4343
4052A481166J2338J1755k5997k0810m5975J4136N532K4176k6688j8488N7267J6674
$$ plain form
4040 1485086 1490057 1508483 1488321 1497886 1531365 1532635 1552990 1630864 1634971 1615624 1609666 1612196 1589574
4027 1589574 1574908 1540576 1530110 1566083 1550751 1589337 1621067 1622055 1634877 1662534 1721323 1694478
4015 1694478 1724743 1748013 1777899 1746966 1758012 1768735 1793574 1763799 1799424 1844929 1840244 1855098
4003 1855098 1836357 1927619 1947567 1937804 1975791 1984654 1970730 1998940 1992371 2007706 2016021 2035722
3991 2035722 2099142 2154039 2147138 2152215 2124209 2144067 2224528 2243069 2255401 2235075 2327219 2346859
3979 2346859 2345999 2336713 2355278 2385459 2436249 2473439 2481914 2462717 2434797 2488495 2454665 2455014 2460390
3966 2460390 2504013 2580521 2589100 2564760 2623748 2637488 2662833 2678453 2706825 2691973 2726238 2809023
3954 2809023 2884353 2853855 2825261 2844010 2884371 2891537 2893902 2879221 2973912 2983397 2985243 2991324
$$ packed form
4040A485086M971J8426k0162R565L3479J270K0355P7874M107j9347n958K530k2622
4027A589574j4666l4332j0466L5973j5332L8586L1730R88J2822K7657N8789k6845
4015A694478L0265K3270K9886l0933J1046J0723K4839k9775L5625M5505m685J4854
4003A855098j8741R1262J9948r763L7987Q863j3924K8210o569J5335Q315J9701
3991B035722O3420N4897o901N077k8006J9858Q0461J8541J2332k0326R2144J9640
3979B346859q60r286J8565L0181N0790L7190Q475j9197k7920N3698l3830L49N376
3966B460390M3623P6508Q579k4340N8988J3740K5345J5620K8372j4852L4265Q2785
3954B809023P5330l0498k8594J8749M0361P166K365j4681R4691R485J846O081
$$ plain form
3942 2991324 3039764 3061408 3094708 3123450 3138563 3167629 3184232 3174150 3196639 3193492 3203358 3219462
3930 3219462 3221883 3275391 3273308 3335086 3366452 3364689 3428633 3485420 3516426 3512353 3502920 3493029 3550983
3917 3550983 3644306 3689062 3739450 3726973 3739450 3779154 3803019 3792683 3823854 3823317 3867488 3882758
3905 3882758 3927103 3962853 4039711 4067632 4074319 4121399 4158877 4161323 4207342 4232110 4263823 4299060
3893 4299060 4332608 4325286 4329308 4355956 4377803 4396537 4437386 4439130 4444586 4494439 4558070 4610976
3881 4610976 4611347 4650947 4656702 4678868 4677561 4732355 4786081 4809074 4894243 4843662 4859397 4903892
3869 4903892 4887802 4909095 4945266 4996135 5027189 5007811 5102466 5142507 5115951 5152448 5194397
3858 5194397 5218888 5277494 5279109 5292935 5352837 5348577 5366200 5399217 5452360 5489405 5543927 5607050
$$ packed form
3942B991324M8440K1644L3300K8742J5113K9066J6603j0082K2489l147R866J6104
3930C219462K421N3508k083O1778L1366j763O3944N6787L1006m073r433r891N7954
3917C550983R3323M4756N0388j2477J2477L9704K3865j0336L1171n37M4171J5270
3905C882758M4345L5750P6858K7921O687M7080L7478K446M6019K4768L1713L5237
3893D299060L3548p322M022K6648K1847J8734M0849J744N456M9853O3631N2906
3881D610976L71L9600N755K2166j307N4794N3726K2993Q5169n0581J5735M4495
3869D903892j6090K1293L6171N0869L1054j9378R4655M0041k6556L6497M1949
3858E194397K4491N8606J615J3826N9902m260J7623L3017N3143L7045N4522O3123
$$ plain form
3846 5607050 5671208 5731554 5662968 5660556 5719564 5736871 5747551 5696497 5657219 5648162 5657163 5688498
3834 5688498 5693563 5703274 5714389 5757679 5840254 5903006 5965159 5951019 5947628 5943728 5961065 6019386
3822 6019386 6080490 6125785 6174007 6218106 6272716 6318952 6333882 6375222 6463631 6460202 6511669 6509669
3810 6509669 6514558 6440715 6425883 6378882 6439300 6436529 6443107 6479444 6541382 6604317 6630561 6641744
3798 6641744 6582918 6615559 6610576 6610295 6599737 6592024 6583130 6604049 6600537 6669650 6757243 6822276 6786814
3785 6786814 6814958 6849378 6908262 6910117 6924909 6964171 6954954 6877324 6871448 6943579 6960501 6994635
3773 6994635 6962258 6984821 7065489 7112070 7091427 7101715 7097724 7063347 7069807 7109209 7184126 7206368
3761 7206368 7257789 7305308 7341059 7356013 7408923 7449875 7481615 7503125 7563050 7621373 7737194
$$ packed form
3846E607050O4158O0346o8586k412N9008J7307J0680n1054l9278r057R001L1335
3834E688498N065R711J1115M3290Q2575O2752O2153j4140l391l900J7337N8321
3822F019386O1104M5295M8222M4099N4610M6236J4930M1340Q8409l429N1467k000
3810F509669M889p3843j4832m7001O0418k771O578L6337O1938O2935K6244J1183
3798F641744n8826L2641m983k81j0558p713q894K0919l512O9113Q7593O5033l5462
3785F786814K8144L4420N8884J855J4792L9262r217p7630n876P2131J6922L4134
3773F994635l2377K2563Q0668M6581k0643J0288l991l4377O460L9402P4917K2242
3761G206368N1421M7519L5751J4954N2910M0952L1740K1510N9925N8323J15821
$$ plain form
3750 7737194 7804661 7834783 7861659 7894015 7970727 8022725 8088045 8179309 8208684 8209456 8234495 8280775
3738 8280775 8266951 8280717 8339574 8392119 8487647 8520313 8561786 8570184 8649151 8739028 8821190 8887678
3726 8887678 8936345 8909207 8989289 9064065 9122495 9171443 9256706 9355510 9384682 9473815 9547682
3715 9547682 9598082 9725402 9769876 9854584 9949125 9974024 10083370 10182534 10239903 10258062 10330550
3704 10330550 10417328 10453800 10555917 10650452 10712028 10835600 10882128 10931066 10988185 11037857 11086640
3693 11086640 11218404 11335309 11342280 11370137 11427737 11469467 11537207 11588152 11596222 11721363 11789894
3682 11789894 11795791 11837522 11895126 11954204 11974149 12002702 12057865 12108078 12141270 12164135 12179098
3671 12179098 12188887 12196593 12266407 12279345 12292302 12300398 12332473 12357256 12391890 12382860 12330364 12374184
$$ packed form
3750G737194O7467L0122K6876L2356P6712N1998O5320R1264K9375P72K5039M6280
3738H280775j3824J3766N8857N2545R5528L2666M1473Q398P8967Q9877Q2162O6488
3726H887678M8667k7138Q0082P4776N8430M8948Q5263R8804K9172Q9133P3867
3715I547682N0400J27320M4474Q4708R4541K4899J09346R9164N7369J8159P2488
3704A0330550Q6778L6472J02117R4535O1576J23572M6528M8938N7119M9672M8783
3693A1086640J31764J16905O971K7857N7600M1730O7740N0945Q070J25141O8531
3682A1789894N897M1731N7604N9078J9945K8553N5163N0213L3192K2865J4963
3671A2179098R789P706O9814J2938J2957Q096L2075K4783L4634r030n2496M3820
$$ plain form
3659 12374184 12444205 12492599 12515835 12468016 12465455 12500209 12549678 12550548 12529742 12554781 12517415 12558128
3647 12558128 12574243 12548769 12586311 12624591 12596627 12611965 12687476 12710033 12756630 12834364 12813628
3636 12813628 12868526 12847007 12859032 12906934 12899975 12973044 12979672 12991538 12965197 12972858 12956766 12988736
3624 12988736 12992801 13014581 12990027 12920192 12867789 12810950 12776999 12762237 12739800 12670091 12664659 12688172
3612 12688172 12641658 12575434 12582246 12486957 12475002 12457371 12484910 12429788 12382638 12321641 12265444
3601 12265444 12260103 12273044 12285088 12306843 12248532 12211033 12256932 12213308 12162473 12128797 12163530
3590 12163530 12162207 12192925 12126967 12124232 12170845 12253902 12212568 12180260 12261156 12248704 12237925 12236817
3578 12236817 12246843 12302405 12274354 12310553 12341598 12353124 12420867 12469418 12490154 12536409 12570176
$$ packed form
3659A2374184P0021M8394K3236m7819k561L4754M9469Q70k0806K5039l7366M0713
3647A2558128J6115k5474L7542L8280k7964J5338P5511K2557M6597P7734k0736
3636A2813628N4898k1519J2025M7902o959P3069O628J1866k6341P661j6092L1970
3624A2988736M065K1780k4554o9835n2403n6839l3951j4762k2437o9709n432K3513
3612A2688172m6514o6224O812r5289j1955j7631K7539n5122m7150o0997n6197
3601A2265444n341J2941J2044K1755n8311l7499M5899m3624n0835l3676L4733
3590A2163530j323L0718o5958k735M6613Q3057m1334l2308Q0896j2452j0779j108
3578A2236817J0026N5562k8051L6199L1045J1526O7743M8551K0736M6255L3767
$$ plain form
3567 12570176 12552694 12612846 12656139 12729097 12828673 12869591 12877933 12896176 12953785 12932403 12994204
3556 12994204 13117468 13205074 13225362 13294046 13331432 13308427 13384552 13373864 13419409 13450665 13498905
3545 13498905 13498255 13513025 13565996 13617218 13679591 13789675 13836221 13845392 13898953 13992909 14091730 14207308
3533 14207308 14269904 14306561 14414882 14500497 14588295 14680643 14716243 14744420 14801335 14919058 14974827
3522 14974827 14972411 15027604 15017650 15041849 15040656 15056528 15070738 15042932 15064037 15095044 15118733 15143997
3510 15143997 15201411 15285072 15278807 15341921 15431839 15469141 15505150 15567672 15638454 15715022 15863518
3499 15863518 15917586 15996864 16033849 16037575 16141266 16231863 16239758 16212436 16223913 16199952 16167031
3488 16167031 16108222 16049528 16053737 16038008 16052348 16067874 16102217 16156624 16188031 16231196 16295078
$$ packed form
3567A2570176j7482O0152M3293P2958R9576M0918Q342J8243N7609k1382O1801
3556A2994204J23264Q7606K0288O8684L7386k3005P6125j0688M5545L1256M8240
3545A3498905o50J4770N2971N1222O2373J10084M6546R171N3561R3956R8821J15578
3533A4207308O2596L6657J08321Q5615Q7798R2348L5600K8177N6915J17723N5769
3522A4974827k416N5193r954K4199j193J5872J4210k7806K1105L1007K3689K5264
3510A5143997N7414Q3661o265O3114Q9918L7302L6009O2522P0782P6568J48496
3499A5863518N4068P9278L6985L726J03691R0597P895k7322J1477k3961l2921
3488A6167031n8809n8694M209j5729J4340J5526L4343N4407L1407M3165O3882
$$ plain form
3477 16295078 16379334 16367804 16434948 16539823 16643233 16704919 16767383 16873651 16990200 17050431
3467 17050431 17077696 17170321 17242956 17260344 17369143 17430719 17417389 17475975 17454205 17443421 17466161
3456 17466161 17455193 17512102 17477507 17483568 17585757 17615545 17662143 17727111 17770334 17820016 17836766
3445 17836766 17918882 17940263 17972766 18077663 18143367 18196885 18246377 18370762 18386772 18463545 18490724
3434 18490724 18587887 18671782 18747898 18819737 18877613 18947660 18973506 19057893 19109344 19158501 19303926
3423 19303926 19464833 19563674 19662955 19759720 19859452 19999672 20161679 20279550 20392942 20487262
3413 20487262 20617625 20741723 20881255 21017336 21172634 21402959 21538040 21679931 21859731
3404 21859731 22079178 22228918 22427732 22618570 22772479 23005238 23211571 23387482 23560607
$$ packed form
3477A6295078Q4256j1530O7144J04875J03410O1686O2464J06268J16549O0231
3467A7050431K7265R2625P2635J7388J08799O1576j3330N8586k1770j0784K2740
3456A7466161j0968N6909l4595O061J02189K9788M6598O4968M3223M9682J6750
3445A7836766Q2116K1381L2503J04897O5704N3518M9492J24385J6010P6773K7179
3434A8490724R7163Q3895P6116P1839N7876P0047K5846Q4387N1451M9157J45425
3423A9303926J60907R8841R9281R6765R9732J40220J62007J17871J13392R4320
3413B0487262J30363J24098J39532J36081J55298K30325J35081J41891J79800
3404B1859731K19447J49740J98814J90838J53909K32759K06333J75911J73125
$$ plain form
3395 23560607 23757712 23995151 24214027 24468746 24683752 24894952 25154096 25352479 25604122
3386 25604122 25772684 25978054 26240521 26460841 26629221 26852681 27145321 27435484 27711314
3377 27711314 27962790 28218087 28474250 28803591 29094293 29395843 29704000 30017152 30339431
3368 30339431 30674514 31003854 31310398 31711226 32107818 32461207 32786822 33140318 33477263
3359 33477263 33839343 34217780 34562061 34879967 35290709 35710407 36176376 36642069 37089242
3350 37089242 37518831 38048044 38593810 39082954 39652500 40249223 40860532 41449293 42079556
3341 42079556 42716405 43394148 44025783 44703057 45465453 46212720 46917304 47738490 48556875
3332 48556875 49339658 50210264 51082573 51987024 52924753 53829859 54791254 55750992 56681070
$$ packed form
3395B3560607J97105K37439K18876K54719K15006K11200K59144J98383K51643
3386B5604122J68562K05370K62467K20320J68380K23460K92640K90163K75830
3377B7711314K51476K55297K56163L29341K90702L01550L08157L13152L22279
3368C0339431L35083L29340L06544M00828L96592L53389L25615L53496L36945
3359C3477263L62080L78437L44281L17906M10742M19698M65969M65693M47173
3350C7089242M29589N29213N45766M89144N69546N96723O11309N88761O30263
3341D2079556O36849O77743O31635O77274P62396P47267P04584Q21186Q18385
3332D8556875P82783Q70606Q72309R04451R37729R05106R61395R59738R30078
$$ plain form
3323 56681070 57720197 58775845 59845846 60954993 62114631 63301653 64557450 65851450
3315 65851450 67172271 68494313 69831468 71204385 72673659 74141149 75499519 76943727
3307 76943727 78394933 79774730 81245022 82686367 84188589 85636308 87174359 88762202
3299 88762202 90425947 92240349 94072315 95935675 97904871 99955973 102028788 104264094
3291 104264094 106546930 109037447 111703544 114375345 117250150 120326632 123559733 127011415
3283 127011415 130732470 134722738 139010082 143602810 148661157 154249456 160336238 166980198
3275 166980198 174208781 182192973 190882333 200355520 210665276 221857760 233847685 246678064
3267 246678064 260171230 274234742 288744931 303487874 318035031 331942568 344620624
$$ packed form
3323E6681070J039127J055648J070001J109147J159638J187022J255797J294000
3315F5851450J320821J322042J337155J372917J469274J467490J358370J444208
3307G6943727J451206J379797J470292J441345J502222J447719J538051J587843
3299H8762202J663745J814402J831966J863360J969196K051102K072815K235306
3291A04264094K282836K490517K666097K671801K874805L076482L233101L451682
3283A27011415L721055L990268M287344M592728N058347N588299O086782O643960
3275A66980198P228583P984192Q689360R473187J0309756J1192484J1989925J2830379
3267B46678064J3493166J4063512J4510189J4742943J4547157J3907537J2678056
$$ plain form
3260 344620624 355312435 363097083 366989910 366215627 360046743 348850441 334064036 317555978
3252 317555978 300977292 285304801 271051970 258299478 246990666 237038040 228133642
3245 228133642 220054673 212805131 206200593 200183520 194672466 189606011 184959022 180736379
3237 180736379 176836118 173204925 169955673 166939015 164114223 161420146 158857327 156416626
3229 156416626 154091515 151768367 149399274 146975766 144545441 142084516 139629932 137104427
3221 137104427 134427908 131730544 128982328 126202981 123446794 120713695 118030205 115387267
3213 115387267 112732869 110151488 107673835 105342979 103063479 100944003 98877920 96922441
3205 96922441 95018964 93175503 91475645 89905838 88349662 86890909 85424157 83984156
$$ packed form
3260C44620624J0691811P784648L892827p74283o168884j1196302j4786405j6508058
3252C17555978j6578686j5672491j4252831j2752492j1308812r952626q904398
3245B28133642q078969p249542o604538o017073n511054n066455m646989m222643
3237A80736379l900261l631193l249252l016658k824792k694077k562819k440701
3229A56416626k325111k323148k369093k423508k430325k460925k454584k525505
3221A37104427k676519k697364k748216k779347k756187k733099k683490k642938
3213A15387267k654398k581381k477653k330856k279500k119476k066083j955479
3205I6922441j903477j843461j699858j569807j556176j458753j466752j440001
$$ plain form
3197 83984156 82671631 81347971 80119900 78906640 77701438 76573518 75574899 74526509
3189 74526509 73522189 72498693 71456392 70433543 69479730 68614597 67660687 66887075 66106270
3180 66106270 65263571 64505297 63734371 63065204 62354388 61683983 61050558 60364672 59723263
3171 59723263 59086639 58478829 57888274 57297072 56717684 56155919 55638417 55079412 54607927
3162 54607927 54107763 53643424 53126973 52509016 51942281 51415822 50808766 50233236 49690175
3153 49690175 49158061 48592310 48103078 47628577 47187986 46773756 46360529 45893409 45493521
3144 45493521 45077144 44649080 44259418 43869930 43478543 43109138 42759332 42381605 42096900
3135 42096900 41781937 41443928 41129821 40817566 40561441 40260454 39983352 39739519 39429295
$$ packed form
3197H3984156j312525j323660j228071j213260j205202j127920r98619j048390
3189G4526509j004320j023496j042301j022849r53813q65133r53910p73612p80805
3180F6106270q42699p58274p70926o69167p10816o70405o33425o85886o41409
3171E9723263o36624o07810n90555n91202n79388n61765n17502n59005m71485
3162E4607927n00164m64339n16451o17957n66735n26459o07056n75530n43061
3153D9690175n32114n65751m89232m74501m40591m14230m13227m67120l99888
3144D5493521m16377m28064l89662l89488l91387l69405l49806l77727k84705
3135D2096900l14963l38009l14107l12255k56125l00987k77102k43833l10224
$$ plain form
3126 39429295 39221072 38981890 38725773 38470642 38224239 37989286 37789519 37533435 37351663
3117 37351663 37166264 36968232 36770567 36561429 36379063 36157405 35969587 35788172 35676093
3108 35676093 35508381 35334170 35216203 35056942 34960270 34820447 34743400 34642478 34467027 34304047
3098 34304047 34160693 34027662 33880539 33731287 33584123 33416034 33247864 33106146 32947976
3089 32947976 32754211 32529499 32310383 32078059 31908660 31726177 31475522 31246911 31020451
3080 31020451 30801954 30514224 30348008 30076625 29786966 29576731 29420351 29311874 29134283
3071 29134283 28937939 28790569 28617343 28498776 28420482 28261376 28080165 27943070 27798502 27577364
3061 27577364 27453548 27299236 27140690 26909862 26721269 26563570 26322181 26094977 25853574
$$ packed form
3126C9429295k08223k39182k56117k55131k46403k34953j99767k56084j81772
3117C7351663j85399j98032j97665k09138j82366k21658j87818j81415j12079
3108C5676093j67712j74211j17967j59261r6672j39823p7047j00922j75451j62980
3098C4304047j43354j33031j47123j49252j47164j68089j68170j41718j58170
3089C2947976j93765k24712k19116k32324j69399j82483k50655k28611k26460
3080C1020451k18497k87730j66216k71383k89659k10235j56380j08477j77591
3071B9134283j96344j47370j73226j18567p8294j59106j81211j37095j44568k21138
3061B7577364j23816j54312j58546k30828j88593j57699k41389k27204k41403
$$ plain form
3052 25853574 25600627 25403647 25177037 24944617 24743138 24564320 24471392 24362099 24183695 24024173
3042 24024173 23957793 23889427 23767782 23715742 23650790 23585329 23544246 23534942 23559035 23557782 23495303
3031 23495303 23474460 23519264 23560158 23573659 23585243 23585948 23556193 23568698 23572763 23553331 23563786 23564564
3019 23564564 23551360 23612841 23676091 23761104 23868351 23997777 24149929 24247076 24378007 24515938
3009 24515938 24679193 24851716 24956225 25101509 25321146 25481884 25630910 25778403 25993318
3000 25993318 26210881 26431341 26644606 26896358 27276819 27630999 27948911 28267546 28600462
2991 28600462 28884337 29162364 29387852 29592634 29769136 29960121 30136094 30339200 30611419
2982 30611419 30880747 31194799 31577595 31837074 32145437 32452082 32838952 33240278 33676835
$$ packed form
3052B5853574k52947j96980k26610k32420k01479j78818r2928j09293j78404j59522
3042B4024173o6380o8366j21645n2040o4952o5461m1083r304K4093j253o2479
3031B3495303k0843M4804M0894J3501J1584P05k9755J2505M065j9432J0455P78
3019B3564564j3204O1481O3250Q5013J07247J29426J52152R7147J30931J37931
3009B4515938J63255J72523J04509J45284K19637J60738J49026J47493K14915
3000B5993318K17563K20460K13265K51752L80461L54180L17912L18635L32916
2991B8600462K83875K78027K25488K04782J76502J90985J75973K03106K72219
2982C0611419K69328L14052L82796K59479L08363L06645L86870M01326M36557
$$ plain form
2973 33676835 34155465 34656391 35239013 35839396 36465220 37138728 37878553 38667537 39522646
2964 39522646 40408503 41367463 42329110 43324173 44353121 45489337 46636590 47841632 49135298
2955 49135298 50484523 51900178 53432172 55038610 56662407 58290423 59957200 61597121
2947 61597121 63137048 64576324 65902820 67141153 68236782 69168094 70047659 70824599 71634920
2938 71634920 72554931 73523245 74510510 75662266 76914643 78335136 79967255 81848632 83986212
2929 83986212 86353434 89002029 91984364 95267554 98765743 102461752 106330593 110226147
2921 110226147 114206395 118222506 122102981 125518110 128020881 129282886 129101307 127510717
2913 127510717 124817623 121454423 117863394 114631993 111979847 109946350 108614396 107944164
$$ packed form
2973C3676835M78630N00926N82622O00383O25824O73508P39825P88984Q55109
2964C9522646Q85857R58960R61647R95063J028948J136216J147253J205042J293666
2955D9135298J349225J415655J531994J606438J623797J628016J666777J639921
2947F1597121J539927J439276J326496J238333J095629R31312Q79565P76940Q10321
2938G1634920R20011R68314R87265J151756J252377J420493J632119J881377K137580
2929H3986212K367222K648595K982335L283190L498189L696009L868841L895554
2921A10226147L980248M016111L880475L415129K502771J262005j81579j590590
2913A27510717k693094l363200l591029l231401k652146k033497j331954o70232
$$ plain form
2905 107944164 107839910 108311214 109188728 110430760 112047701 114061079 116335287 118857573
2897 118857573 121479897 124184223 126898882 129556661 132034379 134158238 135911019 137023624
2889 137023624 137324707 136663565 135110316 132798594 129932065 126527184 122562330 118291202
2881 118291202 114035326 110171628 106903375 104157198 101936160 100262378 98962332 98050758
2873 98050758 97484761 97197849 97098175 97088048 97129080 97041016 96759587 96290132 95458230 94224115
2863 94224115 92593178 90628384 88244516 85486391 82403833 79129186 75810617 72566517
2855 72566517 69610066 66881766 64357559 62137542 60069731 58164789 56406596 54706758
2847 54706758 53126871 51753007 50492275 49273691 48109629 47070793 46089431 45127709
$$ packed form
2905A07944164j04254M71304Q77514J242032J616941K013378K274208K522286
2897A18857573K622324K704326K714659K657779K477718K123859J752781J112605
2889A37023624L01083o61142j553249k311722k866529l404881l964854m271128
2881A18291202m255876l863698l268253k746177k221038j673782j300046r11574
2873I8050758n65997k86912r9674j0127M1032q8064k81429m69455q31902j234115
2863I4224115j630937j964794k383868k758125l082558l274647l318569l244100
2855G2566517k956451k728300k524207k220017k067811j904942j758193j699838
2847E4706758j579887j373864j260732j218584j164062j038836r81362r61722
$$ plain form
2839 45127709 44283791 43405320 42506883 41631549 40649725 39586815 38536633 37497329 36547738
2830 36547738 35603375 34609715 33707254 32854415 32034742 31295269 30592883 29947745 29301682
2821 29301682 28672988 28051732 27497140 26871211 26271476 25703411 25124489 24578872 24098568
2812 24098568 23677373 23245473 22863992 22492470 22192232 21893062 21631345 21377875 21041617
2803 21041617 20788720 20554438 20261551 19947660 19636399 19350815 18983458 18587906 18271489
2794 18271489 17965851 17633202 17287777 17001545 16705753 16337302 16016147 15705509 15443893
2785 15443893 15216038 14909036 14636004 14433365 14277922 14051399 13850001 13702099 13569087
2776 13569087 13396103 13242132 13105125 12958465 12780375 12576349 12386044 12199893 12032650
$$ packed form
2839D5127709q43918q78471q98437q75334r81824j062910j050182j039304r49591
2830C6547738r44363r93660r02461q52839q19673p39473p02386o45138o46063
2821B9301682o28694o21256n54592o25929n99735n68065n78922n45617m80304
2812B4098568m21195m31900l81481l71522l00238k99170k61717k53470l36258
2803B1041617k52897k34282k92887l13891l11261k85584l67357l95552l16417
2794A8271489l05638l32649l45425k86232k95792l68451l21155l10638k61616
2785A5443893k27855l07002k73032k02639j55443k26523k01398j47902j33012
2776A3569087j72984j53971j37007j46660j78090k04026j90305j86151j67243
$$ plain form
2767 12032650 11799091 11590558 11400551 11158068 10968754 10762407 10588834 10401138 10177742
2758 10177742 10004235 9820521 9674563 9568533 9435273 9275059 9128440 9014700 8869221
2749 8869221 8737649 8622382 8529353 8379551 8235919 8172829 8068498 7962222 7870224 7735816
2739 7735816 7570062 7521724 7415318 7329628 7195366 7120747 7014570 6935163 6844089 6718759
2729 6718759 6678513 6630611 6569788 6469047 6382285 6315192 6244403 6201677 6154501 6091594 6092200 6026381
2717 6026381 5964527 5926817 5830693 5828156 5750451 5689290 5632654 5644710 5573588 5513341 5475769 5423022
2705 5423022 5395622 5309295 5287342 5189151 5119566 5131429 5089127 5044337 4997124 4966245 4931985
2694 4931985 4873534 4839813 4786470 4754076 4711381 4677263 4659889 4616764 4539014 4489010 4451094
$$ packed form
2767A2032650k33559k08533j90007k42483j89314k06347j73573j87696k23396
2758A0177742j73507j83714j45958j06030j33260j60214j46619j13740j45479
2749H869221j31572j15267r3029j49802j43632o3090j04331j06276r1998j34408
2739G735816j65754m8338j06406q5690j34262p4619j06177p9407r1074j25330
2729F718759m0246m7902o0823j00741q6762o7093p0789m2726m7176o2907O06o5819
2717F026381o1854l7710r6124k537p7705o1161n6636J2056p1122o0247l7572n2747
2705E423022k7400q6327k1953r8191o9585J1863m2302m4790m7213l0879l4260
2694D931985n8451l3721n3343l2394m2695l4118j7374m3125p7750n0004l7916
$$ plain form
2683 4451094 4443988 4432017 4420731 4403837 4425537 4384625 4326158 4254700 4213317 4220182 4235833 4211067
2671 4211067 4219142 4177815 4116145 4038022 4002762 4014498 4013624 3977583 3958360 3924525 3895946 3872372
2659 3872372 3880553 3818041 3820867 3840700 3780164 3772222 3747356 3734224 3702871 3691492 3687044 3699062
2647 3699062 3690995 3664123 3687592 3675651 3633990 3560388 3565269 3586596 3561830 3563455 3599939 3612955
2635 3612955 3618846 3618635 3558175 3534378 3494842 3446243 3460366 3482475 3430778 3357150 3286089 3256588
2623 3256588 3214318 3234524 3238646 3177726 3169725 3184877 3168729 3137305 3109838 3151803 3159830 3156903
2611 3156903 3176035 3158654 3159861 3130909 3091244 3098207 3122497 3056388 3008753 3023367 3023060 2994499
2599 2994499 2968159 2911001 2887584 2874451 2828879 2761890 2764208 2743493 2686454 2729382 2681055 2654764
$$ packed form
2683D451094p106j1971j1286j6894K1700m0912n8467p1458m1383O865J5651k4766
2671D211067Q075m1327o1670p8123l5260J1736q74l6041j9223l3835k8579k3574
2659C872372Q181o2512K826J9833o0536p942k4866j3132l1353j1379m448J2018
2647C699062q067k6872K3469j1941m1661p3602M881K1327k4766J625L6484J3016
2635C612955N891k11o0460k3797l9536m8599J4123K2109n1697p3628p1061k9501
2623C256588m2270K0206M122o0920q001J5152j6148l1424k7467M1965Q027k927
2611C156903J9132j7381J207k8952l9665O963K4290o6109m7635J4614l07k8561
2599B994499k6340n7158k3417j3133m5572o6989K318k0715n7039M2928m8327k6291
$$ plain form
2587 2654764 2625465 2635097 2619428 2615397 2608562 2583640 2552525 2566564 2516985 2497616 2474087 2385703
2575 2385703 2358564 2324883 2288429 2274260 2270884 2190788 2190515 2216893 2231924 2186972 2145387 2138157
2563 2138157 2106499 2126910 2136646 2144112 2088622 2073581 2081978 2046824 2000048 2001269 2010953 1993378
2551 1993378 1916726 1918656 1934882 1975283 1943831 1908765 1932497 1898881 1905271 1878321 1809679 1846359
2539 1846359 1809297 1828127 1765760 1679174 1733090 1720520 1701377 1682583 1726412 1690493 1698588 1704290
2527 1704290 1672513 1626354 1610779 1626164 1621944 1664310 1649964 1617888 1612444 1574514 1561618 1542844
2515 1542844 1521444 1502060 1408056 1410281 1434516 1418398 1408645 1404740 1433691 1435511 1425888 1343691
2503 1343691 1351902 1366586 1372136 1352129 1315465 1299233 1283817 1321133 1323035 1289501 1322324 1319558
$$ packed form
2587B654764k9299R632j5669m031o835k4922l1115J4039m9579j9369k3529q8384
2575B385703k7139l3681l6454j4169l376q0096k73K6378J5031m4952m1585p230
2563B138157l1658K0411R736P466n5490j5041Q397l5154m6776J221R684j7575
2551A993378p6652J930J6226M0401l1452l5066K3732l3616O390k6950o8642L6680
2539A846359l7062J8830o2367q6586N3916j2570j9143j8794M3829l5919Q095N702
2527A704290l1777m6159j5575J5385m220M2366j4346l2076n444l7930j2896j8774
2515A542844k1400j9384r4004K225K4235j6118r753l905K8951J820r623q2197
2503A343691Q211J4684N550k0007l6664j6232j5416L7316J902l3534L2823k766
$$ plain form
2491 1319558 1285113 1288709 1288505 1265797 1247903 1230523 1274683 1248838 1230597 1161319 1161682 1169742 1139701
2478 1139701 1134155 1159272 1143921 1105127 1053103 1049960 1073160 1033012 984945 968891 1018638 991674
2466 991674 987793 1004863 983011 1012055 978947 998650 998836 938806 880394 896743 898119 858653
2454 858653 859590 880380 858797 888975 910114 859680 824379 790533 770137 750935 829027 819990
2442 819990 800832 831443 838180 838380 817869 755927 730049 744615 709552 649193 664443 737964
2430 737964 732900 682000 630513 601789 660303 684062 716169 673537 677702 658802 679351 660863
2418 660863 595853 578280 592099 584133 597793 592922 604473 581568 560506 574282 566997 572924
2406 572924 594495 564941 534379 558670 583166 537142 541927 543557 481205 477989 547228 507802
$$ packed form
2491A319558l4445L596k04k2708j7894j7380M4160k5845j8241o9278L63Q060l0041
2478A139701n546K5117j5351l8794n2024l143K3200m0148m8067j6054M9747k6964
2466I91674l881J7070k1852K9044l3108J9703J86o0030n8412J6349J376l9466
2454H58653R37K0790k1583L0178K1139n0434l5301l3846k0396j9202P8092r037
2442H19990j9158L0611O737K00k0511o1942k5878J4566l5063o0359J5250P3521
2430G37964n064n0900n1487k8724N8514K3759L2107m2632M165j8900K0549j8488
2418F60863o5010j7573J3819p966J3660m871J1551k2905k1062J3776p285N927
2406E72924K1571k9554l0562K4291K4496m6024M785J630o2352l216O9239l9426
$$ plain form
2394 507802 499548 507665 476515 532991 494980 482676 503747 508657 521980 541236 518919 499826
2382 499826 547472 518577 468869 447013 410164 416047 393237 403657 382237 373257 349467 385480
2370 385480 417706 380181 372684 367905 429687 432099 421282 393796 368879 353366 321604 352352
2358 352352 327712 372726 318154 316284 347173 305758 312228 341712 337601 311246 331764 332295 298379
2345 298379 294527 285231 273220 313897 322778 322420 267492 225866 269224 249072 309905 321778 316102
2332 316102 305745 207097 239413 263358 258200 260268 242526 232080 190468 213022 228484 301106
2320 301106 264330 206932 255781 263468 284991 271809 218419 185381 221387 261570 259228 230495
2308 230495 231780 177193 202910 232702 217428 215360 256144 249046 179413 181318 236311 244919 260762
$$ packed form
2394E07802q254Q117l1150N6476l8011j2304K1071M910J3323J9256k2317j9093
2382D99826M7646k8895m9708k1856l6849N883k2810J0420k1420q980k3790L6013
2370C85480L2226l7525p497m779O1782K412j0817k7486k4917j5513l1762L0748
2358C52352k4640M5014n4572j870L0889m1415O470K9484m111k6355K0518N31l3916
2345B98379l852r296j2011M0677Q881l58n4928m1626M3358k0152O0833J1873n676
2332C16102j0357r8648L2316K3945n158K068j7742j0446m1612K2554J5462P2622
2320C01106l6776n7398M8849P687K1523j3182n3390l3038L6006M0183k342k8733
2308B30495J285n4587K5717K9792j5274k068M0784p098o9633J905N4993Q608J5843
$$ plain form
2295 260762 213101 191549 179023 142165 128503 126144 169727 282162 260762 201383 210523 171419
2283 171419 174770 221726 197936 157512 129630 179879 189981 212949 203084 184211 204106 189171
2271 189171 230576 240670 226023 210499 211891 207237 196225 152889 215805 204144 241856 247838
2259 247838 200819 182310 174376 193785 165139 187192 189923 149830 167936 201538 155198 170757
2247 170757 226148 213281 196274 171130 225725 204585 204133 203799 182760 156576 166473 199578 214774
2234 214774 224946 196166 188997 222795 191367 159880 187430 203593 211167 163618 210393 236255
2222 236255 235348 247600 249154 246614 241255 240709 252294 288088 260975 285926 227167 232314 215245
2209 215245 225029 231524 230677 208056 218976 252238 216780 281667 318291 314169 278122 273327 293099
$$ packed form
2295B60762m7661k1552j2526l6858j3662k359M3583J12435k1400n9379R140l9104
2283A71419L351M6956k3790m0424k7882N0249J0102K2968r865j8873J9895j4935
2271A89171M1405J0094j4647j5524J392m654j1012m3336O2916j1661L7712N982
2259B47838m7019j8509p934J9409k8646K2053K731m0093J8106L3602m6340J5559
2247A70757N5391j2867j7007k5144N4595k1140m52l34k1039k6184R897L3105J5196
2234B14774J0172k8780p169L3798l1428l1487K7550J6163P574m7549M6775K5862
2222B36255r07J2252J554k540n359n46J1585L5794k7113K4951n8759N147j7069
2209B15245R784O495q47k2621J0920L3262l5458O4887L6624m122l6047m795J9772
$$ plain form
2196 293099 322696 346554 352901 340354 357409 377520 433078 443196 484546 461582 453506 454996
2184 454996 462068 461444 452302 491104 477651 484422 540397 574490 578583 534597 598418 651552 615296
2171 615296 617979 653593 707977 672050 739650 777294 724912 751802 747302 774582 826963 875083
2159 875083 864022 893667 924736 945339 990083 1028445 995239 1032996 1124117 1162271 1144562 1155932
2147 1155932 1249730 1303888 1352691 1457841 1571506 1704794 1729714 1888271 2014238 2118656
2137 2118656 2281373 2476013 2686088 2966732 3266028 3590361 3890683 4228680 4659412 5120604
2127 5120604 5690609 6385332 7274524 8184953 9368894 10774031 12402877 14162507 16476393
2118 16476393 19539488 22440323 21424007 17838213 15031772 12278183 10006375 8303507
$$ packed form
2196B93099K9597K3858O347j2547J7055K0111N5558J0118M1350k2964q076J490
2184D54996P072o24r142L8802j3453O771N5975L4093M093m3986O3821N3134l6256
2171F15296K683L5614N4384l5927O7600L7644n2382K6890m500K7280N2381M8120
2159H75083j1061K9645L1069K0603M4744L8362l3206L7757R1121L8154j7709J1370
2147A155932R3798N4158M8803J05150J13665J33288K4920J58557J25967J04418
2137B118656J62717J94640K10075K80644K99296L24333L00322L37997M30732M61192
2127E120604N70005O94723Q89192R10429J183941J405137J628846J759630K313886
2118A6476393L063095K900835j016316l585794k806441k753589k271808j702868
$$ plain form
2110 8303507 7096183 6263510 5579976 5058415 4667463 4387399 4137905 3941696 3775273
2101 3775273 3566230 3253880 2996897 2762000 2560261 2403479 2245441 2122946 2025143 1932366
2091 1932366 1834057 1762228 1734749 1688573 1633070 1589809 1523481 1451861 1373555 1325786 1291691
2080 1291691 1251009 1254306 1219906 1127093 1095105 1093743 1098479 1016064 1032211 1006211 979265 926534
2068 926534 855832 833116 832158 791474 751339 729608 722426 734850 707842 657447 675609 634656
2056 634656 557385 570143 526646 562899 555133 517016 482872 514445 552875 512632 493044 478093
2044 478093 458895 454557 460273 449504 458589 470856 477914 482043 443331 442466 450185 444896 387480
2031 387480 369164 405580 397904 341298 315802 371357 388077 372450 349577 326818 326463 335648
$$ packed form
2110H303507j207324q32673o83534n21561l90952k80064k49494j96209j66423
2101C775273k09043l12350k56983k34897k01739j56782j58038j22495r7803r2777
2091A932366r8309p1829k7479m6176n5503m3261o6328p1620p8306m7769l4095
2080A291691m0682L297l4400r2813l1988j362M736q2415J6147k6000k6946n2731
2068I26534p0702k2716r58m0684m0135k1731p182J2424k7008n0395J8162m0953
2056F34656p7271J2758m3497L6253p766l8117l4144L1573L8430m0243j9588j4951
2044D78093j9198m338N716j0769R085J2267P058M129l8712q65P719n289n7416
2031C87480j8316L6416p676n6606k5496N5555J6720j5627k2873k2759l55R185
$$ plain form
2019 335648 334321 345315 325444 326086 292263 327157 312996 251427 264140 285293 283424 303982
2007 303982 258773 297022 324619 307962 254387 234073 199226 232341 299484 247653 198544 136374
1995 136374 181486 161280 159334 186675 195587 192373 218827 225827 182141 157992 230300 250000
1983 250000 252393 239731 217133 172659 160834 139565 152522 183418 161274 163545 196220 216400
1971 216400 191562 181070 148532 173877 140140 127455 164547 176378 152518 132784 168382 209166
1959 209166 228537 158063 136697 137610 132881 87105 131626 128863 123481 77450 105700 166084 92501
1946 92501 128131 148986 124927 112035 153664 168282 113284 105185 111239 124385 113253 116244
1934 116244 101851 83042 106339 102629 114661 117247 121147 101166 85322 113777 126804 126807 110586
$$ packed form
2019C35648j327J0994j9871O42l3823L4894j4161o1569J2713K1153j869K0558
2007C03982m5209L8249K7597j6657n3575k0314l4847L3115O7143n1831m9109o2170
1995A36374M5112k0206j946K7341Q912l214K6454P000m3686k4149P2308J9700
1983B50000K393j2662k2598m4474j1825k1269J2957L0896k2144K271L2675K0180
1971B16400k4838j0492l2538K5345l3737j2685L7092J1831k3860j9734L5598M0784
1959B09166J9371p0474k1366R13m729m5776M4521k763n382m6031K8250O0384p3583
1946I2501L5630K0855k4059j2892M1629J4618n4998q099O054J3146j1132K991
1934A16244j4393j8809K3297l710J2032K586L900j9981j5844K8455J3027Lj6221
$$ plain form
1921 110586 127767 132849 135422 158758 65441 80558 81911 34038 56397 69971 57512 94989
1909 94989 124684 44479 95705 97379 95017 125184 102893 89345 58636 125648 116299 85807
1897 85807 113860 97704 74585 77382 92290 84404 87962 129639 116615 113506 107024 133296 93967
1884 93967 14681 32585 68759 20086 64993 108879 101773 99703 81550 54763 67468 108291
1872 108291 121800 90732 100967 132420 155681 136344 98891 83383 78713 93525 30923 27987
1860 27987 56608 135055 125156 108716 175683 169044 173641 137150 132270 166320 167716 144579 164206
1847 164206 205208 164659 143374 140410 112733 143361 176592 184399 150249 90783 56129 94913
1835 94913 166219 121389 62335 87297 85409 82475 113055 60853 95642 95663 67811 65323 73075
$$ packed form
1921A10586J7181N082K573K3336r3317J5117J353m7873K2359J3574j2459L7477
1909I4989K9695q0205N1226J674k362L0167k2291j3548l0709O7012r349l0492
1897H5807K8053j6156k3119K797J4908p886L558M1677j3024l109o482K6272l9329
1884I3967p9286J7904L6174m8673M4907M3886p106k070j8153k6787J2705M0823
1872A08291J3509l1068J0235L1453K3261j9337l7453j5508m670J4812o2602k936
1860B7987K8621P8447r899j6440O6967o639M597l6491m880L4050J396k3137J9627
1847A64206M1002m0549k1285k964k7677L0628L3231P807l4150n9466l4654L8784
1835I4913P1306m4830n9054K4962j888k934L0580n2202L4789K1k7852k488P752
$$ plain form
1822 73075 111605 98014 138381 119353 114548 84973 51620 58100 67959 102778 112429 77934 70407
1809 70407 82420 78439 30302 50390 45852 51582 45484 41194 48442 62464 54818 27056 43802
1796 43802 5346 16074 66817 65254 25406 60715 70084 99457 76777 52757 72120 86606
1784 86606 100675 71915 -13441 23552 43156 21295 25662 65434 93747 89752 61115 78049
1772 78049 46309 86970 58322 39550 28654 66617 112091 47345 87513 104460 112006 98185
1760 98185 79899 101844 24565 57981 45345 39635 47971 58977 74073 69105 51904 55939 72677
1747 72677 16212 26715 13530 21171 -17428 38209 25239 69386 85074 47791 63973 45755
1735 45755 23131 37697 74771 15218 36877 41124 -9406 2852 36864 30202 26567 74301
$$ packed form
1822G3075L8530j3591M0367j9028m805k9575l3353O480R859L4819R651l4495p527
1809G0407J2013l981m8137K0088m538N730o098m290P248J4022p646k7762J6746
1796D3802l8456J0728N0743j563l9848L5309R369K9373k2680k4020J9363J4486
1784H6606J4069k8760q5356L6993J9604k1861M367L9772K8313l995k8637J6934
1772G8049l1740M0661k8648j8772j0896L7963M5474o4746M0168J6947P546j3821
1760I8185j8286K1945p7279L3416j2636n710Q336J1006J5096m968j7201M035J6738
1747G2677n6465J0503j3185P641l8599N5637j2970M4147J5688l7283J6182j8218
1735D5755k2624J4566L7074n9553K1659M247n0530J2258L4012o662l635M7734
$$ plain form
1723 74301 45336 46032 89192 87281 77694 54434 34248 19403 7042 80808 74139 65057 76369
1710 76369 58512 9610 42950 48664 3863 66596 63462 31470 24640 25791 9726 31861 83047
1697 83047 98828 11321 -5192 -12297 5196 -2029 36761 88170 44751 82661 44602 13393
1685 13393 24063 80104 50525 102515 38595 -2334 7724 16304 57411 55107 27548 33198
1673 33198 14725 18210 6314 16003 49224 37711 68656 59239 68418 11710 3766 -10448 -8420
1660 -8420 16191 -29475 -7885 10533 8601 3518 4053 65268 71925 13646 41286 -13836 1667
1647 1667 39408 40990 66068 47709 46638 16974 20749 20703 11163 822 22646 -7187 25400
1634 25400 3689 -20277 47766 22109 22971 16265 24111 49632 -13355 24287 51318 74615 83008
$$ packed form
1723G4301k8965O96M3160j911r587k3260k0186j4845j2361P3766o669r082J1312
1710G6369j7857m8902L3340N714m4801O2733l134l1992o830J151j6065K2135N1186
1697H3047J5781q7507j6513p105J7493p225L8790N1409m3419L7910l8059l1209
1685A3393J0670N6041k9579N1990o3920m0929J0058Q580M1107k304k7559N650
1673C3198j8473L485j1896R689L3221j1513L0945r417R179n6708p944j4214K028
1660h420K4611m5666K1590J8418j932n083N35O1215O657n8279K7640n5122J5503
1647A667L7741J582K5078j8359j071k9664L775m6r540j0341K1824k9833L2587
1634B5400k1711k3966O8043k5657Q62o706P846K5521o2987L7642K7031K3297Q393
$$ plain form
1621 83008 27444 -8423 20478 23818 -1941 -395 13100 47856 66181 71190 22527 -19131
1609 -19131 8781 50328 39078 49971 99354 43022 -23528 -41590 -45243 15261 83067 84798
1597 84798 26063 26431 47957 35311 61762 80981 46386 -23622 -12836 73875 61446 19906
1585 19906 41143 75531 55429 16981 23803 31092 31222 -12013 -8526 -4923 -4736 13987 33370
1572 33370 24951 -25786 -25304 4397 20097 31812 47887 12298 7955 12940 26774 49030 21756
1559 21756 1696 -20222 38621 45506 31795 58936 84012 40907 31097 42994 59181 24188
1547 24188 18861 -3300 8451 20544 44003 51124 50034 17256 38925 40256 16028 -66 -20676
1534 -20676 -17596 -16087 7104 28230 50072 83581 75247 62171 53984 29059 4214 -1147 49433
$$ packed form
1621H3008n5564l5867K8901L340k5759J546J3495L4756J8325N009m8663m1658
1609a9131K7912M1547j1250J0893M9383n6332o6550j8062l653O0504O7806J731
1597H4798n8735L68K1526j2646K6451J9219l4595p0008J0786Q6711j2429m1540
1585A9906K1237L4388k0102l8448O822P289J30m3235L487L603J87J8723J9383
1572C3370q419n0737M82K9701J5700J1715J6075l5589m343M985J3834K2256k7274
1559B1756k0060k1918N8843O885j3711K7141K5076m3105r810J1897J6187l4993
1547B4188n327k2161J1751J2093K3459P121j090l2778K1669J331k4228j6094k0610
1534b0676L080J509K3191K1126K1842L3509q334j3076q187k4925k4845n361N0580
$$ plain form
1521 49433 8721 11895 5150 28321 102375 78364 -8889 51379 96539 83337 19595 65465
1509 65465 69275 69735 49397 33056 50455 50561 57583 -6212 40278 30413 17698 53841 30046
1496 30046 50881 -9323 -12156 48966 84955 47554 55329 57621 31919 -12091 26360 -313
1484 -313 -12209 36440 21735 22448 8116 41333 6539 6738 27857 -8185 24886 47423 64001
1471 64001 39225 20340 20121 1678 -33046 -2164 -35562 -28159 -11975 13503 41125 11397
1459 11397 33825 17023 23997 24934 39304 12349 5611 27177 7317 6754 -14861 -9703 -34525
1446 -34525 -52137 -36153 12185 18677 11559 7549 -4565 3269 7230 24387 53985 43276 22498
1433 22498 31648 40614 66560 27443 23321 17420 44386 31318 44511 25141 -14940 -26923 4891
$$ packed form
1521D9433m0712L174o745K3171P4054k4011q7253O0268M5160j3202o3742M5870
1509F5465L810M60k0338j6341J7399J06P022o3795M6490r865j2715L6143k3795
1496C0046K0835o0204k833O1122L5989l7401P775K292k5702m4010L8451k6673
1484c13j1896M8649j4705P13j4332L3217l4794J99K1119l6042L3071K2537J6578
1471F4001k4776j8885k19j8443l4724L0882l3398P403J6184K5478K7622k9728
1459A1397K2428j6802O974R37J4370k6955o738K1566j9860n63k1615N158k4822
1446c4525j7612J5984M8338O492p118m010j2114P834L961J7157K9598j0709k0778
1433B2498R150Q966K5946l9117m122n901K6966j3068J3193j9370m0081j1983L1814
$$ plain form
1420 4891 60024 18289 -35839 -47119 -19262 20328 -12985 4695 -27196 -70470 -51348 -20880
1408 -20880 7357 35454 26777 30461 17061 29821 -3766 -4840 -53666 6760 29201 47197
1396 47197 24036 19104 73015 35563 30922 21494 2755 1538 942 1581 2982 30472 1257 16383
1382 16383 24229 69075 50943 17007 54127 38690 2747 -78273 -7947 52378 29648 72733
1370 72733 62632 30309 78258 41645 24448 43314 55673 41978 17181 5544 -436 -14542
1358 -14542 -20 -7183 -6964 13570 69318 33134 11722 -29213 7885 7370 -45117 -57702 -42184
1345 -42184 -13556 21556 49666 19795 3529 35350 27103 54672 12304 -10813 -30616 -9430
1333 -9430 44788 38953 -1666 11370 13942 19756 48179 35265 -21790 14231 63544 65530 20540
$$ packed form
1420D891N5133m1735n4128j1280K7857L9590l3313J7680l1891m3274J9122L0468
1408b0880K8237K8097q677L684j3400J2760l3587j074m8826O0426K2441J7996
1396D7197k3161m932N3911l7452m641r428j8739j217n96O39J401K7490k9215J5126
1382A6383P846M4846j8132l3936L7120j5437l5943q1020P0326O0325k2730M3085
1370G2733j0101l2323M7949l6613j7197J8866J2359j3695k4797j1637n980j4106
1358a4542J4522p163K19K0534N5748l6184k1412m0935L7098n15n2487j2585J5518
1345d2184K8628L5112K8110k9871j6266L1821q247K7569m2368k3117j9803K1186
1333i430N4218n835m0619J3036K572N814K8423j2914n7055L6021M9313J986m4990
$$ plain form
1320 20540 10879 48854 24445 10958 1485 51583 83124 44916 6051 24880 91842 78425
1308 78425 58256 41635 69224 62669 55741 28018 37448 35440 16581 61163 41149 27248 13579
1295 13579 48186 26450 13543 31351 10423 13815 27535 45502 6975 -17681 65014 57264
1283 57264 60212 72445 64975 56501 33086 -8239 28412 16087 50888 27621 15720 -14569
1271 -14569 -34787 -35247 54485 29762 57635 56253 41440 5769 6964 -12448 -26776 28533 34892
1258 34892 56708 17143 1251 -1885 9334 -8580 6503 -32884 41814 -11119 -61548 10157
1246 10157 13655 25425 874 8162 1034 -4421 18952 11126 55192 66064 57493 41852 32779
1233 32779 26050 21535 -8745 -44754 -25225 -5044 53496 38378 21722 -10732 2459 -15785
$$ packed form
1320B0540r661L7975k4409j3487r473N0098L1541l8208l8865J8829O6962j3417
1308G8425k0169j6621K7589o555o928k7723R430k008j8859M4582k0014j3901j3669
1295A3579L4607k1736j2907J7808k0928L392J3720J7967l8527k4656Q2695p750
1283E7264K948J2233p470q474k3415m1325L6651j2325L4801k3267j1901l0289
1271a4569k0218m60Q9732k4723K7873j382j4813l5671J195j9412j4328N5309O359
1258C4892K1816l9565j5892l136J1219j7914J5083l9387P4698n2933n0429P1705
1246A0157L498J1770k4551P288p128n455K3373p826M4066J0872q571j5641r073
1233C2779o729m515l0280l6009J9529K0181N8540j5118j6656l2454J3191j8244
$$ plain form
1221 -15785 16809 26414 -19993 -9845 -28525 -15520 4200 6295 16841 34940 44029 58131
1209 58131 6813 15525 56105 80468 57857 66105 50622 28260 44995 -521 -42055 -11071
1197 -11071 -10019 12025 34204 32390 -13658 -51200 -70548 -12566 1337 -20129 -24455 -4615
1185 -4615 21506 -2506 1813 26710 12993 88273 71231 84833 42491 17689 -3174 -1793
1173 -1793 3817 -16252 13725 51754 50512 44953 28386 17207 43648 -3598 40372 75050 67059
1160 67059 85653 56016 35148 36980 -27856 -23621 6688 -26497 -47768 -13383 3230 6766
1148 6766 -39448 -24328 -18238 -414 -31443 -39298 -33694 -7562 -8202 -32327 -12018 4896 -14539
1135 -14539 -14597 2423 -19385 24698 15366 9022 45853 27920 53605 26008 16346 24741 -10644
$$ packed form
1221a5785L2594R605m6407J0148j8680J3005J9720K095J0546J8099R089J4102
1209E8131n1318Q712M0580K4363k2611Q248j5483k2362J6735m5516m1534L0984
1197a1071J052K2044K2179j814m6048l7542j9348N7982J3903k1466m326J9840
1185d615K6121k4012M319K4897j3717P5280j7042J3602m2342k4802k0863J381
1173a793N610k0069K9977L8029j242n559j6567j1179K6441m7246M3970L4678p991
1160F7059J8594k9637k0868J832o4836M235L0309l3185k1271L4385J6613L536
1148F766m6214J5120O090J7824l1029p855N604K6132o40k4125K0309J6914j9435
1135a4539n8J7020k1808M4083r332o344L6831j7933K5685k7597r662Q395l5385
$$ plain form
1122 -10644 -22859 -23601 20869 -7955 3247 45682 7753 -37546 -31959 -15296 -34086 -28752 -21230
1109 -21230 62106 54890 7995 12176 -18872 -15564 -8343 -24872 -49744 -19711 -32803 -72608 -32424
1096 -32424 -1838 25611 -30211 -45372 -9698 -5410 1666 -8066 -20312 -53170 -38943 16156
1084 16156 23577 22970 30109 -33952 -53530 30631 888 -13470 5840 -26192 -7159 62503 48363
1071 48363 39639 49793 65614 54555 -34078 -11178 32375 27419 12968 5237 -12034 -30741
1059 -30741 -32127 -34978 -75682 -48095 11002 39342 13777 16106 3984 -1648 1887 -6860 -11361
1046 -11361 -15983 -24873 -33578 -34358 -40128 -44324 -45559 -23547 -16206 -21443 -65261 -58329 -36838 -5220
1032 -5220 -14360 -16531 -18114 1820 -3619 3417 -24026 -13414 20861 41375 42559 35711 22233
$$ packed form
1122a0644j2215p42M4470k8824J1202M2435l7929m5299N587J6663j8790N334P522
1109b1230Q3336p216m6895M181l1048L308P221j6529k4872L0033j3092l9805M0184
1096c2424L0586K7449n5822j5161L5674M288P076r732j2246l2858J4227N5099
1084A6156P421o07P139o4061j9578Q4161k9743j4358J9310l2032J9033O9662j4140
1071D8363q724J0154J5821j1059q8633K2900M3553m956j4451p731j7271j8707
1059c0741j386k851m0704K7587N9097K8340k5565K329j2122n632L535q747m501
1046a1361m622q890q705p80n770m196j235K2012P341n237m3818O932K1491L1618
1032e220r140k171j583J9934n439P036k7443J0612L4275K0514J184o848j3478
$$ plain form
1019 22233 9903 23571 -21722 -24946 -25647 -33033 -19725 23429 31041 31264 46402 50188 -10846
1006 -10846 4056 -4532 -43758 -7793 16435 -33305 -22638 -7464 17438 18451 32954 48520
994 48520 48614 65417 96166 65716 27923 43481 46351 48349 1883 -15365 -42937 -20806 25232
981 25232 -52614 -32643 -21835 -63759 -49735 -33953 4094 5179 11724 -2744 44 6337 -26514
968 -26514 -48075 -10464 -529 23060 13431 -30116 -27351 27494 26864 -354 32697 35261 10590
955 10590 -8162 37118 -2 -31382 -29004 -28530 -40558 -69975 2114 -53023 -48446 -23302 -27752
942 -27752 23706 -8649 -2763 26454 22000 -27798 -47202 -71485 33381 8989 -14547 -1944
930 -1944 33924 36893 39078 4515 3695 5782 -14877 -17095 -54184 -32067 -53012 -44148 -1898 55209
$$ packed form
1019B2233j2330J3668m5293l224p01p386J3308M3154P612K23J5138L786o1034
1006a0846J4902q588l9226L5965K4228m9740J0667J5174K4902J013J4503J5566
994D8520R4J6803L0749l0450l7793J5558K870J998m6466j7248k7572K2131M6038
981B5232p7846J9971J0808m1924J4024J5782L8047J085O545j4468K788O293l2851
968b6514k1561L7611R935K3589r629m3547K765N4845o30k7218L3051K564k4671
955A0590j8752M5280l7120l1380K378M74j2028k9417P2089n5137M577K5144m450
942b7752N1458l2355N886K9217m454m9798j9404k4283J04866k4392k3536J2603
930a944L5868K969K185l4563q20K087k0659k218l7089K2117k0945Q864M2250N7107
$$ plain form
916 55209 44180 6442 -2914 -13205 -42291 -52515 -78581 -9150 -931 -36134 -28022 18059 -23794
903 -23794 -40809 -9873 18992 -68609 -25297 32635 -26634 -14892 -14750 -38216 -26972 -46054
891 -46054 -50313 -59160 -37279 4443 -12275 -29523 -6204 12884 21479 -914 -23080 -10728 -7191
878 -7191 -7266 -35665 -21666 -54786 -73322 -44462 14631 2669 -59539 -57513 -17866 -24394 -23158
865 -23158 23699 18693 -19667 -76191 -35756 -63085 -14349 27956 29593 -7740 -35107 6520
853 6520 -16392 1740 -59395 -36897 -82811 -68392 -64034 -48819 -70538 -71289 -29859 -38423 -17484
840 -17484 -2009 -3019 24646 26935 -35896 -30012 -23135 -19865 -61092 -76352 -41953 -5515 3417
827 3417 4917 -32449 12429 43632 11523 9562 7211 -11525 18292 5662 -42454 5235 49459
$$ packed form
916E5209j1029l7738r356j0291k9086j0224k6066O9431Q219l5203Q112M6081m1853
903b3794j7015L0936K8865q7601M3312N7932n9269J1742J42k3466J1244j9082
891d6054m259q847K1881M1722j6718j7248K3319J9088Q595k2393k2166J2352L537
878g191p5k8399J3999l3120j8536K8860N9093j1962o2208K026L9647o528J236
865b3158M6857n006l8360n6524M0435k7329M8736M2305J637l7333k7367M1627
853F520k2912J8132o1135K2498m5914J4419M358J5215k1719p51M1430q564K0939
840a7484J5475j010K7665K289o2831N884O877L270m1227j5260L4399L6438Q932
827C417J500l7366M4878L1203l2109j961k351j8736K9817j2630m8116M7689M4224
$$ plain form
814 49459 31655 -33478 -13459 16586 28552 10459 14699 70367 70153 82412 32404 52284 34812
801 34812 26357 -9364 -53473 -36496 -16792 7772 -20345 9657 6067 -7070 -7986 -31699 -34862
788 -34862 42734 31614 -3073 8134 5130 -81672 -39926 -18506 -24973 1621 1501 26706 8192
775 8192 -14168 -48492 1254 46241 11573 -33730 -14977 -18201 -9536 30683 8517 17533 14395
762 14395 25200 -11513 -41714 -7810 54628 34876 -793 -2671 -18526 27125 -11163 -17513
750 -17513 -11079 -43590 -13238 -36958 -26353 21835 -17942 -37248 -20615 23569 34035 18165
738 18165 1814 13073 25707 12399 -10863 -1736 35637 69814 47779 29500 9848 -8029
726 -8029 -24251 -72364 -28345 -4710 37418 50250 50991 27650 4737 22986 -3560 -56062 -111888
$$ packed form
814D9459j7804o5133K0019L0045J1966j8093M240N5668k14J2259n0008J9880j7472
801C4812q455l5721m4109J6977J9704K4564k8117L0002l590j3137r16k3713l163
788c4862P7596j1120l4687J1207l004q6802M1746K1420o467K6594j20K5205j8514
775H192k2360l4324M9746M4987l4668m5303J8753l224Q665M0219k2166R016l138
762A4395J0805l6713l0201L3904O2438j9752l5669j878j5855M5651l8288o350
750a7513O434l2511L0352k3720J0605M8188l9777j9306J6633M4184J0466j5870
738A8165j6351J1259J2634j3308k3262R127L7373L4177k2035j8279j9652j7877
726h029j6222m8113M4019K3635M2128J2832P41k3341k2913J8249k6546n2502n5826
$$ plain form
713 -111888 -64817 -25964 -11041 -9787 -27569 -96720 -33233 6341 -39680 -27081 -4961 4627
701 4627 18331 41210 -11155 -21445 18477 22511 -47808 2427 23666 -5349 -25195 -38183
689 -38183 -34243 -15394 27103 33189 31305 35785 12186 -17587 -34005 -57445 -49729 -78481 -31779
676 -31779 -33651 -24777 -75271 -82001 -20138 -33718 18905 -6762 -70111 -86192 -31253 -57988 -87219
663 -87219 -33193 -22686 -54294 -23552 -5458 10479 -17925 -214 -1972 -13360 -8598 -7801 -6992
650 -6992 22170 43464 -23420 -17166 -29003 -11135 16340 38272 12878 -21379 -8980 -4899 -677
637 -677 -4034 5234 -2858 -25850 -24190 -15086 8315 -70124 -13462 44940 7239 -36765 -57478
624 -57478 -17286 52561 79696 -1387 -19383 -13340 -24072 -30756 32329 57762 29351 -29242
$$ packed form
713a11888M7071L8853J4923J254j7782o9151O3487L9574m6021J2599K2120R588
701D627J3704K2879n2365j0290L9922M034p0319N0235K1239k9015j9846j2988
689c8183L940J8849M2497O086j884M480k3599k9773j6418k3440P716k8752M6702
676c1779j872Q874n0494o730O1863j3580N2623k5667o3349j6081N4939k6735k9231
663h7219N4026J0507l1608L0742J8094J5937k8404J7711j758j1388M762P97Q09
650f992K9162K1294o6884O254j1837J7868K7475K1932k5394l4257J2399M081M222
637f77l357R268q092k2992J660R104K3401p8439N6662N8402l7701m4004k0713
624e7478M0192O9847K7135q1083j7996O043j0732o684O3085K5433k8411n8593
$$ plain form
612 -29242 -39774 -30181 -23609 -17324 -67816 -24894 30378 44203 68982 76635 48100 32313 -53332
599 -53332 -47517 29189 1780 -11945 -23581 -18113 7230 -7694 -51858 -44127 2289 -5616 -33193
586 -33193 -62027 -10622 30764 29552 -2314 8425 3974 -14583 -23230 1653 -10206 -13660 -40135
573 -40135 -27860 -42973 -54321 -47981 -65252 -45428 -43870 -23714 -18093 -60917 -33467 11789 -26081
560 -26081 -44518 -24469 -39381 -38902 -23306 -23211 -18506 -25948 27850 9090 -5013 -24008 -47116
547 -47116 -55595 -16795 -48157 -51212 -5635 -3377 -31452 -63308 -105255 -79461 -93410 -72541 -57600
534 -57600 -70458 -44668 -38799 -18543 22763 -19426 -34263 -16902 -9940 -71828 -72562 -71616 -49212
521 -49212 -12496 -55972 -66711 -57234 -94526 -92789 -46815 -21955 -28826 -20851 12201 12854 -23164
$$ packed form
612b9242j0532R593O572O285n0492M2922N5272J3825K4779P653k8535j5787q5645
599e3332N815P6706k7409j3725j1636N468K5343j4924m4164P731M6416p905k7577
586c3193k8834N1405M1386j212l1866J0739m451j8557q647K4883j1859l454k6475
573d0135J2275j5113j1348O340j7271J9824J558K0156N621m2824K7450M5256l7870
560b6081j8437K0049j4912M79J5596R5M705p442N3798j8760j4103j8995k3108
547d7116q479L8800l1362l055M5577K258k8075l1856m1947K5794j3949K0869J4941
534e7600j2858K5790N869K0256M1306m2189j4837J7361O962o1888p34R46K2404
521d9212L6716m3476j0739R477l7292J737M5974K4860o871P975L3052O53l6018
$$ plain form
508 -23164 -21388 -42903 -39093 -13769 -57332 -24862 18909 7056 24162 33663 31982 31649 -138
495 -138 -3338 30176 5217 310 -24226 -90654 -70605 -52708 3906 -5004 -21425 -52852 -85823
482 -85823 -57264 -100095 -145134 -100910 -49115 -84134 -81521 -50389 -39407 -61811 -26465 -24961
470 -24961 -21256 34635 10584 -25338 -38545 -12846 -65942 -28925 -50492 -45184 -11564 21999
458 21999 1592 -15343 -35585 -48032 -39689 -26808 -50475 5603 -2609 -21306 14671 -4963
446 -4963 -37429 -27144 -38323 -385 25828 6635 -33625 -17263 -8171 -22305 -40836 -78507
434 -78507 -58164 -29716 -31389 -41780 -34297 -1048 6804 35845 21243 -50402 -45317 -75021 -74084
421 -74084 -57405 -19366 -18315 -20494 -62809 -77128 -80912 -42263 -36154 7735 -6251 -30161 -2513
$$ packed form
508b3164J776k1515L810K5324m3563L2470M3771j1853J7106R501j681l33l1787
495a38l200L3514k4959m907k4536o6428K0049J7897N6614q910j6421l1427l2971
482h5823K8559m2831m5039M4224N1795l5019K613L1132J0982k2404L5346J504
470b4961L705N5891k4051l5922j3207K5699n3096L7017k1567N308L3620L3563
458B1999k0407j6935k0242j2447Q343J2881k3667N6078q212j8697L5977j9634
446d963l2466J0285j1179L7938K6213j9193m0260J6362R092j4134j8531l7671
434g8507K0343K8448j673j0391P483L3249P852K9041j4602p1645N085k9704R37
421g4084J6679L8039J051k179m2315j4319l784L8649O109M3889j3986k3910K7648
$$ plain form
408 -2513 -22687 -55102 -63170 -104678 -76017 -54970 -18585 -62962 -92566 -73814 -76669 -37544 -17205
395 -17205 -16710 -36762 -800 7609 -59687 -16014 -31950 -81869 -58093 -46761 -721 -12251 -9262
382 -9262 -6316 -22148 -36317 -33231 -47375 -62063 -63317 -77428 -43458 -44556 -53830 -212 1507
369 1507 -42023 -99909 -68805 -23812 -60682 -36521 -2930 -35092 -76495 -68923 -99385 -124171
357 -124171 -96750 -98052 -73011 -16210 5240 -52139 -44713 -80600 -35812 -65014 -91035 -62532
345 -62532 -78876 -43901 -23348 -47855 -25428 -27130 -45197 -48126 -31868 -36875 -13307 -40939 -83076
332 -83076 -39741 -62356 -102563 -78874 -59354 -62723 -42895 -35030 -62131 -81793 -53438 -77035
320 -77035 -37828 -81350 -115623 -112063 -62325 -52686 -22887 -71245 -69097 -55820 -19088 -7311 -60309
$$ packed form
408b513k0174l2415q068m1508K8661K1047L6385m4377k9604J8752k855L9125K0339
395a7205M95k0052L5962Q409o7296M3673j5936m9919K3776J1332M6040j1530K989
382i262K946j5832j4169L086j4144j4688j254j4111L3970j098r274N3618J719
369A507m3530n7886L1104M4993l6870K4161L3591l2162m1403P572l0462k4786
357a24171K7421j302K5041N6801K1450n7379P426l5887M4788k9202k6021K8503
345f2532j6344L4975K0553k4507K2427j702j8067k929J6258n007K3568k7632m2137
332h3076M3335k2615m0207K3689J9520l369J9828P865k7101j9662K8355k3597
320g7035L9207m3522l4273L560M9738R639K9799m8358K148J3277L6732J1777n2998
$$ plain form
307 -60309 -31049 -38723 -31511 -30556 -46715 -36918 -36709 -60448 -43017 -52149 -22098 -35321 -24122 -25875
293 -25875 -52546 -59926 -54722 -46749 -44198 -30850 -11593 692 -52229 -78176 -79449 -53102 -24900
280 -24900 -62245 -66560 -66995 -68998 -90354 -91612 -78442 -64736 -8292 -14655 -37989 -78092 -126323
267 -126323 -128117 -120772 -105385 -96648 -44800 -23863 -83957 -101647 -67748 -33287 -28290 -29699 -59567
254 -59567 -114082 -132581 -117151 -119801 -43479 -43075 -60380 -68820 -77956 -44324 -29490 -60250 -59394
241 -59394 -41051 -45657 -29747 -41301 -26299 -58431 -31907 -22277 -67091 -68306 -80377 -70363 -84722
228 -84722 -105274 -103221 -96843 -119148 -127747 -61032 6432 51941 -24877 -69927 -69042 -58216 -57775
215 -57775 -38661 -42460 -43049 -17737 -67388 -97425 -80905 -20943 -6678 2322 -41204 -44818 -11552
$$ packed form
307f0309K9260p674P212R55j6159R797K09k3739J7431r132L0051j3223J1199j753
293b5875k6671p380N204P973K551J3348J9257J2285n2921k5947j273K6347K8202
280b4900l7345m315m35k003k1356j258J3170J3706N6444o363k3334m0103m8231
267a26323j794P345J5387Q737N1848K0937o0094j7690L3899L4461M997j409k9868
254e9567n4515j8499J5430k650P6322M04j7305q440r136L3632J4834l0760Q56
241e9394J8343m606J5910j1554J5002l2132K6524R630m4814j215j2071J0014j4359
228h4722k0552K053O378k2305q599O6715O7464M5509p6818m5050Q85J0826M41
215e7775J9114l799n89K5312m9651l0037J6520N9962J4265R000m3526l614L3266
$$ plain form
202 -11552 -5501 -18354 -58484 -108305 -173151 -165184 -132221 -49361 -34076 -64833 -31770 -70790
190 -70790 -95511 -51844 -40367 -47368 -60962 -53430 -28141 12228 -6787 -24035 -47803 -40879 -20656
177 -20656 -35865 -68222 -55550 -79941 -115555 -80160 -87281 -78139 -80432 -73688 -47195 -22850 -47672
164 -47672 -70710 -43956 -92583 -95148 -84067 -66181 -53794 -60095 -82033 -88045 -37251 -7250 -76534
151 -76534 -78734 -49503 -39695 -52866 -62833 -50090 -103885 -99081 -92497 -73999 -81002 -113248 -146641
138 -146641 -113777 -79112 -60363 -50477 -68073 -87906 -67334 -93889 -130441 -144738 -145116 -107684
126 -107684 -73037 -87333 -99181 -108372 -130097 -87207 -89929 -76751 -84508 -124666 -136271 -132990 -124198
113 -124198 -76856 -68969 -115291 -84786 -51907 -67909 -104149 -92702 -81657 -78527 -92721 -81316
$$ packed form
202a1552O051j2853m0130m9821o4846P967L2963Q2860J5285l0757L3063l9020
190g0790k4721M3667J1477p001j3594P532K5289M0369j9015j7248k3768O924K0223
177b0656j5209l2357J2672k4391l5614L5395p121R142k293O744K6493K4345k4822
164d7672k3038K6754m8627k565J1081J7886J2387o301k1938o012N0794L0001o9284
151g6534k200K9231R808j3171r967J2743n3795M804O584J8498p003l2246l3393
138a46641L2864L4665J8749R886j7596j9833K0572k6555l6552j4297l78L7432
126a07684L4647j4296j1848r191k1725M2890k722J3178p757m0158j1605L281Q792
113a24198M7342P887m6322L0505L2879j6002l6240J1447J1045L130j4194J1405
$$ plain form
101 -81316 -65315 -66159 -56433 -56612 -101865 -58436 -65122 -94966 -79193 -66727 -68011 -65868 -68908 -85612
87 -85612 -102977 -93747 -81381 -45050 -53804 -42881 -3235 -22084 -60586 -39272 -86144 -95685 -59276
74 -59276 -68184 -74821 -71723 -69687 -47364 -42340 -38048 -25223 -83708 -68923 -48982 -46068 -64036 -47565
60 -47565 -74987 -72488 -36759 -36128 -57260 -59940 -75983 -59874 -60188 -38060 -87468 -95246 -93128 -79718
46 -79718 -90670 -88622 -88255 -66427 -93893 -112820 -118791 -77832 -72284 -75216 -55048 -68070 -77859 -90410
32 -90410 -114386 -124137 -113072 -113371 -115293 -112122 -68882 -67701 -62266 -57719 -45339 -84013 -79022 -78454
18 -78454 -98454 -71199 -62395 -101276 -85344 -92732 -99837 -110798 -102647 -89750 -103898 -79849 -96212
5 -96212 -99565 -77709 -95505 -54282 -72287
$$ packed form
101h1316J6001q44R726j79m5253M3429o686k9844J5773J2466j284K143l040j6704
87h5612j7365R230J2366L6331q754J0923L9646j8849l8502K1314m6872r541L6409
74e9276q908o637L098K036K2323N024M292J2825n8485J4785J9941K914j7968J6471
60d7565k7422K499L5729O31k1132k680j6043J6109l14K2128m9408p778K118J3410
46g9718j0952K048L67K1828k7466j8927n971M0959N548k932K0168j3022r789j2551
32i0410k3976r751J1065k99j922L171M3240J181N435M547J2380l8674M991N68
18g8454k0000K7255Q804l8881J5932p388p105j0961Q151J2897j4148K4049j6363
5i6212l353K1856j7796M1223j8005
$$ plain form
0 -72287
$$ packed form
0g2287
$$ [...]
##END NTUPLES=NMR SPECTRUM
##END=
