##TITLE=1H_CA-8931-3
 CDCl3,8 sc, 
 30.9.2021
##JCAMPDX= 6.0         $$ Bruker NMR JCAMP-DX V2.0
##DATA TYPE= NMR SPECTRUM
##DATA CLASS= NTUPLES
##ORIGIN= UXNMR, Bruker Analytische Messtechnik GmbH
##OWNER= root
$$ XWIN-NMR		Version 3.5
$$ Thu Sep 30 12:35:34 2021 Russian Standard Time (UT+4h)  she@DPX200
##.OBSERVE FREQUENCY= 200.1313468511
##.OBSERVE NUCLEUS= ^1H
##.ACQUISITION MODE= SIMULTANEOUS
##.ACQUISITION SCHEME= undefined
##.AVERAGES= 8
##.DIGITISER RES= 18
##SPECTROMETER/DATA SYSTEM= spect
##.PULSE SEQUENCE= zg30
##.SOLVENT NAME= CDCl3
##.SHIFT REFERENCE= (INTERNAL, CDCl3, 0, 15.7304)
##AUDIT TRAIL= $$ (NUMBER, WHEN, WHO, WHERE, WHAT)
$$ ##TITLE= Audit trail, XWIN-NMR		Version 3.5
$$ ##JCAMPDX= 5.01
$$ ##ORIGIN= Bruker BioSpin GmbH
$$ ##OWNER= she
$$ F:/spectra/data/she/nmr/H-F/1/pdata/1/auditp.txt
$$ ##AUDIT TRAIL=  $$ (NUMBER, WHEN, WHO, WHERE, WHAT)
(   1,<2021-09-30 12:32:49.28 +0400>,<she>,<DPX200>,
      <created by zg, POWCHK disabled, PULCHK disabled
       configuration hash MD5:
       00 E9 B6 7A A2 85 ED C7 34 08 36 98 17 FE 4E 26
       data hash MD5: 16K
       83 E4 28 56 22 85 6A 39 50 89 2B A7 8B EC 4B 42>)
(   2,<2021-09-30 12:32:51.87 +0400>,<she>,<DPX200>,
      <Start of raw data processing
       efp BC_mod = 2 LB = 0.24 FT_mod = 6 PKNL = 1 PHC0 = -14706.06 PHC1 = 15.20085 SI = 16K 
       data hash MD5: 16K
       C4 C1 7F 4F 30 42 82 19 54 8B 01 E8 F4 B8 73 90>)
(   3,<2021-09-30 12:33:36.31 +0400>,<she>,<DPX200>,
      <pk PHC0 = -92.61083 PHC1 = 3.599971 
       data hash MD5: 16K
       7D 91 76 C0 37 52 2B D9 E7 AB 77 ED 08 A7 5B F5>)
(   4,<2021-09-30 12:33:39.89 +0400>,<she>,<DPX200>,
      <abs ABSG = 5 
       data hash MD5: 16K
       C1 B5 38 F7 37 F5 61 CF 83 67 BC 5A 9C 2F 62 01>)
(   5,<2021-09-30 12:34:09.87 +0400>,<she>,<DPX200>,
      <pk PHC0 = 4.153074 PHC1 = -4.399999 
       data hash MD5: 16K
       EB 43 19 F6 9E 67 68 03 25 44 96 5D F8 E1 39 A7>)
(   6,<2021-09-30 12:34:13.18 +0400>,<she>,<DPX200>,
      <abs ABSG = 5 
       data hash MD5: 16K
       5D 8A CC 69 0F E0 69 C9 E5 B2 36 07 D9 2F 68 4D>)
$$ ##END=
$$ 
$$ hash MD5
$$ 9D A7 8D F1 7B 5D C2 C5 6B 3A 0A B1 3B 8B 22 2D
##$RELAX= 
##$RELAX= 
##$RELAX= 
##$RELAX= 
##$RELAX= 
##$RELAX= 
$$ Bruker specific parameters
$$ --------------------------
##$DU= <F:/spectra>
##$EXPNO= 1
##$NAME= <H-F>
##$PROCNO= 1
##$TYPE= <nmr>
##$USER= <she>
##$AMP= (0..31)
100 100 100 100 100 100 100 100 100 100 100 100 100 100 100 100 100 100 
100 100 100 100 100 100 100 100 100 100 100 100 100 100 
##$AQSEQ= 0
##$AQ_mod= 1
##$AUNM= <au_zg>
##$AUTOPOS= <>
##$BF1= 200.13
##$BF2= 200.13
##$BF3= 200.13
##$BF4= 200.13
##$BF5= 200.13
##$BF6= 200.13
##$BF7= 200.13
##$BF8= 200.13
##$BYTORDA= 1
##$CFDGTYP= 0
##$CFRGTYP= 5
##$CHEMSTR= <none>
##$CNST= (0..31)
1 1 145 1 1 1 1 1 1 1 1 1 1 1 1 1 1 1 1 1 1 1 1 1 1 1 1 1 1 1 1 1 
##$CPDPRG= <>
##$CPDPRG1= <>
##$CPDPRG2= <>
##$CPDPRG3= <>
##$CPDPRG4= <mlev>
##$CPDPRG5= <mlev>
##$CPDPRG6= <mlev>
##$CPDPRG7= <mlev>
$$ [...]
##$SUBNAM2= <"">
##$SUBNAM3= <"">
##$SUBNAM4= <"">
##$SUBNAM5= <"">
##$SUBNAM6= <"">
##$SUBNAM7= <"">
##$SUBNAM8= <"">
##$SUBNAM9= <"">
##$SW= 18.0517286264689
##$SWIBOX= (0..15)
0 0 2 0 0 0 0 0 0 0 0 0 0 0 0 0 
##$SW_h= 3612.71676300578
##$TD= 16384
##$TD0= 1
##$TE= 0
##$TE2= 300
##$TE3= 300
##$TEG= 300
##$TL= (0..7)
0 120 120 120 120 120 120 120 
##$TP= (0..7)
150 150 150 150 150 150 150 150 
##$TP07= 0
##$TPNAME0= <>
##$TPNAME1= <>
##$TPNAME2= <>
##$TPNAME3= <>
##$TPNAME4= <>
##$TPNAME5= <>
##$TPNAME6= <>
##$TPNAME7= <>
##$TPOAL= (0..7)
0.5 0.5 0.5 0.5 0.5 0.5 0.5 0.5 
##$TPOFFS= (0..7)
0 0 0 0 0 0 0 0 
##$TUNHIN= 0
##$TUNHOUT= 0
##$TUNXOUT= 0
##$USERA1= <user>
##$USERA2= <user>
##$USERA3= <user>
##$USERA4= <user>
##$USERA5= <user>
##$V9= 5
##$VALIST= <valist>
##$VCLIST= <CCCCCCCCCCCCCCC>
##$VD= 0
##$VDLIST= <DDDDDDDDDDDDDDD>
##$VPLIST= <PPPPPPPPPPPPPPP>
##$VTLIST= <TTTTTTTTTTTTTTT>
##$WBST= 1024
##$WBSW= 4
##$XGAIN= (0..3)
0 0 0 0 
##$XL= 0
##$YL= 0
##$YMAX_a= 245300
##$YMIN_a= -467359
##$ZGOPTNS= <>
##$ZL1= 120
##$ZL2= 120
##$ZL3= 120
##$ZL4= 120
##$ABSF1= 15.70942
##$ABSF2= -2.342429
##$ABSG= 5
##$ABSL= 3
##$ALPHA= 0
##$AQORDER= 0
##$ASSFAC= 0
##$ASSFACI= 0
##$ASSFACX= 0
##$ASSWID= 0
##$AUNMP= <proc_1d>
##$AZFE= 0.1
##$AZFW= 0.1
##$BCFW= 0
##$BC_mod= 2
##$BYTORDP= 0
##$COROFFS= 0
##$CY= -3
##$DATMOD= 1
##$DC= 0
##$DFILT= <>
##$DTYPP= 0
##$F1P= 0
##$F2P= 0
##$FCOR= 1
##$FTSIZE= 16384
##$FT_mod= 6
##$GAMMA= 0
##$GB= 0
##$INTBC= 1
##$INTSCL= 0
##$ISEN= 128
##$LB= 0.24
##$LEV0= 0
##$LPBIN= 0
##$MAXI= 10000
##$MC2= 0
##$MEAN= 0
##$ME_mod= 0
##$MI= 1.114404
##$NCOEF= 0
##$NC_proc= -7
##$NLEV= 6
##$NOISF1= 3.799351
##$NOISF2= 2.8
##$NSP= 0
##$NTH_PI= 0
##$NZP= 0
##$OFFSET= 15.73036
##$PC= 1
##$PHC0= -14794.52
##$PHC1= 14.40082
##$PH_mod= 1
##$PKNL= yes
##$PPARMOD= 0
##$PSCAL= 0
##$PSIGN= 0
##$REVERSE= no
##$SF= 200.130005091136
##$SI= 16384
##$SIGF1= 3
##$SIGF2= 2
##$SINO= 5.538805
##$SIOLD= 16384
##$SREGLST= <1H.CDCl3>
##$SSB= 0
##$STSI= 16384
##$STSR= 0
##$SW_p= 3612.71676300578
##$SYMM= 0
##$S_DEV= 0
##$TDeff= 16384
##$TDoff= 0
##$TI= <>
##$TILT= no
##$TM1= 0
##$TM2= 0
##$TOPLEV= 0
##$USERP1= <user>
##$USERP2= <user>
##$USERP3= <user>
##$USERP4= <user>
##$USERP5= <user>
##$WDW= 1
##$XDIM= 16384
##$YMAX_p= 308219001
##$YMIN_p= -799967
$$ End of Bruker specific parameters
$$ ---------------------------------
##NTUPLES= NMR SPECTRUM
##VAR_NAME=  FREQUENCY,     SPECTRUM/REAL,   SPECTRUM/IMAG
##SYMBOL=    X,             R,               I
##VAR_TYPE=  INDEPENDENT,   DEPENDENT,       DEPENDENT
##VAR_FORM=  AFFN,          ASDF,            ASDF
##VAR_DIM=   16384,         16384,           16384
##UNITS=     HZ,            ARBITRARY UNITS, ARBITRARY UNITS
##FACTOR=    0.220516191357247, 1,           1
##FIRST=     3148.11703311504, 0,            0
##LAST=      -464.599729890745, 0,           0
##MIN=       -464.599729890745, -799967,     0
##MAX=       3148.11703311504, 308219001,    0
$$ Real data points
##PAGE= N=1
##DATA TABLE= (X++(R..R)), XYDATA
$$ [...]
7625E897249j45843m834K05372N402j35466j15247k94126J22560M464N9624j26103
$$ 5897249 5751406 5746572 5951944 5957346 5821880 5706633 5412507 5535067 5539531 5599155 5473052
7614E473052j78519m9708l8364O9476j21617j07234J32689K3705j48960r1043
$$ 5473052 5294533 5244825 5206461 5275937 5154320 5047086 5179775 5203480 5054520 4963477
7604D963477j65282J42606j03377k08735N4990K2155j77916j57892l7715J27259
$$ 4963477 4798195 4940801 4837424 4628689 4683679 4705834 4527918 4370026 4332311 4459570
7594D459570J0773l9500o0427m3478m7900j31123m0556P0116j84191q0813J94392
$$ 4459570 4470343 4430843 4370416 4326938 4279038 4147915 4107359 4177475 3993284 3912471 4106863
7583D106863q114j15873P4201p3909j18090k03925J42800J11720L1144k4233j04537
$$ 4106863 4098749 3982876 4057077 3983168 3865078 3661153 3803953 3915673 3946817 3922584 3818047
7572C818047j28022p4819o7667P9882n600r1017j03579p7615J44439j40240J71145
$$ 3818047 3690025 3615206 3547539 3627421 3621821 3530804 3427225 3349610 3494049 3353809 3524954
7561C524954M8490K8394k14037J72657o8370n5305k23301j6186P1853O2410J45365
$$ 3524954 3573444 3601838 3387801 3560458 3492088 3436783 3213482 3197296 3269149 3331559 3476924
7550C476924m1048J9120j57593j67291N9572J66327k6977r4159o5209j01714P3739
$$ 3476924 3435876 3454996 3297403 3130112 3189684 3356011 3329034 3234875 3169666 3067952 3141691
7539C141691R4787j04050J14026j05536l1694l1776K783j64255j75027N4046J09298
$$ 3141691 3236478 3132428 3246454 3140918 3109224 3077448 3080231 2915976 2740949 2794995 2904293
7528B904293n4900p3382J14662j29319j04958j33417J7103K9908j27836P3191
$$ 2904293 2849393 2776011 2890673 2761354 2656396 2522979 2540082 2569990 2442154 2515345
7518B515345m1824J25789J39952m7721j51631j68438K36068K07278o0697l43168
$$ 2515345 2473521 2599310 2739262 2691541 2539910 2371472 2607540 2814818 2754121 2410953
7508B410953M8756K8181k32303P054j24531J50916K4844k24689n688j7389J80172
$$ 2410953 2459709 2487890 2255587 2262641 2138110 2289026 2313870 2089181 2083493 2066104 2246276
7497B246276o340k22687m4715P6699j43538K12284J08601j81923o887M5384O4770
$$ 2246276 2239936 2017249 1972534 2049233 1905695 2117979 2226580 2044657 2037770 2083154 2147924
7486B147924j20857l9435P6861j52782J07758r3380j37122K37516N2490j02931
$$ 2147924 2027067 1987632 2064493 1911711 2019469 1926089 1788967 2026483 2078973 1976042
7476A976042o0276J02654j17861P1563p2453j29570K9301P4911n765p0990R1135
$$ 1976042 1915766 2018420 1900559 1972122 1899669 1770099 1799400 1874311 1868546 1797556 1888691
7465A888691P4760j31968R1722j75472J02612P2484j31980O1311p3068j51915
$$ 1888691 1963451 1831483 1923205 1747733 1850345 1922829 1790849 1852160 1779092 1627177
7455A627177M5189j55351P3402P6895p0102J8285M2903j45778L8198J6240o0534
$$ 1627177 1672366 1517015 1590417 1667312 1597210 1615495 1658398 1512620 1550818 1567058 1506524
7444A506524J10860J35880j92278M9109k6850q1331k30780N7164J84127k10116
$$ 1506524 1617384 1753264 1560986 1610095 1583245 1501914 1271134 1328298 1512425 1302309
7434A302309j07555J17103L3885l4118n0756J69905K04456j72461n8735o1346
$$ 1302309 1194754 1311857 1345742 1311624 1260868 1430773 1635229 1462768 1404033 1342687
7424A342687j13328J57266L01409k59811l6084o9923J62425j5688j77019L8588
$$ 1342687 1229359 1386625 1688034 1428223 1392139 1322216 1484641 1468953 1291934 1330522
7414A330522L0309o4342L7379j83416L4133n2442j94351J33141L7382J8093l1874
$$ 1330522 1360831 1296489 1333868 1150452 1184585 1132143 937792 1070933 1108315 1126408 1094534
7403A094534J99526q3820n0148J41611j87067J69181M0345p6830j33667j6262
$$ 1094534 1294060 1210240 1160092 1301703 1114636 1283817 1324162 1247332 1113665 1097403
7393A097403j89107n7129K18155p218J4441J08019p3900j10484r48j99396j86674
$$ 1097403 908296 851167 1069322 1062104 1076545 1184564 1110664 1000180 999232 799836 613162
7382F13162Q976J61025M7976l7092j60322J85046J615l7853m790j91507J54385
$$ 613162 622138 783163 831139 794047 633725 818771 820386 782533 777743 586236 740621
7371G40621K3232j16603L4892K1435m0652L5833j09735J64578J29315o2371o0872
$$ 740621 763853 647250 682142 703577 662925 698758 589023 753601 882916 820545 759673
7360G59673P1321Q1331j31656j90694M3249j9311N7661j44232M7793K44412j38030
$$ 759673 830994 912325 780669 589975 633224 613913 671574 527342 575135 819547 681517
7349F81517j53110J38087R9136o2484q7421J86698M3920j92610l3712o1265j00523
$$ 681517 528407 666494 765630 703146 615725 802423 846343 653733 620021 558756 458233
7338D58233P3596j5832J65687q5128j0991k8606o7289M4317o4038J1679J31541
$$ 458233 531829 515997 681684 596556 585565 556959 489670 533987 469949 481628 613169
7327F13169m4929j51658j91504K28124Q6164l02284J69472j548O931p6855J1866
$$ 613169 568240 416582 225078 453202 539366 237082 406554 405006 411937 335082 346948
7316C46948Q2620l3633J0699K6059q8696Q4354j23212k34665Q9423J50789q2210
$$ 346948 429568 395935 406634 432693 343997 428351 305139 70474 159897 310686 228476
7305B28476p021K30982r8529k5848K00293l3936K6405k5821j41048k50051J31007
$$ 228476 221455 452437 353908 328060 528353 494417 520822 495001 353953 103902 234909
7294B34909J21191L5645J03522P7722j0381J74046l60740o2053Q935j02193k7099
$$ 234909 356100 391745 495267 572989 562608 736654 375914 313861 322796 220603 193504
7283A93504O3018L5119l6611j87516J97342R3452j52520m3907J41355k29205k3018
$$ 193504 256522 291641 255030 67514 264856 358308 205788 161881 303236 74031 51013
7272E1013Q2355j27737J47984n4212M6437J8696k9950p1242j03800o9904J06198
$$ 51013 133368 5631 153615 99403 145840 164536 134586 63344 -40456 -110360 -4162
7261d162j43928O0651J12008k3940J41575O2813j04192k23825J98917j45346l3448
$$ -4162 -148090 -87439 24569 629 142204 205017 100825 -123000 75917 -69429 -102877
7250a02877o2131j32936J62725J42187K10931r0452o2861j32621l1309k9283q5677
$$ -102877 -165008 -297944 -135219 6968 217899 127447 64586 -68035 -99344 -128627 -214304
7239b14304J6682N1449L5785J45678O3940k54876j75261J08817K17833L7139n1835
$$ -214304 -197622 -146173 -110388 35290 99230 -155646 -330907 -222090 -4257 32882 -18953
7228a8953j3679j88045K14692q6762j899j543n8461j08847N0238J37255J8480
$$ -18953 -32632 -220677 -5985 -92747 -94646 -96189 -154650 -263497 -213259 -76004 -57524
7217e7524j84690Q0960j17514P7728L4218j74677J93620j2296o5919L9681Q0110
$$ -57524 -242214 -161254 -278768 -201040 -166822 -341499 -147879 -160175 -226094 -186413 -106303
7206a06303M4144r4472o6876N6848J4589j95616l6531J12608K64486P4387k67474
$$ -106303 -62159 -156631 -223507 -166659 -152070 -347686 -384217 -271609 -7123 67264 -200210
7195b00210J2550m9660J55817P3217j94308o56l3649m17j08534K13155j10745
$$ -200210 -187660 -237320 -81503 -8286 -202594 -203250 -236899 -237316 -345850 -132695 -243440
7184b43440j62540J00224l0816j21773O7466L05734j78780N2206k6747k08194
$$ -243440 -405980 -305756 -336572 -458345 -390879 -85145 -263925 -211719 -238466 -446660
7174d46660J79575J06965j84162J0565K3224J09026j31001m4203K28356P8476
$$ -446660 -267085 -160120 -344282 -333717 -310493 -201467 -332468 -376671 -148315 -69839
7164f9839j07070m2650r281P0456j74909k0257J82858j87457P8007r9841l5289
$$ -69839 -176909 -219559 -228840 -158384 -333293 -353550 -170692 -358149 -280142 -379983 -415272
7153d15272j1196J7531j14612J96225K07743k813m834m3483N0910l8635j30038
$$ -415272 -426468 -408937 -523549 -327324 -119581 -122394 -127228 -170711 -119801 -158436 -288474
7142b88474m4995J40383R6175k11329j50352N4894K7469Q0730j04822P8050R2369
$$ -288474 -333469 -193086 -96911 -308240 -458592 -403698 -376229 -295499 -400321 -322271 -229902
7131b29902j27949R9582K75165J39416l8417j74426K9557j39408K2250j3475N6280
$$ -229902 -357851 -258269 16896 156312 117895 -56531 -26974 -166382 -144132 -157607 -101327
7120a01327k9271J01621P2590M3576j98388K16584k33860J02289N1681p2524J03183
$$ -101327 -130598 -28977 43613 87189 -111199 105385 -128475 -26186 25495 -47029 56154
7109E6154p6676j2848k41542n1450N3371J44428p2956k577m1559K1191J11863
$$ 56154 -20522 -33370 -274912 -326362 -272991 -128563 -201519 -204096 -245655 -224464 -112601
7098a12601n2480j18998J30775J55600q1383N5313j72595j62771J67264J2670
$$ -112601 -165081 -284079 -153304 2296 -79087 -23774 -196369 -359140 -191876 -179206
7088a79206R8692j90669J19924J18619j95098k48090P4912K1671J46003j25191
$$ -179206 -80514 -271183 -151259 -32640 -227738 -475828 -400916 -379245 -233242 -358433
7078c58433M7243J00685k6014L5720m8693M3000p3921Q3594J13851p3064K4140
$$ -358433 -311190 -210505 -236519 -200799 -249492 -206492 -280413 -196819 -82968 -156032 -131892
7067a31892J44403j40128k8750J33326k6375Q1668O5757l03115J19731J08239
$$ -131892 12511 -127617 -156367 -23041 -49416 32252 98009 -205106 -85375 22864
7057B2864q130L4799j08024p7759l1943N7316P5681p416J1116N4730q3735J66632
$$ 22864 14734 49533 -58491 -136250 -168193 -110877 -35196 -42612 -31496 23234 -60501 106131
7045A06131j0684J16802p9323j19584J78734k23433j4720L65736j07996p0779
$$ 106131 95447 212249 132926 13342 192076 -31357 -46077 319659 211663 140884
7035A40884J21482m8816r1874l1248j5599K43326J30336k13882r6047L9389R4412
$$ 140884 262366 213550 121676 90428 74829 318155 448491 234609 138562 177951 272363
7024B72363p8315K17639N0364j54561O7610J34738k518j81120j83338J42168n3227
$$ 272363 194048 411687 462051 307490 375100 509838 507320 326200 142862 285030 231803
7013B31803J77005J44585l5380J9633J28598j16740P0473J74518j21480n7921
$$ 231803 408808 553393 518013 537646 666244 549504 619977 794495 673015 615094
7003F15094L5128O7207N8145K54488L745P734k28667L33580J18835r3449j4231
$$ 615094 650222 717429 775574 1030062 1033807 1041541 812874 1146454 1265289 1171840 1157609
6992A157609J86164L42714M8964j04523K13883J85452J78801P0162L5555o785
$$ 1157609 1343773 1686487 1735451 1630928 1844811 2030263 2209064 2279226 2314781 2307996
6982B307996n5269J20362J05171o6275J44628L8125p1321K6542l5081m0767j98926
$$ 2307996 2252727 2373089 2478260 2411985 2556613 2594738 2523417 2549959 2514878 2474111 2275185
6971B275185j34200J8774O0527j00752j91441j56997p6709j74243N439j59330
$$ 2275185 2140985 2159759 2220286 2119534 1928093 1771096 1694387 1520144 1525583 1366253
6961A366253R5307o8221J8181K73697o3230k57100q8601M5218j11915j97750M7972
$$ 1366253 1461560 1393339 1411520 1685217 1621987 1364887 1276286 1321504 1209589 1011839 1059811
6950A059811J40168p5736L1431r1471j30482J52849m5599J5223j17292m6330o3467
$$ 1059811 1199979 1124243 1155674 1064203 933721 1086570 1040971 1056194 938902 892572 829105
6939H29105l2891j97469J3780J2306j03949J88669L4678j70885j43025j47580
$$ 829105 796214 598745 612525 624831 520882 709551 744229 573344 430319 282739
6929B82739j06136o4344P2780J36817J7220q635N1871o6044j43325j19397L660
$$ 282739 176603 112259 185039 321856 339076 330441 382312 316268 172943 53546 57206
6918E7206J89278q267N6028M3053j37056r0141n383q1026o8386N9728P757j4489
$$ 57206 246484 238217 294245 337298 200242 110101 104718 23692 -44694 15034 22791 8302
6906H302N834J01711J70160J44593j38269j9187r6792Q8420L6993l32877J74375
$$ 8302 14136 115847 286007 430600 292331 273144 176352 264772 301765 -31112 143263
6895A43263n3416Q8194O4319l7040J41162n8242q8557O0813J3309O9606p2108
$$ 143263 89847 178041 242360 205320 346482 288240 199683 260496 273805 343411 271303
6884B71303Q5842L6616k48784j1717M5560q1577j8654k4558J805J86999O7352
$$ 271303 357145 393761 144977 133260 178820 97243 78589 54031 55836 242835 310187
6873C10187r848L469m1575r9205J0628l6330J4475N5744L1775J66987R9537j8570
$$ 310187 300339 303808 262233 163028 173656 137326 151801 207545 239320 406307 505844 487274
6861D87274j45604l4198Q9318O1574j11483l7006J6603j27427j0676J78564J38659
$$ 487274 341670 307472 396790 458364 346881 309875 326478 199051 188375 366939 505598
6850E05598p440l16882r3189J96797P0288p7641j06566P178Q1729P9404j11568
$$ 505598 498158 181276 88087 284884 355172 277531 170965 178143 259872 339276 227708
6839B27708P6969K8457o2641q3739j2688n0311L33859m028k85144j03645R9098
$$ 227708 304677 333134 270493 186754 174066 123755 457614 453586 168442 64797 163895
6828A63895J41822o1316j24498j58494j4462k5450K32736k1362k07723R3137R7548
$$ 163895 305717 244401 119903 -38591 -53053 -78503 154233 132871 -74852 18285 115833
6817A15833j00400j19493J9257J11223M6388n3973J07735J27302l27370j1639
$$ 115833 15433 -104060 -84803 26420 72808 18835 126570 253872 -73498 -85137
6807h5137N0667J62030q442k73015j21899k6758J3174L36201L8640j90960j27190
$$ -85137 -34470 127560 119118 -153897 -275796 -302554 -289380 46821 85461 -105499 -232689
6796b32689K11279L7002n3458k2907m8331j07801M6491Q5516P114o8733K720j19524
$$ -232689 -21410 15592 -37866 -60773 -109104 -216905 -170414 -84898 -77784 -146517 -143797 -263321
6784b63321l1388J35545j16218j51176j23635P6473P7451j09220J06050K66948
$$ -263321 -294709 -159164 -275382 -426558 -550193 -473720 -396269 -505489 -399439 -132491
6774a32491j51803m9797J17145j60849j65099j47780j09293K15438J4075j74595
$$ -132491 -284294 -334091 -216946 -377795 -542894 -690674 -799967 -584529 -570454 -745049
6764g45049L16516K22948j58681J77333n6114j31905j91344J0670J38699o829
$$ -745049 -428533 -205585 -364266 -186933 -243047 -374952 -566296 -555626 -416927 -423756
6754d23756R8987J17562j62873J5066r4919J932J23366L06782l21724l41741J29025
$$ -423756 -324769 -207207 -370080 -355014 -449933 -448001 -324635 -17853 -339577 -681318 -552293
6743e52293k5032J91179K11230j04325L0321j86661J72758J21706j19080P7061
$$ -552293 -577325 -386146 -174916 -279241 -248920 -435581 -262823 -141117 -260197 -183136
6733a83136M0231r4453Q5885J15377J46506j01390j9249l5493j21762O6045j43416
$$ -183136 -142905 -237358 -151473 -36096 110410 9020 -10229 -45722 -167484 -101439 -244855
6722b44855K95865J4909j09142j388L6196K59106o4085j32406J29648l0253q794
$$ -244855 51010 65919 -43223 -44611 -8415 250691 186606 54200 183848 153595 144801
6711A44801k1229O5244n452J7651K03354K14236R073j80523N2273J52993J73139
$$ 144801 123572 188816 183364 201015 404369 618605 627678 447155 499428 652421 825560
6700H25560J41819L1305l6308m6597J16679L0763J25581n5332J50777J93304j47992
$$ 825560 967379 998684 962376 915779 1032458 1063221 1188802 1133470 1284247 1477551 1329559
6689A329559J19702K24237K05131j2968J39244K07320R8254J09158J03119P6235
$$ 1329559 1449261 1673498 1878629 1865661 2004905 2212225 2310479 2419637 2522756 2598991
6679B598991J97766r8092J5469M83436j61878l64650o1201K30609J30529Q9444
$$ 2598991 2796757 2698665 2714134 3197570 3035692 2671042 2609841 2840450 2970979 3060423
6669C060423O2594k37037k09663J55474m1873j36225k68374r3204Q4439j9922
$$ 3060423 3123017 2885980 2676317 2831791 2789918 2653693 2385319 2292115 2376554 2356632
6659B356632q583L887j87225k29069P0476L1582j93528j80512l1342o2846q2280
$$ 2356632 2348049 2351936 2164711 1935642 2006118 2037700 1844172 1663660 1632318 1569472 1487192
6648A487192j55139k14192O5742j4332k4609K9716o4547j7400Q035j33760j79491
$$ 1487192 1332053 1117861 1183603 1169271 1144662 1174378 1109831 1092431 1100466 966706 787215
6637G87215R7657J59852p5432j59548r5335m9297j74599J72392R9312O1805o1863
$$ 787215 884872 1044724 969292 809744 714409 665112 490513 662905 762217 824022 762159
6626G62159q8566n2228r9782j03927l3890n9526J4264J31511q0379O5854k12295
$$ 762159 673593 621365 521583 417656 383766 324240 338504 470015 389636 455490 243195
6615B43195K7090M1355L3893k2031o5339K9435k31302M6904J02113m4362q1716
$$ 243195 270285 311640 345533 323502 258163 287598 56296 103200 205313 160951 79235
6604G9235k8954p4227K35726J94077n8494O580k30469L6719j8294j5552o3509
$$ 79235 50281 -23946 211780 405857 347363 353943 123474 160193 141899 126347 62838
6593F2838N5807n4217p1868k60458J2598O362J18043K58912j03119o6289o3739
$$ 62838 118645 64428 -7440 -267898 -255300 -248938 -130895 128017 24898 -41391 -105130
6582a05130k15835p0008L5365M7379j77901J3883J10151J22453J06815j97803
$$ -105130 -320965 -390973 -355608 -308229 -486130 -472247 -362096 -239643 -132828 -330631
6572c30631j77909N9840J30002q497j62511p2400J53369J15918n5045j00728P6805
$$ -330631 -508540 -448700 -318698 -327195 -489706 -562106 -408737 -292819 -347864 -448592 -371787
6561c71787J1787K9621m1033n7387Q1115N4495j89031J82833r1146J82384r1076
$$ -371787 -360000 -330379 -371412 -428799 -347684 -293189 -482220 -299387 -390533 -208149 -299225
6550b99225j52434L4003J50352k4454K6686k6338J23483r5905j18172j51623M1713
$$ -299225 -451659 -417656 -267304 -291758 -265072 -291410 -167927 -263832 -382004 -533627 -491914
6539d91914N8057L3556p4198J21360K07557j93360j7643j35995J4103J32917q9887
$$ -491914 -433857 -400301 -474499 -353139 -145582 -338942 -356585 -492580 -478477 -345560 -435447
6528d35447r5327J84784O7320j09831J9193K41497p7523M6263Q4298J09278j71362
$$ -435447 -530774 -345990 -278670 -388501 -369308 -127811 -205334 -159071 -74773 34505 -136857
6517a36857P8764m10J17923m8967p5435j12399K81403L117q4415k333m315K04398
$$ -136857 -58093 -58503 59420 10453 -64982 -177381 104022 107139 22724 20391 16076 220474
6505B20474Q811k7742J83693j27411J693K392J62530J02221J8765J099k291R8200
$$ 220474 229285 201543 385236 257825 259518 261910 424440 526661 545426 546525 544234 642434
6493F42434r7378p9815k8651q1163J97812J04925J22331J06587J3694J29645o2564
$$ 642434 545056 465241 436590 355427 553239 658164 780495 887082 900776 1030421 967857
6482I67857J16691l9601Q3439j05144l1593J39225n571q6406J33933R2143R596
$$ 967857 1084548 1044947 1128386 1023242 991649 1130874 1125303 1038897 1172830 1264973 1274569
6471A274569L53596R0203k17322j56157J76903K06583r0601J71424p6071M5816
$$ 1274569 1628165 1718368 1501046 1344889 1521792 1728375 1637774 1809198 1733127 1778943
6461A778943l7342k02129O2030J70194o547J00957o5173K2620N1665k5630l6009
$$ 1778943 1741601 1539472 1601502 1771696 1765149 1866106 1800933 1823553 1875218 1849588 1813579
6450A813579j04323J0514K03770N6658J39182j95305j02895J46898J27507j14199
$$ 1813579 1709256 1719770 1923540 1980198 2119380 1924075 1821180 1968078 2095585 1981386
6440A981386k45281O4809J51568k2156k7157m5137l5395L703K5778R501M167j44749
$$ 1981386 1736105 1800914 1952482 1930326 1903169 1858032 1822637 1826340 1852118 1861619 1865786 1721037
6428A721037J8116J95276j881j92089j39089k0960j35171J16532P579j87848k0445
$$ 1721037 1739153 1934429 1932548 1740459 1601370 1580410 1445239 1561771 1569350 1381502 1361057
6417A361057R0284P159n0842L4483L1703J28471r0448J8996q7992k71445M002
$$ 1361057 1451341 1458500 1407658 1442141 1473844 1602315 1511867 1530863 1442871 1171426 1175428
6406A175428Q0887R0528j57183p9782O9509O8906j35322P7603j09975n579k60585
$$ 1175428 1256315 1346843 1189660 1109878 1179387 1248293 1112971 1190574 1080599 1075020 814435
6395H14435P4469j0113j53720K64887j19665j76647J39074j92073l9853R9327
$$ 814435 888904 878791 725071 989958 870293 693646 832720 640647 600794 700121
6385G00121j4174J72351k13494p2400P8413R3811K6750j60513j47703o4586N5985
$$ 700121 685947 858298 644804 572404 650817 744628 771378 610865 463162 398576 454561
6374D54561n5639P155J42028P1140J2314j40928j6237J59286M3582j29850l16336
$$ 454561 398922 406077 548105 619245 631559 490631 474394 633680 677262 547412 231076
6363B31076j47760J65598J61317Q2404J411j1418N9076r1156O6924M318K2001
$$ 231076 83316 248914 410231 492635 494046 482628 541704 450548 517472 521790 543791
6352E43791r5063O8610L250j07254n4320k243p8273k02715J47208O8354J32400
$$ 543791 448728 517338 520588 413334 359014 356771 278498 75783 222991 291345 423745
6341D23745J16781L0777N1052j72796R4063J50637O1609N5429k12776O0619Q4216
$$ 423745 540526 571303 622355 449559 543622 694259 755868 811297 598521 659140 743356
6330G43356k1986k7238K41653J56667r2348q2983P4321q6829J02399J33368j00067
$$ 743356 721370 694132 935785 1092452 1000104 917121 991442 904613 1007012 1140380 1040313
6319A040313P5992K51536o6964K8594L2538n9301P4235o921J11702l6233M1882
$$ 1040313 1116305 1367841 1300877 1329471 1362009 1302708 1376943 1370022 1481724 1445491 1487373
6308A487373J16067M4627M5936j25508K50526k8711j04075J33008K10971K70071
$$ 1487373 1603440 1648067 1694003 1568495 1819021 1790310 1686235 1819243 2030214 2300285
6298B300285K05061k28537k8031M0640P0814j54266K786J556L130J24513k30152
$$ 2300285 2505346 2276809 2248778 2289418 2360232 2205966 2208752 2210308 2213438 2337951 2107799
6287B107799J07416J92496L2876j73876K951J5427l0824P7634J46362j53706Q5945
$$ 2107799 2215215 2407711 2440587 2266711 2269662 2285089 2254265 2331899 2478261 2324555 2410500
6276B410500l1861P129M7654Q3939J25841K56017p3124k0604J84527k38739J67136
$$ 2410500 2378639 2385768 2433422 2517361 2643202 2899219 2826095 2805491 2990018 2751279 2918415
6265B918415O4384k18382J59985J66436J18892k7477p9080j85536Q0851N6177
$$ 2918415 2982799 2764417 2924402 3090838 3209730 3182253 3103173 2917637 2998488 3054665
6255C054665j61867j59171k4591M8597j1487j51241j68349j7730l7817L4818L7172
$$ 3054665 2892798 2733627 2709036 2757633 2746146 2594905 2426556 2408826 2371009 2405827 2442999
6244B442999J92237J46775k7150n5920j56176j90093m8132L0179J7983N1982K7842
$$ 2442999 2635236 2782011 2754861 2698941 2542765 2352672 2304540 2334719 2352702 2404684 2432526
6233B432526K10065q7564j1666l36476Q1162r7861n2343J5887J1548j0694j96312
$$ 2432526 2642591 2555027 2543361 2206885 2288047 2190186 2137843 2153730 2165278 2154584 1958272
6222A958272M9761K57601M6451m4914o9878n6539Q2135k23061Q1592p9894p4676
$$ 1958272 2008033 2265634 2312085 2267171 2197293 2140754 2222889 1999828 2081420 2001526 1926850
6211A926850l296j08021k82277K7174K70437K282j61974k9285j48326Q9574q1983
$$ 1926850 1923554 1815533 1533256 1560430 1830867 1833149 1671175 1641890 1493564 1583138 1501155
6200A501155J12773O2903n8549j05884j69546P3433L8854n3811Q3171j18776K19970
$$ 1501155 1613928 1676831 1618282 1512398 1342852 1416285 1455139 1401328 1484499 1365723 1585693
6189A585693j24391k73796J86486n1946j86591L38939l0032j76992j08553r5720
$$ 1585693 1461302 1187506 1373992 1322046 1135455 1474394 1444362 1267370 1158817 1063097
6179A063097J96652O2441P9198m1817j79692N3405J00064q2963Q5873L9249m1424
$$ 1063097 1259749 1322190 1401388 1359571 1179879 1233284 1333348 1250385 1336258 1375507 1334083
6168A334083J16936j89232j7954q6808j20120O2960o5835L3227p4815R766J51884
$$ 1334083 1451019 1261787 1243833 1157025 1036905 1099865 1034030 1067257 992442 1002208 1154092
6157A154092N3420k8730k6593n2329r3402p7937O0747j25141m2463N5089R3506
$$ 1154092 1207512 1178782 1152189 1099860 1006458 928521 989268 864127 821664 876753 970259
6146I70259o0195o2654J84153J3468J9102k6288k9305O0155R2959J08007k08365
$$ 970259 910064 847410 1031563 1045031 1064133 1037845 1008540 1068695 1161654 1269661 1061296
6135A061296J42209k8199j6347M3797k418Q4105l29333j11295J32520O3374l8247
$$ 1061296 1203505 1175306 1158959 1202756 1200338 1284443 955110 843815 976335 1039709 1001462
6124A001462L9562J6801L6715q1985j2944p3061K0345J74667L5594j37402N6428
$$ 1001462 1041024 1057825 1094540 1012555 999611 926550 946895 1121562 1157156 1019754 1076182
6113A076182K32407j95124o1268k6446R9412j501q3921j32343J5729J12955P5402
$$ 1076182 1308589 1113465 1052197 1025751 1125163 1123662 1039741 907398 923127 1036082 1111484
6102A111484J21342q4319R0403P8532j39933j40180M5662K9841J67224n7167M801
$$ 1111484 1232826 1148507 1238910 1317442 1177509 1037329 1082991 1112832 1280056 1222889 1227690
6091A227690J5856q5929J98289J7970m9732j19519J57477R9335j01334m7180m7865
$$ 1227690 1243546 1157617 1355906 1373876 1324144 1204625 1362102 1461437 1360103 1312923 1265058
6080A265058o7538R5340M0082O6664J1022O0649K01242Q3411j74470r2005M2337
$$ 1265058 1197520 1292860 1332942 1399606 1410628 1471277 1672519 1755930 1581460 1489455 1531792
6069A531792M447J32983J83573o9612j82012M8776N7339o5115J8447P6005k51418
$$ 1531792 1536239 1669222 1852795 1783183 1601171 1649947 1707286 1642171 1660618 1736623 1485205
6058A485205J64039R4080J5090J14302P2601J95922l02343r6529o9415K11515
$$ 1485205 1649244 1743324 1758414 1872716 1945317 2141239 1838896 1742367 1672952 1884467
6048A884467J09928p7594k21828N5414J15322J61650j84417J2285N0291j4884
$$ 1884467 1994395 1916801 1694973 1750387 1865709 2027359 1842942 1855227 1905518 1890634
6038A890634J05576l1173P3375J8510J47119p2648J10862j8031k3539j1349J37025
$$ 1890634 1996210 1965037 2038412 2056922 2204041 2131393 2242255 2224224 2200685 2189336 2326361
6027B326361J59361l9545J10911J29365q3303M661k2389j1335J13313j23902J99883
$$ 2326361 2485722 2446177 2557088 2686453 2603150 2607811 2585422 2574087 2687400 2563498 2763381
6016B763381J8208j19987K56659m7112K42196N1509R073L6190J11444j21959j64894
$$ 2763381 2781589 2661602 2918261 2871149 3113345 3164854 3173927 3210117 3321561 3199602 3034708
6005C034708J02541l222K08184P2143j1733J94720q0475k05404J67562J81060
$$ 3034708 3137249 3134027 3342211 3414354 3402621 3597341 3516866 3311462 3479024 3660084
5995C660084Q1793j42224J72113J20360m5685K17682P176J1517K7434k8339R7104
$$ 3660084 3741877 3599653 3771766 3892126 3846441 4064123 4071299 4082816 4110250 4081911 4179015
5984D179015O1972j824M1693M3050J32944j23040J46130J0270J42867r7220j21131
$$ 4179015 4240987 4239163 4280856 4323906 4456850 4333810 4479940 4490210 4633077 4535857 4414726
5973D414726l6240j1879J95990O7162N3114J42140j04512O4732J08283J34536
$$ 4414726 4378486 4366607 4562597 4629759 4682873 4825013 4720501 4785233 4893516 5028052
5963E028052K9623l6283J53881j37454k25489M8364m2903K61892K52263j57474
$$ 5028052 5057675 5021392 5175273 5037819 4812330 4860694 4817791 5079683 5331946 5174472
5953E174472k28955M7538N4163O8404j8403J7593N2061J36184p8161L8563J61957
$$ 5174472 4945517 4993055 5047218 5115622 5097219 5114812 5166873 5303057 5224896 5263459 5425416
5942E425416j10608J98673q3555k13361J10885L00643J6334k13133j60080J11468
$$ 5425416 5314808 5513481 5429926 5216565 5327450 5628093 5644427 5431294 5271214 5382682
5932E382682o6420L10887J91379J2647J8205M01003r9788m7058J98170j78810
$$ 5382682 5316262 5627149 5818528 5831175 5849380 6250383 6150595 6103537 6301707 6122897
5922F122897K9219J41377J53157Q705l7910k698J149K61791J40353J36229l0312
$$ 6122897 6152116 6293493 6446650 6455355 6417445 6414747 6415896 6677687 6818040 6954269 6923957
5911F923957j37929j31818P4047P0689q9466K63655J08911j1848J36669j08655
$$ 6923957 6786028 6654210 6728257 6798946 6709480 6973135 7082046 7070198 7206867 7098212
5901G098212K1115M1578J73938m2921j14054j33488k152m7979l3539K00874J8828
$$ 7098212 7119327 7160905 7334843 7291922 7177868 7044380 7042228 6994249 6960710 7161584 7180412
5890G180412l587Q9600l206O3593J10682j21520M4783J5171K0468l2732j23748
$$ 7180412 7176825 7266425 7263219 7326812 7437494 7315974 7360757 7375928 7396396 7363664 7239916
5879G239916j7748J73424o9273j04713J20200Q1160M551m1683L3694k1760j02663
$$ 7239916 7222168 7395592 7326319 7221606 7341806 7422966 7427517 7385834 7419528 7397768 7295105
5868G295105N6800j06385l6634J32909q5124P6921n0623o137R2912k59105n5152
$$ 7295105 7351905 7245520 7208886 7341795 7256671 7333592 7282969 7276832 7369744 7110639 7055487
5857G055487n2928J60780K1863N890M22865j25422m2156j5671k85541O3156K76845
$$ 7055487 7002559 7163339 7185202 7191092 7613957 7488535 7446379 7430708 7145167 7208323 7485168
5846G485168M4818j70112m4868M1819O9231O3956J6043L6589J40850O013O7695
$$ 7485168 7529986 7359874 7315006 7356825 7426056 7490012 7506055 7542644 7683494 7689507 7757202
5835G757202J1990R4942l6394L5911O686K82672P458O8435J55414K5714K44540
$$ 7757202 7769192 7864134 7827740 7863651 7870337 8153009 8160467 8228902 8384316 8410030 8654570
5824H654570K40844n6438q7944J21350p580N0129n152J36465J41589L9879J58983
$$ 8654570 8895414 8838976 8751032 8872382 8864802 8914931 8909779 9046244 9187833 9227712 9386695
5813I386695J31922j47072K3093r753J10845q9537j11626R4166k0062j21327k10960
$$ 9386695 9518617 9371545 9394638 9384885 9495730 9406193 9294567 9388733 9368671 9247344 9036384
5802I036384J7265K1117j30378j8188j134o8932k30924K5799j56837j04273N226
$$ 9036384 9053649 9074766 8944388 8926200 8925066 8856134 8625210 8651009 8494172 8389899 8395125
5791H395125k9396N5357q7655J25915k8596k9907k44831p9461m281P4861K22220
$$ 8395125 8365729 8421086 8333431 8459346 8430750 8400843 8156012 8076551 8072270 8147131 8369351
5780H369351l0505N709J16447M7954K8389K2708J22879P3036J62210K50642J1973
$$ 8369351 8338846 8344555 8461002 8508956 8537345 8560053 8682932 8755968 8918178 9168820 9180793
5769I180793K1019J90821J34992L91774K31812Q9897m8025N0689K63123L38223
$$ 9180793 9201812 9392633 9527625 9919399 10151211 10241108 10193083 10243772 10506895 10845118
5759A0845118K28978J35083J33054K41693J19030k1977K10371o1792K05184J10457
$$ 10845118 11074096 11209179 11342233 11583926 11702956 11680979 11891350 11829558 12034742 12145199
5749A2145199k13801Q0939K69432R4233N3885m8355J44115L4213j61126N2086
$$ 12145199 11931398 12012337 12281769 12376002 12429887 12381532 12525647 12559860 12398734 12450820
5739A2450820R5735J7454l79018j43437j46901l29839Q8497k63841q2882j81902
$$ 12450820 12546555 12564009 12184991 12041554 11894653 11564814 11653311 11389470 11306588 11124686
5729A1124686k57351k10337k67199L2081o5081k26680k08770m00975m6315K02075
$$ 11124686 10867335 10656998 10389799 10421880 10356799 10130119 9921349 9520374 9474059 9676134
5719I676134p9880k19316p1698j16327j21232r1446M7860j21062j26645j44124
$$ 9676134 9596254 9376938 9305240 9188913 9067681 8976235 9024095 8903033 8776388 8632264
5709H632264k43431j11859n2538j62011J4542l114j57149M1033k02999N4988K21101
$$ 8632264 8388833 8276974 8224436 8062425 8076967 8073853 7916704 7957737 7754738 7809726 8030827
5698H030827R8377k79444k17755J24384j7618k07025L5170r2926r7805N956J16953
$$ 8030827 8129204 7849760 7632005 7756389 7738771 7531746 7566916 7473990 7376185 7382141 7499094
5687G499094P6806K8730j33168r8828n9086K52990J04644l65298P8557J60923
$$ 7499094 7575900 7604630 7471462 7372634 7313548 7566538 7671182 7305884 7384441 7545364
5677G545364j03210L7727r7960N3386M9558K3377k10740r9176R5137K5872J29326
$$ 7545364 7442154 7479881 7381921 7435307 7484865 7508242 7297502 7198326 7293463 7319335 7448661
5666G448661j2464O0922K8126L0177J5121K00884j57401j18501M2754J17938J11115
$$ 7448661 7436197 7497119 7525245 7555422 7570543 7771427 7614026 7495525 7538279 7656217 7767332
5655G767332R9677j04318J94460j398n4929M9677k7438J36975J19680J0342J3451
$$ 7767332 7867009 7762691 7957151 7955753 7900824 7950501 7923063 8060038 8179718 8190060 8203511
5644H203511Q8457N7033L1394j07386J29948J53320K76352j30259j85451J42792
$$ 8203511 8291968 8349001 8380395 8273009 8402957 8556277 8832629 8702370 8516919 8659711
5634H659711J31930J80966O6773l1859Q3124J10154o6516J02139j33167K57077
$$ 8659711 8791641 8972607 9039380 9007521 9090645 9200799 9134283 9236422 9103255 9360332
5624I360332J36963K4072J98879j14161J06411J49631R0897J21481j2072M1296
$$ 9360332 9497295 9521367 9720246 9606085 9712496 9862127 9953024 10074505 10062433 10103729
5614A0103729K38892P1966K12281r2843P3133L13279J0378J77051O6575R8655
$$ 10103729 10342621 10414587 10626868 10534025 10607158 10920437 10930815 11107866 11174441 11273096
5604A1273096J94129R4730M577j03086L32245L02657K19941K73257j15462J17958
$$ 11273096 11467225 11561955 11566532 11463446 11795691 12098348 12318289 12591546 12476084 12594042
5594A2594042L98881L45975K8026J55823M37263K29192J63814L23353L92710K74572
$$ 12594042 12992923 13338898 13366924 13522747 13960010 14189202 14353016 14676369 15069079 15343651
5584A5343651J30704R9704L41206K06128L23797J08439K35232P5397l248K55389
$$ 15343651 15474355 15574059 15915265 16121393 16445190 16553629 16788861 16864258 16861010 17116399
5574A7116399K45715L73639N3869R0878J32089O8353K11031O8521J73744M8870
$$ 17116399 17362114 17735753 17789622 17880500 18012589 18080942 18291973 18360494 18534238 18583108
5564A8583108L6233L10039j7384L3004J17473M2966J58225L9963P0818l4712k84504
$$ 18583108 18619341 18929380 18911996 18945000 19062473 19105439 19263664 19303627 19374445 19339733 19055229
5553A9055229l0795J33303M4679P7807j46669p9879j2269k06081P5055J83946
$$ 19055229 19024434 19157737 19202416 19280223 19133554 19053675 19041406 18835325 18910380 19094326
5543A9094326j30626k6032j6588L2395n6383j35705J05481K87827O7733k47194
$$ 19094326 18963700 18937668 18921080 18953475 18897092 18761387 18866868 19154695 19222428 18975234
5533A8975234m1546J41797O6634p1653O1122o769q7502K45801J65634m6487J4768
$$ 18975234 18933688 19075485 19142119 19070466 19131588 19124819 19037317 19283118 19448752 19402265 19417033
5522A9417033J06902J4661J54451l5516o664j54565J14650Q4644m4842p2470r0058
$$ 19417033 19523935 19538596 19693047 19657531 19650867 19496302 19610952 19695596 19650754 19578284 19488226
5511A9488226K38830J3662j25964j71931k11498n8605J48068K2870J59380l83638
$$ 19488226 19727056 19740718 19614754 19442823 19231325 19172720 19320788 19343658 19503038 19119400
5501A9119400q2600J9538l08424j19459Q2377J08067O5123N693n9329Q1835P6036
$$ 19119400 19036800 19056338 18747914 18628455 18710832 18818899 18884022 18889715 18830386 18912221 18988257
5490A8988257k68439M2220j065k25458q9456J80221k49020p9606k64578P9769
$$ 18988257 18719818 18762038 18760973 18535515 18446059 18626280 18377260 18297654 18033076 18112845
5480A8112845K5320k36217p7603k14197O0036k9927N490L0438q0536J04681j55864
$$ 18112845 18138165 17901948 17824345 17610148 17670184 17640257 17645747 17676185 17595649 17700330 17544466
5469A7544466j0563J70854Q729m2036j68218l9396Q0234L1566j5593J251O5884
$$ 17544466 17533903 17704757 17713486 17671450 17503232 17463836 17544070 17575636 17560043 17561294 17627178
5458A7627178J79893j07968n8508N820r6061J45261K36709O1695J13043J46293
$$ 17627178 17807071 17699103 17640595 17646415 17550354 17695615 17932324 17994019 18107062 18253355
5448A8253355N434j64615J50393J13996m6966J198J45999j82906N2262K66352
$$ 18253355 18258789 18094174 18244567 18358563 18311597 18312795 18458794 18275888 18328150 18594502
5438A8594502m7564M3494J82478J85487o5576L168Q1905J57270K00196Q7763p2062
$$ 18594502 18546938 18590432 18772910 18958397 18892821 18895989 18977894 19135164 19335360 19423123 19351061
5427A9351061j05019J98453J1258j25760o6229L7862K3514K71275P0354J16074
$$ 19351061 19246042 19444495 19455753 19329993 19263764 19301626 19325140 19596415 19666769 19782843
5417A9782843k6244J08455q4072j29785J29005k7641J99569K63656j70213k0555
$$ 19782843 19756599 19865054 19780982 19651197 19780202 19752561 19952130 20215786 20045573 20025018
5407B0025018J23669J06033L0335L4970m5697j65341M1645J31760j2961j16746
$$ 20025018 20148687 20254720 20285055 20320025 20274328 20108987 20150632 20282392 20269431 20152685
5397B0152685N7132J15172K1012j17497m5453J9995j6025O1613J5830L2886k6118
$$ 20152685 20209817 20324989 20346001 20228504 20183051 20203046 20187021 20248634 20264464 20297350 20271232
5386B0271232r8804J15190J81595j30172m00688J80794L45404J70556j19120j43317
$$ 20271232 20172428 20287618 20469213 20339041 19938353 20119147 20464551 20635107 20515987 20372670
5376B0372670Q7193p9713j14993K15110J46586j51368J47930J02207n8078q1083
$$ 20372670 20459863 20380150 20265157 20480267 20626853 20475485 20623415 20725622 20667544 20586461
5366B0586461J94871K583Q683k0197J89333J09166l73770j65134P6747K71563
$$ 20586461 20781332 20783915 20792598 20772401 20961734 21070900 20697130 20531996 20608743 20880306
5356B0880306K50490n3993q8190O222q1648R4533L9117K2958P4446K1650j433
$$ 20880306 21130796 21076803 20988613 20994835 20913187 21007720 21046837 21069795 21144241 21165891 21164458
5345B1164458n1907o3282L2574J53001R0879j64814k522j26615r0226r4499R5190
$$ 21164458 21112551 21049269 21081843 21234844 21325723 21160909 21158387 21031772 20941546 20847047 20942237
5334B0942237L7511k41060j59032l3665J95575K74854k44914j1458p9052M7110
$$ 20942237 20979748 20738688 20579656 20545991 20741566 21016420 20771506 20760048 20680996 20728106
5324B0728106J78912p341j49794K4178O2228j1166K6009Q5325k28445j51813Q5367
$$ 20728106 20907018 20899677 20749883 20774061 20836289 20825123 20851132 20936457 20708012 20556199 20641566
5313B0641566P5754m102O3361k03955o7665k944m3003j58926j55870J97880r2618
$$ 20641566 20717320 20713218 20776579 20572624 20504959 20502015 20459012 20300086 20144216 20342096 20249478
5302B0249478l07231q0017l6538l6984p2266j7077J76729k83901q9463j79221
$$ 20249478 19942247 19862230 19825692 19788708 19716442 19699365 19876094 19592193 19502730 19323509
5292A9323509n234P3198n4789j42363p5723M9827j69803l9095J22508k32573l17907
$$ 19323509 19318275 19391473 19336684 19194321 19118598 19168425 18998622 18959527 19082035 18849462 18531555
5281A8531555j61618k384k71754o6142r7177n3183J98163q6392Q9126r9661j67397
$$ 18531555 18369937 18367553 18095799 18029657 17932480 17879297 18077460 17991068 18080194 17980533 17813136
5270A7813136l51429p9171K7690o5512K51843j39981j11742j96111M1024j89640
$$ 17813136 17461707 17382536 17410226 17344714 17596557 17456576 17344834 17148723 17189747 17000107
5260A7000107l3919N1573n4600j88675o1467l4649j19128j37632j85036j63112
$$ 17000107 16966188 17017761 16963161 16774486 16713019 16678370 16559242 16421610 16236574 16073462
5250A6073462J19664O363k07056M6721k53121J74115J25829j98892l6039J84960
$$ 16073462 16193126 16199489 15992433 16039154 15786033 15960148 16085977 15887085 15851046 16036006
5240A6036006j45505L2943n4627j68985M7241k9090K6951Q9764o7836Q7252J84880
$$ 16036006 15890501 15923444 15868817 15699832 15747073 15717983 15744934 15834698 15766862 15854114 16038994
5229A6038994j97123q6232j1739J24737K6865j03006J22570J5332j84035R6659
$$ 16038994 15841871 15755639 15743900 15868637 15895502 15792496 15915066 15930398 15746363 15843022
5219A5843022l7349m9379M1999j04111r639L04729r1093j83256j36928M4045m5125
$$ 15843022 15805673 15756294 15798293 15694182 15684543 15989272 15898179 15714923 15577995 15622040 15576915
5208A5576915J09904J51986j69872K90323K659Q6890K77035j17312j4179K23726
$$ 15576915 15686819 15838805 15668933 15959256 15961915 16048805 16325840 16208528 16194349 16418075
5198A6418075j6755K07697r2977q6396Q0510K42965K03902R3934K76818J22865
$$ 16418075 16401320 16609017 16516040 16429644 16510154 16753119 16957021 17050955 17327773 17450638
5188A7450638o0605Q7276J63010K19861R5861K01486K95129l4163J98077L33003
$$ 17450638 17390033 17477309 17640319 17860180 17956041 18157527 18452656 18418493 18616570 18949573
5178A8949573O6894L4847J16139L21576L2626O1840J07730M28441J50497j5813
$$ 18949573 19016467 19051314 19167453 19489029 19521655 19583495 19691225 20119666 20270163 20254350
5168B0254350J79814K37966J03069k48553N8453M1423K20154K329j37974J27976
$$ 20254350 20434164 20672130 20775199 20526646 20585099 20626522 20846676 20849005 20711031 20839007
5158B0839007j58964m9914K36967j97982l9474n0188l4875j35815J24092r2052
$$ 20839007 20680043 20630129 20867096 20669114 20629640 20579452 20544577 20408762 20532854 20440802
5148B0440802l05252N2335m3056j40655K9540J13081p2845j28238J76730j59708
$$ 20440802 20135550 20187885 20144829 20004174 20033714 20146795 20073950 19945712 20122442 19962734
5138A9962734j80816L0503o3900n4661k54044j6072n0220o1353K32446k27646
$$ 19962734 19781918 19812421 19748521 19693860 19439816 19423744 19373524 19312171 19544617 19316971
5128A9316971p4721m3621m6785J4822J60869k17709m1698J95447r4078l5314j35420
$$ 19316971 19242250 19198629 19151844 19166666 19327535 19109826 19068128 19263575 19169497 19134183 18998763
5117A8998763J79300J95133k13716J78445J83006l0858K03544j16566j48686J05840
$$ 18998763 19178063 19373196 19159480 19337925 19520931 19490073 19693617 19577051 19428365 19534205
5107A9534205J05270k63434O3469K68775q8975M6210o7504n239M00389K33285
$$ 19534205 19639475 19376041 19439510 19708285 19619310 19665520 19598016 19592777 19993166 20226451
5097B0226451J77057J30417K55610R7645J28312K96950J08094K68896L51033L2717
$$ 20226451 20403508 20533925 20789535 20887180 21015492 21312442 21420536 21689432 22040465 22073182
5087B2073182K58494L39271M24941P1453J25356K68471K86325J34893P2380M65624
$$ 22073182 22331676 22670947 23095888 23167341 23292697 23561168 23847493 23982386 24054766 24520390
5077B4520390M14758P0911K53187J06702J92244L25750l8361J66594K17055j7128
$$ 24520390 24935148 25006059 25259246 25365948 25558192 25883942 25845581 26012175 26229230 26212102
5067B6212102l077J61824L51185J14629l582K39898J06070L6919K59581K42727
$$ 26212102 26209025 26370849 26722034 26836663 26833081 27072979 27179049 27215968 27475549 27718276
5057B7718276O7570J48251M39635J39369j28013J14628J15973K08672o9514k27160
$$ 27718276 27785846 27934097 28373732 28513101 28385088 28499716 28615689 28824361 28754847 28527687
5047B8527687J10116J576k06577k14871J64929J26005J5473l78646j77221j91389
$$ 28527687 28637803 28639379 28432802 28217931 28382860 28508865 28524338 28145692 27968471 27777082
5037B7777082R79j90558k423J47944j72909k15745r6906j19679m9618l0881j5359
$$ 27777082 27778061 27587503 27585080 27733024 27560115 27344370 27247464 27127785 27078167 27047286 27031927
5026B7031927O7809o0130j46147k41328K6400l78945j85212k82892l61455k46972
$$ 27031927 27099736 27039606 26893459 26652131 26678531 26299586 26114374 25831482 25470027 25223055
5016B5223055n3164l40674n86891j86167m75131l64003k69791k88997j65915l57603
$$ 25223055 25169891 24829217 24242326 24056159 23581028 23217025 22947234 22658237 22492322 22134719
5006B2134719k91584j78248k04133m77893r7109k27573k866o6162N4371l14792
$$ 22134719 21843135 21664887 21460754 20982861 20885752 20658179 20655313 20589151 20643522 20328730
4996B0328730r9837l8081j54891j58182l56735j81373k14243j62092o849j08078
$$ 20328730 20228893 20190812 20035921 19877739 19521004 19339631 19125388 18963296 18956447 18848369
4986A8848369l66368l16948j46319j67587l00507j57818p6392k88228n9243j63911
$$ 18848369 18482001 18165053 18018734 17851147 17550640 17392822 17316430 17028202 16968959 16805048
4976A6805048j36940l61660l8299k6453Q715j71133j92038K33094j8191q4337
$$ 16805048 16668108 16306448 16268149 16241696 16250411 16079278 15887240 16120334 16102143 16017806
4966A6017806p0374M4345k51289k67752j08223J917J50610m9667j42569o3324
$$ 16017806 15947432 15991777 15740488 15472736 15364513 15366430 15517040 15467373 15324804 15261480
4956A5261480r404N8730K23647J26560R005l6660J05350K57058j25459M6039K48166
$$ 15261480 15252076 15310806 15534453 15661013 15670018 15633358 15738708 15995766 15870307 15916346 16164512
4945A6164512m7889n348K69825N6556P5080K00993J39996J53446J81169K481k9419
$$ 16164512 16116623 16111275 16381100 16437656 16512736 16713729 16853725 17007171 17188340 17190821 17161402
4934A7161402K60252N678J55976R8512j18714J83241k64339N3396j084J0945J09460
$$ 17161402 17421654 17427332 17583308 17681820 17563106 17746347 17482008 17535404 17534320 17545265 17654725
4923A7654725j09757P3218j18156k90028J16577J90470K54445p0452N5903J37846
$$ 17654725 17544968 17618186 17500030 17210002 17326579 17517049 17771494 17701042 17756945 17894791
4913A7894791J02010m7786J77630L28415J58279M4210M2600M01334K66660J95856
$$ 17894791 17996801 17949015 18126645 18455060 18613339 18657549 18700149 19101483 19368143 19563999
4903A9563999N36459J81135M30247K13651L48204L83248L58110L54158L96165
$$ 19563999 20100458 20281593 20711840 20925491 21273695 21656943 22015053 22369211 22765376
4894B2765376N51011J59599K15535M16382M24231K72221L31731N05893L35243
$$ 22765376 23316387 23475986 23691521 24107903 24532134 24804355 25136086 25641979 25977222
4885B5977222K55098M57483K93183K60920L30022L28822K92422L87128K25948
$$ 25977222 26232320 26689803 26982986 27243906 27573928 27902750 28195172 28582300 28808248
4876B8808248J26781K53434K55214N1487p6227j55910j22214N228n6204k48915
$$ 28808248 28935029 29188463 29443677 29495164 29418937 29263027 29140813 29146041 29089837 28840922
4866B8840922j96936n2904k05750j04622L049l87781j33933j57096l40473j04238
$$ 28840922 28643986 28591082 28385332 28280710 28283759 27895978 27762045 27604949 27264476 27160238
4856B7160238k9124L3560l037l7875O8970p0310J19689R7092L8166J11886J57937
$$ 27160238 27131114 27164674 27161637 27123762 27192732 27122422 27242111 27339203 27377369 27489255 27647192
4845B7647192J75006J34412L70433J52579Q0203M81106M12223K15498N9103N48489
$$ 27647192 27822198 27956610 28327043 28479622 28559825 29040931 29453154 29668652 29727755 30276244
4835C0276244K18536Q9038m5775l2578R7852k37819K18436K21577o4232m514J00279
$$ 30276244 30494780 30583818 30538043 30505465 30603317 30365498 30583934 30805511 30741279 30736765 30837044
4824C0837044n5889J92482Q3365J3225J79475L02763O9205Q4131K85653L82514
$$ 30837044 30781155 30973637 31057002 31070227 31249702 31552465 31621670 31705801 31991454 32373968
4814C2373968K65951J14760M69874J97473L38526L23740M67310M36417J95619
$$ 32373968 32639919 32754679 33224553 33422026 33760552 34084292 34551602 34988019 35183638
4805C5183638N17614N50621N40944M27264N49659N89051M76358N52153P57658
$$ 35183638 35701252 36251873 36792817 37220081 37769740 38358791 38835149 39387302 40144960
4796D0144960P59058N31739O40168N38891N09629Q23974Q59103O17468O14016
$$ 40144960 40904018 41435757 42075925 42614816 43124445 43948419 44807522 45424990 46039006
4787D6039006O91775R72277J033008J029556R63624J073259R57107J203538J439983
$$ 46039006 46730781 47703058 48736066 49765622 50729246 51802505 52759612 53963150 55403133
4778E5403133J394003J327066J256211J330275J536923J592402J743792J868592
$$ 55403133 56797136 58124202 59380413 60710688 62247611 63840013 65583805 67452397
4770F7452397J320475J155679J360594J132738R52791J013789O12146M78235M70011
$$ 67452397 68772872 69928551 71289145 72421883 73374674 74388463 75000609 75478844 75948855
4761G5948855L49387M09474J1873P455M41172M54192M20974M79578P13414O40216
$$ 75948855 76298242 76707716 76719589 76727044 77168216 77622408 78043382 78522960 79236374 79876590
4751G9876590P97386J016235J135438R40884J168592J203682J459835J404723
$$ 79876590 80673976 81690211 82825649 83766533 84935125 86138807 87598642 89003365
4743H9003365J594913J781188J614481J855334J935447K190849K369577K431823
$$ 89003365 90598278 92379466 93993947 95849281 97784728 99975577 102345154 104776977
4735A04776977K764642K678671K840403K699059K881946K938680K801648K731720
$$ 104776977 107541619 110220290 113060693 115759752 118641698 121580378 124382026 127113746
4727A27113746K798506K793024K527956K705470K367594K370865K509309K573878
$$ 127113746 129912252 132705276 135233232 137938702 140306296 142677161 145186470 147760348
4719A47760348K580831K722905K920999K983332L376742L723423M007099M602094
$$ 147760348 150341179 153064084 155985083 158968415 162345157 166068580 170075679 174677773
4711A74677773M659281M900005N331147N351667N469299N488381N515854N372116
$$ 174677773 179337054 184237059 189568206 194919873 200389172 205877553 211393407 216765523
4703B16765523N091580N198179N011436M805194M845059M943285M698115M838081
$$ 216765523 221857103 227055282 232066718 236871912 241716971 246660256 251358371 256196452
4695B56196452M935249N022650N094093N217999N303213N122611N286855M915526
$$ 256196452 261131701 266154351 271248444 276466443 281769656 286892267 292179122 297094648
4687B97094648M165736L671166K314561R72890n25315j926766l369989m962486
$$ 297094648 301260384 304931550 307246111 308219001 307693686 305766920 302396931 297434445
4679B97434445o368747p177640p983375q776721r243510r505119r613628r170613
$$ 297434445 291065698 283888058 275904683 267127962 257884452 248379333 238765705 229595092
4671B29595092q790138q056625p356236o956230o410538n703980n445105n101039
$$ 229595092 220804954 212748329 205392093 198435863 192025325 186321345 180876240 175775201
4663A75775201m412371m251444l822029l643548l621380l274373l006559k919738
$$ 175775201 171362830 167111386 163289357 159645809 156024429 152750056 149743497 146823759
4655A46823759k487015k615049k763366k233175k154434k072678k091394j911948
$$ 146823759 144336744 141721695 138958329 136725154 134570720 132498042 130406648 128494700
4647A28494700j617263j668670j449508j596460j690125j578230j307591j172757
$$ 128494700 126877437 125208767 123759259 122162799 120472674 118894444 117586853 116414096
4639A16414096j093824j223843q94535r81020o99373q66187q67113o42360m24803
$$ 116414096 115320272 114096429 113201894 112220874 111521501 110655314 109788201 109145841 108721038
4630A08721038n38932l64671n12847o22657r3615k54919k52325p7076l97627k32096
$$ 108721038 108182106 107817435 107304588 106681931 106588316 106333397 106081072 106003996 105606369 105374273
4620A05374273J22831n9978P4826J67566o9715O981O6718J71107J66158J43754
$$ 105374273 105497104 105437126 105511952 105679518 105609803 105616784 105683502 105854609 106020767 106164521
4610A06164521J84315L45833O6456K60054j9965L00205L68813J384J57290J20459
$$ 106164521 106348836 106694669 106761125 107021179 107001214 107301419 107670232 107671616 107828906 107949365
4600A07949365K95670K9993J26411K11705K03638L29220o774p4872K00072J10116
$$ 107949365 108245035 108275028 108401439 108613144 108816782 109146002 109139228 109064356 109264428 109374544
4590A09374544J82510N5156j0264R5507m10869m60542l22468q64832q17041r89209
$$ 109374544 109557054 109612210 109601946 109697453 109286584 108826042 108503574 107638742 106821701 105832492
4580A05832492j222035j239766j566382j646415j747483j743428j718309k053577
$$ 105832492 104610457 103370691 101804309 100157894 98410411 96666983 94948674 92895097
4572I2895097j694219k020479j868126j734737j668353j549285j598465j660726
$$ 92895097 91200878 89180399 87312273 85577536 83909183 82359898 80761433 79100707
4564G9100707j699529j388167j607197j170529j326271j520880j485706j172909
$$ 79100707 77401178 76013011 74405814 73235285 71909014 70388134 68902428 67729519
4556F7729519j101635j396583j045779q89635j396936j001905o12676j162896
$$ 67729519 66627884 65231301 64185522 63295887 61898951 60897046 60284370 59121474
4548E9121474j022859j010464r13019p88723p55120j000590q99406o87720o47259
$$ 59121474 58098615 57088151 56175132 55386409 54631289 53630699 52731293 52043573 51396314
4539E1396314q89036o26467q28731n54501n76063n11127p09309q95105p38670
$$ 51396314 50507278 49880811 49052080 48497579 47921516 47410389 46701080 45805975 45067305
4530D5067305m64479n73322o20615o20872l12115o13042p13102m49635n19476
$$ 45067305 44602826 44029504 43408889 42788017 42475902 41862860 41149758 40700123 40180647
4521D0180647l29868k93029m25791n86295n29975n46478p5626l41217n16968k67950
$$ 40180647 39850779 39557750 39131959 38545664 38015689 37469211 37393585 37052368 36535400 36267450
4511C6267450m07450k22322k99309k77567j09445k89011j36901j78924k95957
$$ 36267450 35860000 35637678 35338369 35060802 34951357 34662346 34525445 34346521 34050564
4502C4050564j25225k03911R9045Q2446n7837k74717J01920J1868k3886M3309
$$ 34050564 33925339 33721428 33820473 33902919 33845082 33570365 33672285 33684153 33660267 33703576
4492C3703576N4702J7494j91940J31544J48703j0179r5521l37590p3422k34519
$$ 33703576 33758278 33775772 33583832 33715376 33864079 33853900 33758379 33420789 33347367 33112848
4482C3112848l27682j48808j57521j70919l14156j04331k30873k32869k43300
$$ 33112848 32785166 32636358 32478837 32307918 31993762 31889431 31658558 31425689 31182389
4473C1182389j23541m40689k03326k06813k83164m09290O2676j85557m02557m84559
$$ 31182389 31058848 30618159 30414833 30208020 29924856 29515566 29578242 29392685 28990128 28505569
4463B8505569j08752j89831n70162l60047l09624k81320j59125k12801o49536
$$ 28505569 28396817 28206986 27636824 27276777 26967153 26685833 26526708 26313907 25664371
4454B5664371n67641k42157l95839m15057o38095j09687m88423l05805k99899
$$ 25664371 25096730 24854573 24458734 24043677 23405582 23295895 22807472 22501667 22201768
4445B2201768j87328l02676l20694j64963n91723l91175p1553k95927k20064o6038
$$ 22201768 22014440 21711764 21391070 21226107 20634384 20243209 20171656 19875729 19655665 19589627
4435A9589627j28970j07072j78305M8964k09576k13141r7591k52711k82371j47829
$$ 19589627 19460657 19353585 19175280 19224244 19014668 18801527 18703936 18451225 18168854 18021025
4425A8021025L0764J39899j87312l16030Q9646n3619k46584k93854p9371j66022
$$ 18021025 18051789 18191688 18004376 17688346 17777992 17724373 17477789 17183935 17104564 16938542
4415A6938542R5845K9850o6209j8263k01743m7929j5447j58102p596k38883k01457
$$ 16938542 17034387 17064237 16998028 16979765 16778022 16730093 16714646 16556544 16548948 16310065 16108608
4404A6108608j3266J9729j07919o468j9418j10810k1601k16808j3034k423Q2840
$$ 16108608 16095342 16115071 16007152 16000684 15981266 15870456 15848855 15632047 15619013 15616590 15699430
4393A5699430k06298J20746k87410k01355k2689J43291l0397j40122o746m7711
$$ 15699430 15493132 15613878 15326468 15125113 15102424 15245715 15215318 15075196 15068450 15020739
4383A5020739R8394k69721m5785K42810j86868k85927r3150J52603p2492j24438
$$ 15020739 15119133 14849412 14803627 15046437 14859569 14573642 14480492 14633095 14560603 14436165
4373A4436165k16843o6841j82772r0574Q5499J91037Q409k26632k7551l5653l28599
$$ 14436165 14219322 14152481 13969709 13879135 13964634 14155671 14164080 13937448 13909897 13874244 13545645
4362A3545645J33764j31356p3968L2549o5056l1789l2401j04649L8892J10720
$$ 13545645 13679409 13548053 13474085 13506634 13441578 13409789 13377388 13272739 13311631 13422351
4352A3422351l28165n1258O4135k77539k91930j28003K0034M9026j43062m4067
$$ 13422351 13094186 13042928 13107063 12829524 12537594 12409591 12429625 12478651 12335589 12291522
4342A2291522J7686o4685j45093j67299j82319j54431J22559L8694k0618p3646
$$ 12291522 12309208 12244523 12099430 11932131 11749812 11595381 11717940 11756634 11736016 11662370
4332A1662370l80708L911J97897J9884m4124k14258L073o3079j20503O810k60871
$$ 11662370 11281662 11285573 11483470 11503354 11459230 11244972 11248045 11184966 11064463 11071273 10810402
4321A0810402j36090K32160k04241l3219m4777J61691j74044j13035m6496Q1561
$$ 10810402 10674312 10906472 10702231 10669012 10624235 10785926 10611882 10498847 10452351 10533912
4311A0533912J45883k62268j3342n5378k19217j37328K02905j09062k00018p7434
$$ 10533912 10679795 10417527 10404185 10348807 10129590 9992262 10195167 10086105 9886087 9808653
4301I808653K2276N348j28069j87896k68221J35091L36056k96850n1965N2008
$$ 9808653 9830929 9836277 9708208 9520312 9252091 9387182 9723238 9426388 9374423 9426431
4291I426431p0662r5939j76893j3792j22976J30574R4399j75485m5648j31070
$$ 9426431 9355769 9259830 9082937 9069145 8946169 9076743 9171142 8995657 8950009 8818939
4281H818939n7441j55508K24331p8532j79636k643M940j05769j1044n7895j9043
$$ 8818939 8761498 8605990 8830321 8751789 8572153 8569510 8574450 8468681 8457637 8399742 8380699
4270H380699j03891O0566J70599j07936j49110l13565J9736j7490p1681N2654
$$ 8380699 8276808 8337374 8507973 8400037 8250927 7937362 7957098 7939608 7867927 7920581
4260G920581J22787K68636j58003j69884J26323L4165Q3794r7348L3300J2891
$$ 7920581 8043368 8312004 8154001 7984117 8110440 8144605 8228399 8131051 8164351 8177242
4250H177242m8442K0117l5975J92655O1416q9496j61920K06357k20986j4686k31361
$$ 8177242 8128800 8148917 8112942 8305597 8367013 8277517 8115597 8321954 8100968 8086282 7854921
4239G854921K54958J46890j57210j1753N2473r580j14746k110M933j85180j55638
$$ 7854921 8109879 8256769 8099559 8087806 8140279 8130699 8015953 8013843 8018776 7833596 7677958
4228G677958J8456J37685j31534j11105j13333m610J96987R9079j36007j19738
$$ 7677958 7696414 7834099 7702565 7591460 7478127 7473517 7670504 7769583 7633576 7513838
4218G513838J29228j58242j8028q407j24696O8231K3415j9465Q6539j31334P5311
$$ 7513838 7643066 7484824 7466796 7458389 7333693 7401924 7425339 7405874 7492413 7361079 7436390
4207G436390J97340P5536r1616j36312J24636m4688j41700P5475j3598M4282J37194
$$ 7436390 7633730 7709266 7617650 7481338 7605974 7561286 7419586 7495061 7481463 7525745 7662939
4196G662939J45110k36173J11028J26687K732k6148J28527j22898Q6643N3900
$$ 7662939 7808049 7571876 7682904 7809591 7812323 7786175 7914702 7791804 7878447 7932347
4186G932347p0208K04638R1348j75449o8776J68089R4172J03415J22304J28297
$$ 7932347 7862139 8066777 8158125 7982676 7913900 8081989 8176161 8279576 8401880 8530177
4176H530177P0676k780J38134r6433J25661O1756J52307M567j52732J6415o9268
$$ 8530177 8600853 8598073 8736207 8639774 8765435 8827191 8979498 8984065 8831333 8847748 8778480
4165H778480K01023K25782n7425L58789J27215K3373J3829J94460K84673n5532
$$ 8778480 8979503 9205285 9147860 9506649 9633864 9657237 9671066 9865526 10150199 10094667
4155A0094667K2569J27378L57766P9005j30015J43775K84882n9096K2312J35030
$$ 10094667 10117236 10244614 10602380 10681385 10551370 10695145 10980027 10920931 10943243 11078273
4145A1078273K38745J57679N4738K99123J64436Q6522K83144J54322K14485L9747
$$ 11078273 11317018 11474697 11529435 11828558 11992994 12079516 12362660 12516982 12731467 12771214
4135A2771214J41153K79937K60513J32926M29932M63552K0471K49628J7999K34011
$$ 12771214 12912367 13192304 13452817 13585743 14015675 14479227 14499698 14749326 14767325 15001336
4125A5001336M36917O92759K84477M29345M71870M93036L02812L66912N06283
$$ 15001336 15438253 16131012 16415489 16844834 17316704 17809740 18112552 18479464 18985747
4116A8985747L51562N95898M00051L01865N44170O11061N66637N13858P53889
$$ 18985747 19337309 19933207 20333258 20635123 21179293 21790354 22356991 22870849 23624738
4107B3624738N78111J044752J139568J096094J283756J172137J398113J371970
$$ 23624738 24202849 25247601 26387169 27483263 28767019 29939156 31337269 32709239
4099C2709239J670749J950497K072218J916523K262906K279864K361882K569391
$$ 32709239 34379988 36330485 38402703 40319226 42582132 44861996 47223878 49793269
4091D9793269L123522L271625L627972L723583M299251M771370N154442N941453
$$ 49793269 52916791 56188416 59816388 63539971 67839222 72610592 77765034 83706487
4083H3706487N841035O518490P385035P678785P919601Q611767Q946026R452394
$$ 83706487 89547522 96066012 103451047 111129832 119049433 127661200 136607226 146059620
4075A46059620R966615J0026434J0435768J0372329R637442Q110013N693258K568188
$$ 146059620 156026235 166052669 176488437 186860766 196498208 204608221 210301479 212869667
4067B12869667k92664k970579m860127o571442q062628r941337j1142276j2110792
$$ 212869667 212577003 209606424 204746297 198174855 190112227 180170890 169028614 156917822
4059A56917822j2353590j1724292j0841112r822818q436093p517160o439238n610036
$$ 156917822 144564232 132839940 121998828 112176010 103739917 96222757 89783519 84173483
4051H4173483m972608m413810m330394l807861l222779k733417k943924k585271
$$ 84173483 79200875 74787065 70456671 66648810 63426031 60692614 57748690 55163419
4043E5163419k527757j948688j694001j976877j624786j573314j600090j199439
$$ 55163419 52635662 50686974 48992973 47016096 45391310 43817996 42217906 41018467
4035D1018467j067131j235040j200116r92097q80019j042425q28670q45193r40449
$$ 41018467 39951336 38716296 37516180 36524083 35644064 34601639 33772969 32927776 31987327
4026C1987327p58082r92323r05138p38350o42118p05642q63437o34874o20428
$$ 31987327 31229245 30236922 29331784 28593434 27951316 27245674 26382237 25747363 25126935
4017B5126935m51654o80265n13131n75409l21295n99549o45599o28161m79726
$$ 25126935 24675281 23995016 23481885 22906476 22585181 21985632 21340033 20711872 20232146
4008B0232146l71839k13736m41048m08844m63739n24548j64521r1449m24249m14831
$$ 20232146 19860307 19646571 19205523 18796679 18332940 17808392 17643871 17552422 17128173 16713342
3998A6713342j87631l90477l77471l39431k42689r2923q5569k59447k48733l94824
$$ 16713342 16525711 16135234 15757763 15418332 15175643 15082720 14997151 14737704 14488971 14094147
3988A4094147j71294k71409j46413j72150k95985Q1444l41503n48407j43864l09220
$$ 14094147 13922853 13651444 13505031 13332881 13036896 13118340 12776837 12228430 12084566 11775346
3978A1775346p5544j86550l4885k48841J03645j09895m7079j54590k96336j24244
$$ 11775346 11699802 11513252 11478367 11229526 11333171 11223276 11176197 11021607 10725271 10601027
3968A0601027j54973l16404n2427J13214l69003j69328N2735r5554j64525N470
$$ 10601027 10446054 10129650 10077223 10190437 9821434 9652106 9704841 9609287 9444762 9450232
3958I450232k36042J272j06714j25647J6617j55160j47418q1361R6705k75002
$$ 9450232 9214190 9215462 9108748 8983101 8999718 8844558 8697140 8615779 8712484 8437482
3948H437482L5668l21142m5134r915k08670K7272j02480k04003J1431j61922r217
$$ 8437482 8473150 8152008 8106874 8096959 7888289 7915561 7813081 7609078 7620509 7458587 7449370
3937G449370o5123m0022L5519k39043p258O5343p1748Q3972k56947l2140R9363
$$ 7449370 7384247 7344225 7379744 7140701 7133443 7198786 7127038 7211010 6954063 6921923 7021286
3926G021286q9129k39472m9706k3877j9836j30360k54421J50227j5526k30151
$$ 7021286 6932157 6692685 6642979 6619102 6599266 6468906 6214485 6364712 6349186 6119035
3916F119035j9502J08382J30100j26483j97399J5113j19106k44801J19644J62425
$$ 6119035 6099533 6207915 6338015 6211532 6014133 6029246 5910140 5665339 5784983 5947408
3906E947408k78152p4396o0644J20658j02654o0464k7359j75166o8733r8501j40564
$$ 5947408 5669256 5594860 5534216 5654874 5552220 5491756 5464397 5289231 5220498 5121997 4981433
3895D981433J92125j05192k7886M0133k1854K9930P7915j80186J01959R792J13285
$$ 4981433 5173558 5068366 5040480 5080613 5058759 5088689 5166604 4986418 5088377 5098169 5211454
3884E211454k47771k23148K09552j10206N9612j38162O986L6833l2263J38169
$$ 5211454 4963683 4740535 4950087 4839881 4899493 4761331 4768317 4805150 4772887 4911056
3874D911056J3854K3674j86296p1768O5673k51295N7623K07035j48413R4527j59203
$$ 4911056 4924910 4948584 4762288 4690520 4756193 4504898 4562521 4769556 4621143 4715670 4556467
3863D556467l1819j14277j46901o9656J10238J66183P6670j19581j72625P7572
$$ 4556467 4524648 4410371 4263470 4193814 4304052 4470235 4546905 4427324 4254699 4332271
3853D332271l4029j08083Q5806L2260k08273J21149Q8362j97105j24472q7879
$$ 4332271 4298242 4190159 4275965 4308225 4099952 4221101 4309463 4112358 3987886 3900007
3843C900007J65531l4758Q0153q6902n229K00191r6603j37551J737P8608q8949
$$ 3900007 4065538 4030780 4110933 4024031 4018802 4218993 4122390 3984839 3986576 4065184 3976235
3832C976235R0809q561j69805K40394q1565k05672Q4299M8956l720J06113J56632
$$ 3976235 4067044 4058483 3888678 4129072 4047507 3841835 3926134 3975090 3971370 4077483 4234115
3821D234115j10085l940P4042J24010j19952o5290M4729r0178q6787J87253j57724
$$ 4234115 4124030 4120090 4194132 4318142 4198190 4132900 4177629 4087451 4000664 4187917 4030193
3810D030193L5438p8788J04232k12322j86152J28923J37531J79516j06690l05279
$$ 4030193 4065631 3986843 4091075 3878753 3692601 3821524 3959055 4138571 4031881 3726602
3800C726602j53800J87058K74888j7984k90253Q5025m7702J90784J32711J04592
$$ 3726602 3572802 3759860 4034748 4016764 3726511 3811536 3763834 3954618 4087329 4191921
3790D191921p6238j17889L7819r5429j7835J95765k11234L71602K75931P4656
$$ 4191921 4115683 3997794 4035613 3940184 3922349 4118114 3906880 4278482 4554413 4629069
3780D629069q5245n9257L7442K0939J79328p4607j20954j06084k9012k28441k6747
$$ 4629069 4543824 4484567 4522009 4542948 4722276 4647669 4526715 4420631 4391619 4163178 4136431
3769D136431N3650j59659k55928J19208j33119P9906j54562k23439J478J37270
$$ 4136431 4190081 4030422 3774494 3893702 3760583 3840489 3685927 3462488 3463966 3601236
3759C601236K7198l6835j12698L4717o8376j29138n8015K02750J6732j45476k05986
$$ 3601236 3628434 3591599 3478901 3513618 3445242 3316104 3258089 3460839 3477571 3332095 3126109
3748C126109k9232K59066j971k06585o1829R6222J65817l1986o6709k12560O6792
$$ 3126109 3096877 3355943 3353972 3147387 3085558 3181780 3347597 3315611 3248902 3036342 3103134
3737C103134K35023j62917p1757J61218K5459O6630o0041j31689R8798j3540k20726
$$ 3103134 3338157 3175240 3103483 3264701 3290160 3356790 3296749 3165060 3263858 3250318 3029592
3726C029592j32842K06465j8968n3046N7752j14900k50131J77329m5529J40385
$$ 3029592 2896750 3103215 3084247 3031201 3088953 2974053 2723922 2901251 2855722 2996107
3716B996107Q3870j96637J8861R9324J05229n0645j09323j34687m3811R9520K41812
$$ 2996107 3079977 2883340 2902201 3001525 3106754 3056109 2946786 2812099 2768288 2867808 3109620
3705C109620J3626l3399k15541k7267J0018j86790M0264K23889N9439j53823K17618
$$ 3109620 3123246 3089847 2874306 2847039 2857057 2670267 2710531 2934420 2993859 2840036 3057654
3694C057654J35648l01157N1772q6943N5096L044k41580P9309J98477P3982L191
$$ 3057654 3193302 2892145 2943917 2856974 2912070 2915114 2673534 2752843 2951320 3025302 3028493
3683C028493J17411j49491k6207k21702q7468P8792J38070J99578j13055j65669
$$ 3028493 3145904 2996413 2970206 2748504 2661036 2739828 2877898 3077476 2964421 2798752
3673B798752N1507J06468O4210J11945j77280r6649o924k6797q50J16882J61812
$$ 2798752 2850259 2956727 3020937 3132882 2955602 2858953 2852029 2825232 2824382 2941264 3103076
3662C103076J18976q9782r1216j027K18739o9341j46863M3727l34624n0385P4224
$$ 3103076 3222052 3132270 3041054 3040027 3258766 3189425 3042562 3086289 2751665 2701280 2775504
3651B775504K57839r5341m963j80527J7569J16675m050J50178J05037k57619K5454
$$ 2775504 3033343 2938002 2933039 2752512 2770081 2886756 2882706 3032884 3137921 2880302 2905756
3640B905756j8199l2440l8393l1735O5176J2109K9254M4685R5440L4005J03898
$$ 2905756 2887557 2855117 2816724 2784989 2850165 2862274 2891528 2936213 3031653 3065658 3169556
3629C169556L9799p7210q1573o1752Q8607l3457p4254R0268K00177q6971j38681
$$ 3169556 3209355 3132145 3050572 2988820 3077427 3043970 2969716 3059984 3260161 3173190 3034509
3618C034509k0600J60374k46481l4144j29866P3324K32372O9503Q0832j47076
$$ 3034509 3013909 3174283 2927802 2893658 2763792 2837116 3069488 3138991 3219823 3072747
3608C072747j85859j3565L7264J05615m9374N4140j5876N5074N6517j12019o9306
$$ 3072747 2886888 2873323 2910587 3016202 2966828 3020968 3005092 3060166 3116683 3004664 2935358
3597B935358m8122J58213j05772K9031k71742J39989J41075o644n3599n6712P1453
$$ 2935358 2887236 3045449 2939677 2968708 2696966 2836955 2978030 2971386 2917787 2861075 2932528
3586B932528J1980Q9995J59689j74320j24640n3229k5879J56121o8698l25653
$$ 2932528 2944508 3034503 3194192 3019872 2895232 2842003 2816124 2972245 2903547 2577894
3576B577894J82959J27303J52219J14253L8011j23695j65752J27082R7999r4164
$$ 2577894 2760853 2888156 3040375 3154628 3192639 3068944 2903192 3030274 3128273 3034109
3566C034109J39999j5681j04675o9251j34408j22772J87174n6287j02285k9310
$$ 3034109 3174108 3158427 3053752 2984501 2850093 2727321 2914495 2858208 2755923 2726613
3556B726613m1537J24160J09279L2141K17292j01124J29674k59575k21813O0150
$$ 2726613 2685076 2809236 2918515 2950656 3167948 3066824 3196498 2936923 2715110 2775260
3546B775260O9224n5411O6471J23837j92817J23956j6356j05295j81182K57570
$$ 2775260 2844484 2789073 2855544 2979381 2786564 2910520 2894164 2788869 2607687 2865257
3536B865257l9298m5955M0203o5032J10633k21646J8167n3415j52462L7845K04866
$$ 2865257 2825959 2780004 2820207 2755175 2865808 2644162 2662329 2608914 2456452 2494297 2699163
3525B699163N8541q4619j30273j11912L60522J331r6059J08349p889j26413J0192
$$ 2699163 2757704 2673085 2542812 2430900 2791422 2792753 2696694 2805043 2797154 2670741 2680933
3514B680933K10987q5833p0434j33958J22103J05528J0647j67261k18066N1225
$$ 2680933 2891920 2806087 2735653 2601695 2723798 2829326 2839973 2672712 2454646 2505871
3504B505871J47503o8339j4721q6847j35851J57179J47175j13886n0375J58133
$$ 2505871 2653374 2585035 2570314 2483467 2347616 2504795 2651970 2538084 2487709 2645842
3494B645842J38771R380k69605M2515m4562j24864j01755J64451M8339k01179
$$ 2645842 2784613 2793993 2524388 2566903 2522341 2397477 2295722 2460173 2508512 2307333
3484B307333k07643J26117J03157n8191j1675J64613p133r833L0332O0783J95500
$$ 2307333 2099690 2225807 2328964 2270773 2259098 2423711 2416578 2406745 2437077 2497860 2693360
3473B693360n2746l3999j95041n3920R8475J99382N9181j06524J3446l13090J58527
$$ 2693360 2640614 2606615 2411574 2357654 2456129 2655511 2714692 2608168 2621614 2308524 2467051
3462B467051M9146M1785J09082j99528j68259L63576p8556M2192n19k54966Q1716
$$ 2467051 2516197 2557982 2667064 2467536 2299277 2662853 2584297 2626489 2625970 2371004 2452720
3451B452720K28553j82992L8992M0960n974K5313L0624l8810j90382k2953P6458
$$ 2452720 2681273 2498281 2537273 2578233 2572259 2597572 2628196 2589386 2399004 2376051 2452509
3440B452509N8202J26292R7895J51703j25913j09970j52379J7345K07420j08324
$$ 2452509 2510711 2637003 2734898 2886601 2760688 2650718 2498339 2515684 2723104 2614780
3430B614780P8029J4538Q0249J14888J54882K2746q6402p4357p1654O1701l7853
$$ 2614780 2692809 2707347 2787596 2902484 3057366 3080112 2993710 2919353 2847699 2909400 2871547
3419B871547r2143J27704l3773L0259J49476q0827p111P5337j07435K8028O6515
$$ 2871547 2779404 2907108 2873335 2903594 3053070 2972243 2965132 3040469 2933034 2961062 3027577
3408C027577m5939r1595j13361K43214N9411n58J512J81040l4015l7131J80587
$$ 3027577 2981638 2890043 2776682 3019896 3079307 3078749 3080261 3261301 3227286 3190155 3370742
3397C370742K2488p7664n5527O6871j2761M6879J0416L13621j42452Q3651j26332
$$ 3370742 3393230 3315566 3260039 3326910 3314149 3361028 3371444 3685065 3542613 3626264 3499932
3386C499932p0413o5108Q5648J939L404N7892o4789m3847K56915O4692k5801M0219
$$ 3499932 3429519 3364411 3450059 3451998 3455402 3513294 3448505 3404658 3661573 3726265 3700464 3740683
3374C740683J9590r7198O3449j5354Q5865n7886J04785Q5738J28502L2164K7619
$$ 3740683 3760273 3663075 3726524 3711170 3797035 3739149 3843934 3929672 4058174 4090338 4117957
3363D117957J94640p1750J12960n3135O3662l2217L12478l7702j00764O7885J26372
$$ 4117957 4312597 4240847 4353807 4300672 4364334 4332117 4644595 4606893 4506129 4574014 4700386
3352D700386P2811l08530j17184L61K73550Q6010J18774J03347J1983J71983J5759
$$ 4700386 4773197 4464667 4347483 4347844 4621394 4707404 4826178 4929525 4941508 5113491 5129250
3341E129250k703J26950K17361j56689j401q4895j0134L08684o2971J36820m0582
$$ 5129250 5126547 5253497 5470858 5314169 5312768 5227873 5217739 5526423 5463452 5600272 5559690
3330E559690K16642j14505J91335K31693j35962J76714J15715J28945L1839P9579
$$ 5559690 5776332 5661827 5853162 6084855 5948893 6125607 6241322 6370267 6402106 6481685
3320F481685l89K52349K03153J43603J4288Q4941n940J89653J75798J6131J15373
$$ 6481685 6481296 6733645 6936798 7080401 7094689 7179630 7173690 7363343 7539141 7555272 7670645
3309G670645L60608J34653O5456J17468l10K39629K29291K78634J82160K99589
$$ 7670645 8031253 8165906 8231362 8348830 8348520 8588149 8817440 9096074 9278234 9577823
3299I577823r7814k2654M59059K18339J42919N9072J48787K42389J59764J33111
$$ 9577823 9480009 9457355 9916414 10134753 10277672 10336744 10485531 10727920 10887684 11020795
3289A1020795J59607K56772L03530P0815K01114L68845K42415J67709N20998M92157
$$ 11020795 11180402 11437174 11740704 11811519 12012633 12381478 12623893 12791602 13312600 13804757
3279A3804757K56148K35521M18268M33266M34898K79749N33739O01136N96417
$$ 13804757 14060905 14296426 14714694 15147960 15582858 15862607 16396346 16997482 17593899
3270A7593899N57476N12290O07228O90185Q54041P27868Q33886P84800Q03557
$$ 17593899 18151375 18663665 19270893 19961078 20815119 21542987 22376873 23161673 23965230
3261B3965230P90168R79433R06038Q57197J006353Q44307Q41056J058878P60934
$$ 23965230 24755398 25734831 26640869 27498066 28504419 29348726 30189782 31248660 32009594
3252C2009594Q54226P43202N15824N66573K94446Q6499r5814j72341j75920k11128
$$ 32009594 32863820 33607022 34122846 34689419 34983865 35070364 34974550 34802209 34626289 34415161
3242C4415161o00644n45340o83976q53505j164052q22437p73356p87488p26447
$$ 34415161 33814517 33269177 32585201 31731696 30567644 29745207 28971851 28184363 27457916
3233B7457916q14512p33880q62287o14156l76450n16750o26130n25811k51233
$$ 27457916 26643404 25909524 25047237 24433081 24056631 23539881 22913751 22387940 22136707
3224B2136707l38290m68209n42683j94240l13667k80650l67999o61463k84459
$$ 22136707 21798417 21330208 20787525 20593285 20279618 19998968 19630969 18969506 18685047
3215A8685047k72496j50529k39023l28890k77266k50217k67766j80721l13145
$$ 18685047 18412551 18262022 18022999 17694109 17416843 17166626 16898860 16718139 16404994
3206A6404994k46404j09476n13208l64765j28808r7917m68816n135l7319l07528
$$ 16404994 16158590 16049114 15535906 15171141 15042333 14944416 14475600 14470465 14433146 14125618
3196A4125618k58772j19808m9207k79358q1358j27337o5885k19586l08250k37995
$$ 14125618 13866846 13747038 13697831 13418473 13337115 13209778 13143893 12924307 12616057 12378062
3186A2378062l2437j33722j71782l34994j96222O1165k26524j70707n4096j00745
$$ 12378062 12345625 12211903 12040121 11705127 11508905 11570070 11343546 11172839 11118743 11017998
3176A1017998j24631j95626j88825r305j0824m07844k17764m9913k47469j50753
$$ 11017998 10893367 10697741 10508916 10499611 10488787 10080943 9863179 9813266 9565797 9415044
3166I415044K40730k42875j32611k61568l31443k439n7237j87148P6405j55503
$$ 9415044 9655774 9412899 9280288 9018720 8687277 8684838 8627601 8440453 8516858 8361355
3156H361355k12342k01058j70576n583r2978k88467n8790K8751l4535j5045j10843
$$ 8361355 8149013 7947955 7777379 7771796 7678818 7390351 7331561 7360312 7325777 7310732 7199889
3145G199889r6323N386k01814j13523J6832j80821N2148k3531l43494k1309o806
$$ 7199889 7103566 7108952 6907138 6793615 6810447 6629626 6681774 6658243 6314749 6293440 6286634
3134F286634k50021J07819p201k48685j36362L1927n259Q9729o7657J0634k11764
$$ 6286634 6036613 6144432 6137231 5888546 5752184 5784111 5778852 5868581 5800924 5811558 5599794
3123E599794J1404P6560j55378P7753k83571n8955N4131m5067m4852L1191k29563
$$ 5599794 5611198 5687758 5532380 5610133 5326562 5267607 5321738 5276671 5231819 5263010 5033447
3112E033447k36710Q6815J55372r7289k71744k6743L48245l6045j69655j04521
$$ 5033447 4796737 4883552 5038924 4941635 4669891 4643148 4991393 4955348 4785693 4681172
3102D681172R0854j40707p1365M1860j23429M2166j04763O3135M4786L9434O1491
$$ 4681172 4772026 4631319 4559954 4601814 4478385 4520551 4415788 4478923 4523709 4563143 4624634
3091D624634j06090o9599j18450k33033J75086M3845j02585k21037j42977J64146
$$ 4624634 4518544 4448945 4330495 4097462 4272548 4316393 4213808 3992771 3849794 4013940
3081D013940L7152N6003R905k11767J93656j34159N0381p0644M8816j46687r1614
$$ 4013940 4051092 4107095 4117000 3905233 4098889 3964730 4015111 3944467 3993283 3846596 3754982
3070C754982K67797J02143k34275q7652L7950O423p8572o0192M44159O1863o3495
$$ 3754982 4022779 4124922 3890647 3802995 3840945 3847368 3768796 3708604 4152763 4214626 4151131
3059D151131n3305r4958K0071L5912m8208Q149j83084R6101L35537J18680R719
$$ 4151131 4097826 4002868 4022939 4058851 4010643 4018792 3835708 3931809 4267346 4386026 4395745
3048D395745O2827j29818l45357K86210K78423j84624j6432j943J42619Q7255
$$ 4395745 4458572 4328754 3983397 4269607 4548030 4363406 4346974 4345031 4487650 4574905
3038D574905j1288K51758J52311K56581l20002j03091J269K68905P7036k7668
$$ 4574905 4563617 4815375 4967686 5224267 4904265 4801174 4802443 5071348 5148384 5120716
3028E120716R6775M90329K80376m30L1356J66256J81118n6937L07368L76527J55002
$$ 5120716 5217491 5707820 5988196 5987766 6019122 6185378 6366496 6309559 6616927 6993454 7148456
3017G148456P057K44419j1653K99564K17566P1820K30268K64674K81483Q2044
$$ 7148456 7155513 7399932 7388279 7687843 7905409 7977229 8207497 8472171 8753654 8835698
3007H835698N1833R6341P1495K36257j02787K07499J56836O7188q5197n963K23522
$$ 8835698 8887531 8983872 9055367 9291624 9188837 9396336 9553172 9620360 9535163 9529200 9752722
2996I752722M5305m5822l08M03878K51560R5178Q7150O0370K67389j0975L14979
$$ 9752722 9798027 9752205 9751897 10155775 10407335 10502513 10589663 10650033 10917422 10906447 11221426
2985A1221426L33186K46560M19968J28314K93556K97406M25357L36470J13063
$$ 11221426 11554612 11801172 12221140 12349454 12643010 12940416 13365773 13702243 13815306
2976A3815306J39732L63562K84464n4760J19247J35462R759k03794M4210O1645
$$ 13815306 13955038 14318600 14603064 14548304 14667551 14803013 14812772 14608978 14653188 14714833
2966A4714833j91539j40428q8952j77835K4191k20677k91045k91129J8614p5394
$$ 14714833 14523294 14382866 14293914 14116079 14140270 13919593 13628548 13337419 13356033 13280639
2956A3280639k38666J15503l61052R354p9638n9227K3709j85537K30510L5378
$$ 13280639 13041973 13157476 12796424 12805778 12726140 12666913 12690622 12505085 12735595 12770973
2946A2770973K03182J2793J10473J83751Q1256J90659l5795l3346Q2896J17316
$$ 12770973 12974155 12986948 13097421 13281172 13362428 13553087 13517292 13483946 13566842 13684158
2936A3684158n8108j60096J91378K19745j51352l02728k23880j37673j60944m9615
$$ 13684158 13626050 13465954 13657332 13877077 13725725 13422997 13199117 13061444 12900500 12850885
2926A2850885k82548n8817k00260L8506j23248k75671k4092n1324j41549k4908
$$ 12850885 12568337 12509520 12309260 12347766 12224518 11948847 11924755 11873431 11731882 11706974
2916A1706974j02869j23157N224l3031L4790j2226r2183j46530q8909K7472k5945
$$ 11706974 11604105 11480948 11486172 11453141 11487931 11475705 11383522 11236992 11148083 11175555 11149610
2905A1149610j57976n4182n7070q1528l12280J09869j61666j81284k4709o1310
$$ 11149610 10991634 10937452 10880382 10798854 10486574 10596443 10434777 10253493 10228784 10167474
2895A0167474Q3408k02098p1473p0299m0177k9652K7777k2612O2474j62668j72194
$$ 10167474 10250882 10048784 9977311 9907012 9866835 9837183 9864960 9842348 9904822 9742154 9569960
2884I569960J69412j20503N361q2533n2134j25630J09073k36595j50106J40575
$$ 9569960 9739372 9618869 9624230 9541697 9489563 9363933 9473006 9236411 9086305 9226880
2874I226880k26065j57507j89357j98689n9329m9076k09102k06874o557l6222
$$ 9226880 9000815 8843308 8653951 8455262 8395933 8346857 8137755 7930881 7924324 7888102
2864G888102k67893k54206m3632R42j45029J6945j52068j59246q6789j04338m60838
$$ 7888102 7620209 7366003 7322371 7323313 7178284 7195229 7043161 6883915 6797126 6692788 6231950
2853F231950q4320K21398k00701j58061k42406j37261j17688l40635m809l3320
$$ 6231950 6147630 6369028 6168327 6010266 5767860 5630599 5512911 5172276 5167467 5134147
2843E134147p3738k61487k73434K69894o4261j54451j16577r1493o5884j7651
$$ 5134147 5060409 4798922 4525488 4795382 4731121 4576670 4460093 4368600 4302716 4285065
2833D285065j25389j18990L5961j9809q4123j28065j29197J46932p6593j38873
$$ 4285065 4159676 4040686 4076647 4056838 3972715 3844650 3715453 3862385 3785792 3646919
2823C646919j5954j24251K9995j84154j19510j33768J7375o6148J31338n5573
$$ 3646919 3630965 3506714 3536709 3352555 3233045 3099277 3116652 3050504 3181842 3126269
2813C126269j95562j85890j39472J8450K14761k03728J66091o6390j65748q5913
$$ 3126269 2930707 2744817 2605345 2623795 2838556 2634828 2800919 2734529 2568781 2482868
2803B482868L5015P6856L4411j78379r4076L8634k56543l3232M2523m9598J54086
$$ 2482868 2517883 2594739 2629150 2450771 2356695 2395329 2138786 2105554 2148077 2098479 2252565
2792B252565m7258k16863J07196J3570n8415j75771R2233Q8905M4799j54640J49679
$$ 2252565 2205307 1988444 2095640 2109210 2050795 1875024 1967257 2056162 2100961 1946321 2096000
2781B096000n8517j63311j04788k00640R5299J21974J56460k02599j74365K07507
$$ 2096000 2037483 1874172 1769384 1568744 1664043 1786017 1942477 1739878 1565513 1773020
2771A773020j13862J8093j01007q389K03396j00636j8796K5636j35836j7619q2156
$$ 1773020 1659158 1677251 1576244 1567855 1771251 1670615 1651819 1677455 1541619 1524000 1441844
2760A441844l2683j24523O7518J04839j42201o1546K50359Q9136n941k06322N2808
$$ 1441844 1409161 1284638 1352156 1456995 1314794 1253248 1503607 1592743 1586802 1380480 1433288
2749A433288J6003k52828m670j67587P5932K02153j38706j90922M1342n024J0830
$$ 1433288 1449291 1196463 1191793 1024206 1100138 1302291 1163585 972663 1014005 1008981 1019811
2738A019811K61243k48341O3089J4054j42344m5090k9276N9527J3032J05064o6522
$$ 1019811 1281054 1032713 1095802 1109856 967512 922422 893146 952673 965705 1070769 1004247
2727A004247j83085j15091J74895j6690k6238Q5550K7447K44427k54939l80106
$$ 1004247 821162 706071 880966 864276 838038 923588 951035 1195462 940523 560417
2717E60417R5687Q2505L8875J61929p2402n0197K06203M4007R823k4248Q4921
$$ 560417 656104 738609 777484 939413 867011 816814 1023017 1067024 1076847 1052599 1137520
2706A137520P686r2088j28386Q0062l5251l8901j15592K8240K6140J52404j93896
$$ 1137520 1145206 1053118 924732 1004794 969543 930642 815050 843290 869430 1021834 827938
2695H27938N7173k3823k68002K16636n697L80220k8757J7293j4177j37872N9430
$$ 827938 885111 861288 593286 809922 804225 1184445 1155688 1172981 1158804 1020932 1080362
2684A080362o520M9504q1016J57313J24573k7179j01603j30233j9257J50266J10128
$$ 1080362 1073842 1123346 1042330 1199643 1324216 1297037 1195434 1065201 1045944 1196210 1306338
2673A306338J79627n5707m6590J63984P6414L4196J3930k9566O5712R8732J16317
$$ 1306338 1485965 1430258 1383668 1547652 1624066 1658262 1672192 1642626 1708338 1807070 1923387
2662A923387n7934N5898j3558k8132J73180J52649J84454K22379k83552j89287
$$ 1923387 1865453 1921351 1907793 1879661 2052841 2205490 2389944 2612323 2328771 2139484
2652B139484J9605P6784J06666N8527J15985J45048j0249J38456J77085k0336
$$ 2139484 2159089 2235873 2342539 2401066 2517051 2662099 2651850 2790306 2967391 2947055
2642B947055J13052J16824K1765j3473J77616J30402J95577o4487K61357L04386
$$ 2947055 3060107 3176931 3198696 3185223 3362839 3493241 3688818 3624331 3885688 4190074
2632D190074q8342j20042j6706M722N7912O0023N6418n320l3057L5079J44425
$$ 4190074 4101732 3981690 3964984 3969706 4027618 4087641 4144059 4138739 4105682 4140761 4285186
2621D285186K24551N4964j61714m4830J89222R0638m2585J74070p3037J11035
$$ 4285186 4509737 4564701 4402987 4358157 4547379 4638017 4595432 4769502 4696465 4807500
2611D807500Q5212k7709j0843K38937M8822j2336J50197j75384J8483K08562p9327
$$ 4807500 4892712 4865003 4854160 5093097 5141919 5129583 5279780 5104396 5122879 5331441 5252114
2600E252114M3306K14768j01405J48482N7303K5550j6569j19533k3220j82344
$$ 5252114 5295420 5510188 5408783 5557265 5614568 5640118 5623549 5504016 5480796 5298452
2590E298452j5018k6967Q1792P4199j69304p4876r2530N636k2142R7080K15689
$$ 5298452 5283434 5256467 5338259 5412458 5243154 5168278 5075748 5081384 5059242 5156322 5372011
2579E372011l78637k43606M3454q5351l5453K51844o1335j79585j36141L33640
$$ 5372011 4993374 4749768 4793222 4707871 4672418 4924262 4862927 4683342 4547201 4880841
2569D880841k46932j35098M1020j14845J34730K7914j85391j56656J77880k86474
$$ 4880841 4633909 4498811 4539831 4424986 4559716 4587630 4402239 4245583 4423463 4136989
2559D136989K05199j00801j33266j96575j27355j15056j4182q2600O3178N0665
$$ 4136989 4342188 4241387 4108121 3911546 3784191 3669135 3654953 3572353 3635531 3686196
2549C686196j68791j35206q3990k01958r0376j25332j2913j32859q3321m6780
$$ 3686196 3517405 3382199 3298209 3096251 3005875 2880543 2867630 2734771 2651450 2604670
2539B604670j57207k6858J02985L6444k5977l6043N7566K1264j35105k27543O547
$$ 2604670 2447463 2420605 2523590 2560034 2534057 2498014 2555580 2576844 2441739 2214196 2220743
2528B220743j70389j94399Q0852l0357m5119o1549m9096m8205j29999J6941k9827
$$ 2220743 2050354 1855955 1936807 1906450 1861331 1799782 1750686 1702481 1572482 1589423 1559596
2517A559596m649N6405j90339j26065l6354j73501P2613K9746m3892O3332M05
$$ 1559596 1554947 1611352 1421013 1294948 1258594 1085093 1157706 1187452 1143560 1206892 1207297
2506A207297j62044k81557M219j08014J57183l3178j63541j99208K4068J15950
$$ 1207297 1045253 763696 767915 659901 817084 783906 620365 421157 445225 561175
2496E61175L591p4743j57650O92M990J22185J43000r0600m9916o3060j36957J06753
$$ 561175 564766 490023 332373 333065 338055 460240 603240 512640 462724 399664 262707 369460
2484C69460j22412j16574L7297j73795K4732J1143J59083K15605j59257J8858
$$ 369460 247048 130474 167771 -6024 18708 29851 188934 404539 245282 264140
2474B64140J65140j60084n9387L8582L9258j28664L85R707J55047r0904l8466
$$ 264140 429280 269196 209809 248391 287649 158985 159370 169077 324124 233220 194754
2463A94754J4873p1557j03671R2183n425J87048j76400k14847J22267J32437J66830
$$ 194754 209627 138070 34399 126582 121157 308205 131805 -83042 39225 171662 338492
2452C38492o3524k5095j1687j80781M3435R5155j56572Q9384K2082j56116L521
$$ 338492 274968 249873 238186 57405 100840 195995 39423 128807 150889 -5227 -1706
2441a706N9813P7307n9725n7125k92077J15626K15064R53j41016k27633J68920
$$ -1706 58107 135414 75689 18564 -273513 -157887 57177 58130 -82886 -310519 -141599
2430a41599j0422Q5867j51937J0512J52045J15505J2347m1735j75616P5568L4820
$$ -141599 -152021 -66154 -218091 -207579 -55534 59971 72318 30583 -145033 -69465 -34645
2419c4645p6936P1774k8918M1320j72075o7217J56365J04874q2434k4695q2465
$$ -34645 -111581 -39807 -68725 -27405 -199480 -266697 -110332 -5458 -87892 -112587 -195052
2408a95052m9100m2462J65841J40113k9697m4723l5996L9354L7856j50828j7652
$$ -195052 -244152 -286614 -120773 19340 -10357 -55080 -91076 -51722 -13866 -164694 -182346
2397a82346Q4264k6206j2723N4663J01417j98697J05820J11716L1664j5198N7594
$$ -182346 -98082 -124288 -137011 -82348 19069 -179628 -73808 37908 69572 54374 111968
2386A11968r5877R022j22329L8473P8986l0136k5929M2508o2915j15435L0020
$$ 111968 16091 25113 -97216 -58743 20243 -9893 -35822 6686 -56229 -171664 -141644
2375a41644r2248J0874N5425k4161R8271j1895k3733j11622J41162j02604l5521
$$ -141644 -233892 -223018 -167593 -191754 -93483 -105378 -129111 -240733 -99571 -202175 -237696
2364b37696Q2668R044l9219l4334p1718k2104J76687Q6919l01151l472J70570
$$ -237696 -155028 -145984 -185203 -219537 -291255 -313359 -136672 -49753 -350904 -354376 -183806
2353a83806J6645r7932j65560J91836m3118j54421K62265k7155l1729J70469n038
$$ -183806 -167161 -265093 -430653 -238817 -281935 -436356 -174091 -201246 -232975 -62506 -67544
2342f7544n3711M5300q8092j8517P2110n7488k13725j61268K12724M3315R7070
$$ -67544 -121255 -75955 -164047 -182564 -110454 -167942 -381667 -542935 -330211 -286896 -189826
2331a89826R850P6396p6061N4564m9992k11950J40223N4388j0743L0427O0572
$$ -189826 -179976 -103580 -179641 -125077 -175069 -387019 -246796 -192408 -203151 -172724 -112152
2320a12152j2257P4357j61769j47339m8497K0035N5097R0806J14597k6171K2031
$$ -112152 -124409 -50052 -211821 -359160 -407657 -387622 -332525 -241719 -127122 -153293 -131262
2309a31262J40504J73443l23979j36149j2706m0528K24309K28183j70955j763
$$ -131262 9242 182685 -141294 -277443 -290149 -330677 -106368 121815 -49140 -50903
2299e0903L5103O5277M3422J02742j06687o4243l29981j03953P7746K72697k42569
$$ -50903 -15800 49477 92899 195641 88954 24711 -305270 -409223 -331477 -58780 -301349
2288c01349j5130P8742m0827J02069l3140Q7285M7222j59751m162l2935N1436
$$ -301349 -316479 -237737 -278564 -176495 -209635 -122350 -75128 -234879 -239041 -271976 -220540
2277b20540O3317j21978J50510j85123J22366K0714j8830P2871o5889m6149j338
$$ -220540 -157223 -279201 -128691 -313814 -191448 -170734 -189564 -116693 -182582 -228731 -230069
2266b30069j82884L2772M0188P2776O1513j96254L7630R1655J33381J53739j23353
$$ -230069 -412953 -380181 -339993 -267217 -205704 -401958 -364328 -272673 -139292 14447 -108906
2255a08906J34584n6321k54696j934J9096K18431j51253j3966J34295n5759N4228
$$ -108906 25678 -30643 -285339 -287273 -268177 -49746 -200999 -214965 -80670 -136429 -82201
2244h2201k8315n1619L9287N3299M6228j44151J4606K27589L3910p6461j41216
$$ -82201 -110516 -162135 -122848 -69549 -23321 -167472 -152866 74723 108633 32172 -109044
2233a09044J6773K90963l2949k16388N123K782J30357l8562J30862k08816M907
$$ -109044 -92271 198692 165743 -50645 -45522 -42740 87617 49055 179917 -28899 -23992
2222b3992J79833j11305j6021K0825J76395O3341M3035K1638l805N1745o1587
$$ -23992 155841 44536 28515 49340 225735 289076 332111 353749 349944 401689 340102
2211C40102j08975M5850J135m181r7580K4924K50840O5085n498O6476n6982m7787
$$ 340102 231127 276977 278112 273931 176351 201275 452115 517200 511702 578178 521196 473409
2199D73409R6922k6688q9738Q8638M5401J34659J19830j43414J94009K19898j09482
$$ 473409 570331 543643 453905 542543 587944 722603 842433 699019 893028 1112926 1003444
2188A003444n6157K81466r3183L00305J78448N2258J09955j13444j9317K76935
$$ 1003444 947287 1228753 1135570 1435875 1614323 1666581 1776536 1663092 1643775 1920710
2178A920710m5655j86650Q2437J34144K5998k56495O9208l7333M8872j38980j22834
$$ 1920710 1875055 1688405 1770842 1904986 1930984 1674489 1743697 1706364 1755236 1616256 1493422
2167A493422r0690O2435J11845r2390K47785J34856j18473N8123K39665P1004
$$ 1493422 1402732 1465167 1577012 1484622 1732407 1867263 1748790 1806913 2046578 2117582
2157B117582j51826q4997J01249j54480K64567L33279N1420j20176m0629L78543
$$ 2117582 1965756 1880759 1982008 1827528 2092095 2425374 2476794 2356618 2315989 2694532
2147B694532O8195j72803L2213N51709K46252J20154N7155J49410L14808M38766
$$ 2694532 2762727 2589924 2622137 3173846 3420098 3540252 3597407 3746817 4061625 4500391
2137D500391J94993J74209L95684K09546N61759N50855N36370L54933N55451L82766
$$ 4500391 4695384 4869593 5265277 5474823 6036582 6587437 7123807 7478740 8034191 8416957
2127H416957N52096Q71484R87856Q41749J010285P33129J074569J193536J213520
$$ 8416957 8969053 9840537 10828393 11670142 12680427 13413556 14488125 15681661 16895181
2118A6895181J353177J299319J521263J156836J540726J620275J409959J439032
$$ 16895181 18248358 19547677 21068940 22225776 23766502 25386777 26796736 28235768
2110B8235768J260794M88033K86100j03152m04310o57181q98621j337579j491008
$$ 28235768 29496562 29984595 30270695 30167543 29763233 29106052 28207431 26869852 25378844
2101B5378844j633993j857487j934183j565291j566400j260592j219881j097569
$$ 25378844 23744851 21887364 19953181 18387890 16821490 15560898 14341017 13243448
2093A3243448q40166p07569p10629p11129n45995m80622l70876n35246o21858
$$ 13243448 12403282 11695713 10985084 10273955 9727960 9247338 8876462 8341216 7719358
2084G719358m26414l39239k68458k47327l48189l13393k23186k94128n2995K7284
$$ 7719358 7292944 6953705 6685247 6437920 6089731 5776338 5553152 5259024 5206029 5233313
2074E233313k41659m47229k33258P2698N0856j56476l52206j29404j98402j28213
$$ 5233313 4991654 4544425 4311167 4383865 4434721 4278245 3926039 3796635 3598233 3470020
2064C470020r3368J2134j83593L3862N4181m2349l11694l46423k0856J7337J21461
$$ 3470020 3376652 3388786 3205193 3239055 3293236 3250887 2939193 2592770 2571914 2589251 2710712
2053B710712j67197n275j96708l36726l1997K55980j05815r855k87164l8697K07136
$$ 2710712 2543515 2538240 2341532 2004806 1972809 2228789 2122974 2113119 1825955 1787258 1994394
2042A994394k09558l8754j12380J01316j19706L9974l7896O4608k36780o2970
$$ 1994394 1784836 1746082 1633702 1735018 1615312 1655286 1617390 1681998 1445218 1382248
2032A382248j36593M6627J33030k01760j51938J40223j06271l31762L78577N02
$$ 1382248 1245655 1292282 1425312 1223552 1071614 1211837 1105566 773804 1152381 1152883
2022A152883j49867j41727M2197k53102K05386J8676j26777J33773N5553p9691
$$ 1152883 1003016 861289 903486 650384 855770 874446 747669 881442 936995 857304
2012H57304r6667q7428Q084j2851q3764P5461j28227j0570P8344M3732k58755
$$ 857304 760637 673209 681293 668442 584678 660139 531912 521342 599686 643418 384663
2001C84663J6402r0588L8969p1227J32877L88325j88756k18731q198r0886Q6942
$$ 384663 401065 310477 349446 278219 411096 799421 610665 391934 383736 292850 379792
1990C79792Q9733r6971R7973n7162k0206J44345k53850N8246j98534m9307Q8114
$$ 379792 469525 372554 470527 413365 393159 537504 283654 341900 143366 94059 182173
1979A82173J77390N0646j01559r5219p1550J69567j5939j5015p181j31592M3146
$$ 182173 359563 410209 308650 213431 141881 311448 295509 280494 273313 141721 184867
1968A84867m0396k04145Q7770K66904j242r2158k4562Q931j09017r5868k0432
$$ 184867 144471 -59674 28096 295000 293758 201600 177038 185969 76952 -18916 -39348
1957c9348O2539L5468J4677j4908q7218J51618k81411J10479J02016k7599j14492
$$ -39348 23191 58659 73336 58428 -28790 122828 -158583 -48104 53912 26313 -88179
1946h8179K1261J364k67209K64685O87j05301P4635j91533P0390r4849R4478J18921
$$ -88179 -66918 -65554 -332763 -68078 -67391 -172692 -98057 -289590 -219200 -314049 -219571 -100650
1934a00650P3038j21366m1800J02735P9808q3738l2969K00997r1426j62550j11587
$$ -100650 -27612 -148978 -190778 -88043 -8235 -91973 -124942 76055 -15371 -177921 -289508
1923b89508J58202L9389o8891o7116K21451J02474o2344r8192k7899L0203L4509
$$ -289508 -131306 -91917 -160808 -227924 -6473 96001 33657 -64535 -92434 -62231 -27722
1912b7722R1365n6799J05703m8455j23832m970j48731J43105O8014O7716k2733
$$ -27722 63643 6844 112547 64092 -59740 -64710 -213441 -70336 -2322 65394 42661
1901D2661q5109J57214n1800j79392k6118k22749n0728K44718P2832M4500J70335
$$ 42661 -42448 114766 62966 -116426 -142544 -365293 -416021 -171303 -98471 -53971 116364
1890A16364m9361j84131O8682k0119P9032n6311j33573j9009J10368j5037o5218
$$ 116364 67003 -117128 -48446 -68565 10467 -45844 -179417 -198426 -88058 -103095 -168313
1879a68313L3251O1731r3286Q3732K0987J01735j140J03901J57877O0762N2629
$$ -168313 -135062 -73331 -166617 -82885 -61898 39837 38697 142598 300475 361237 413866
1868D13866q6602l76020k72661J35973J41801M7731N565K3328p124L0663J0771
$$ 413866 327264 -48756 -321417 -185444 -43643 4088 9653 32981 25857 56520 67291
1857F7291r644j32894Q4063J77137k01685Q479o9488k95164J98726M5173q4637
$$ 67291 57647 -75247 8816 185953 -15732 -7253 -76741 -371905 -173179 -128006 -212643
1846b12643O0481L4428n9793O3209J74538K0541j25607k3677R9187l6047p5843
$$ -212643 -152162 -117734 -177527 -114318 60220 80761 -44846 -68523 30664 -5383 -81226
1835h1226M1775K3247M9876K16019k03809p1376O6570m9878P4423j07323r3048
$$ -81226 -39451 -16204 33672 249691 45882 -25494 41076 -8802 65621 -41702 -134750
1824a34750O3523J58341p3341L3819l7044J31439n0299j43108r6167Q6312K42246
$$ -134750 -71227 87114 13773 47592 10548 141987 91688 -51420 -147587 -61275 180971
1813A80971j20056m8720O8356N331j87763j23384J45153j20351J11047J77596
$$ 180971 60915 12195 80551 85882 -101881 -225265 -80112 -200463 -89416 88180
1803H8180m7017j22265j24196N1503J20241j24217M7818q6505o6620O8521J61014
$$ 88180 41163 -81102 -205298 -153795 -33554 -157771 -109953 -196458 -263078 -194557 -33543
1792c3543k068L3291p4908n7987q0307k79676K95378M929r0215O4863J17955P2512
$$ -33543 -35611 -2320 -77228 -135215 -215522 -495198 -199820 -194891 -285106 -220243 -102288 -29776
$$ [...]
##END NTUPLES=NMR SPECTRUM
##END=
