##TITLE=1H_CA-8931-2
 CDCl3,8 sc, 
 30.9.2021
##JCAMPDX= 6.0         $$ Bruker NMR JCAMP-DX V2.0
##DATA TYPE= NMR SPECTRUM
##DATA CLASS= NTUPLES
##ORIGIN= UXNMR, Bruker Analytische Messtechnik GmbH
##OWNER= root
$$ XWIN-NMR		Version 3.5
$$ Thu Sep 30 09:10:01 2021 Russian Standard Time (UT+4h)  she@DPX200
##.OBSERVE FREQUENCY= 200.1313468511
##.OBSERVE NUCLEUS= ^1H
##.ACQUISITION MODE= SIMULTANEOUS
##.ACQUISITION SCHEME= undefined
##.AVERAGES= 8
##.DIGITISER RES= 18
##SPECTROMETER/DATA SYSTEM= spect
##.PULSE SEQUENCE= zg30
##.SOLVENT NAME= D2O
##.SHIFT REFERENCE= (INTERNAL, D2O, 0, 16.0455)
##AUDIT TRAIL= $$ (NUMBER, WHEN, WHO, WHERE, WHAT)
$$ ##TITLE= Audit trail, XWIN-NMR		Version 3.5
$$ ##JCAMPDX= 5.01
$$ ##ORIGIN= Bruker BioSpin GmbH
$$ ##OWNER= she
$$ F:/spectra/data/she/nmr/H-F/1/pdata/1/auditp.txt
$$ ##AUDIT TRAIL=  $$ (NUMBER, WHEN, WHO, WHERE, WHAT)
(   1,<2021-09-30 09:08:33.20 +0400>,<she>,<DPX200>,
      <created by zg, POWCHK disabled, PULCHK disabled
       configuration hash MD5:
       00 E9 B6 7A A2 85 ED C7 34 08 36 98 17 FE 4E 26
       data hash MD5: 16K
       7E 8F F0 CE 19 BF 85 64 E7 59 FC FC 3F 31 0D 47>)
(   2,<2021-09-30 09:08:35.89 +0400>,<she>,<DPX200>,
      <Start of raw data processing
       efp BC_mod = 2 LB = 0.24 FT_mod = 6 PKNL = 1 PHC0 = -13875.12 PHC1 = 11.60085 SI = 16K 
       data hash MD5: 16K
       74 0C BE 81 CF 64 AD 2E 9E ED F9 71 EA BC 1E 7A>)
(   3,<2021-09-30 09:08:53.64 +0400>,<she>,<DPX200>,
      <pk PHC0 = -111.5301 PHC1 = -1.6 
       data hash MD5: 16K
       8D 71 8E 2D 18 CB 7A 9E C9 35 7D B7 EC AA 8E 4F>)
(   4,<2021-09-30 09:08:57.01 +0400>,<she>,<DPX200>,
      <abs ABSG = 5 
       data hash MD5: 16K
       DD 02 08 03 26 7F D9 C8 0E F9 DE 9A 0B 54 D7 EA>)
$$ ##END=
$$ 
$$ hash MD5
$$ 32 A1 01 2B B3 DB 12 10 A5 4B 1B 41 17 6B 87 15
##$RELAX= 
##$RELAX= 
##$RELAX= 
##$RELAX= 
##$RELAX= 
##$RELAX= 
$$ Bruker specific parameters
$$ --------------------------
##$DU= <F:/spectra>
##$EXPNO= 1
##$NAME= <H-F>
##$PROCNO= 1
##$TYPE= <nmr>
##$USER= <she>
##$AMP= (0..31)
100 100 100 100 100 100 100 100 100 100 100 100 100 100 100 100 100 100 
100 100 100 100 100 100 100 100 100 100 100 100 100 100 
##$AQSEQ= 0
##$AQ_mod= 1
##$AUNM= <au_zg>
##$AUTOPOS= <>
##$BF1= 200.13
##$BF2= 200.13
##$BF3= 200.13
##$BF4= 200.13
##$BF5= 200.13
##$BF6= 200.13
##$BF7= 200.13
##$BF8= 200.13
##$BYTORDA= 1
##$CFDGTYP= 0
##$CFRGTYP= 5
##$CHEMSTR= <none>
##$CNST= (0..31)
1 1 145 1 1 1 1 1 1 1 1 1 1 1 1 1 1 1 1 1 1 1 1 1 1 1 1 1 1 1 1 1 
##$CPDPRG= <>
##$CPDPRG1= <>
##$CPDPRG2= <>
##$CPDPRG3= <>
##$CPDPRG4= <mlev>
##$CPDPRG5= <mlev>
##$CPDPRG6= <mlev>
##$CPDPRG7= <mlev>
##$CPDPRG8= <mlev>
##$CPDPRGB= <>
##$CPDPRGT= <>
##$D= (0..31)
0 1.2 0 0 0 0 0 0 0 0.06 0 0.03 0 0 0 0 0.0002 0 0 0 0 0 0 0 0 0 0 0 0 
0 0 0 
##$DATE= 1632978512
##$DBL= (0..7)
120 120 120 120 120 120 120 120 
##$DBP= (0..7)
150 150 150 150 150 150 150 150 
##$DBP07= 0
##$DBPNAM0= <>
##$DBPNAM1= <>
##$DBPNAM2= <>
##$DBPNAM3= <>
##$DBPNAM4= <>
$$ [...]
##$SUBNAM2= <"">
##$SUBNAM3= <"">
##$SUBNAM4= <"">
##$SUBNAM5= <"">
##$SUBNAM6= <"">
##$SUBNAM7= <"">
##$SUBNAM8= <"">
##$SUBNAM9= <"">
##$SW= 18.0517286264689
##$SWIBOX= (0..15)
0 0 2 0 0 0 0 0 0 0 0 0 0 0 0 0 
##$SW_h= 3612.71676300578
##$TD= 16384
##$TD0= 1
##$TE= 0
##$TE2= 300
##$TE3= 300
##$TEG= 300
##$TL= (0..7)
0 120 120 120 120 120 120 120 
##$TP= (0..7)
150 150 150 150 150 150 150 150 
##$TP07= 0
##$TPNAME0= <>
##$TPNAME1= <>
##$TPNAME2= <>
##$TPNAME3= <>
##$TPNAME4= <>
##$TPNAME5= <>
##$TPNAME6= <>
##$TPNAME7= <>
##$TPOAL= (0..7)
0.5 0.5 0.5 0.5 0.5 0.5 0.5 0.5 
##$TPOFFS= (0..7)
0 0 0 0 0 0 0 0 
##$TUNHIN= 0
##$TUNHOUT= 0
##$TUNXOUT= 0
##$USERA1= <user>
##$USERA2= <user>
##$USERA3= <user>
##$USERA4= <user>
##$USERA5= <user>
##$V9= 5
##$VALIST= <valist>
##$VCLIST= <CCCCCCCCCCCCCCC>
##$VD= 0
##$VDLIST= <DDDDDDDDDDDDDDD>
##$VPLIST= <PPPPPPPPPPPPPPP>
##$VTLIST= <TTTTTTTTTTTTTTT>
##$WBST= 1024
##$WBSW= 4
##$XGAIN= (0..3)
0 0 0 0 
##$XL= 0
##$YL= 0
##$YMAX_a= 236883
##$YMIN_a= -226780
##$ZGOPTNS= <>
##$ZL1= 120
##$ZL2= 120
##$ZL3= 120
##$ZL4= 120
##$ABSF1= 15.79978
##$ABSF2= -2.252071
##$ABSG= 5
##$ABSL= 3
##$ALPHA= 0
##$AQORDER= 0
##$ASSFAC= 0
##$ASSFACI= 0
##$ASSFACX= 0
##$ASSWID= 0
##$AUNMP= <proc_1d>
##$AZFE= 0.1
##$AZFW= 0.1
##$BCFW= 0
##$BC_mod= 2
##$BYTORDP= 0
##$COROFFS= 0
##$CY= -3
##$DATMOD= 1
##$DC= 0
##$DFILT= <>
##$DTYPP= 0
##$F1P= 0
##$F2P= 0
##$FCOR= 1
##$FTSIZE= 16384
##$FT_mod= 6
##$GAMMA= 0
##$GB= 0
##$INTBC= 1
##$INTSCL= 0
##$ISEN= 128
##$LB= 0.24
##$LEV0= 0
##$LPBIN= 0
##$MAXI= 10000
##$MC2= 0
##$MEAN= 0
##$ME_mod= 0
##$MI= 1.114404
##$NCOEF= 0
##$NC_proc= -6
##$NLEV= 6
##$NOISF1= 3.799351
##$NOISF2= 2.8
##$NSP= 0
##$NTH_PI= 0
##$NZP= 0
##$OFFSET= 16.04548
##$PC= 1
##$PHC0= -13986.65
##$PHC1= 10.00085
##$PH_mod= 1
##$PKNL= yes
##$PPARMOD= 0
##$PSCAL= 0
##$PSIGN= 0
##$REVERSE= no
##$SF= 200.129942027826
##$SI= 16384
##$SIGF1= 3
##$SIGF2= 2
##$SINO= 5.538805
##$SIOLD= 16384
##$SREGLST= <1H.CDCl3>
##$SSB= 0
##$STSI= 16384
##$STSR= 0
##$SW_p= 3612.71676300578
##$SYMM= 0
##$S_DEV= 0
##$TDeff= 16384
##$TDoff= 0
##$TI= <>
##$TILT= no
##$TM1= 0
##$TM2= 0
##$TOPLEV= 0
##$USERP1= <user>
##$USERP2= <user>
##$USERP3= <user>
##$USERP4= <user>
##$USERP5= <user>
##$WDW= 1
##$XDIM= 16384
##$YMAX_p= 545492032
##$YMIN_p= -116807
$$ End of Bruker specific parameters
$$ ---------------------------------
##NTUPLES= NMR SPECTRUM
##VAR_NAME=  FREQUENCY,     SPECTRUM/REAL,   SPECTRUM/IMAG
##SYMBOL=    X,             R,               I
##VAR_TYPE=  INDEPENDENT,   DEPENDENT,       DEPENDENT
##VAR_FORM=  AFFN,          ASDF,            ASDF
##VAR_DIM=   16384,         16384,           16384
##UNITS=     HZ,            ARBITRARY UNITS, ARBITRARY UNITS
##FACTOR=    0.220516191357247, 1,           1
##FIRST=     3211.18112793314, 0,            0
##LAST=      -401.535635072639, 0,           0
##MIN=       -401.535635072639, -116807,     0
##MAX=       3211.18112793314, 545492032,    0
$$ Real data points
##PAGE= N=1
##DATA TABLE= (X++(R..R)), XYDATA
$$ [...]
$$ plain form
8054 1465410 1551341 1628692 1702633 1740653 1747167 1759809 1751195 1748370 1763096 1762256 1773790 1807370
8042 1807370 1835410 1842742 1867644 1891201 1887148 1855225 1797922 1758619 1676146 1583227 1509289 1438260
8030 1438260 1400244 1341161 1293898 1286382 1286449 1259576 1218166 1210534 1212068 1199135 1182652 1191343 1201499
8017 1201499 1177970 1163551 1152941 1139610 1108814 1080901 1047374 1018365 1005115 975400 952229
8006 952229 945577 912904 895812 895632 886317 888127 892999 899816 902904 895351 888839 887035 862109 839688
7992 839688 826254 786947 763345 752352 713909 691525 700108 703713 686765 667044 654100 628381
7980 628381 605516 600642 590193 585122 572278 578705 563918 539633 520465 519400 500437 501087 510466
7967 510466 523671 512218 489860 477471 470767 460788 466645 468495 464500 467979 446929 469961 472300
$$ packed form
8054A465410Q5931P7351P3941L8020O514J2642q614k825J4726q40J1534L3580
8042A807370K8040P332K4902K3557m053l1923n7303l9303q2473r2919p3938p1029
8030A438260l8016n9083m7263p516O7k6873m1410p632J534j2933j6483Q691J0156
8017A201499k3529j4419j0610j3331l0796k7913l3527k9009j3250k9715k3171
8006I52229o652l2673j7092j80r315J810M872O817L088p553o512j804k4926k2421
7992H39688j3434l9307k3602j0993l8443k2384Q583L605j6948j9721j2944k5719
7980F28381k2865m874j0449n071j2844O427j4787k4285j9168j065j8963O50R379
7967E10466J3205j1453k2358j2389o704r979N857J850l995L479k1050K3032K339
$$ plain form
7954 472300 447147 449936 462177 457663 482124 495750 490404 487544 507537 520900 524442 532882 539414
7941 539414 531208 517980 503091 495234 507884 497613 481972 486059 482838 467847 483996 495144
7929 495144 487555 474891 458100 464888 474843 479504 462734 453838 460414 489866 491500 494451 496962
7916 496962 487159 484455 493915 481829 469121 460919 455625 448092 434071 446611 432807 438954 432592
7903 432592 449459 457682 455189 463678 447776 457333 458913 462817 457697 463020 477798 478503 478004 474019
7889 474019 458494 456202 458378 465321 474276 457705 463431 469116 473729 472143 465618 476567 485510 490644
7875 490644 490717 496778 501758 499968 494539 492789 516176 509896 509393 524684 524933 522805 518691 538299 551148
7860 551148 540734 555322 581804 565007 588081 598913 621312 620238 628654 638909 633162 635629
$$ packed form
7954D72300k5153K789J2241m514K4461J3626n346k860J9993J3363L542Q440O532
7941E39414q206j3228j4889p857J2650j0271j5641M087l221j4991J6149J1148
7929D95144p589j2664j6791O788R955M661j6770q896O576K9452J634K951K511
7916D96962r803k704R460j2086j2708q202n294p533j4021J2540j3804O147o362
7903D32592J6867Q223k493Q489j5902R557J580L904n120N323J4778P05m99l985
7889D74019j5525k292K176O943Q955j6571N726N685M613j586o525J0949Q943N134
7875D90644P3O061M980j790n429j750K3387o280n03J5291K49k128m114J9608J2849
7860E51148j0414J4588K6482j6797K3074J0832K2399j074Q416J0255n747K467
$$ plain form
7848 635629 649525 648921 641935 623652 635030 643627 645901 675637 695910 685297 670503 667815 672954
7835 672954 685078 679690 693707 697894 693075 697222 700419 698691 713335 724028 731848 736256 751345
7822 751345 764656 769789 785729 786297 784197 802685 823611 846783 867781 894765 909931 955846
7810 955846 1020725 1392783 1212389 965917 984788 982894 1006376 988510 1007797 996808 1013042
7799 1013042 1009725 1042795 1079754 1111706 1128075 1167017 1191819 1222664 1225281 1246089 1226248 1217322
7787 1217322 1198064 1176678 1165805 1151376 1131092 1123902 1089549 1075677 1054337 1039268 1019541 996430
7775 996430 961485 954752 935373 916251 889029 871349 860054 827919 811558 821444 833280 827446
7763 827446 834512 846697 850590 865620 894443 914602 935638 937302 942145 943127 948615 949510 946715 952545
$$ packed form
7848F35629J3896o04o986j8283J1378Q597K274K9736K0273j0613j4794k688N139
7835F72954J2124n388J4017M187m819M147L197j728J4644J0693P820M408J5089
7822G51345J3311N133J5940N68k100J8488K0926K3172K0998K6984J5166M5915
7810I55846O4879L72058j80394k46472J8871j894K3482j7866J9287j0989J6234
7799A013042l317L3070L6959L1952J6369L8942K4802L0845K617K0808j9841q926
7787A217322j9258k1386j0873j4429k0284p190l4353j3872k1340j5069j9727k3111
7775I96430l4945o733j9379j9122k7222j7680j1295l2135j6361R886J1836n834
7763H27446P066J2185L893J5030K8823K0159K1036J664M843R82N488Q95k795N830
$$ plain form
7749 952545 944750 947573 945649 969028 1015318 1045637 1046796 1067870 1091639 1103542 1101803 1087903 1060448
7736 1060448 1021855 971604 926766 881892 861432 845301 829907 804069 781587 773031 754900 736335
7724 736335 710678 685104 679570 644468 637348 618392 611610 600710 586801 575870 552967 559525
7712 559525 545711 531577 531889 525830 521074 504307 485540 491232 484733 486774 481981 483198 460026
7699 460026 457935 481527 480519 478612 488201 489032 494309 503950 501017 487373 485667 489271 507465 500405
7685 500405 492209 486543 486052 489539 484596 480857 514325 514342 500569 510902 500104 493326 477215 472089
7671 472089 476948 481392 476228 450940 459921 465539 463234 468818 466906 471120 473282 478786 474687 465577
7657 465577 469697 458721 463866 474723 493850 501012 489042 490546 492750 509446 516355 517843 534316
$$ packed form
7749I52545p795K823j924K3379M6290L0319J159K1074K3769J1903j739j3900k7455
7736A060448l8593n0251m4838m4874k0460j6131j5394k5838k2482q556j8131j8565
7724G36335k5657k5574n534l5102p120j8956o782j0900j3909j0931k2903O558
7712E59525j3814j4134L12o059m756j6767j8767N692o499K041m793J217k3172
7699D60026k091K3592j008j907R589Q31N277R641k933j3644j706L604J8194p060
7685E00405q196n666m91L487m943l739L3468J7j3773J0333j0798o778j6111n126
7671D72089M859M444n164k5288Q981N618k305N584j912M214K162N504m099r110
7657D65577M120j0976N145J0857J9127P162j1970J504K204J6696O909J488J6473
$$ plain form
7644 534316 539898 553167 560455 562535 558830 567826 557379 557492 551366 535788 540865 526753 518618 511364
7630 511364 514611 531699 517318 500083 496185 482723 487981 488136 485617 476800 460284 482754 477126
7617 477126 471956 476056 462643 458584 463204 454686 443925 452709 455243 447922 448802 464290 463173 462215
7603 462215 475490 502894 508724 493557 487936 473654 480378 501544 501538 499102 492890 484409 477407 463452
7589 463452 458946 472694 461719 440401 428945 430195 424627 407026 388542 400908 394678 375299
7577 375299 360881 352241 359723 353887 336676 326842 315374 320471 319805 305267 303102 294893 296555 298910
7563 298910 291155 287215 299254 290379 269178 267111 269910 270824 299756 307562 302758 305550 308452 312870
7549 312870 329794 331857 327771 330621 340703 334079 344225 352586 329733 334985 343614 339082 342332
$$ packed form
7644E34316N582J3269P288K080l705Q996j0447J13o126j5578N077j4112q135p254
7630E11364L247J7088j4381j7235l898j3462N258J55k519q817j6516K2470n628
7617D77126n170M100j3413m059M620q518j0761Q784K534p321Q80J5488j117r58
7603D62215J3275K7404N830j5167n621j4282O724K1166ok436o212q481p002j3955
7589D63452m506J3748j0975k1318j1456J250n568j7601j8484J2366o230j9379
7577C75299j4418q640P482n836j7211r834j1468N097o66j4538k165q209J662K355
7563B98910p755l940J2039q875k1201k067K799R14K8932P806m804K792K902M418
7549C12870J6924K063m086K850J0082o624J0146Q361k2853N252Q629m532L250
$$ plain form
7536 342332 343480 344325 360198 360886 354187 351395 359976 354457 364959 373904 372651 355488 355778 372291
7522 372291 355521 356048 351425 344044 347708 332739 345054 327993 318892 282864 316604 334754 312351
7509 312351 294104 287977 263487 259438 249532 252373 250648 250625 248111 221190 211523 211002 222900 211502
7495 211502 195900 201036 213407 211008 211171 203406 204532 193486 210021 207053 188999 169304 182108
7482 182108 171598 162363 151101 159421 161402 162835 163406 161156 164904 158710 167919 153342 137565 134171
7468 134171 122171 138808 129628 127091 132025 114621 110252 101849 107866 118163 118518 110149 107482 111482
7454 111482 110480 106747 102605 85557 95037 102173 107068 107593 94615 87253 92420 108075 106926 99701
7440 99701 91750 87303 59802 71145 74015 84312 93721 87366 82064 70723 69844 73192 51714 56977
$$ packed form
7536C42332J148Q45J5873O88o699k792Q581n519J0502Q945j253j7163K90J6513
7522C72291j6770N27m623p381L664j4969J2315j7061r101l6028L3740J8150k2403
7509C12351j8247o127k4490m049r906K841j725k3k514k6921r667n21J1898j1398
7495B11502j5602N136J2371k399J63p765J126j1046J6535k968j8054j9695J2804
7482A82108j0510r235j1262Q320J981J433N71k250L748o194R209j4577j5777l394
7468A34171j2000J6637r180k537M934j7404m369q403O017J0297L55q369k667M000
7454A11482j002l733m142j7048R480P136M895N25j2978p362N167J5655j149p225
7440I9701p951m447k7501J1343K870J0297R409o355n302j1341q79L348k1478N263
$$ plain form
7426 56977 71401 69143 77239 75997 57277 47575 47058 48445 36039 37952 50360 50543 39968 26325
7412 26325 39357 32600 35375 46086 42749 33804 24750 40336 49538 52221 51594 41879 35571 23216
7398 23216 29082 32190 42483 51538 44017 46784 46027 59083 54439 18644 16437 21997 10338 21821
7384 21821 19635 15293 28255 14054 11480 17800 44696 39298 25159 16734 2818 7400 5538
7371 5538 7717 15436 8237 10271 7031 -1870 -11775 -7570 5590 24090 16093 9096 12494 10187
7357 10187 10573 -10475 -14465 -16598 -5080 -7816 -9424 -1858 3575 4806 16888 34813 24966 19336
7343 19336 18605 28746 32109 32357 27325 5082 -5064 6376 7748 15507 17590 -4376 -6960 1518
7329 1518 20599 6974 714 1841 6229 1264 3551 27958 18889 14493 6849 8741 19627 7219
$$ packed form
7426E6977J4424k258Q096j242j8720r702n17J387j2406J913J2408J83j0575j3643
7412B6325J3032o757K775J0711l337q945r054J5586R202K683o27r715o308j2355
7398B3216N866L108J0293R055p521K767p57J3056m644l5795k207N560j1659J1483
7384B1821k186m342J2962j4201k574O320K6896n398j4139q425j3916M582j862
7371E538K179P719p199K034l240q901r905M205J3160J8500p997o997L398k307
7357A0187L86k1048l990k133J1518k736j608P566N433J231J2082J7925r847n630
7343A9336p31J0141L363K48n032k2243j0146J1440J372P759K083k1966k584Q478
7329A518J9081j3625o260J127M388m965K287K4407r069m396p644J892J0886j2408
$$ plain form
7315 7219 -11636 -1847 -9719 -9711 1231 9867 1355 -1751 5911 -13358 -5193 -15916 -16639 -1183 -15694
7300 -15694 -20553 -19016 -20527 -14244 -19200 -4753 105 -16683 -19510 -6729 -7994 -5291 6315 -10655
7286 -10655 -28218 -41328 -33939 -21883 -22330 -15071 -21675 -35617 -25534 -27080 -32632 -28366 -28711 -17618
7272 -17618 -9508 -15886 -24379 -40689 -25010 -15120 -17059 -28235 -27073 -41526 -40358 -33350 -53645
7259 -53645 -39680 -28097 -37778 -23895 -27703 -32853 -36501 -44059 -44078 -41537 -48762 -41080 -27321 -37977
7245 -37977 -34559 -22926 -38962 -51174 -57964 -45523 -31871 -45337 -47688 -28902 -14447 -12393 -16045
7232 -16045 -23376 -24879 -18823 -26580 -31904 -25197 -31879 -38882 -32813 -26882 -21073 -22095 -43961 -46239
7218 -46239 -38282 -31813 -36354 -11534 -19206 -20572 -29384 -43607 -39054 -36594 -23319 -37160 -38340 -48782
$$ packed form
7315G219j8855R789p872QJ0942Q636q512l106P662j9269Q165j0723p23J5456j4511
7300a5694m859J537j511O283m956J4447M858j6788k827J2781j265K703J1606j6970
7286a0655j7563j3110P389J2056m47P259o604j3942J0083j546n552M266l45J1093
7272a7618Q110o378q493j6310J5679R890j939j1176J162j4453J168P008k0295
7259e3645J3965J1583r681J3883l808n150l648p558j9K541p225P682J3759j0656
7245c7977L418J1633j6036j2212o790J2441J3652j3466k351J8786J4455K054l652
7232a6045p331j503O056p757n324O707o682p003O069N931N809j022k1866k278
7218d6239P957O469m541K4820p672j366q812j4223M553K460J3275j3841j180j0442
$$ plain form
7204 -48782 -47830 -38295 -46447 -52258 -59202 -40542 -37911 -42428 -28991 -27486 -46032 -51845 -31127 -47240
7190 -47240 -25176 -5936 -7539 -16161 -45743 -33541 -42534 -43802 -30260 -38610 -54237 -43796 -48739
7177 -48739 -38898 -39918 -46781 -39438 -36311 -37237 -34946 -48148 -43411 -27178 -36477 -49173 -46109 -44717
7163 -44717 -51437 -51429 -47761 -55517 -47611 -40064 -34906 -40075 -23283 -39186 -20275 -11727 -26665 -33492
7149 -33492 -41157 -22950 -27529 -31448 -40123 -36198 -20548 -17628 -12338 -14523 -27207 -38049 -32528 -26243
7135 -26243 -21206 -12926 -6621 -22134 -26447 -17941 -21610 -21531 -10256 -15342 -17554 -15743 -5478 -19179
7121 -19179 -47944 -34098 -28156 -32219 -38876 -14748 -18252 -23101 -26244 -25876 -25145 -28574 -39970 -37666
7107 -37666 -26705 -14692 -21706 -15257 -21432 -16172 -34088 -27434 -16995 -20980 -22824 -15698 -7355 -11414
$$ packed form
7204d8782R52R535q152n811o944J8660K631m517J3437J505j8546n813K0718j6113
7190d7240K2064J9240j603q622k9582J2202q993j268J3542q350j5627J0441m943
7177d8739R841j020o863P343L127r26K291j3202M737J6233r299j2696L064J392
7163d4717o720QL668p756P906P547N158n169J6792j5903J8911Q548j4938o827
7149c3492p665J8207m579l919q675L925J5650K920N290k185j2684j0842N521O285
7135b6243N037Q280O305j5513m313Q506l669P9J1275n086k212J811J0265j3701
7121a9179k8765J3846N942m063o657K4128l504m849l143L68P31l429j1396K304
7107c7666J0961J2013p014O449o175N260j7916O654J0439l985j844P126Q343m059
$$ plain form
7093 -11414 -6558 -20332 -12786 -2138 -6738 -3520 -3731 -5190 -16034 -17639 -935 4792 -1131 -5825
7079 -5825 -3145 8257 -15900 -27359 -10157 -6451 -6670 7326 12534 833 -13192 -14137 -15591 -11071
7065 -11071 -28180 -18172 -26438 -14075 -12819 6437 18055 -17508 -29461 -25490 -20067 -27179 -21979
7052 -21979 -27824 -25208 -16252 -28483 -26307 -35036 -29860 -31064 -45929 -49760 -47152 -39538 -36785 -29581
7038 -29581 -37281 -29173 -34623 -31566 -19606 -21438 -26608 -30861 -54473 -49312 -42922 -49543 -39093 -33206
7024 -33206 -47371 -38221 -22730 -21329 -38023 -27321 -31438 -27646 -30559 -37689 -20481 -24771 -35455
7011 -35455 -36226 -44513 -41537 -39260 -36145 -38114 -48450 -43731 -37149 -42671 -18153 -19825 -34573 -28387
6997 -28387 -31396 -38456 -33107 -33564 -34272 -35713 -47180 -43517 -24564 -33367 -36013 -41188 -42578 -38338 -55843
$$ packed form
7093a1414M856j3774P546J0648m600L218k11j459j0844j605J6704N727n923m694
7079e825K680J1402k4157j1459J7202L706k19J3996N208j1701j4025r45j454M520
7065a1071j7109J0008q266J2363J256J9256J1618l5563j1953L971N423p112N200
7052b1979n845K616Q956j2231K176q729N176j204j4865l831K608P614K753P204
7038b9581p700Q108n450L057J1960j832n170m253k3612N161O390o621J0450N887
7024c3206j4165R150J5491J401j6694J0702m117L792k913p130J7208m290j0684
7011c5455p71q287K976K277L115j969j0336M719O582n522K4518j672j4748O186
6997b8387l009p060N349m57p08j441j1467L663J8953q803k646n175j390M240j7505
$$ plain form
6982 -55843 -52229 -32332 -42842 -52743 -53289 -47097 -46285 -50765 -54807 -44975 -43774 -35171 -55760 -59498
6968 -59498 -45704 -43264 -41869 -45687 -30278 -29769 -38404 -37478 -38373 -34560 -35955 -39754 -29111 -28894 -29640
6953 -29640 -9870 -7050 -24720 -36371 -35772 -27207 -38121 -34002 -38846 -25642 -16984 -32098 -34925
6940 -34925 -39151 -58152 -32263 -20134 -23556 -27648 -25473 -25413 -13825 -11690 -27631 -46900 -42905 -35063
6926 -35063 -24920 -14281 -6751 -10686 -9395 -33314 -22354 -9173 -30557 -25056 -6215 -13537 -42894
6913 -42894 -20558 -9852 -6049 -24910 -16589 -1658 -6882 -11309 -510 -8173 -6318 8035 4474
6900 4474 5114 2182 5671 -4305 -10322 -6721 -7618 1173 5944 2064 8275 11645 2626 -7795 -15284
6885 -15284 435 16462 18393 20230 12823 -497 -11899 -9409 14144 5890 6800 3495 1716 13107
$$ packed form
6982e5843L614J9897j0510r901n46O192Q12m480m042R832J201Q603k0589l738
6968e9498J3794K440J395l818J5409N09q635R26q95L813j395l799J0643K17p46
6953b9640J9770K820j7670j1651N99Q565j0914M119m844J3204Q658j5114k827
6940c4925m226j9001K5889J2129l422m092K175O0J1588K135j5941j9269L995P842
6926c5063J0143J0639P530l935J291k3919J0960J3181k1384N501J8841p322k9357
6913d2894K2336J0706L803j8861Q321J4931n224m427J0799p663J855J4353l561
6900D474O40k932L489r976o017L601q97Q791M771l880O211L370r019j0421p489
6885a5284J5719J6027J931J837p407j3320j1402K490K3553q254R10l305j779J1391
$$ plain form
6871 13107 6535 14052 -477 -97 14102 20378 3786 15416 19770 18450 4392 10120 14381 17979
6857 17979 5918 14358 24911 21822 12523 7945 22243 17400 37947 35103 55729 61707 61011 75644
6843 75644 73745 72620 75747 84739 73169 68254 76662 58775 46151 30136 21721 28654 31023 28205
6829 28205 16213 21151 24570 29197 33063 41026 32315 25470 19800 13531 24994 31993 27498 9927
6815 9927 10909 9762 9530 25203 30636 32884 38982 20905 13286 20259 16033 5306 6004 1536 4046
6800 4046 14774 7877 11105 24065 31934 23684 8617 11219 12464 -848 11480 10447 13411 25271
6786 25271 33542 41815 43888 45046 34915 27365 18036 20274 33109 28478 24375 27578 12432 9538
6772 9538 31068 19327 27368 42172 29732 26380 28624 45571 42729 49683 42719 36580 43030 43077
$$ packed form
6871A3107o572P517j4529L80J4199O276j6592J1630M354j320j4058N728M261L598
6857A7979j2061Q440J0553l089r299m578J4298m843K0547k844K0626N978o96J4633
6843G5644j899j125L127Q992j1570m915Q408j7887j2624j6015q415O933K369k818
6829B8205j1992M938L419M627L866P963q711o845n670o269J1463O999m495j7571
6815I927R82j147k32J5673N433K248O098j8077p619O973m226j0727O98m468K510
6800D046J0728o897L228J2960P869q250j5067K602J245j3312J2328j033K964J1860
6786B5271Q271Q273K073J158j0131p550r329K238J2835m631m103L203j5146k894
6772I538K1530j1741Q041J4804j2440l352K244J6947k842O954o964o139O450M7
$$ plain form
6758 43077 41204 37554 37197 53861 44813 57404 57544 44130 44653 54160 59159 48470 43276 52077
6744 52077 48914 29202 45871 40653 31637 36596 43488 33681 44398 56677 52877 67224 58050
6731 58050 64210 55226 65437 65444 41172 56227 65249 67129 76839 69506 69562 74170 72512 88415 89825
6716 89825 91285 101401 119822 128024 118647 128951 126488 137343 158673 165692 165483 172382 199430
6703 199430 201042 219113 223607 205333 217036 226426 195877 186904 184924 166051 166865 159003 142790
6690 142790 147939 149741 142463 144276 137982 137590 136952 156166 166745 160172 159264 147066 148818 130412
6676 130412 112110 111918 114135 113349 113416 112061 102283 104869 111617 104913 104427 104673 99853 110535 118211
6661 118211 127340 108714 108183 108585 97794 84912 84630 78608 98227 88085 88111 78767 63856 84487
$$ packed form
6758D3077j873l650l57J6664r048J2591J40j3414N23R507M999j0689n194Q801
6744E2077l163j9712J6669n218r016M959O892r807J0717J2279l800J4347r174
6731E8050O160q984J0211Pk4272J5055R022J880R710p333N6M608j658J5903J410
6716H9825J460J0116J8421Q202r377J0304k463J0855K1330P019k09O899K7048
6703A99430J612J8071M494j8274J1703R390l0549q973j980j8873Q14p862j6213
6690A42790N149J802p278J813o294l92o38J9214J0579o573r08j2198J752j8406
6676A30412j8302j92K217p86O7j355r778K586O748o704m86K46m820J0682P676
6661A18211R129j8626n31M02j0791j2882k82o022J9619j0142K6r344j4911K0631
$$ plain form
6647 84487 83115 91130 100020 107008 98986 99430 105842 96899 93126 105925 106003 104143 94156 83640 82935
6632 82935 81914 94971 113338 106681 102419 97053 79839 88934 117549 112058 109071 102122 112757
6619 112757 104061 100116 105826 117378 123568 121226 114699 106112 108553 119715 98497 101516 96526 99015
6605 99015 89143 85995 93801 112303 115967 112807 118431 127805 125814 107249 102619 108586 112963 121116
6591 121116 113029 107219 115590 120845 117279 129974 137398 113625 108759 102373 108630 116419 126053 110613
6577 110613 94796 107248 105958 109668 117852 111567 109295 121917 134726 114352 114314 127375 121801
6564 121801 113584 133006 127807 122154 131261 139315 136199 141532 141282 136790 129325 144035 144329 138532
6550 138532 132621 117436 130842 152430 155252 144823 149156 144754 144565 156425 167433 161270 161495
$$ packed form
6647H4487j372Q015Q890O988q022M44O412q943l773J2799P8j860r987j0516p05
6632H2935j021J3057J8367o657m262n366j7214R095K8615n491k987o949J0635
6619A12757q696l945N710J1552O190k342o527q587K441J1162k1218L019m990K489
6605I9015r872l148P806J8502L664l160N624R374j991j8565m630N967M377Q153
6591A21116q087n810Q371N255l566J2695P424k3773m866o386O257P789R634j5440
6577A10613j5817J2452j290L710Q184o285k272J2622J2809k0374l8J3061n574
6564A21801q217J9422n199n653R107Q054l116N333k50m492p465J4710K94n797
6550A38532n911j5185J3406K1588K822j0429M333m402j89J1860J1008o163K25
$$ plain form
6537 161495 160927 165129 166609 165769 160876 147308 158700 149364 168595 175386 182071 171916 177981 198902
6523 198902 212996 203050 213734 215055 205579 210726 189234 183659 203215 211290 227151 221887 223614
6510 223614 227307 234347 247687 238150 249067 281967 303365 313972 306364 300807 320005 323883 347384
6497 347384 327876 321639 350020 348785 332863 338799 343411 347430 348731 368894 387443 389091 422208
6484 422208 440843 457840 474002 472241 504283 526275 545866 582987 603153 614956 607979 578177
6472 578177 558627 548021 514535 468579 458805 471982 454493 424945 405489 399279 408241 401124
6460 401124 392159 384953 360110 332023 334923 356801 347509 308784 304912 323393 323033 328004 319543
6447 319543 322604 336310 330377 336715 325930 339316 362080 376818 368300 369795 363923 350143 333127
$$ packed form
6537A61495n68M202J480q40m893j3568J1392r336J9231O791O685j0155O065K0921
6523A98902J4094r946J0684J321r476N147k1492n575J9556Q075J5861n264J727
6510B23614L693P040J3340r537J0917L2900K1398J0607p608n557J9198L878K3501
6497C47384j9508o237K8381j235j5922N936M612M019J301K0163J8549J648L3117
6484D22208J8635J6997J6162j761L2042K1992J9591L7121K0166J1803o977k9802
6472E78177j9550j0606l3486m5956r774J3177j7489k9548j9456o210Q962p117
6460D01124q965p206k4843k8087K900K1878r292l8725l872J8481l60M971q461
6447C19543L061J3706n933O338j0785J3386K2764J4738q518J495n872j3780j7016
$$ plain form
6434 333127 315520 304999 273084 276878 267683 256658 254668 259305 267996 266050 254532 262093 270396
6421 270396 266960 272220 254553 244519 273272 252419 219190 223328 229185 236146 217286 210410 213503
6408 213503 234497 247532 251366 239770 234990 242741 251719 259954 263294 274802 268727 280033 283811
6395 283811 276760 286525 300624 321979 349548 346594 353684 375545 399453 418060 444732 440359 432677
6382 432677 439267 429632 427235 419107 422934 408609 387177 379342 384448 368258 380550 378370 394446
6369 394446 406690 404462 431582 440369 443667 458907 480300 499896 533917 564237 605324 648057
6357 648057 686446 722470 735159 747120 767249 778824 782385 774352 744418 743633 748231 741833 708854
6344 708854 679299 661337 635194 612103 607631 601354 590939 567818 570163 568545 578925 588362 605137
$$ packed form
6434C33127j7607j0521l1915L794r195j1025j990M637Q691j946j1518P561Q303
6421B70396l436N260j7667j0034K8753k0853l3229M138N857O961j8860o876L093
6408B13503K0994J3035L834j1596m780P751Q978Q235L340J1508o075J1306L778
6395B83811p051R765J4099K1355K7569k954P090K1861K3908J8607K6672m373p682
6382D32677O590r635k397q128L827j4325k1432p835N106j6190J2292k180J6076
6369C94446J2244k228K7120Q787L298J5240K1393J9596L4021L0320M1087M2733
6357F48057L8389L6024J2689J1961K0129J1575L561q033k9934p85M598o398l2979
6344G08854k9555j7962k6143k3091m472o277j0415k3121K345j618J0380R437J6775
$$ plain form
6331 605137 621465 641420 664573 694594 720972 715019 737878 768307 780942 781048 821710 833487
6319 833487 829340 828981 809112 791939 781815 765059 748447 700044 665848 617728 564567 541448
6307 541448 553064 538930 507771 499947 511408 497636 490388 486093 504475 512626 518771 539641 552236
6294 552236 548617 544049 534625 527752 538853 509034 511176 498545 461018 455564 454860 427184 405842
6281 405842 400269 380068 370710 359493 350444 344237 329937 325957 323733 321056 312237 301991 309040
6268 309040 307307 290977 284515 301971 299145 302374 298898 284086 290393 288880 280566 281880 269982
6255 269982 259273 268020 262065 260430 251845 258421 276362 266167 275198 263532 241443 231000 238396
6242 238396 249279 242918 235147 243749 239762 234721 243070 235078 235533 238266 241598 249134 241867 233775
$$ packed form
6331F05137J6328J9955K3153L0021K6378n953K2859L0429J2635J06M0662J1777
6319H33487m147l59j9869j7173j0124j6756j6612m8403l4196m8120n3161k3119
6307E41448J1616j4134l1159p824J1461j3772p248m295J8382Q151O145K0870J2595
6294E52236l619m568r424o873J1101k9819K142j2631l7527n454p04k7676k1342
6281D05842n573k0201r358j1217r049o207j4300l980k224k677q819j0246P049
6268C09040j733j6330o462J7456k826L229l476j4812O307j513q314J314j1898
6255B69982j0709Q747n955j635q585O576J7941j0195R031j1666k2089j0443P396
6242B38396J0883o361p771Q602l987n041Q349p992M55K733L332P536p267q092
$$ plain form
6228 233775 228778 227757 217337 218144 220655 224744 230814 227296 223674 219650 221058 225972 216590 214569
6214 214569 228292 220566 224380 237382 225825 225486 238604 207967 208206 225210 235127 253476 261508
6201 261508 237326 226715 236920 256059 253708 252573 261460 252342 240604 247691 230288 226309 228923
6188 228923 221120 235057 229212 211958 228571 211390 204117 195695 197152 211875 210981 225167 211546
6175 211546 232139 236465 234296 245659 234654 234142 237132 245022 261387 270783 281281 299033 294352
6162 294352 293659 278942 270314 258638 248554 245294 249926 236694 233661 230165 216992 228737 212622
6149 212622 204696 212226 210464 199568 203110 209095 204091 190633 201690 212491 209675 211772 190026
6136 190026 194201 198200 200351 223951 219364 206488 203550 214137 228554 228338 223576 228222 237521 257584
$$ packed form
6228B33775m997j021j0420Q07K511M089O070l518l622m024J408M914r382k021
6214B14569J3723p726L814J3002j1557l39J3118l0637K39J7004R917J8349Q032
6201B61508k4182j0611J0205J9139k351j135Q887r118j1738P087j7403l979K614
6188B28923p803J3937n845j7254J6613j7181p273q422J457J4723q94J4186j3621
6175B11546K0593M326k169J1363j1005n12K990P890J6365R396J0498J7752m681
6162B94352o93j4717q628j1676j0084l260M632j3232l033l496j3173J1745j6115
6149B12622p926P530j762j0896L542N985n004j3458J1057J0801k816K097k1746
6136A90026M175L999K151K3600m587j2876k938J0587J4417k16m762M646R299K0063
$$ plain form
6122 257584 271626 262553 246839 255532 269491 274051 270804 255016 245211 241334 247833 260209 245952
6109 245952 241495 255573 248667 242761 245605 241307 238557 237184 234016 237153 227200 220994 233709 251737
6095 251737 251451 243683 254711 256051 265994 278267 295891 315042 336338 351160 337228 331353 320289
6082 320289 304619 288268 276109 281458 268316 258382 253290 262334 267846 276170 271065 263846 255857
6069 255857 248814 247909 235532 260786 274373 264754 276742 284823 268885 267194 282430 290196 294485
6056 294485 309496 327794 342180 356674 392705 415030 441253 471846 506817 538717 542339 537785
6044 537785 509627 482806 442717 410443 390625 371655 366441 349715 333329 321403 310534 301935
6032 301935 293718 283829 277021 283150 277970 276371 270700 278717 280211 275109 264988 259539 266415 288258
$$ packed form
6122B57584J4042r073j5714Q693J3959M560l247j5788r805l877O499J2376j4257
6109B45952m457J4078o906n906K844m298k750j373l168L137r953o206J2715J8028
6095B51737k86p768J1028J340R943J2273J7624J9151K1296J4822j3932n875j1064
6082C20289j5670j6351j2159N349j3142r934n092R044N512Q324n105p219p989
6069B55857p043r05j2377K5254J3587r619J1988Q081j5938j691J5236P766M289
6056B94485J5011J8298J4386J4494L6031K2325K6223L0593L4971L1900L622m554
6044E37785k8158k6821m0089l2274j9818j8970n214j6726j6386j1926j0869q599
6032C01935q217r889o808O129n180j599n671Q017J494n102j0121n449O876K1843
$$ plain form
6018 288258 287787 278433 297266 315398 307496 309896 316634 344863 374493 405757 401780 388572 403417
6005 403417 390667 355114 329997 294050 285030 281434 292628 296815 295190 286491 275865 267540 260702
5992 260702 259320 260852 250671 246658 257380 243118 259105 255237 250862 269038 267046 256966 267123
5979 267123 259558 251855 250004 252519 249738 244274 250941 243727 223762 238233 242652 240767 248387 242489
5965 242489 221418 247510 257158 241580 238566 240857 252933 248724 245337 245178 241642 242881 238132 237957
5951 237957 242528 244633 240275 247751 236104 221492 226346 228815 239945 246289 261727 261852 243381
5938 243381 241483 239235 245859 231764 239325 247111 251744 236712 224213 223221 241894 236924 236136 244442
5924 244442 254797 254277 234615 221752 236630 228689 226663 230442 223771 228211 226312 230429 229420 216577
$$ packed form
6018B88258m71r354J8833J8132p902K400O738K8229K9630L1264l977j3208J4845
6005D03417j2750l5553k5117l5947r020l596J1194M187j625q699j0626q325o838
5992B60702j382J532j0181m013J0722j4262J5987l868m375J8176j992j0080J0157
5979B67123p565p703j851K515k781n464O667p214j9965J4471M419j885P620n898
5965B42489k1071K6092R648j5578l014K291J2076m209l387j59l536J239m749j75
5951B37957M571K105m358P476j1647j4612M854K469J1130O344J5438J25j8471
5938B43381j898k248O624j4095P561P786M633j5032j2499r92J8673m970p88Q306
5924B44442J0355n20j9662j2863J4878p941k026L779o671M440j899M117j009j2843
$$ plain form
5910 216577 206938 224471 249875 239069 243491 244591 240505 227119 240102 244780 234098 252227 263836
5897 263836 266220 262186 256884 261275 265344 267540 277545 266268 265124 264333 278253 286579 294964 272721
5883 272721 291194 295610 279231 279977 286536 292800 292301 290060 295484 292019 299902 312608 318075 340835
5869 340835 360192 367407 387865 404243 436237 450163 463395 428307 417679 406578 371745 362128
5857 362128 347165 331239 334583 340039 345672 339985 329319 330261 340818 345427 357106 359779 360275 377269
5843 377269 387201 399899 416517 443776 459823 470819 463504 456838 438840 413402 401420 399067
5831 399067 383790 383530 395440 409402 428349 433083 453861 462276 449327 430231 413833 399542
5819 399542 385465 372241 374154 359708 348166 354728 351236 351147 335935 343925 332140 335145 356765
$$ packed form
5910B16577r639J7533K5404j0806M422J100m086j3386J2983M678j0682J8129J1609
5897B63836K384m034n302M391M069K196J0005j1277j144p91J3920Q326Q385k2243
5883B72721J8473M416j6379P46O559O264m99k241N424l465P883J2706N467K2760
5869C40835J9357P215K0458J6378L1994J3926J3232l5088j0628j1101l4833r617
5857C62128j4963j5926L344N456N633n687j0666R42J0557M609J1679K673M96J6994
5843C77269R932J2698J6618K7259J6047J0996p315o666j7998k5438j1982k353
5831C99067j5277k60J1910J3962J8947M734K0778Q415j2949j9096j6398j4291
5819C99542j4077j3224J913j4446j1542O562l492q9j5212P990j1785L005K1620
$$ plain form
5806 356765 355998 355149 348987 340797 353960 374596 409124 418129 410205 405495 406313 403103 381173 375955
5792 375955 354732 344928 347609 342093 337164 346681 365547 370156 347954 337361 344909 342906 339146
5779 339146 317742 306049 320578 308446 292317 298760 304982 307404 324121 317214 322157 321590 323483
5766 323483 337898 341906 340852 340269 343249 331067 333570 335905 366791 362912 351919 382242 377790
5753 377790 373183 384217 378602 375657 393567 399637 396104 390314 388656 391550 401645 422717 411312
5740 411312 402324 417156 422212 421943 430566 437544 432910 427738 425306 438032 439398 444793 447279 439552
5726 439552 425038 426628 436292 421494 437230 436239 458944 467293 469634 478156 472879 472557 508716 505903
5712 505903 506727 531882 537569 567289 584382 585105 590928 572193 561604 560470 546308 528801 499076
$$ packed form
5806C56765p67q49o162q190J3163K0636L4528R005p924m710Q18l210k1930n218
5792C75955k1223r804K681n516m929R517J8866M609k2202j0593P548k003l760
5779C39146k1404j1693J4529j2132j6129O443O222K422J6717o907M943n67J893
5766C23483J4415M008j054n83K980j2182K503K335L0886l879j0993L0323m452
5753C77790m607J1034n615k945J7910O070l533n790j658K894J0095K1072j1405
5740D11312q988J4832N056k69Q623O978m634n172k432J2726J366N395K486p727
5726D39552j4514J590R664j4798J5736r91K2705Q349K341Q522n277l22L6159k813
5712E05903Q24K5155N687K9720J7093P23N823j8735j0589j134j4162j7507k9725
$$ plain form
5699 499076 513014 519604 500873 492324 485718 482056 484632 481098 490490 503032 510883 522680 543044
5686 543044 559330 567962 582469 581743 578380 565118 557542 536772 527248 509501 497048 488666 472223
5673 472223 470793 461536 456810 477628 462690 454653 467604 478835 472751 468895 479117 485847 486134
5660 486134 479195 481260 468361 454703 463534 472949 482686 489197 488124 479628 478031 485864 488172 480897
5646 480897 469791 475098 459562 466933 462807 458975 459921 480049 475394 474486 469814 455096 465852 470685
5632 470685 465473 461404 477997 477519 467041 478757 490366 497141 489267 484207 495373 497295 462589
5619 462589 466071 466460 454111 453676 451521 443643 440862 438197 436507 446531 430878 429147 416436 423200
5605 423200 437370 445747 445796 442299 443618 438504 444776 440778 438563 449501 450585 443827 457794 453685
$$ packed form
5699D99076J3938O590j8731q549o606l662K576l534R392J2542P851J1797K0364
5686E43044J6286Q632J4507p26l363j3262p576k0770r524j7747j2453q382j6443
5673D72223j430r257m726K0818j4938q037J2951J1231o084l856J0222O730K87
5660D86134o939K065j2899j3658Q831R415R737O511j073q496j597P833K308p275
5646D80897j1106N307j5536P371m126l832R46K0128m655r08m672j4718J0756M833
5632D70685n212m069J6593m78j0478J1716J1609O775p874n060J1166J922l4706
5619D62589L482L89j2349m35k155p878k781k665j690J0024j5653j731j2711O764
5605D23200J4170Q377M9l497J319n114O272l998k215J0938J084o758J3967m109
$$ plain form
5591 453685 448939 452615 460625 437628 444753 439051 425047 432696 446697 453080 449822 459867 456663
5578 456663 457820 453170 444371 457661 448885 435249 459048 444471 449543 455077 459181 457928 460402
5565 460402 464210 461484 467277 466745 465131 457191 452342 437889 433996 440216 440469 444983 432703 422698
5551 422698 424868 422817 413917 414417 413660 415911 417533 420840 413182 409347 420378 412684 415481 410464 431043
5536 431043 405623 400707 416473 435824 443138 434676 452132 455322 469740 469178 477436 472455 469616
5523 469616 478928 487360 499307 507869 508896 512814 508361 514214 525842 534541 537062 530343 535330 532916
5509 532916 524664 508436 498248 514692 503109 492398 502416 498079 497844 509752 523086 533931
5497 533931 535037 530415 527796 535143 542232 541242 535114 541427 546788 554536 547868 535735 532171 513346
$$ packed form
5591D53685m746L676Q010k2997P125n702j4004P649J4001O383l258J0045l204
5578D56663J157m650q799J3290q776j3636K3799j4577N072N534M104j253K474
5565D60402L808k726N793n32j614p940m849j4453l893O220K53M514j2280j0005
5551D22698K170k051q900N00p57K251J622L307p658l835J1031p694K797n017K0579
5536D31043k5420m916J5766J9351P314q462J7456L190J4418n62Q258m981k839
5523D69616R312Q432J1947Q562J027L918m453N853J1628Q699K521o719M987k414
5509E32916q252j6228j0188J6444j1583j0711J0018m337k35J1908J3334J0845
5497E33931J106m622k619P347P089r90o128O313N361P748o668j2133l564j8825
$$ plain form
5483 513346 500774 486261 470124 482524 475649 459175 468518 459638 455096 456217 464045 455297 448802
5470 448802 460529 447949 452207 460630 459752 445476 445537 451152 447079 445448 442693 437385 455207 457024
5456 457024 444619 441710 454046 462906 455078 456996 440399 429958 451651 462132 455242 457403 476169
5443 476169 486214 479362 479655 486124 481730 482039 476978 493880 510296 497318 500101 475995 458009
5430 458009 471315 493287 486805 485092 494490 495710 502079 516818 518228 521152 529055 532911 545025
5417 545025 536051 529732 545160 561277 560291 576645 588546 606754 606372 594949 607978 600978 580497
5404 580497 571245 575715 586564 585623 591148 597903 598125 602827 617301 623473 613830 626284 644744 659783
5390 659783 665884 661851 658208 642971 641055 643385 623952 634731 646726 642424 644438 636812 643125
$$ packed form
5483E13346j2572j4513j6137J2400o875j6474R343q880m542J121P828q748o495
5470D48802J1727j2580M258Q423q78j4276O1N615m073j631k755n308J7822J817
5456D57024j2405k909J2336Q860p828J918j6597j0441K1693J0481o890K161J8766
5443D76169J0045o852K93O469m394L09n061J6902J6416j2978K783k4106j7986
5430D58009J3306K1972o482j713R398J220O369J4739J410K924P903L856J2114
5417E45025q974o319J5428J6117r86J6354J1901J8208l82j1423J3029p000k0481
5404E80497r252M470J0849r41N525O755K22M702J4474O172r643J2454J8460J5039
5390F59783O101m033l643j5237j916K330j9433J0779J1995m302K014p626O313
$$ plain form
5377 643125 642262 646705 645208 656957 682216 662115 668206 688379 695390 708795 708587 708064 719499 736149
5363 736149 746693 757792 747792 763106 800154 819903 847181 891217 941130 975691 1004060 1034142
5351 1034142 1050907 1031131 1014328 1004425 985868 974059 995214 967796 973589 1003362 1013783 1025663
5339 1025663 1035296 1064637 1084026 1110836 1143104 1170366 1201505 1212002 1204287 1163680 1153004 1157833
5327 1157833 1147595 1150349 1164352 1193007 1193573 1176931 1145963 1089825 1056537 1032721 1008050 1005023
5315 1005023 1026238 1018450 1007648 997197 1003943 1029496 1063018 1088113 1096404 1117054 1103406 1081564
5303 1081564 1048439 1016833 975579 955976 940917 930554 934330 907984 896192 900480 915577 915946
5291 915946 923449 932291 959868 968746 978482 970191 964228 969799 963787 967699 967323 962262 945276 960760
$$ packed form
5377F43125q63M443j497J1749K5259k0101O091K0173P011J3405k08n23J1435J6650
5363G36149J0544J1099j0000J5314L7048J9749K7278M4036M9913L4561K8369L0082
5351A034142J6765j9776j6803r903j8557j1809K1155k7418N793K9773J0421J1880
5339A025663R633K9341J9389K6810L2268K7262L1139J0497p715m0607j0676M829
5327A157833j0238K754J4003K8655N66j6642l0968n6138l3288k3816k4671l027
5315A005023K1215p788j0802j0451O746K5553L3522K5095Q291K0650j3648k1842
5303A081564l3125l1606m1254j9603j5059j0363L776k6346j1792M288J5097L69
5291I15946P503Q842K7577Q878R736q291n963N571o012L912l76n061j6986J5484
$$ plain form
5277 960760 954601 949480 966728 968477 989247 996280 1000432 1007130 1014765 1002123 997786 987558 971254
5264 971254 953214 935524 927769 932725 932588 905466 916157 928661 921357 928819 936216 926320 943614
5251 943614 955552 961407 954321 959032 941726 941081 919667 914773 932104 926459 925360 935089 928435 916116
5237 916116 922361 923401 914132 900673 899179 892712 903866 917481 912672 913543 900955 910626 924834
5224 924834 957396 963390 959993 973532 967392 979822 995812 1000440 981874 971683 987203 1004826
5212 1004826 1025491 1022647 1037236 1033584 1035802 1044959 1065541 1073053 1074667 1073637 1071740 1088788 1111457
5199 1111457 1117951 1119603 1113950 1134074 1152402 1152710 1159064 1161315 1171405 1197602 1220614 1235947 1253611
5186 1253611 1282201 1290560 1301415 1308091 1286355 1278580 1297252 1310351 1328434 1347130 1362454 1375113
$$ packed form
5277I60760o159n121J7248J749K0770P033M152O698P635j2642m337j0228j6304
5264I71254j8040j7690p755M956j37k7122J0691J2504p304P462P397r896J7294
5251I43614J1938N855p086M711j7306o45k1414m894J7331n645j099R729o654j2319
5237I16116O245J040r269j3459j494o467J1154J3615m809Q71j2588R671J4208
5224I24834L2562N994l397J3539o140J2430J5990M628j8566j0191J5520J7623
5212A004826K0665k844J4589l652K218R157K0582P512J614j030j897J7048K2669
5199A111457O494J652n653K0124J8328L08O354K251J0090K6197K3012J5333J7664
5186A253611K8590Q359J0855O676k1736p775J8672J3099J8083J8696J5324J2659
$$ plain form
5174 1375113 1390850 1417926 1445584 1471799 1483855 1527239 1550950 1547295 1570210 1600900 1638091 1680517
5162 1680517 1709810 1743157 1772043 1808439 1849909 1904096 1950085 1986113 2014822 2063438 2076279
5151 2076279 2104108 2152132 2191867 2222313 2244130 2268830 2306279 2283724 2232982 2196549 2156983
5140 2156983 2110264 2045888 1983505 1918310 1880677 1851242 1828723 1795272 1786147 1758281 1721004 1715832
5128 1715832 1670588 1651308 1651818 1636492 1610893 1622443 1622971 1626013 1596397 1559578 1541336 1535055 1516959
5115 1516959 1479242 1465636 1474932 1451200 1411702 1427752 1432299 1406012 1425572 1418469 1404237 1400259
5103 1400259 1392042 1364664 1359487 1345179 1334232 1316865 1310600 1309539 1290841 1285315 1292257 1301384 1291766
5090 1291766 1275849 1260275 1265419 1286100 1287066 1289787 1303416 1305489 1295450 1254217 1240758 1216839
$$ packed form
5174A375113J5737K7076K7658K6215J2056M3384K3711l655K2915L0690L7191M2426
5162A680517K9293L3347K8886L6396M1470N4187M5989L6028K8709M8616J2841
5151B076279K7829M8024L9735L0446K1817K4700L7449k2555n0742l6433l9566
5140B156983m6719o4376o2383o5195l7633k9435k2519l3451r125k7866l7277n172
5128A715832m5244j9280N10j5326k5599J1550N28L042k9616l6819j8242o281j8096
5115A516959l7717j3606R296k3732l9498J6050M547k6287J9560p103j4232l978
5103A400259q217k7378n177j4308j0947j7367o265j061j8698n526O942R127r618
5090A291766j5917j5574N144K0681R66K721J3629K073j0039m1233j3459k3919
$$ plain form
5078 1216839 1199197 1208150 1199028 1193046 1180330 1172645 1168184 1165620 1158674 1137373 1150325 1148276 1151013
5065 1151013 1164395 1155851 1169132 1173926 1169285 1171085 1166345 1172300 1172433 1152840 1151556 1158788 1160806 1164575
5051 1164575 1153138 1166614 1194874 1200789 1184997 1185086 1189374 1167041 1176330 1188517 1194908 1204345 1202757
5038 1202757 1198659 1192175 1227311 1235850 1202890 1186217 1183041 1172524 1175081 1197241 1203496 1214989 1220985
5025 1220985 1206433 1194989 1169597 1155016 1145673 1142219 1121749 1119865 1102273 1088275 1093356 1080617
5013 1080617 1068795 1071066 1074247 1075442 1087399 1101128 1097895 1079193 1084430 1079408 1073209 1087631 1080789
5000 1080789 1101473 1099080 1121745 1130246 1133714 1129074 1135706 1153659 1153580 1157988 1161783 1174335 1196011
4987 1196011 1194726 1213256 1221187 1240585 1268424 1283561 1312977 1350908 1391447 1438869 1457041 1487930
$$ packed form
5078A216839j7642Q953r122n982j2716p685m461k564o946k1301J2952k049K737
5065A151013J3382q544J3281M794m641J800m740N955J33j9593j284P232K018L769
5051A164575j1437J3476K8260N915j5792Q9M288k2333R289J2187O391R437j588
5038A202757m098o484L5136Q539l2960j6673l176j0517K557K2160O255J1493N996
5025A220985j4552j1444k5392j4581r343l454k0470j884j7592j3998N081j2739
5013A080617j1822K271L181J195J1957J3729l233j8702N237n022o199J4422o842
5000A080789K0684k393K2665Q501L468m640O632J7953p9M408L795J2552K1676
4987A196011j285J8530P931J9398K7839J5137K9416L7931M0539M7422J8172L0889
$$ plain form
4975 1487930 1520256 1543764 1555495 1531475 1512752 1506547 1488950 1481667 1479071 1468543 1483041 1484962
4963 1484962 1499054 1533047 1537347 1584010 1631124 1656108 1678335 1687948 1689110 1675589 1673374 1678145
4951 1678145 1692012 1712787 1715157 1690507 1682921 1678223 1674857 1680523 1685550 1696778 1741212 1774817 1807384
4938 1807384 1854127 1897921 1937897 1976750 1999778 2010867 2019578 2008455 2008821 2022671 2045243 2075349
4926 2075349 2129178 2183208 2238154 2288063 2330930 2377931 2442291 2504632 2532693 2565510 2576743
4915 2576743 2592656 2609906 2646863 2665217 2648220 2605711 2579738 2554873 2528435 2505596 2504094 2516747
4903 2516747 2542900 2606387 2644795 2673177 2703256 2720938 2733262 2714775 2704101 2684543 2675239 2668824
4891 2668824 2652762 2648663 2642266 2578795 2522169 2481881 2473815 2445834 2435888 2455849 2500841 2529542
$$ packed form
4975A487930L2326K3508J1731k4020j8723o205j7597p283k596j0528J4498J921
4963A484962J4092L3993M300M6663M7114K4984K2227R613J162j3521k215M771
4951A678145J3867K0775K370k4650p586m698l366N666N027J1228M4434L3605L2567
4938A807384M6743M3794L9976L8853K3028J1089Q711j1123L66J3850K2572L0106
4926B075349N3829N4030N4946M9909M2867M7001O4360O2341K8061L2817J1233
4915B576743J5913J7250L6957J8354j6997m2509k5973k4865k6438k2839j502J2653
4903B516747K6153O3487L8408K8382L0079J7682J2324j8487j0674j9558r304o415
4891B668824j6062m099o397o3471n6626m0288q066k7981r946J9961M4992K8701
$$ plain form
4879 2529542 2591758 2647227 2708789 2748045 2807992 2862110 2889607 2866479 2838229 2811525 2789500
4868 2789500 2780324 2764219 2746054 2726413 2704388 2699617 2712127 2700127 2711769 2730700 2726088 2755063
4856 2755063 2772796 2810591 2851538 2900507 2983569 3035363 3076879 3105491 3147501 3181444 3241323
4845 3241323 3344621 3444970 3555741 3693607 3871467 4098668 4359275 4645316 4933542 5221906
4835 5221906 5405213 5437368 5292509 5003613 4648507 4296582 4039264 3873924 3738867 3632187
4825 3632187 3540424 3481228 3423956 3350789 3305781 3272005 3214429 3165283 3125896 3064788 3035590
4814 3035590 3008708 2973435 2936049 2894556 2875606 2846831 2815344 2802450 2794878 2784722 2776008 2788608
4802 2788608 2824004 2814044 2831275 2852446 2875326 2895739 2921976 2920588 2934413 2957524 2992556 3013810
$$ packed form
4879B529542O2216N5469O1562L9256N9947N4118K7497k3128k8250k6704k2025
4868B789500r176j6105j8165j9641k2025m771J2510j2000J1642J8931m612K8975
4856B755063J7733L7795M0947M8969Q3062N1794M1516K8612M2010L3943N9879
4845C241323J03298J00349J10771J37866J77860K27201K60607K86041K88226K88364
4835E221906J83307L2155j44859k88896l55106l51925k57318j65340j35057j06680
4825C632187r1763n9196n7272p3167m5008l3776n7576m9146l9387o1108k9198
4814C035590k6882l5273l7386m1493j8950k8775l1487j2894p572j0156q714J2600
4802B788608L5396r960J7231K1171K2880K0413K6237j388J3825K3111L5032K1254
$$ plain form
4790 3013810 3035766 3034856 3022900 3002052 3007513 3008114 3008089 2995234 2996256 3001145 3005570 3009205 3033113 3040571
4776 3040571 3052771 3069639 3088219 3113855 3153521 3176866 3195077 3224397 3271681 3306260 3332358
4765 3332358 3379274 3437792 3483506 3548055 3612182 3704466 3781896 3843936 3925669 4014708 4068973
4754 4068973 4101841 4151684 4202164 4273945 4391946 4509442 4634944 4775175 4971173 5210591
4744 5210591 5459076 5765992 6080239 6373967 6751393 7061285 7174121 7155951 7027952 6796913
4734 6796913 6480125 6166420 5932898 5783559 5684688 5594655 5531286 5517395 5494246 5459935 5434500
4723 5434500 5432804 5371877 5332403 5269217 5185091 5108077 5062240 5056467 5075072 5138652 5205606 5271101
4711 5271101 5324457 5357967 5380321 5385931 5393057 5408117 5439914 5498008 5556950 5617215 5675289 5720364
$$ packed form
4790C013810K1956r10j1956k0848N461O01k5j2855J022M889M425L635K3908P458
4776C040571J2200J6868J8580K5636L9666K3345J8211K9320M7284L4579K6098
4765C332358M6916N8518M5714O4549O4127R2284P7430O2040Q1733Q9039N4265
4754D068973L2868M9843N0480P1781J18001J17496J25502J40231J95998K39418
4744E210591K48485L06916L14247K93728L77426L09892J12836j8170j27999k31039
4734F796913l16788l13705k33522j49339r8871r0033o3369j3891k3149l4311k5435
4723E434500j696o0927l9474o3186q4126p7014m5837n773J8605O3580O6954O5495
4711E271101N3356L3510K2354N610P126J5060L1797N8094N8942O0265N8074M5075
$$ plain form
4699 5720364 5737751 5722297 5679815 5622436 5565910 5521321 5438013 5368482 5317761 5291174 5276071
4688 5276071 5286866 5321547 5336298 5392213 5439559 5509681 5591219 5696822 5799652 5924448 5991932
4677 5991932 6039801 6072685 6129812 6134615 6120006 6084906 6064948 6070089 6106123 6143293 6220473 6297092
4665 6297092 6378781 6460855 6548562 6622861 6688912 6717077 6737474 6733567 6713123 6707415 6695671 6659267
4653 6659267 6628632 6611663 6597400 6593047 6595919 6609796 6629056 6626515 6636546 6651756 6652905 6652343 6651724
4640 6651724 6652147 6677324 6691563 6720676 6778404 6848317 6948541 7112946 7304864 7501833 7681900
4629 7681900 7859505 7981169 8053461 8051637 8072570 8085236 8135186 8222682 8364412 8544174 8751841
4618 8751841 8934690 9094742 9228723 9358775 9452177 9584494 9719535 9885008 10062952 10251293
$$ packed form
4699E720364J7387j5454m2482n7379n6526m4589q3308o9531n0721k6587j5103
4688E276071J0795L4681J4751N5915M7346P0122Q1538J05603J02830J24796O7484
4677E991932M7869L2884N7127M803j4609l5100j9958N141L6034L7170P7180P6619
4665F297092Q1689Q2074Q7707P4299O6051K8165K0397l907k0444n708j1744l6404
4653F659267l0635j6969j4263m353K872J3877J9260k541J0031J5210J149n62o19
4640F651724M23K5177J4239K9113N7728O9913J00224J64405J91918J96969J80067
4629G681900J77605J21664P2292j824K0933J2666M9950Q7496J41730J79762K07667
4618H751841J82849J60052J33981J30052R3402J32317J35041J65473J77944J88341
$$ plain form
4608 10251293 10464035 10694695 10941710 11193499 11472395 11769138 12110430 12500987 12966681
4599 12966681 13453169 13921864 14367113 14801829 15202945 15615009 16073671 16591412 17107566
4590 17107566 17654813 18198472 18744234 19285927 19851645 20392831 20950821 21494257 22025993
4581 22025993 22557223 23115732 23637809 24131615 24633176 25121736 25557668 26011881 26448496
4572 26448496 26937660 27465222 28058904 28669649 29397192 30204833 31108577 32087472 33177696
4563 33177696 34336017 35644196 37048364 38580923 40192206 41875999 43530760 45187601
4555 45187601 46773249 48407739 50102732 52018395 54194012 56750163 59667951 62994931
4547 62994931 66682353 70787865 75224698 80143059 85544413 91688605 98773190 107237384
$$ packed form
4608A0251293K12742K30660K47015K51789K78896K96743L41292L90557M65694
4599A2966681M86488M68695M45249M34716M01116M12064M58662N17741N16154
4590A7107566N47247N43659N45762N41693N65718N41186N57990N43436N31736
4581B2025993N31230N58509N22077M93806N01561M88560M35932M54213M36615
4572B6448496M89164N27562N93682O10745P27543Q07641R03744R78895J090224
4563C3177696J158321J308179J404168J532559J611283J683793J654761J656841
4555D5187601J585648J634490J694993J915663K175617K556151K917788L326980
4547F2994931L687422M105512M436833M918361N401354O144192P084585Q464194
$$ plain form
4539 107237384 117310584 129285496 143213598 159219265 177092735 197041887 219544615
4532 219544615 245853945 277534608 316028966 362464765 411014954 457341538 504972601
4525 504972601 536960792 545492032 527774643 481607750 418617988 350808894 294982893
4518 294982893 252096243 219103060 193251444 172307239 154632190 139729649 126968309
4511 126968309 116218479 107237450 99691045 93024259 87182524 82020201 77604328 74049590
4503 74049590 71240094 69006632 67150407 65456638 63816831 62205632 60627731 59047855
4495 59047855 57499469 56070333 54856894 53903154 53176708 52636283 52254616 51970815 51710156
4486 51710156 51402927 51012466 50616156 50225844 49858175 49583343 49371328 49108341 48818135
$$ packed form
4539A07237384J0073200J1974912J3928102J6005667J7873470J9949152K2502728
4532B19544615K6309330L1680663L8494358M6435799M8550189M6326584M7631063
4525E04972601L1988191Q531240j7717389m6166893o2989762o7809094n5826001
4518B94982893m2886650l2993183k5851616k0944205j7675049j4902541j2761340
4511A26968309j0749830q981029p546405o666786n841735n162323m415873l554738
4503G4049590k809496k233462j856225j693769j639807j611199j577901j579876
4495E9047855j548386j429136j213439r53740p26446n40425l81667k83801k60659
4486E1710156l07229l90461l96310l90312l67669k74832k12015k62987k90206
$$ plain form
4477 48818135 48548678 48324246 47947149 47286131 46448190 45660697 45031753 44629772 44370726
4468 44370726 44305420 44417318 44719368 45216774 45903304 46748862 47763762 48902312 50104773
4459 50104773 51332226 52583232 53822055 55111159 56446829 57970762 59720651 61846668
4451 61846668 64308490 67186760 70474810 74195422 78285887 82822668 87848158 93617008
4443 93617008 100286220 108110992 117355624 128273574 141023485 155634080 172116598 190848497
4435 190848497 212467397 238435584 269647600 307271308 350077050 389665780 430913122
4428 430913122 477364975 505059372 505899876 491253007 463689526 419381934 360150015
4421 360150015 304150381 260521932 225752709 198405898 176301608 157964419 142615057
$$ packed form
4477D8818135k69457k24432l77097o61018q37941p87493o28944m01981k59046
4468D4370726o5306J11898L02050M97406O86530Q45558J014900J138550J202461
4459E0104773J227453J251006J238823J289104J335670J523933J749889K126017
4451F1846668K461822K878270L288050L720612M090465M536781N025490N768850
4443I3617008O669212P824772R244632J0917950J2749911J4610595J6482518J8731899
4435A90848497K1618900K5968187L1212016L7623708M2805742L9588730M1247342
4428D30913122M6451853K7694397Q40504j4646869k7563481m4307592n9231919
4421C60150015n5999634m3628449l4769223k7346811k2104290j8337189j5349362
$$ plain form
4414 142615057 129720464 118725414 109517658 101593655 94630101 88476186 83044420 78189828
4406 78189828 74008786 70446767 67409476 64779756 62433061 60194518 57998737 55839203
4398 55839203 53740290 51758923 49884616 48134862 46597413 45251985 44072898 43035271
4390 43035271 42117031 41234954 40324406 39329648 38327649 37322710 36272139 35226457 34208123
4381 34208123 33198729 32215769 31278585 30376703 29479542 28621773 27831392 27062808 26324112
4372 26324112 25648933 25045822 24534243 24087962 23673638 23319387 23020891 22686960 22332445
4363 22332445 21979695 21617895 21267385 20897415 20533283 20202622 19866232 19511613 19150234
4354 19150234 18792341 18487450 18205468 17916056 17667318 17452810 17250669 17036939 16740245
$$ packed form
4414A42615057j2894593j0995050r207756p924003o963554o153915n431766m854592
4406G8189828m181042l562019l037291k629720k346695k238543k195781k159534
4398E5839203k098913j981367j874307j749754j537449j345428j179087j037627
4390D3035271r18240q82077r10548r94758j001999j004939j050571j045682j018334
4381C4208123j009394r82960r37184r01882q97161q57769p90381p68584p38696
4372B6324112o75179o03111n11579m46281m14324l54251k98496l33931l54515
4363B2332445l52750l61800l50510l69970l64132l30661l36390l54619l61379
4354A9150234l57893l04891k81982k89412k48738k14508k02141k13730k96694
$$ plain form
4345 16740245 16435815 16138751 15811095 15409713 15009416 14632114 14307877 13968232 13679344
4336 13679344 13453725 13260565 13108688 12960289 12782200 12617886 12446579 12249153 12016524
4327 12016524 11772961 11514783 11273070 10978954 10701323 10461747 10233646 10050825 9915019
4318 9915019 9807502 9740392 9655444 9583654 9498758 9358260 9188122 9012063 8824634 8632286
4308 8632286 8453336 8290476 8154043 8033502 7903235 7784391 7686114 7575024 7445179 7325273
4298 7325273 7187073 7018306 6857655 6737720 6585888 6467680 6341949 6216381 6102554 6003560
4288 6003560 5910550 5839532 5790855 5710246 5658506 5607113 5527758 5447957 5362020 5303389 5234255
4277 5234255 5147181 5072431 5015075 4963010 4904002 4878762 4877641 4899056 4946775 4998904 5052402 5091986
$$ packed form
4345A6740245l04430k97064l27656m01382m00297l77302l24237l39645k88888
4336A3679344k25619j93160j51877j48399j78089j64314j71307j97426k32629
4327A2016524k43563k58178k41713k94116k77631k39576k28101j82821j35806
4318I915019j07517o7110q4948p1790q4896j40498j70138j76059j87429j92348
4308H632286j78950j62860j36433j20541j30267j18844r8277j11090j29845j19906
4298G325273j38200j68767j60651j19935j51832j18208j25731j25568j13827r8994
4288F003560r3010p1018m8677q0609n1740n1393p9355p9801q5937n8631o9134
4277E234255q7074p4750n7356n2065n9008k5240j121K1415M7719N2129N3498L9584
$$ plain form
4265 5091986 5138520 5185125 5187828 5163297 5113781 5064337 5024665 4990524 4968463 4949655 4903867 4824994
4253 4824994 4719439 4616368 4501831 4393301 4285432 4171419 4084901 4026629 3992297 3973352
4243 3973352 3955699 3933649 3902178 3853032 3828511 3792053 3774105 3760128 3743934 3750221 3740214 3710898
4231 3710898 3695431 3648298 3637922 3640088 3643929 3665515 3695153 3759723 3832672 3938885 4042849
4220 4042849 4199341 4350686 4534673 4747759 4981505 5253213 5545726 5817843 6100617 6290230
4210 6290230 6307355 6212256 5920470 5495349 5073984 4719399 4423109 4205536 4054869 3904410
4200 3904410 3777172 3685146 3602630 3517527 3454411 3424290 3382257 3334298 3284396 3281561 3291486 3306970
4188 3306970 3356828 3403377 3453524 3507043 3544642 3588712 3602496 3581929 3551078 3498412 3463340
$$ packed form
4265E091986M6534M6605K703k4531m9516m9444l9672l4141k2061j8808m5788p8873
4253D824994j05555j03071j14537j08530j07869j14013q6518n8272l4332j8945
4243C973352j7653k2050l1471m9146k4521l6458j7948j3977j6194O287j0007k9316
4231C710898j5467m7133j0376K166L841K1586K9638O4570P2949J06213J03964
4220D042849J56492J51345J83987K13086K33746K71708K92513K72117K82774J89613
4210F290230J7125r5099k91786m25121m21365l54585k96290k17573j50667j50459
4200C904410j27238r2026q2516q5103o3116l0121m2033m7959m9902k835R925J5484
4188C306970M9858M6549N0147N3519L7599M4070J3784k0567l0851n2666l5072
$$ plain form
4177 3463340 3427387 3396227 3354635 3320864 3293030 3299065 3296617 3281549 3245224 3196815 3179671 3173515
4165 3173515 3162453 3144354 3107659 3076851 3055060 3055180 3027562 3003878 2973424 2959919 2942365 2906299
4153 2906299 2892182 2873543 2849090 2853762 2822235 2798545 2803092 2792615 2764874 2725634 2706456 2695297
4141 2695297 2646536 2590705 2557320 2523623 2495735 2460589 2423954 2410354 2399543 2404637 2399835 2418523
4129 2418523 2446992 2478581 2510689 2562717 2586949 2630481 2685794 2741421 2801128 2887578 3001245
4118 3001245 3136727 3321853 3553444 3806004 4034788 4285743 4496274 4530776 4452064 4279317
4108 4279317 4019371 3663177 3294247 3005965 2778355 2590615 2421499 2284938 2158952 2063899
4098 2063899 1952666 1872990 1820395 1787744 1753035 1763761 1741992 1708089 1673320 1649354 1614951
$$ packed form
4177C463340l5953l1160m1592l3771k7834O035k448j5068l6325m8409j7144o156
4165C173515j1062j8099l6695l0808k1791J20k7618k3684l0454j3505j7554l6066
4153B906299j4117j8639k4453M672l1527k3690M547j0477k7741l9240j9178j1159
4141B695297m8761n5831l3385l3697k7888l5146l6635j3600j0811N094m802J8688
4129B418523K8469L1589L2108N2028K4232M3532N5313N5627N9707Q6450J13667
4118C001245J35482J85126K31591K52560K28784K50955K10531L4502p8712j72747
4108D279317k59946l56194l68930k88282k27610j87740j69116j36561j25986r5053
4098B063899j11233p9676n2595l2651l4709J0726k1769l3903l4769k3966l4403
$$ plain form
4087 1614951 1582164 1541771 1529575 1501255 1451878 1405564 1365883 1351132 1320740 1267357 1235018
4076 1235018 1218578 1162707 1138574 1119192 1103930 1107427 1074743 1053932 1045973 1027572 1025999 1012593
4064 1012593 979512 960122 932383 920053 898423 888285 863355 836780 806057 778799 785993 781379
4052 781379 753146 754484 759935 743513 725717 722681 723090 714938 712718 694257 696782 708514 696794
4039 696794 682656 689687 691385 704158 724144 732733 710851 698018 681775 670377 672839 663301 672990
4026 672990 661623 668938 663826 661808 646869 636350 607333 570276 558705 540052 511996 516796
4014 516796 523775 486028 478769 481740 489562 477462 486806 500222 492082 502026 510153 518691 507968
4001 507968 515335 520638 521948 522067 527909 520249 501246 501990 488954 479199 477445 460124 464183 451548
$$ packed form
4087A614951l2787m0393j2196k8320m9377m6314l9681j4751l0392n3383l2339
4076A235018j6440n5871k4133j9382j5262L497l2684k0811p959j8401j573j3406
4064A012593l3081j9390k7739j2330k1630j0138k4930k6575l0723k7258P194m614
4052G81379k8233J338N451j6422j7796l036M09q152k220j8461K525J1732j1720
4039F96794j4138P031J698J2773J9986Q589k1882j2833j6243j1398K462r538R689
4026F72990j1367P315n112k018j4939j0519k9017l7057j1571j8653k8056M800
4014E16796O979l7747p259K971P822j2100R344J3416q140R944Q127Q538j0723
4001E07968P367N303J310J19N842p660j9003P44j3036r755j754j7321M059j2635
$$ plain form
3987 451548 447120 422451 421563 418116 409879 416879 412388 378822 357306 349409 352104 353732 357433 377500
3973 377500 378112 378287 370580 387206 383679 380396 383995 380706 372405 358140 358494 362173 360519 347940
3959 347940 372142 394933 376960 372150 354063 356667 344730 343784 337288 358802 349276 345638 345827
3946 345827 359805 361690 364177 362548 346260 341464 321400 312325 307977 294118 265942 249184 256956
3933 256956 244395 244334 260252 256171 258375 266288 267972 257865 245073 242649 225089 216216 206682 224398
3919 224398 244623 241407 233279 226757 221610 239346 228232 210515 232466 245306 241165 230681 207111
3906 207111 204630 206185 219963 217895 220475 231767 226876 230994 244731 248201 251146 236208 213447
3893 213447 221145 219601 202463 231349 239010 245963 240056 221287 221880 229995 237957 250064 254165 251039
$$ packed form
3987D51548m428k4669q88l447q237P000m491l3566k1516p897K695J628L701K0067
3973C77500O12J75p707J6626l527l283L599l289q301j4265L54L679j654j2579
3959C47940K4202K2791j7973m810j8087K604j1937r46o496K1514r526l638J89
3946C45827J3978J885K487j629j6288m796k0064r075m348j3859k8176j6758P772
3933B56956j2561o1J5918m081K204P913J684j0107j2792k424j7560q873r534J7716
3919B24398K0225l216q128o522n147J7736j1114j7717K1951J2840m141j0484k3570
3906B07111k481J555J3778k068K580J1292m891M118J3737L470K945j4938k2761
3893B13447P698j544j7138K8886P661O953n907j8769N93Q115P962J2107M101l126
$$ plain form
3879 251039 253989 235559 229338 219779 226108 239802 243538 253309 258762 260291 263729 255616 250941 252449
3865 252449 243194 227003 248735 240594 251112 246057 234376 223273 234471 221399 217022 229429
3853 229429 222903 213482 228402 222600 225406 233595 218957 226846 254499 251437 241527 237444 223959
3840 223959 233065 221015 222208 226954 225422 210859 211434 200250 203849 217082 223663 237446 237096 231856
3826 231856 228108 225043 240502 265820 296071 318186 321958 349051 353570 334490 342670 338252 323557
3813 323557 329816 311495 306075 313233 303373 297262 288959 298630 304908 283345 297523 292705 308996
3800 308996 341888 393472 403098 436275 485518 514090 557908 633771 716107 847988 936064 984445
3788 984445 1106144 1161577 1104941 939290 767388 662412 575113 509979 465943 432008 403697
$$ packed form
3879B51039K950j8430o221r559O329J3694L736R771N453J529L438q113m675J508
3865B52449r255j6191K1732q141J0518n055j1681j1103J1198j3072m377J2407
3853B29429o526r421J4920n802K806Q189j4638P889K7653l062r910m083j3485
3840B23959R106j2050J193M746j532j4563N75j1184L599J3233O581J3783l50n240
3826B31856l748l065J5459K5318L0251K2115L772K7093M519j9080Q180m418j4695
3813C23557O259j8321n420P158r860o111q303R671O278k1563J4178m818J6291
3800C08996L2892N1584R626L3177M9243K8572M3818P5863Q2336J31881Q8076M8381
3788I84445J21699N5433n6636j65651j71902j04976q7299o5134m4036l3935k8311
$$ plain form
3777 403697 385315 338484 318096 312982 277087 274360 270690 240803 230761 224007 219265 220837 220005
3764 220005 207584 200729 188861 177211 179729 162047 145454 148947 160200 169072 172890 170647 169782
3751 169782 158450 156168 156859 147304 141209 160510 149867 163455 159329 138050 140605 134194 134341 138957
3737 138957 158524 145363 146369 152707 157464 164467 170232 177723 177126 188020 191145 210356 186281
3724 186281 183011 184196 179622 201042 191260 161504 167236 193087 178870 180148 179244 179646 174185 175656
3710 175656 179348 174820 184440 183885 173837 156911 164539 162491 155613 149609 144360 130164 145775 134946
3696 134946 146836 132622 150743 149159 136821 151070 163934 147800 160776 172045 169401 159301
3684 159301 181402 179564 185800 174450 162310 160919 154172 168808 172386 169620 182914 179277 144667
$$ packed form
3777D03697j8382m6831k0388n114l5895k727l670k9887j0042o754m742J572q32
3764B20005j2421o855j1868j1650K518j7682j6593L493J1253Q872L818k243q65
3751A69782j1332k282O91r555o095J9301j0643J3588m126k1279K555o411J47M616
3737A38957J9567j3161J006O338M757P003N765P491n97J0894L125J9211k4075
3724A86281l270J185m574K1420r782k9756N732K5851j4217J278r04M02n461J471
3710A75656L692m528R620n55j0048j6926P628k048o878o004n249j4196J5611j0829
3696A34946J1890j4214J8121j584j2338J4249J2864j6134J2976J1269k644j0100
3684A59301K2101j838O236j1350j2140j391o747J4636L578k766J3294l637l4610
$$ plain form
3671 144667 161575 159151 140422 130361 140988 140088 134737 135635 149598 133543 118673 130011 132411
3658 132411 117167 131970 137765 135731 136784 110124 111196 117182 117421 111853 101408 115614 118572
3645 118572 126877 126278 124266 148368 141372 125565 134747 127818 124563 134971 140738 123486 136925
3632 136925 125851 94909 91341 111931 103414 98072 78751 85281 89631 86504 77467 77503 75177 61229
3618 61229 76811 89324 90487 92514 95274 107798 96409 88160 96842 93816 118062 120474 105792
3605 105792 95964 102210 101952 98807 102832 101700 109497 103522 107005 109583 122887 99358 90569 85657
3591 85657 74636 70017 67063 86736 87175 86493 87901 91301 96428 85816 83885 77985 88837 79880
3577 79880 71381 70100 76077 72752 41222 45316 47224 43884 33784 37452 44769 41815 41452 38075
$$ packed form
3671A44667J6908k424j8729j0061J0627r00n351Q98J3963j6055j4870J1338K400
3658A32411j5244J4803N795k034J053k6660J072N986K39n568j0445J4206K958
3645A18572Q305n99k012K4102o996j5807R182o929l255J0408N767j7252J3439
3632A36925j1074l0942l568K0590q517n342j9321O530M350l127r037L6k326j3948
3618F1229J5582J2513J163K027K760J2524j1389q249Q682l026K4246K412j4682
3605A05792r828O246k58l145M025j132P797n975L483K578J3304k3529q789m912
3591H5657j1021m619k954J9673M39o82J408L400N127j0612j931n900J0852q957
3577G9880q499j281N977l325l1530M094J908l340j0100L668P317k954l63l377
$$ plain form
3563 38075 39358 57828 61471 53108 42312 29059 41840 56607 63931 47437 48991 46122 39489
3550 39489 40791 34854 25906 20908 30524 42892 37633 8791 21139 40135 35909 33086 31078 30972
3536 30972 39181 18724 22159 35659 30842 28313 24504 32459 13835 7468 10545 19093 18307 24488
3522 24488 41032 21859 21932 3335 2597 11564 14445 20281 15921 14675 12279 19920 9796 17212
3508 17212 21097 12410 17427 24084 8340 5787 7058 13832 7810 -1615 6694 7861 13993 8705
3494 8705 6671 -9983 -3464 1374 -1056 -11897 1068 -15701 -12230 -2155 -639 2222 14887
3481 14887 8693 -4293 -8940 8185 -965 -7030 -6927 -14259 -1830 1610 2387 -6559 -9578 2912
3467 2912 16423 16890 24758 23158 26704 36658 16271 3666 -369 -2014 8033 12760 9454 -2009
$$ packed form
3563C8075J283J8470L643q363j0796j3253J2781J4767P324j6494J554k869o633
3550C9489J302n937q948m998R616J2368n259k8842J2348J8996m226k823k008j06
3536C0972Q209k0457L435J3500m817k529l809P955j8624o367L077Q548p86O181
3522B4488J6544j9173P3j8597p38Q967K881N836m360j246k396P641j0124P416
3508A7212L885q687N017O657j5744k553J271O774o022r425Q309J167O132n288
3494H705k034j6654O519M838k430j0841J2965j6769L471J0075J516K861J2665
3481A4887o194j2986m647J7125r150o065J03p332J2429L440P77q946l019J2490
3467B912J3511M67P868j600L546R954k0387j2605m035j645J0047M727l306j1463
$$ plain form
3453 -2009 9811 26744 27144 25492 18775 13523 20708 36322 26156 30395 32184 22911 23461 31202
3439 31202 31937 18688 27024 24297 28205 28670 42680 36303 23346 21220 9576 29785 33325 22370
3425 22370 24105 30530 20856 7007 12448 13293 11227 12927 8366 -10330 -15307 849 12367 4318
3411 4318 3237 5100 13984 14898 20723 21731 19578 42853 33835 16711 10111 6783 22745 14658
3397 14658 -1820 279 8180 -170 9278 5296 10158 32053 16024 -4281 -3824 9986 6203 9674
3383 9674 26680 29360 29518 28257 41898 28653 19147 11936 3808 19771 18448 20865 34137 38413
3369 38413 47219 29447 26794 25490 33876 39119 41621 45046 63157 63932 50715 40851 34523 39371
3355 39371 45153 52651 42537 39497 32437 48190 48712 49706 39625 23583 41662 42005 42491 45449
$$ packed form
3453b009J1820J6933M00j652o717n252P185J5614j0166M239J789r273N50P741
3439C1202P35j3249Q336k727L908M65J4010o377j2957k126j1644K0209L540j0955
3425B2370J735O425r674j3849N441Q45k066J700m561j8696m977J6156J1518q049
3411D318j081J863Q884R14N825J008k153K3275r018j7124o600l328J5962q087
3397A4658j6478K099P901q350R448l982M862K1895j6029k0305M57J3810l783L471
3383I674J7006K680J58j261J3641j3245r506p211q128J5963j323K417J3272M276
3369C8413Q806j7772k653j304Q386N243K502L425J8111P75j3217r864o328M848
3355C9371N782P498j0114l040p060J5753N22R94j0081j6042J8079L43M86K958
$$ plain form
3341 45449 52858 54500 42236 36253 45573 54868 52439 38466 40776 61445 54680 45046 32744 43739
3327 43739 48331 48159 52191 44616 60113 40361 36005 43814 38686 39837 39448 51518 40491 40905
3313 40905 39573 42758 43964 29459 16998 21838 42490 34958 53326 55978 54563 40419 37272
3300 37272 44866 32156 17497 23259 16190 1825 8933 32243 38325 37469 47932 48494 48403 48396 48535
3285 48535 40590 40423 35015 28848 20221 21598 24356 35967 35376 37550 37123 25488 17835 16390 25437
3270 25437 34502 14541 8154 2732 7007 5044 8681 21206 20045 13909 9483 3593 17473 25429
3256 25429 28395 31374 27458 11445 16923 5478 -10400 14895 29959 20432 16239 964 10718
3243 10718 15096 20230 18750 -3243 -4724 4284 12042 23017 8524 4784 11125 2873 -3511 -10562
$$ packed form
3341D5449P409J642j2264n983R320R295k429j3973K310K0669o765r634j2302J0995
3327D3739M592j72M032p575J5497j9752m356P809n128J151l89J2070j1027M14
3313D0905j332L185J206j4505j2461M840K0652p532J8368K652j415j4144l147
3300C7272P594j2710j4659N762p069j4365P108K3310O082q56J0463N62r1pJ39
3285D8535p945j67n408o167q627J377K758J1611n91K174m27j1635p653j445R047
3270B5437R065j9961o387n422M275j963L637J2525j161o136m426n890J3880P956
3256B5429K966K979l916j6013N478j1445j5878K5295J5064r527m193j5275R754
3243A0718M378N134j480k1993j481R008P758J0975j4493l740O341q252o384p051
$$ plain form
3229 -10562 -5854 17290 7145 -1282 14078 -895 3801 1985 2771 8231 16942 22418 20356 19682
3215 19682 4106 2560 -1960 -16224 -15960 -24635 -11650 3318 -8263 -11891 -4785 -8707 1249 -2638
3201 -2638 5135 2844 5214 16602 -793 -20866 -13535 13086 5107 11466 14160 17345 17675 24086
3187 24086 23254 8990 6378 19602 19794 3621 4746 24039 28818 13943 5077 20014 19605 9685
3173 9685 7704 4942 17217 6824 8442 6358 22786 -4214 -18996 -2386 6982 3404 8637
3160 8637 15886 14395 16231 24253 27157 26699 12036 13236 7109 10342 17039 12097 11221 11472 25382
3145 25382 25532 23863 34426 39509 42217 36857 57805 67314 50989 32253 38102 51910 46604 34617
3131 34617 51808 52753 45503 45564 48703 54733 33885 41745 44944 49620 49813 40947 55384 59367 67152
$$ packed form
3229a0562M708K3144j0145q427J5360j4973M696j816P86N460Q711N476k062o74
3215A9682j5576j546m520j4264K64q675J2985J4968j1581l628P106l922R956l887
3201b638P773k291K370J1388j7395k0073P331K6621p979O359K694L185L30O411
3187B4086q32j4264k612J3224J92j6173J125J9293M779j4875q866J4937m09r920
3173I685j981k762J2275j0393J618k084J6428k7000j4782J6610R368l578N233
3160H637P249j491J836Q022K904m58j4663J200o127L233O697m942q76K51J3910
3145B5382J50j669J0563N083K708n360K0948R509j6325j8736N849J3808n306j1987
3131C4617J7191R45p250O1L139O030k0848P860L199M676J93q866J4437L983P785
$$ plain form
3116 67152 81642 80395 88729 74971 90817 102402 85694 74996 76246 79576 76320 84881 79899
3103 79899 86167 82909 73059 74377 73048 74922 61382 74193 65230 78654 95567 90943 81047 84037
3089 84037 104522 102923 100842 105323 107752 126650 126301 136909 150073 154358 157022 163598 155940 143409
3075 143409 126959 117332 133492 137124 118818 117790 129260 110890 102739 124254 134596 129166 123860
3062 123860 117542 128002 122373 126400 134084 144663 151202 162711 161735 162843 170326 182537 201121
3049 201121 197810 205588 207174 201418 210114 218334 209333 210574 201237 194690 190184 212250 220720 222504
3035 222504 227661 221556 229884 245496 240786 239143 251923 266969 267471 263496 254999 251247 246465 269527
3021 269527 291017 293494 300631 295917 296122 290850 297696 295685 319143 325640 329930 343215 338524 343546
$$ packed form
3116F7152J4490j247Q334j3758J5846J1585j6708j0698J250L330l256Q561m982
3103G9899O268l258r850J318j329J874j3540J2811q963J3424J6913m624r896K990
3089H4037K0485j599k081M481K429J8898l49J0608J3164M285K664O576p658j2531
3075A43409j6450r627J6160L632j8306j028J1470j8370q151K1515J0342n430n306
3062A23860o318J0460n629M027P684J0579O539J1509r76J108P483J2211J8584
3049B01121l311P778J586n756Q696Q220r001J241r337o547m506K2066Q470J784
3035B22504N157o105Q328J5612m710j643J2780J5046N02l975q497l752m782K3062
3021B69527K1490K477P137m714K05n272O846k011K3458O497M290J3285m691N022
$$ plain form
3007 343546 338251 344611 366537 376861 383291 384381 405173 398985 418801 423311 425214 425819 447542
2994 447542 461031 474229 493418 496750 502816 499718 497973 516540 553497 566633 578322 577616 593595
2981 593595 637720 664023 686675 722223 753150 776397 819186 875061 919433 973720 1030606 1078833
2969 1078833 1122909 1157903 1209387 1263914 1299833 1317660 1307758 1282252 1263574 1227669 1174780 1111675
2957 1111675 1034706 978191 911804 837506 794444 749391 726434 710402 700166 676155 652916
2946 652916 651126 654951 671007 674259 670799 677968 696006 685437 664424 633879 599824 579426 577659
2933 577659 560437 556412 548854 559331 555731 562725 566289 563328 560367 560998 551560 515570 500777 501336
2919 501336 505193 509871 500707 512702 516284 543265 577826 592538 609181 623183 653915 678154
$$ packed form
3007C43546n295O360K1926J0324O430J090K0792o188J9816M510J903O05K1723
2994D47542J3489J3198J9189L332O066l098j745J8567L6957J3136J1689p06J5979
2981E93595M4125K6303K2652L5548L0927K3247M2789N5875M4372N4287N6886M8227
2969A078833M4076L4994N1484N4527L5919J7827r902k5506j8678l5905n2889o3105
2957A111675p6969n6515o6387p4298m3062m5053k2957j6032j0236k4011k3239
2946F52916j790L825J6056L252l460P169J8038j0569k1013l0545l4055k0398j767
2933E77659j7222m025p558J0477l600O994L564k961k961O31r438l5990j4793N59
2919E01336L857M678r164J1995L582K6981L4561J4712J6643J4002L0732K4239
$$ plain form
2907 678154 672452 625712 572494 534497 492511 476844 476539 460489 434799 421650 406291 416188
2895 416188 408012 391879 390487 380391 373490 364540 344896 331737 328511 338994 331473 330358 332806
2882 332806 340011 352132 355114 364929 373648 370029 378323 356919 330597 341864 310647 281408 277273
2869 277273 254892 230790 220447 203618 205420 200668 208580 190828 190726 173665 166343 172677 161291
2856 161291 143342 149527 149002 142581 150169 143016 127085 125972 106621 95810 109464 123018 117913
2843 117913 107167 110469 129611 102015 119679 107556 105696 92342 76264 85967 88892 74293
2831 74293 59270 80155 96496 92084 87528 80576 64222 73373 72651 68621 57715 59585 64069 62693
2817 62693 60265 68544 78225 75600 62103 55372 65574 67641 59358 66653 68852 65870 55827 40458
$$ packed form
2907F78154n702m6740n3218l7997m1986j5667l05j6050k5690j3149j5359R897
2895D16188q176j6133j392j0096o901q950j9644j3159l226J0483p521j115K448
2882C32806P205J2121K982R815Q719l619Q294k1404k6322J1267l1217k9239m135
2869B77273k2381k4102j0343j6829J802m752P912j7752j02j7061p322O334j1386
2856A61291j7949O185n25o421P588p153j5931j113j9351j0811J3654J3554n105
2843A17913j0746L302J9142k7596J7664j2123j860j3354j6078R703K925j4599
2831G4293j5023K0885J6341m412m556o952j6354R151p22m030j0906J870M484j376
2817F2693k428Q279R681k625j3497o731J0202K067q283P295K199k982j0043j5369
$$ plain form
2803 40458 26869 26222 33043 23657 24227 29271 22993 31317 17894 25784 42205 47609 38429 25114
2789 25114 45375 52083 32031 44411 49760 34937 33988 38740 25621 31529 28826 24637 23266 24329
2775 24329 27386 36039 37901 24486 22992 26742 30753 22809 21340 20675 19568 14018 18700 30514
2761 30514 14843 15348 17071 16498 7880 10062 17535 11684 18006 10389 32032 26584 11440 17147
2747 17147 15814 18802 16794 1548 -3104 6017 3634 4410 15666 31368 15278 34776 42882 29526
2733 29526 24232 30780 37864 32395 23686 31099 21761 28549 35269 20499 8355 14431 15617 30197
2719 30197 23343 19532 27172 38973 57855 39952 27847 33920 21389 35806 37524 58844 57049
2706 57049 53341 42676 35996 39906 48379 79548 76986 68621 61064 62744 57735 51121 50404 52570
$$ packed form
2803D0458j3589o47O821r386N70N044o278Q324j3423P890J6421N404r180j3315
2789B5114K0261O708k0052J2380N349j4823r49M752j3119N908k703m189j371J063
2775B4329L057Q653J862j3415j494L750M011p944j469o65j107n550M682J1814
2761C0514j5671N05J723n73q618K182P473n851O322p617K1643n448j5144N707
2747A7147j333K988k008j5246m652R121k383P76J1256J5702j6090J9498Q106j3356
2733B9526n294O548P084n469q709P413r338O788O720j4770j2144O076J186J4580
2719C0197o854l811P640J1801J8882j7903j2105O073j2531J4417J718K1320j795
2706E7049l708j0665o680L910Q473L1169k562q365p557J680n009o614p17K166
$$ plain form
2692 52570 64966 69002 65280 56139 48876 64647 64639 54299 48043 58079 50817 56759 52304 60743
2678 60743 59065 63865 67262 63607 54483 78345 88327 93153 96716 87854 90679 95633 82372 89078
2664 89078 94907 95188 98304 98488 95623 82377 92923 114219 108035 82903 93636 105286 106900 113303
2650 113303 113227 103400 111495 136971 136880 132703 139758 150347 150894 162386 150955 159927 159274 155201 160634
2635 160634 173164 166037 152413 150817 152580 147462 154431 161337 176268 181507 189955 190299 186967 195102
2621 195102 188595 201623 221196 212318 207024 185384 190562 190873 183280 192087 178885 157230 162616
2608 162616 169919 163699 174359 167805 163035 164517 163221 166363 156840 152813 142657 154787 165173
2595 165173 164177 169381 164090 182743 168322 158227 137006 127465 117999 113948 118001 136067 123294
$$ packed form
2692E2570J2396M036l722r141p263J5771qj0340o256J0036p262N942m455Q439
2678F0743j678M800L397l655r124K3862R982M826L563q862K825M954j3261O706
2664H9078N829K81L116J84k865j3246J0546K1296o184k5132J0733J1650J614O403
2650A13303p6r827Q095K5476r1m177P055J0589N47J1492j1431Q972o53m073N433
2635A60634J2530p127j3624j596J763n118O969O906J4931N239Q448L44l332Q135
2621A95102o507J3028J9573q878n294k1640N178L11p593Q807j3202k1655N386
2608A62616P303o220J0660o554m770J482j296L142r523m027j0156J2130J0386
2595A65173r96N204n291J8653j4421j0095k1221r541r466m051M053J8066j2773
$$ plain form
2582 123294 118082 121268 111167 97387 91420 93892 93661 98050 97879 106666 101307 71989 68410 64311
2568 64311 57497 51731 57485 55038 53503 31272 26628 42888 37433 37228 30805 22647 21159 14261
2554 14261 13830 17030 -758 -27 21253 24800 24118 19900 12879 321 4927 13240 22824 -6178
2540 -6178 5789 -2843 -22430 -4183 -159 -6359 1523 11424 11164 -9131 -6556 -11325 -20286 -13765
2526 -13765 -19631 -16832 -4705 1016 -8587 -10056 -4560 -21340 -8450 3463 -15469 -14371 -10310
2513 -10310 -30257 -50068 -46693 -37185 -37460 -30618 -28439 -19502 -25372 -30096 -20488 -27019 -21922 -37232
2499 -37232 -27468 -31264 -40260 -33266 -31521 -37222 -31209 -34195 -45568 -32476 -23769 -43767 -41202 -39122
2485 -39122 -32176 -36762 -32651 -46875 -55533 -72006 -51512 -41139 -44652 -48676 -45930 -30758 -47429
$$ packed form
2582A23294n212L186j0101j3780n967K472k31M389j71Q787n359k9318l579m099
2568F4311o814n766N754k447j535k2231m644J6260n455k05o423q158j488o898
2554A4261m31L200j7788P31K1280L547o82m218p021j2558M606Q313R584k9002
2540f178J1967q632j9587J8247M024o200P882R901k60k0295K575m769q961O521
2526a3765n866K799J2127N721r603j469N496j6780J2890J1913j8932J098M061
2513a0310j9947j9811L375R508k75O842K179Q937n870m724R608o531N097j5310
2499c7232R764l796q996O994J745n701O013k986j1373J3092Q707j9998K565K080
2485c9122O946m586M111j4224q658j6473K0494J0373l513m024K746J5172j6671
$$ plain form
2472 -47429 -52501 -47054 -54927 -44416 -36134 -46053 -46469 -68388 -51279 -40742 -66800 -51366 -45125
2459 -45125 -50655 -47538 -48929 -41701 -40904 -47776 -38320 -36135 -31845 -37069 -30274 -21152 -33369 -41232 -45336
2444 -45336 -39769 -27273 -46325 -51652 -30539 -33310 -26428 -31185 -41674 -44422 -31054 -27755 -46882
2431 -46882 -34484 -41130 -51919 -47382 -35487 -41508 -36816 -33501 -42169 -57656 -59619 -55801 -56908 -50757
2417 -50757 -56552 -36433 -30807 -33242 -44294 -46789 -51689 -53478 -55962 -37407 -36217 -42468 -48628 -60611
2403 -60611 -47438 -37945 -53494 -36555 -44218 -49141 -44637 -52454 -44886 -48900 -47032 -43916 -40015 -51032
2389 -51032 -48217 -58817 -67072 -53018 -52164 -58584 -62018 -69749 -62300 -61807 -54137 -42442 -39232 -39652 -40056
2374 -40056 -50864 -51586 -56727 -55258 -36635 -35795 -41762 -33192 -20005 -14860 -14455 -25317 -31337 -30414 -32883
$$ packed form
2472d7429n072N447p873J0511Q282r919m16k1919J7109J0537k6058J5434O241
2459d5125n530L117j391P228P97o872R456K185M290n224O795R122j2217p863m104
2444d5336N567J2496j9052n327K1113k771O882m757j0489k748J3368L299j9127
2431d6882J2398o646j0789M537J1895o021M692L315q668j5487j963L818j107O151
2417e0757n795K0119N626k435j1052k495m900j789k484J8555J190o251o160j1983
2403f0611J3173R493j5549J6939p663m923M504p817P568m014J868L116L901j1017
2389e1032K815j0600q255J4054Q54o420l434p731P449M93P670J1695L210m20m04
2374d0056j0808p22n141J469J8623Q40n967Q570J3187N145M05j0862o020R23k469
$$ plain form
2359 -32883 -27824 -38131 -46721 -42885 -41021 -51291 -59440 -47412 -51092 -51212 -56133 -53024 -51476 -52801
2345 -52801 -40920 -33168 -36283 -48248 -51597 -57642 -56041 -44793 -40664 -26114 -33068 -39220 -38264 -24100
2331 -24100 -18306 -30988 -44186 -45981 -42825 -38224 -44532 -34793 -14178 -13412 -13546 -25160 -30594 -32614
2317 -32614 -44827 -30317 -45451 -40628 -45474 -53788 -42529 -35202 -33055 -31203 -33692 -39294 -44099 -37650
2303 -37650 -36956 -32149 -28192 -33043 -28770 -49568 -48272 -45364 -27333 -19928 -39186 -44125 -30321 -35803
2289 -35803 -34287 -36268 -44779 -40736 -30144 -26305 -41025 -37307 -44618 -60405 -71009 -51206 -41182
2276 -41182 -44925 -32830 -32534 -30773 -42300 -55210 -40248 -42309 -40472 -54988 -59071 -44816 -39381
2263 -39381 -38192 -57423 -57985 -55322 -45077 -47737 -50048 -54809 -51036 -49348 -23621 -19159 -24915 -32999
$$ packed form
2359c2883N059j0307q590L836J864j0270q149J2028l680j20m921L109J548j325
2345e2801J1881P752l115j1965l349o045J601J1248M129J4550o954o152R56J4164
2331b4100N794j2682j3198j795L156M601o308R739K0615P66j34j1614n434k020
2317c2614j2213J4510j5134M823m846q314J1259P327K147J852k489n602m805O449
2303c7650O94M807L957m851M273k0798J296K908J8031P405j9258m939J3804n482
2289c5803J516j981q511M043J0592L839j4720L718p311j5787j0604J9803J0024
2276d1182l743J2095K96J761j1527j2910J4962k061J837j4516m083J4255N435
2263c9381J189j9231n62K663J0245k660k311m761L773J688K5727M462n756q084
$$ plain form
2249 -32999 -43297 -40788 -43689 -38039 -42516 -59093 -45609 -33889 -33797 -26891 -31940 -37041 -48200 -50018
2235 -50018 -37313 -39085 -38171 -39444 -37337 -47522 -40307 -35785 -51768 -46400 -35896 -40814 -53142 -62063
2221 -62063 -57613 -41205 -46388 -48748 -54577 -53597 -29228 -36585 -36752 -34458 -43930 -38789 -45340 -34625
2207 -34625 -39175 -52485 -50661 -31840 -27941 -48373 -50551 -44725 -44013 -64280 -61455 -64685 -53447 -46337
2193 -46337 -54050 -47129 -48230 -52213 -60424 -51405 -51079 -56299 -44493 -48971 -56848 -64724 -50810 -41373
2179 -41373 -52888 -69581 -57643 -32924 -41004 -38186 -53018 -51797 -39234 -45671 -40622 -44186 -42913
2166 -42913 -30606 -37136 -38988 -40918 -50196 -45083 -46657 -56014 -50512 -66182 -71685 -64498 -54984 -56214
2152 -56214 -49450 -52152 -46661 -57544 -67034 -74745 -69519 -66885 -52702 -53705 -61458 -58803 -52321 -39807
$$ packed form
2249c2999j0298K509k901N650m477j6577J3484J1720R2O906n049n101j1159j818
2235e0018J2705j772R14j273K107j0185P215M522j5983N368J0504m918j2328q921
2221f2063M450J6408n183k360n829R80K4369p357j67K294r472N141o551J0715
2207c4625m550j3310J824J8821L899k0432k178N826P12k0267K825l230J1238P110
2193d6337p713O921j101l983q211R019L26n220J1806m478p877p876J3914R437
2179d1373j1515j6693J1938K4719q080K818j4832J221J2563o437N049l564J273
2166d2913J2307o530j852j930r278N113j574r357N502j5670n503P187R514j230
2152e6214O764k702N491j0883r490p711N226K634J4183j003p753K655O482J2514
$$ plain form
2138 -39807 -53681 -49861 -47598 -38465 -51525 -56497 -50105 -52287 -52146 -54892 -56750 -63606 -63203 -73578
2124 -73578 -65645 -66317 -64712 -64397 -39005 -33728 -44406 -48854 -41492 -32999 -42018 -40818 -62777 -58431
2110 -58431 -50199 -38655 -38673 -48289 -45909 -51727 -57568 -52130 -44261 -36260 -37811 -34593 -37021 -40286 -31637
2095 -31637 -48260 -51026 -35636 -33833 -13271 -20435 -24485 -35506 -37454 -44086 -44060 -43599 -45696 -46774
2081 -46774 -46201 -51537 -32554 -27214 -36653 -54948 -62132 -55444 -59217 -59770 -58295 -59890 -51597 -48090 -50582
2066 -50582 -49366 -26508 -40863 -43747 -38677 -47921 -52407 -48593 -41302 -29801 -22264 -27602 -29427 -38824
2052 -38824 -47485 -60610 -51673 -55936 -47576 -46394 -57624 -55629 -41754 -32647 -40681 -51162 -50967 -42138
2038 -42138 -32549 -47895 -41543 -45577 -41229 -41162 -28967 -37101 -41334 -20802 -30954 -40323 -39087 -44821
$$ packed form
2138c9807j3874L820K263R133j3060m972O392k182J41k746j858o856M03j0375
2124g3578P933o72J605L15K5392N277j0678m448P362Q493r019J200k1959M346
2110e8431Q232J1544j8r616K380n818n841N438P869Q001j551L218k428l265Q649
2095c1637j6623k766J5390J803K0562p164m050j1021j948o632K6M61k097j078
2081d6774N73n336J8983N340r439j8295p184O688l773n53J475j595Q293L507k492
2066e0582J216K2858j4355k884N070r244m486L814P291J1501P537n338j825r397
2052c8824q661j3125Q937m263Q360J182j1230J995J3875R107q034j0481J95Q829
2038d2138R589j5346O352m034M348O7J2195q134m233K0532j0152r369J236n734
$$ plain form
2024 -44821 -44473 -58375 -42406 -47926 -59633 -67436 -42685 -28203 -30365 -35735 -62735 -50414 -40624
2011 -40624 -38157 -29925 -39274 -38536 -39486 -32184 -23522 -26634 -20205 -18077 -23798 -35700 -33583 -45999 -48508
1996 -48508 -49410 -57767 -45593 -50571 -44796 -33575 -41221 -47827 -35207 -40369 -32484 -28303 -34120 -52990
1982 -52990 -42671 -36594 -54041 -52152 -54200 -33944 -16863 -30605 -41847 -37641 -32739 -23271 -20026
1969 -20026 -15345 -35735 -32645 -38082 -46492 -31206 -19374 -18413 -14613 -19656 -25075 -24911 -30133 -36924
1955 -36924 -37531 -32768 -13710 -25640 -22829 -22122 -27303 -16494 -33316 -35113 -18357 -23118 -6763 -14682
1941 -14682 -33172 -33485 -18443 3556 -10780 -28085 -13195 -21368 -11843 -16003 -8561 207 -9628
1928 -9628 -14110 -13284 -6784 -1704 -10906 2581 -15441 -17495 -3497 -1394 7854 -5025 -2513 7889
$$ packed form
2024d4821L48j3902J5969n520j1707p803K4751J4482k162n370k7000J2321R790
2011d0624K467Q232r349P38r50P302Q662l112O429K128n721j1902K117j2416k509
1996d8508r02q357J2174m978N775J1221p646o606J2620n162P885M181n817j8870
1982e2990J0319O077j7447J889k048K0256J7081j3742j1242M206M902R468L245
1969b0026M681k0390L090n437q410J5286J1832R61L800n043n419J64n222o791
1955c6924o07M763J9058j1930K811P07n181J0809j6822j797J6756m761J6355p919
1941a4682j8490l13J5042K1999j4336j7305J4890q173R525m160P442Q768r835
1928i628m482Q26O500N080r202J3487j8022k054J3998K103R248j2879K512J0402
$$ plain form
1914 7889 -2141 -15117 -23720 -12180 7666 9889 7166 7700 15930 27641 16553 12345 22341 16734
1900 16734 20977 8333 15111 25405 28583 38095 37251 46897 42918 35031 50026 33579 41346 44597
1886 44597 52476 35224 42989 54046 52655 61578 67583 65867 84341 97953 83180 70222 61322
1873 61322 65150 81107 82734 79659 87390 92900 86658 105794 117198 110186 110814 115135 122481 132375
1859 132375 139701 155071 159244 162164 156859 181691 189138 191152 211681 219926 244632 260483 287957
1846 287957 300888 330973 355170 379247 393061 405900 455499 483711 538189 599435 660382 730082
1834 730082 793433 880056 982082 1094842 1224308 1366872 1536038 1803882 2113391 2497206
1824 2497206 2884329 3090705 3356188 3692332 3714450 3282302 2610347 2112445 1760089 1499619
$$ packed form
1914G889j0030j2976q603J1540J9846K223k723N34Q230J1711j1088m208R996n607
1900A6734M243j2644O778J0294L178R512q44R646l979p887J4995j6447P767L251
1886D4597P879j7252P765J1057j391Q923O005j716J8474J3612j4773j2958q900
1873F1322L828J5957J627l075P731N510o242J9136J1404p012O28M321P346R894
1859A32375P326J5370M173K920n305K4832P447K014K0529Q245K4706J5851K7474
1846B87957J2931L0085K4197K4077J3814J2839M9599K8212N4478O1246O0947O9700
1834G30082O3351Q6623J02026J12760J29466J42564J69166K67844L09509L83815
1824B497206L87123K06376K65483L36144K2118m32148o71955m97902l52356k60470
$$ plain form
1814 1499619 1301469 1138348 1008138 908025 825657 731109 667261 622709 584339 563518 496843
1803 496843 454620 412564 371925 353689 333521 322599 311836 303425 283408 268135 261208 249098
1791 249098 212406 202775 187867 188347 187602 173578 158531 166894 166456 170098 152567 138496 122308
1778 122308 131496 132548 129769 124950 124911 123330 113436 111377 96217 86221 100856 98255 82423 60752
1764 60752 61504 55293 56322 59313 57268 56822 48016 43709 36622 55909 69135 53199 36154 34759
1750 34759 55939 70733 44436 37560 36920 33360 27008 22108 24678 23063 46273 47940 12809 29485
1736 29485 28427 26360 27927 18560 16119 25567 27053 9964 10485 2245 10103 15069 9516 15208 -1950
1721 -1950 3267 12880 5466 8076 12093 6503 -2399 -6276 7090 4005 1191 7397 10278 6522 3591
$$ packed form
1814A499619j98150j63121j30210j00113q2368r4548o3848m4552l8370k0821o6675
1803D96843m2223m2056m0639j8236k0168j0922j0763q411k0017j5273o927j2110
1791B49098l6692r631j4908M80p45j4024j5047Q363m38L642j7531j4071j6188
1778A22308R188J052k779m819l9j581r894k059j5160r996J4635k601j5832k1671
1764F0752P52o211J029K991k045m46q806m307p087J9287J3226j5936j7045j395
1750C4759K1180J4794k6297o876o40l560o352m900K570j615K3210J667l5131J6676
1736B9485j058k067J567r367k441R448J486j7089N21q240P858M966n553N692j7158
1721a950N217R613p414K610M017n590q902l877J3366l085k814O206K881l756k931
$$ plain form
1706 3591 -2968 -5292 -5354 -2773 -2789 6559 -1473 -15640 -18513 -9350 -12824 -10162 -8683 4765 -2770
1691 -2770 -9071 -24137 -37597 -29968 -8057 -9566 -13162 -3663 -5228 9109 -12854 -26524 -21008
1678 -21008 -5587 -4411 -14091 -25886 -31214 -23372 -13100 -17395 -26288 -20740 -17277 -21108 -19100 -24227
1664 -24227 -18116 -20514 -20856 -6035 -14917 -15946 -8548 -7605 -30977 -42024 -26655 -17797 -30134 -15869
1650 -15869 2799 -5175 -21337 -11572 -128 -4453 -11201 -14005 -26109 -22097 -28023 -24612 -9995
1637 -9995 -14339 -19472 -10754 -14254 -23476 785 -19334 -16586 -9781 -9542 -26705 -33500 -14012 -7583
1623 -7583 -12078 -4413 -9029 -9894 -27727 -35383 -27231 -7642 -21125 -31301 -50107 -56736 -43121 -29141
1609 -29141 -27061 -37102 -29447 -12952 -24110 -26055 -15983 -15133 -9223 -9135 -15442 -21613 -9161 -15950
$$ packed form
1706C591o559k324o2K581j6R348q032j4167k873R163l474K662J479J3448p535
1691b770o301j5066j3460P629K1911j509l596R499j565J4337k1963j3670N516
1678b1008J5421J176r680j1795n328P842J0272m295q893N548L463l831K008n127
1664b4227O111k398l42J4821q882j029P398R43k3372j1047J5369Q858j2337J4265
1650a5869J8668p974j6162R765J1444m325o748k804j2104M012n926L411J4617
1637i995m344n133Q718l500r222K4261k0119K748O805K39j7163o795J9488O429
1623g583m495P665m616q65j7833p656Q152J9589j3483j0176j8806o629J3615J3980
1609b9141K080j0041P655J6495j1158j945J0072Q50N910Q8o307o171J2452o789
$$ plain form
1595 -15950 -20591 -13231 -25932 -18569 -12967 -17232 -35050 -23252 -21094 -24652 -35479 -52870 -33083
1582 -33083 -21568 -13466 -25011 -41979 -32145 -31984 -33489 -8703 -22896 -19634 -20344 -22237 -24588 -27167
1568 -27167 -27394 -35981 -31601 -24606 -28397 -30315 -17049 -24482 -20584 -15628 -12938 -12326 -3888 7461 9557
1553 9557 6426 -7155 -559 340 -9690 542 -8678 -15446 -2463 -5058 -21163 -34203 -19960
1540 -19960 -25269 -29220 -10299 -6847 -26698 -14777 -3511 -14690 -26551 -28055 -34326 -38257 -29158
1527 -29158 -19905 -38526 -40862 -41251 -25315 -21450 -22542 -22429 -44519 -40328 -40602 -39455 -39509 -37708 -17498
1512 -17498 -22561 -10191 -26595 -42994 -35108 -29331 -21648 -40690 -33113 -14554 -18977 -15038 -8347
1499 -8347 -11784 -23702 -25696 -21362 -30479 -36010 -34234 -9147 -17783 -23167 -26245 -21989 -25919 -36806
$$ packed form
1595a5950m641P360j2701P363N602m265j7818J1798K158l558j0827j7391J9787
1582c3083J1515Q102j1545j6968R834J61j505K4786j4193L262p10j893k351k579
1568b7167k27q587M380O995l791j918J3266p433L898M956K690O12Q438J1349K096
1553I557l131j3581O596Q99j0030J0232r220o768J2983k595j6105j3040J4243
1540a9960n309l951J8921L452j9851J1921J1266j1179j1861j504o271l931R099
1527b9158R253j8621k336l89J5936L865j092J13k2090M191k74J147n4J801K0210
1512a7498n063J2370j6404j6399P886N777P683j9042P577J8559m423L939O691
1499h347l437j1918j994M334r117n531J776K5087q636n384l078M256l930j0887
$$ plain form
1485 -36806 -11334 -20861 -31871 -27896 -24932 -31182 -22681 -19924 -10623 -22584 -25427 -16669 -5911 -13668
1471 -13668 -32403 -20977 -17625 -16775 -27767 -45167 -22030 -16577 -22727 -21654 -24738 -23429 -25216 -14929
1457 -14929 -13076 -14710 -6428 -1774 -17526 -24058 -15555 -8596 -19907 -23368 -14950 -18658 -17254 -9934
1443 -9934 -18650 -19493 -17080 -14100 -14467 -15949 -710 4823 -10206 -13325 -11964 -7386 -10231 -12819 -30576
1428 -30576 -29046 -31458 -27109 -37728 -45279 -34862 -17169 -32881 -24319 -12966 -14056 -32299 -36877
1415 -36877 -37530 -30384 -24017 -28266 -19113 -11467 -19375 -17734 -25252 -16970 5470 -8603 -6504 -11519
1401 -11519 -24472 -31376 -33885 -33257 -32310 -37011 -24627 -25847 -30596 -28891 -12690 -22712 -22863 -10199
1387 -10199 -5241 -19683 -20242 -21420 -11698 -16049 -19362 -9770 -11497 -7305 2181 -5399 -14884 -25466
$$ packed form
1485c6806K5472r527j1010L975K964o250Q501K757R301j1961k843Q758J0758p757
1471a3668j8735J1426L352Q50j0992j7400K3137N453o150J073l084J309j787J0287
1457a4929J853j634Q282M654j5752o532Q503O959j1311l461Q418l708J404P320
1443i934q716q43K413K980l67j482J5239N533j5029l119J361M578k845k588j7757
1428c0576J530k412M349j0619p551J0417J7693j5712Q562J1353j090j8243m578
1415c6877o53P146O367m249R153P646p908J641p518Q282K2440j4073K099n015
1401a1519j2953o904k509O28R47m701J2384j220m749J705J6201j0022j51J2664
1387a0199M958j4442n59j178R722m351l313R592j727M192R486p580r485j0582
$$ plain form
1373 -25466 -13212 -8970 -14113 -25361 -30602 -23638 -20177 -23322 -14224 -18955 -27641 -17771 -19047 -30294
1359 -30294 -28525 -38802 -38652 -16385 -23030 -11852 -9933 -14770 -16329 -13206 -16277 -23693 -19359 -7487
1345 -7487 -28441 -20316 -16762 -28675 -22805 -17517 -26199 -30346 -21041 -14086 -7813 -23309 -36439 -32261
1331 -32261 -25825 -11837 -8161 -6037 -3249 -18688 -10584 -1458 -12836 -15215 -16988 -18858 -19470 -27693
1317 -27693 -19884 -4039 -11234 -26259 -24063 -25465 -28756 -30899 -25605 -27642 -43182 -27755 -34645 -38961
1303 -38961 -36436 -39871 -25523 -22360 -20660 -17607 -40165 -41841 -27842 -14527 -18627 -16079 -24350 -42028
1289 -42028 -45652 -33898 -26247 -21537 -9772 1681 -7648 -20057 -3626 -6523 -7424 -17487 -9048
1276 -9048 -7060 -15651 -4669 9375 -13505 -24397 -8317 -10528 -12467 -8254 -12482 -20190 -28455 -6387
$$ packed form
1373b5466J2254M242n143j1248n241O964L461l145R098m731q686R870j276j1247
1359c0294J769j0277J50K2267o645J1178J919m837j559L123l071p416M334J1872
1345g487k0954Q125L554j1913N870N288q682m147R305O955O273j5496j3130M178
1331c2261O436J3988L676K124K788j5439Q104R126j1378k379j773j870o12q223
1317b7693P809J5845p195j5025K196j402l291k143N294k037j5540J5427o890m316
1303c8961K525l435J4348L163J700L053k2558j676J3999J3315m100K548q271j7678
1289d2028l624J1754P651M710J1765J1453r329j2409J6431k897r01j0063Q439
1276i048J988q591J0982J4044k2880j0892J6080k211j939M213m228p708q265K2068
$$ plain form
1262 -6387 17683 -6403 -461 -10823 -19365 -17133 -10485 -16478 -16690 -38184 -34627 -15777 -17361 -12921
1248 -12921 -30994 -9280 -13423 -23927 -19629 -7108 -19632 -27773 -23791 -19430 -1129 6777 -19789
1235 -19789 -20406 -10178 -8448 -22842 -24157 -18835 -19061 -20072 -31155 -28646 -16697 -9610 -8991 -24348
1221 -24348 -25538 -13482 -19684 -21889 -11027 -10670 2857 4764 750 12433 5604 -9529 -10652 -10340
1207 -10340 2843 4200 -13968 -8438 -9844 -1311 857 -15206 -17634 -16709 73 6666 -1903 -14378
1193 -14378 -16932 4757 3999 -18905 -23235 -3735 4980 4061 -21481 -14837 -2345 -3760 -11673 -12370
1179 -12370 -11524 -19620 -15781 -7965 -1484 -27678 -11312 -6626 -16998 -32099 -29178 -26181 -30938 -17829
1165 -17829 -14800 -15180 -28457 -3035 706 1474 -5562 -21281 -9481 -8442 -6413 5522 -5621 -12714
$$ packed form
1262f387K4070k4086N942j0362q542K232O648n993k12k1494L557J8850j584M440
1248a2921j8073K1714m143j0504M298J2521j2524q141L982M361J8301P906k6566
1235a9789o17J0228J730j4394j315N322k26j011j1083K509J1949P087O19j5357
1221b4348j190J2056o202k205J0862L57J3527J907m014J1683o829j5133j123L12
1207a0340J3183J357j8168N530j406Q533K168j6063k428R25J6782O593q569j2475
1193a4378k554K1689p58k2904m330J9500Q715r19k5542O644J2492j415p913o97
1179a2370Q46q096L839P816O481k6194J6366M686j0372j5101K921K997m757J3109
1165a7829L029l80j3277K5422L741P68p036j5719J1800J039K029J1935j1143p093
$$ plain form
1151 -12714 -9826 -7963 -20771 -17769 -14323 -25623 -35295 -18004 -4041 -19159 -21423 -26554 -9339
1138 -9339 -13226 -16098 -16168 -19943 -12531 -2921 -2986 -9699 -3075 804 -1403 -23465 -28276 -26579 -18505 5022
1122 5022 -10741 -13502 -429 -30201 -23543 -33027 -21286 -24494 -20567 -9598 -8616 -11201 -21662 -35280
1108 -35280 -20123 -10884 -8836 -7909 -11712 810 -3626 12191 -13288 -21124 -4865 4317 9251 19410
1094 19410 3738 -14397 -13924 -19620 241 -19258 -13873 3141 -19094 -16685 -23065 -28641 -26290
1081 -26290 -16900 -709 -7143 -12823 -13702 -8186 -4788 -3948 -10172 -2633 -753 -12363 -7359 4283
1067 4283 5065 -13447 -17825 -20205 -2156 -11372 -2357 4034 -5930 -631 -14988 -20541 -12268 -5934
1053 -5934 815 -15781 -21157 -10656 5579 -6143 -13946 -1377 -4570 -6782 5019 4423 -6269
$$ packed form
1151a2714K888J863j2808L002L446j1300r672J7291J3963j5118k264n131J7215
1138i339l887k872p0l775P412R610o5o713O624L879k207k2062m811J697Q074K3527
1122E022j5763k761J3073k9772O658r484J1741l208L927J0969R82k585j0461j3618
1108c5280J5157R239K048R27l803J2522m436J5817k5479p836J6259R182M934J0159
1094A9410j5672j8135M73n696J9861j9499N385J7014k2235K409o380n576K351
1081b6290R390J6191o434n680q79N516L398Q40o224P539J880j1610N004J1642
1067D283P82j8512m378k380J8049r216R015O391r964N299j4357n553Q273O334
1053e934O749j6596n376J0501J6235j1722p803J2569l193k212J1801n96j0692
$$ plain form
1040 -6269 -6268 -2297 -12459 -13023 5572 -8930 5330 13567 -2971 -5057 6022 6513 -18301 -27900
1026 -27900 -13037 -1683 -7502 -18507 -25710 -16508 -17771 -24712 -14593 355 -4537 2383 16127
1013 16127 -224 702 -6339 -12115 -11746 3013 5680 867 3732 -4634 -6385 3542 -418 -19181
999 -19181 10550 7623 3312 13952 -4362 -1057 436 15308 12141 -4692 -7113 -14191 -9877 -9756
985 -9756 -8758 -14748 -16969 -5403 3074 -16080 -9963 -7250 8805 14141 -6335 -10110 -3541 6575
971 6575 -2086 -15137 -9496 -14757 -16223 -10820 -11537 -19414 -19215 -4424 2290 16497 9020 449 21764
$$ packed form
1040f269JL971j0162n64J8595j4502J4260Q237j6538k086J1079M91k4814r599
1026b7900J4863J1354n819j1005p203R202j263o941J0119J4948m892O920J3744
1013A6127j6351R26p041n776L69J4759K667m813K865q366j751R927l960j8763
999a9181K9731k927m311J0640j8314L305J493J4872l167j6833k421p078M314J21
985i756R98n990k221J1566Q477j9154O117K713J6055N336k0476l775O569J0116
971F575q661j3051N641n261j466N403p17p877J99J4791O714J4207p477q571K1315
$$ [...]
##END NTUPLES=NMR SPECTRUM
##END=
