##TITLE=1H_CA-8931-1
 CDCl3,8 sc, 
 30.9.2021
##JCAMPDX= 6.0         $$ Bruker NMR JCAMP-DX V2.0
##DATA TYPE= NMR SPECTRUM
##DATA CLASS= NTUPLES
##ORIGIN= UXNMR, Bruker Analytische Messtechnik GmbH
##OWNER= root
$$ XWIN-NMR		Version 3.5
$$ Thu Sep 30 09:19:48 2021 Russian Standard Time (UT+4h)  she@DPX200
##.OBSERVE FREQUENCY= 200.1313468511
##.OBSERVE NUCLEUS= ^1H
##.ACQUISITION MODE= SIMULTANEOUS
##.ACQUISITION SCHEME= undefined
##.AVERAGES= 8
##.DIGITISER RES= 18
##SPECTROMETER/DATA SYSTEM= spect
##.PULSE SEQUENCE= zg30
##.SOLVENT NAME= D2O
##.SHIFT REFERENCE= (INTERNAL, D2O, 0, 15.8681)
##AUDIT TRAIL= $$ (NUMBER, WHEN, WHO, WHERE, WHAT)
$$ ##TITLE= Audit trail, XWIN-NMR		Version 3.5
$$ ##JCAMPDX= 5.01
$$ ##ORIGIN= Bruker BioSpin GmbH
$$ ##OWNER= she
$$ F:/spectra/data/she/nmr/H-F/1/pdata/1/auditp.txt
$$ ##AUDIT TRAIL=  $$ (NUMBER, WHEN, WHO, WHERE, WHAT)
(   1,<2021-09-30 09:18:25.62 +0400>,<she>,<DPX200>,
      <created by zg, POWCHK disabled, PULCHK disabled
       configuration hash MD5:
       00 E9 B6 7A A2 85 ED C7 34 08 36 98 17 FE 4E 26
       data hash MD5: 16K
       41 09 DC 7E B7 99 17 D1 EF 37 A9 B7 AD 69 AB 69>)
(   2,<2021-09-30 09:18:28.14 +0400>,<she>,<DPX200>,
      <Start of raw data processing
       efp BC_mod = 2 LB = 0.24 FT_mod = 6 PKNL = 1 PHC0 = -13986.65 PHC1 = 10.00085 SI = 16K 
       data hash MD5: 16K
       D8 D7 D9 E2 80 9C 25 39 D5 FD 15 EF 4E 6E D7 8B>)
(   3,<2021-09-30 09:18:46.56 +0400>,<she>,<DPX200>,
      <pk PHC0 = -2.880994 PHC1 = 5.6 
       data hash MD5: 16K
       8A 76 C7 FA 36 EA D7 E1 F0 5C A0 5D CA 9D 5C 5F>)
(   4,<2021-09-30 09:18:50.12 +0400>,<she>,<DPX200>,
      <abs ABSG = 5 
       data hash MD5: 16K
       7C 79 63 92 D9 1D 57 51 5E 25 62 08 74 C9 0C EC>)
(   5,<2021-09-30 09:19:24.93 +0400>,<she>,<DPX200>,
      <abs ABSG = 5 
       data hash MD5: 16K
       73 AA 57 AD D0 76 15 C7 CC 15 87 09 11 2C 80 12>)
$$ ##END=
$$ 
$$ hash MD5
$$ 5D D1 CC 47 B8 A3 E8 FA B5 C0 B1 D0 88 42 5F 11
##$RELAX= 
##$RELAX= 
##$RELAX= 
##$RELAX= 
##$RELAX= 
##$RELAX= 
$$ Bruker specific parameters
$$ --------------------------
##$DU= <F:/spectra>
##$EXPNO= 1
##$NAME= <H-F>
##$PROCNO= 1
##$TYPE= <nmr>
##$USER= <she>
##$AMP= (0..31)
100 100 100 100 100 100 100 100 100 100 100 100 100 100 100 100 100 100 
100 100 100 100 100 100 100 100 100 100 100 100 100 100 
##$AQSEQ= 0
##$AQ_mod= 1
##$AUNM= <au_zg>
##$AUTOPOS= <>
##$BF1= 200.13
##$BF2= 200.13
##$BF3= 200.13
##$BF4= 200.13
##$BF5= 200.13
##$BF6= 200.13
##$BF7= 200.13
##$BF8= 200.13
##$BYTORDA= 1
##$CFDGTYP= 0
##$CFRGTYP= 5
##$CHEMSTR= <none>
##$CNST= (0..31)
1 1 145 1 1 1 1 1 1 1 1 1 1 1 1 1 1 1 1 1 1 1 1 1 1 1 1 1 1 1 1 1 
##$CPDPRG= <>
##$CPDPRG1= <>
##$CPDPRG2= <>
##$CPDPRG3= <>
##$CPDPRG4= <mlev>
##$CPDPRG5= <mlev>
##$CPDPRG6= <mlev>
##$CPDPRG7= <mlev>
##$CPDPRG8= <mlev>
##$CPDPRGB= <>
##$CPDPRGT= <>
##$D= (0..31)
0 1.2 0 0 0 0 0 0 0 0.06 0 0.03 0 0 0 0 0.0002 0 0 0 0 0 0 0 0 0 0 0 0 
0 0 0 
##$DATE= 1632979104
##$DBL= (0..7)
$$ [...]
##$SUBNAM2= <"">
##$SUBNAM3= <"">
##$SUBNAM4= <"">
##$SUBNAM5= <"">
##$SUBNAM6= <"">
##$SUBNAM7= <"">
##$SUBNAM8= <"">
##$SUBNAM9= <"">
##$SW= 18.0517286264689
##$SWIBOX= (0..15)
0 0 2 0 0 0 0 0 0 0 0 0 0 0 0 0 
##$SW_h= 3612.71676300578
##$TD= 16384
##$TD0= 1
##$TE= 0
##$TE2= 300
##$TE3= 300
##$TEG= 300
##$TL= (0..7)
0 120 120 120 120 120 120 120 
##$TP= (0..7)
150 150 150 150 150 150 150 150 
##$TP07= 0
##$TPNAME0= <>
##$TPNAME1= <>
##$TPNAME2= <>
##$TPNAME3= <>
##$TPNAME4= <>
##$TPNAME5= <>
##$TPNAME6= <>
##$TPNAME7= <>
##$TPOAL= (0..7)
0.5 0.5 0.5 0.5 0.5 0.5 0.5 0.5 
##$TPOFFS= (0..7)
0 0 0 0 0 0 0 0 
##$TUNHIN= 0
##$TUNHOUT= 0
##$TUNXOUT= 0
##$USERA1= <user>
##$USERA2= <user>
##$USERA3= <user>
##$USERA4= <user>
##$USERA5= <user>
##$V9= 5
##$VALIST= <valist>
##$VCLIST= <CCCCCCCCCCCCCCC>
##$VD= 0
##$VDLIST= <DDDDDDDDDDDDDDD>
##$VPLIST= <PPPPPPPPPPPPPPP>
##$VTLIST= <TTTTTTTTTTTTTTT>
##$WBST= 1024
##$WBSW= 4
##$XGAIN= (0..3)
0 0 0 0 
##$XL= 0
##$YL= 0
##$YMAX_a= 133401
##$YMIN_a= -111349
##$ZGOPTNS= <>
##$ZL1= 120
##$ZL2= 120
##$ZL3= 120
##$ZL4= 120
##$ABSF1= 15.86809
##$ABSF2= -2.183762
##$ABSG= 5
##$ABSL= 3
##$ALPHA= 0
##$AQORDER= 0
##$ASSFAC= 0
##$ASSFACI= 0
##$ASSFACX= 0
##$ASSWID= 0
##$AUNMP= <proc_1d>
##$AZFE= 0.1
##$AZFW= 0.1
##$BCFW= 0
##$BC_mod= 2
##$BYTORDP= 0
##$COROFFS= 0
##$CY= -3
##$DATMOD= 1
##$DC= 0
##$DFILT= <>
##$DTYPP= 0
##$F1P= 0
##$F2P= 0
##$FCOR= 1
##$FTSIZE= 16384
##$FT_mod= 6
##$GAMMA= 0
##$GB= 0
##$INTBC= 1
##$INTSCL= 0
##$ISEN= 128
##$LB= 0.24
##$LEV0= 0
##$LPBIN= 0
##$MAXI= 10000
##$MC2= 0
##$MEAN= 0
##$ME_mod= 0
##$MI= 1.114404
##$NCOEF= 0
##$NC_proc= -7
##$NLEV= 6
##$NOISF1= 3.799351
##$NOISF2= 2.8
##$NSP= 0
##$NTH_PI= 0
##$NZP= 0
##$OFFSET= 15.86809
##$PC= 1
##$PHC0= -13989.53
##$PHC1= 15.60085
##$PH_mod= 1
##$PKNL= yes
##$PPARMOD= 0
##$PSCAL= 0
##$PSIGN= 0
##$REVERSE= no
##$SF= 200.129977528606
##$SI= 16384
##$SIGF1= 3
##$SIGF2= 2
##$SINO= 5.538805
##$SIOLD= 16384
##$SREGLST= <1H.CDCl3>
##$SSB= 0
##$STSI= 16384
##$STSR= 0
##$SW_p= 3612.71676300578
##$SYMM= 0
##$S_DEV= 0
##$TDeff= 16384
##$TDoff= 0
##$TI= <>
##$TILT= no
##$TM1= 0
##$TM2= 0
##$TOPLEV= 0
##$USERP1= <user>
##$USERP2= <user>
##$USERP3= <user>
##$USERP4= <user>
##$USERP5= <user>
##$WDW= 1
##$XDIM= 16384
##$YMAX_p= 484149708
##$YMIN_p= -226683
$$ End of Bruker specific parameters
$$ ---------------------------------
##NTUPLES= NMR SPECTRUM
##VAR_NAME=  FREQUENCY,     SPECTRUM/REAL,   SPECTRUM/IMAG
##SYMBOL=    X,             R,               I
##VAR_TYPE=  INDEPENDENT,   DEPENDENT,       DEPENDENT
##VAR_FORM=  AFFN,          ASDF,            ASDF
##VAR_DIM=   16384,         16384,           16384
##UNITS=     HZ,            ARBITRARY UNITS, ARBITRARY UNITS
##FACTOR=    0.220516191357247, 1,           1
##FIRST=     3175.68043026044, 0,            0
##LAST=      -437.036332745344, 0,           0
##MIN=       -437.036332745344, -226683,     0
##MAX=       3175.68043026044, 484149708,    0
$$ Real data points
##PAGE= N=1
##DATA TABLE= (X++(R..R)), XYDATA
$$ [...]
7894B951467k2337j3046k6886p665m9893p4480n7682r3074o6755p0956r5304r8044
$$ 2951467 2929130 2916084 2889198 2881533 2831640 2757160 2699478 2606404 2539649 2468693 2373389 2275345
7882B275345j02208l7193o1145m3617m4559o7225l7669k0775n8999m0873p453
$$ 2275345 2173137 2135944 2074799 2031182 1986623 1919398 1881729 1860954 1801955 1761082 1753629
7871A753629l0068m7130k3960L591m8905l6323j6513m1695l2031J7286k9508o060
$$ 1753629 1723561 1676431 1652471 1656062 1607157 1570834 1554321 1512626 1480595 1497881 1468373 1462313
7859A462313k2455L6275K3876m2082k1838j6749J2063J0057l5605l0928P77R27
$$ 1462313 1439858 1476133 1500009 1457927 1436089 1419340 1431403 1441460 1405855 1374927 1375704 1376631
7847A376631o865k7109r853m1106o160K1420j6072p2098K1595l1628j2846l1606
$$ 1376631 1369766 1342657 1332804 1291698 1285538 1306958 1290886 1218788 1240383 1208755 1195909 1164303
7835A164303J5348j8453j247o737l1520J0432j777R709M05j3044n380M822M106
$$ 1164303 1179651 1161198 1159951 1153214 1121694 1132126 1130349 1140058 1140463 1127419 1122039 1126861 1130967
7822A130967P38m5073o944j6895k3805l9111l0347j0503l9394l7078j47926k04795
$$ 1130967 1131705 1086632 1079688 1062793 1038988 999877 969530 959027 919633 882555 734629 529834
7810E29834L09723M95314J0918j20493m1189j3073j851J9421K2954J8708K6520
$$ 529834 839557 1334871 1345789 1225296 1184107 1171034 1169183 1188604 1211558 1230266 1256786
7799A256786k5337K731k133J8898Q73k9493m5756j1245j1402N499r636m2135k724
$$ 1256786 1231449 1234180 1232047 1250945 1251818 1222325 1176569 1165324 1153922 1159421 1149785 1107650 1104926
7786A104926j3827m0013k263N436k5793R154l1893K0650l3006m407l463K6886
$$ 1104926 1091099 1051086 1048823 1054259 1028466 1037620 1005727 1026377 993371 988964 985501 1012387
7774A012387r066j5403L4856P901m601J3407O820j6650J0714N7434P188m1843
$$ 1012387 1003321 987918 1022774 1030675 1026074 1039481 1046301 1029651 1040365 1097799 1104987 1063144
7762A063144M641M7577K5705L827N0395L6613L4714J5279K4394P478J3800L9263
$$ 1063144 1067785 1115362 1141067 1144894 1195289 1231902 1266616 1281895 1306289 1313767 1327567 1366830
7750A366830J1988n140J4557l7809l6839p992q175m9080p9758l2488m631l7742
$$ 1366830 1378818 1373678 1388235 1350426 1313587 1305595 1297420 1248340 1168582 1136094 1131463 1093721
7738A093721l180J1551P265O462j0786L326j7855j5992J4234L4113k243R264J3981
$$ 1093721 1090541 1102092 1109357 1115819 1105033 1108359 1090504 1074512 1088746 1122859 1120616 1129880 1143861
7725A143861o885K8592K2057J8422R316K0111O675L8198J3920k458R469O889J6763
$$ 1143861 1136976 1165568 1187625 1206047 1215363 1235474 1242149 1280347 1294267 1291809 1301278 1308167 1324930
7712A324930J9289J9581K3766p409k0207k3198M2681L8878J4954q236j4390J9807
$$ 1324930 1344219 1363800 1387566 1380157 1359950 1336752 1379433 1418311 1433265 1425029 1410639 1430446
7700A430446J5654Q458j7089j7727K8695M9541j3776l8395K071l2058M451L123
$$ 1430446 1446100 1454558 1437469 1419742 1448437 1497978 1484202 1445807 1447878 1415820 1420271 1423394
7688A423394j5246q254Q427K0488M724o0504l4888m274k834J2850k1104n0233
$$ 1423394 1408148 1399894 1408321 1428809 1433533 1373029 1338141 1333867 1331033 1343883 1322779 1272546
7676A272546k7877r535j7316j2538l9524J0778R035k9891l0606k0298Q371k3194
$$ 1272546 1244669 1235134 1217818 1205280 1165756 1176534 1185569 1155678 1125072 1104774 1113145 1089951
7664A089951j4798j5693m2432q687l4439m2145J785l699l3111o662k4174m667
$$ 1089951 1075153 1059460 1017028 1008341 973902 931757 933542 929843 896732 890070 865896 861229
7652H61229l1517m089M345m0719o981Q00Q141k7038M145K5027l5864k049Q503
$$ 861229 829712 825623 829968 789249 782268 783068 791209 764171 768316 793343 757479 755430 763933
7639G63933J8667k9955Q548L705k761l0535j086L9890l0358J0090Q820j6725J9668
$$ 763933 782600 752645 761193 764898 762137 731602 730516 770406 740048 750138 758958 742233 761901
7626G61901l1310k0144k4936L2661K0835k2298K0558m0641j4405j1176j763L4228
$$ 761901 730591 710447 685511 718172 739007 716709 737267 696626 682221 671045 669282 703510
7614G03510j8981j9275O0831K009j2672J9865K6058K4430J9536l9524J209L0827
$$ 703510 684529 665254 726085 728094 715422 735287 761345 785775 805311 765787 766996 797823
7602G97823K0562J7723P0451N1253J9858R104L2304K4012J2378k1875n781K8501
$$ 797823 818385 836108 906559 957812 977670 986774 1019078 1043090 1055468 1033593 1027812 1056313
7590A056313n089K2803l0010N5285j6107l126m0524k2418k9980k160L342m4441
$$ 1056313 1051224 1074027 1044017 1099302 1083195 1080069 1039545 1017127 987147 984987 988329 943888
7578I43888M856j9189l6236k7759k7018j3623q463k2227k2047m0253j3362L148
$$ 943888 948744 929555 893319 865560 838542 824919 816456 794229 772182 731929 718567 721715
7566G21715k2924l9796k141P931r165j0762l1515o494K4991k6328k6757K175l2921
$$ 721715 698791 658995 656854 664785 655620 644858 613343 606849 631840 605512 578755 580930 548009
7553E48009M810o313j2813N455q399l9212l9071K3331p143k8643k1572J4159n101
$$ 548009 552819 546506 533693 539148 530749 491537 452466 475797 468654 440011 418439 432598 427497
7540D27497o434r88J2850P728O016K672j1960k6701J5086Q087j9575j9829J8403
$$ 427497 421063 420075 432925 440653 446669 449341 437381 410680 425766 433853 414278 394449 412852
7527D12852N3233l9557l3631J7497K2887J2924j0894J195K981K1906M2972L3716
$$ 412852 466085 426528 392897 410394 433281 446205 435311 436506 439487 461393 504365 538081
7515E38081L7535k6522j6952j1520m0103j37j7623n562l5387l132J2698j701k3457
$$ 538081 575616 549094 532142 520622 480519 480382 462759 457197 421810 418678 431376 429675 406218
7502D06218k7585p864Q863K8912K9356N5602L843l938j4133l3987l7844l940l5112
$$ 406218 378633 370769 379632 408544 437900 493502 497345 493407 479274 445287 407443 403503 368391
7489C68391l65r556J5721L425M818P019l2314m1856P980L4129j5387P009l3425
$$ 368391 368026 358470 374191 377616 382434 389453 357139 315283 323263 357392 342005 349014 315589
7476C15589K6488J108j7201P897M8026j497j2078k0395L7561J4317N448J5519
$$ 315589 342077 343185 325984 333881 381907 380410 368332 347937 385498 399815 405263 420782
7464D20782k4692k1542P980l2433p879N146K1114k5780l0431r538J4460N690L9367
$$ 420782 396090 374548 382528 350095 342216 347362 368476 342696 312265 302727 317187 322877 362244
7451C62244l528K161J8692J4356k0611m260o009k0631O927l9673J2775L9599l4729
$$ 362244 358716 360877 379569 393925 373314 369054 363045 342414 349341 309668 322443 362042 327313
7438C27313k0544Q033R071J265k4729K2785l0911j3835j28J1589l8109o435J0
$$ 327313 306769 314802 323873 325138 300409 323194 292283 278448 278320 289909 251800 245365 245375
7425B45375J4807j18n9061P499Q55M968M4924j4579L926k8150o761j89J31j5270
$$ 245375 260182 260064 201003 208502 209357 214325 259249 244670 248596 220446 213685 213496 213627 198357
7411A98357L3930k8697m120J1731J1540k4030j2530J5158J0080J8738J1780j7222
$$ 198357 232287 203590 199470 211201 222741 198711 186181 201339 211419 230157 241937 224715
7399B24715j7784k7425j6807J1160Q935p119O002J419N715J936N009j9092q856
$$ 224715 206931 179506 162699 173859 182794 175675 181677 183096 188811 190747 195756 176664 167808
7386A67808k1316R059M1597Q94q522J2928l0708N567L4648J4054l8989j8523J3647
$$ 167808 146492 155551 197148 198042 189520 202448 171740 177307 211955 226009 187020 168497 182144
7373A82144l008j7018m220K6455j6636m254m638k2660K6798Q32k3070M741j5109
$$ 182144 179136 162118 157898 184353 167717 163463 158825 136165 162963 163795 140725 145466 130357
7360A30357J1287K4343P845r322K1526R717K5621j7326o758l0496L1175j4024
$$ 130357 141644 165987 173832 164510 186036 195753 221374 204048 197290 166794 197969 183945
7348A83945l2812L1405k726j391J5418L502j6684j2688O546j3626o244K878K8243
$$ 183945 151133 182538 179812 178421 193839 197341 180657 167969 174515 160889 154645 157523 185766
7335A85766J2171k0606k5899n209n185K8041l731q817J2579M570n804J1406j5472
$$ 185766 197937 177331 151432 146223 141038 169079 165348 156531 169110 173680 167876 179282 163810
7322A63810O928k1693j6071k0224p829J4930J5643R363L6109j2379j0491k8786
$$ 163810 170738 149045 132974 112750 104921 119851 135494 144857 180966 168587 158096 129310
7310A29310j3940k1143L7442K0135j2862J7061j3078k337J6347M650j1146k2677
$$ 129310 115370 94227 131669 151804 138942 156003 142925 140588 156935 161585 150439 127762
7298A27762L02K7669k4572J4266p786q994j4972O313K1138m820R003L3669k081
$$ 127762 128064 155733 131161 145427 137641 128647 113675 119988 141126 136306 145309 178978 176897
7285A76897l9827p217J8332j1733R822q070k213j5260K1757O238o193q015K726
$$ 176897 137070 129853 148185 136452 146274 138204 135991 120731 142488 148726 142533 134518 137244
7272A37244L907O818k523l4304O763L4993p756n083Q434M914L468l9007j3266
$$ 137244 141151 147969 145446 111142 117905 152898 145142 140059 148493 153407 156875 117868 104602
7259A04602K2838M179l0494k3317J5246J0489K9645p285J0144J640k1520k8472
$$ 104602 127440 131619 101125 77808 93054 103543 133188 125903 136047 137687 116167 87695
7247H7695L2862K089J2740k3068l4671L3091K1483p144p496r964j3466M958J6286
$$ 87695 120557 122646 135386 112318 77647 110738 132221 125077 117581 107617 94151 99109 115395
7234A15395l12j453m100K0857k071m216o699k5276J8757j4946J5556m939K7032
$$ 115395 115083 113630 109530 130387 128316 124100 117401 92125 110882 95936 111492 106553 133585
7221A33585n091K615N604j3354M983j0670q455k3557M200J888k2662p454P364
$$ 133585 128494 131109 136713 123359 128342 117672 109217 85660 89860 91748 69086 61632 68996
7208F8996J4008K8072m8152N145K7644M356N483P528j3653K4359k7745j8410K220
$$ 68996 83004 111076 62924 68069 95713 100069 105552 113080 99427 123786 96041 77631 79851
7195G9851j7555O922k8303L5239O827L6613o096k4157J4596K4216m3189K4947
$$ 79851 62296 69218 40915 76154 82981 119594 113498 89341 103937 128153 84964 109911
7183A09911L0061l8542J550r3k3684l060M8946j3185k9043K0498p987P580j6927
$$ 109911 139972 101430 102980 102887 79203 76143 125089 111904 82861 103359 95372 102952 86025
7170H6025O558O481j3788J3921J6939k0949r967l1783k8514K1775K5655q703N3226
$$ 86025 92583 99064 85276 99197 116136 95187 85220 53437 24923 46698 72353 63650 116876
7157A16876k9163o318K6720p53j1661N899j8041k3875J4748M220k3641K6669J7088
$$ 116876 87713 81395 108115 107362 95701 101600 83559 59684 74432 78652 55011 81680 98768
7144I8768j2924J5639n7767K6659K2609j0510l0189L132l05J8892k6707m862j1331
$$ 98768 85844 101483 43716 70375 92984 82474 52285 55417 55112 74004 47297 42435 31104
7131C1104j707o214M677K4919P844j9589J000K5281K933p560J9505J676O898K4051
$$ 31104 29397 23183 27860 52779 60623 41034 42034 67315 70248 62688 82193 83869 90767 114818
7117A14818j2209k5070r741M804L624n817q245Q471j4255k220M30K8601L4323
$$ 114818 102609 77539 67798 72602 76226 70409 62164 70635 56380 54160 54590 83191 117514
7104A17514l388J1331m1217k4532K4608R822j6637M651j3970o432K2116j8167
$$ 117514 114126 125457 84240 59708 84316 94138 77501 82152 68182 61750 83866 65699
7092F5699P502j6462o012K3801k0129K4928j8952l329j0296m504L3331R371K892
$$ 65699 73201 56739 50727 74528 54399 79327 60375 57046 46750 42246 75577 84948 87840
7079H7840k9306j7800O071J0696J0721k7200k9257N4148j000k8382K0318K744
$$ 87840 58534 40734 46805 57501 68222 41022 11765 65913 64913 36531 56849 59593
7067E9593l4731K6995J4585J2865l2255r854L010J3237M2829m368l3672J8673
$$ 59593 24862 51857 66442 79307 47052 37198 40208 53445 96274 91906 58234 76907
7055G6907N192r9p166O362O058m755P985J1571k7488N677k7403M676j1689n371
$$ 76907 82099 82000 74834 81196 87254 82499 90484 102055 74567 80244 52841 57517 45828 40457
7041D0457M483P283K8664l831l870o895J2519J5608R277k953j1299n1053J6612
$$ 40457 44940 52223 80887 77056 73186 66291 78810 94418 103695 100742 89443 38390 55002
7028E5002K6137J034j5154J8045j9838J1879J7467j1158K3380K152o363k0128
$$ 55002 81139 82173 67019 85064 65226 77105 94572 83414 106794 108946 102583 82455
7016H2455j4635L999n672J2309L6649R281j3003O298N774J3431j7562J9533j0967
$$ 82455 67820 71819 66147 78456 115105 124386 111383 117681 123455 136886 119324 138857 127890
7003A27890m0873k1066K0971J1053l8523Q068Q597r260K1110K1680K1931l3691
$$ 127890 87017 65951 86922 97975 59452 67520 76117 66857 87967 109647 131578 97887
6991I7887q147j3169j4900M09J481K7987J0351j9246J473k0429P486Q804K741
$$ 97887 89740 76571 61671 62080 63561 91548 101899 82653 84126 63697 71183 79987 82728
6978H2728j3531L262p433P722P927j7586q46l0884L5298l297o90J8443p39K8323
$$ 82728 69197 72459 65026 72748 80675 63089 62243 31359 66657 63360 62670 81113 80374 108697
6964A08697k1930O407L120l8622j5395Q719L9552n062l1982p723J1764J8373n434
$$ 108697 86767 93174 96294 57672 42277 50996 90548 85486 53504 45781 57545 75918 70484
6951G0484k462K7514k133j0962J422L04K3283j08m0162K2463k2772K1699J9910
$$ 70484 68022 95536 93403 82441 83863 84167 107450 107342 67180 89643 66871 88570 108480
6938A08480K148O761j7101N378p833J5593p751L799K8727P130J0360j2768j848
$$ 108480 110628 117389 100288 105666 97833 113426 105675 109474 138201 145331 155691 142923 141075
6925A41075n683K0484r402o457J1358o318j7675j0442J6102k707l4859Q773j0197
$$ 141075 135392 155876 146474 140017 151375 145057 127382 116940 133042 130335 95476 104249 94052
6912I4052J7827J6923j0842k753R416J7716P371l0003k2935k26N551M268k1001
$$ 94052 111879 128802 117960 115207 124623 142339 149710 119707 96772 96546 102097 106365 85364
6899H5364M5667R454l4718K0294N941p967Q613J3244m278j768J231K4092N141
$$ 85364 131031 140485 105767 126061 132002 124035 132648 145892 141614 139846 141077 165169 170310
6886A70310j5640K230l4181j272K4299K960J5862J6814j5743j7908J9676J1588
$$ 170310 154670 156900 122719 121447 145746 148706 164568 181382 165639 147731 167407 178995
6874A78995k7275j9815L3971J4094j0967L7725J6370R958O470K6167K0514M8437
$$ 178995 151720 131905 165876 179970 169003 206728 223098 233056 239526 265693 286207 334644
6862C34644J8699O054J3728n930K1567M1399j0663L3735J8582j9176n5628o4323
$$ 334644 353343 359397 373125 367195 388762 430161 419498 453233 471815 452639 397011 332688
6850C32688j8945m295k1838l6479N6157o565l6282J1828m0588k7853L8874n119
$$ 332688 313743 309448 287610 251131 307288 300723 264441 276269 235681 207828 246702 241583
6838B41583k9529m009k304J0548q786q223L556k5204m335L483k3617J9042j7831
$$ 241583 212054 208045 205741 216289 207503 199280 202836 177632 173297 176780 153163 172205 154374
6825A54374J174Q628K4681N784l5642J0723L3523j3454l6192J1588J3776q848
$$ 154374 155548 164176 188857 194641 158999 169722 203245 189791 153599 165187 178963 170115
6813A70115j2016L8397Q942k6435m9248k3541L7328K5686j9143j5697l378k6907
$$ 170115 158099 196496 205438 179003 129755 106214 143542 169228 150085 134388 131010 104103
6801A04103L1276R413o501Q062K0473J0306l8024J909P597j8651K7659j3291j018
$$ 104103 135379 144792 138291 146353 166826 177132 139108 141017 148614 129963 157622 144331 143313
6788A43313L540k729J0849p919M829K7328p939j5332L3412n771k1725n071q951
$$ 143313 146853 144124 154973 147054 151883 179211 171272 155940 189352 183581 161856 156785 147834
6775A47834L5549m980P200R901M386j7279N818j3795l4733L0127K5221K1534l0781
$$ 147834 183383 178403 185603 195504 199890 182611 188429 174634 139901 170028 195249 216783 186002
6762A86002K7095l6139M430K8208M05n292K1369r080l6500k1032K7540k6229l2968
$$ 186002 213097 176958 181388 209596 210001 204709 226078 216998 180498 159466 187006 160777 127809
6749A27809j490J4870L0203J1915k654k1814J0472J2605m5816j6855M0231J172
$$ 127809 126319 141189 171392 183307 180653 158839 169311 181916 136100 119245 159476 160648
6737A60648j7130o932O455L1638l342J7695L2197N224j9243l335k0459k6015M831
$$ 160648 143518 136586 143041 174679 171337 189032 221229 226453 207210 203875 183416 157401 162232
6724A62232M1864R774j9344N396K0045M0M715J2066j504j6118j5271j0899j9231
$$ 162232 204096 213870 194526 199922 219967 220007 224722 236788 235284 219166 203895 192996 173765
6711A73765k6671J1073j3415K1366J3758o569K7618m2256m58K4094k0872k858
$$ 173765 147094 158167 144752 166118 179876 173307 200925 158669 158211 182305 161433 158575
6699A58575Q660k4237j232N970N5564l7460j3171L0114n2743l4653M9811j4141
$$ 158575 167235 142998 141766 147736 203300 165840 152669 182783 130040 95387 145198 131057
6687A31057r347J5213j8946j558M2719j6590r196L7003Q767k0395m276k5478J8089
$$ 131057 121710 136923 117977 116419 159138 142548 133352 170355 179122 158727 154451 128973 147062
6674A47062M3305K3747O973L799m7783J1822J7113l7307L5127J5830l5434k1499
$$ 147062 190367 214114 221087 224886 177103 188925 206038 168731 203858 219688 184254 162755
6662A62755K5875K1167p590k3837l1966K8244k0951K9617J4254J8407Q130K0971
$$ 162755 188630 209797 202207 178370 146404 174648 153697 183314 197568 215975 224105 245076
6650B45076k0906m3797J2284M491J2050q619L8400r077j6505R651M323l538R640
$$ 245076 224170 180373 192657 197148 209198 200579 238979 229902 213397 223048 227371 223833 233473
6637B33473j3021J9285R449o408J9885J5061k9554K9415M956j7229J2978J2599
$$ 233473 220452 239737 249186 242778 262663 277724 248170 277585 282541 265312 278290 290889
6625B90889k3712j2160j7066K9203J0386J4235n109q853L118o066j2020Q99n746
$$ 290889 267177 255017 237951 267154 277540 291775 286666 277813 280931 274865 262845 263744 257998
6612B57998j2104J7672N356M4767J2282R680J1673J091O705k1141K9228J2271
$$ 257998 245894 263566 268922 313689 325971 335651 347324 348415 355120 333979 363207 375478
6600C75478K5737K0548L9453L8054P415l1944L5234O9053N7283J1216K1590M2840
$$ 375478 401215 421763 461216 499270 506685 474741 509975 579028 636311 647527 669117 711957
6588G11957J9261r22q479J8250p3717o9450l1926m0235j6464p3153o6586M7746
$$ 711957 731218 730296 721817 740067 666350 596900 564974 524739 508275 435122 368536 416282
6576D16282m5035j8050k2339Q018q817k3809j659n4437k2234J2615J2771l0302
$$ 416282 371247 353197 330858 338876 330059 306250 304591 250154 227920 240535 253306 223004
6564B23004n0666L7197J5964J7572M4533l1195n2412L3645J2273k9408m684N049
$$ 223004 172338 209535 225499 243071 287604 256409 203997 237642 249915 220507 215823 220872
6552B20872l743k6540K0411j3473r461o392K1672J0664l2436K4120k6814j3114
$$ 220872 217129 190589 211000 197527 188066 181674 203346 214010 181574 205694 178880 165766
6540A65766K7611l3273m1104J1747M1421J403k413L0702n90j8036R974m5806P953
$$ 165766 193377 160104 119000 130747 172168 173571 171158 201860 201270 183234 193208 147402 155355
6527A55355L0765l6264J773M318K0489j2326q109J2046l536K7010j8465j8496
$$ 155355 186120 149856 151629 155947 176436 164110 156001 168047 164511 191521 173056 154560
6515A54560J0082K0060l0890l500j167o490J229L9069J0804J745j963L0475k7431
$$ 154560 164642 184702 153812 150312 149145 142655 143884 182953 193757 195502 193539 224014 196583
6502A96583l4388R404K5876J4638l6280L0144K158L900n2380j646l7162J4825
$$ 196583 162195 171599 197475 212113 175833 205977 208135 212035 159655 158009 120847 135672
6490A35672J2252k4118K718q293P514J9767O866o207k5771N727j364N563j3820
$$ 135672 147924 123806 126524 118231 125745 145512 152378 146171 120400 126127 124763 130326 116506
6477A16506R768l743Q000m4653n253N2884K8776r247K811r771k1773o296l6560
$$ 116506 126274 122531 130531 85878 80625 133509 162285 153038 155849 146078 124305 118009 81449
6464H1449J2709n64J8396K4968K9325j5248J8645j6166L459M832K5188l1063m346
$$ 81449 94158 93594 111990 136958 166283 151035 169680 153514 156973 161805 186993 155930 151584
6451A51584K262L80j106k0297K02j2813K7963K2436k3474K481L0615P953L9869
$$ 151584 153846 154226 153120 132823 133025 120212 148175 170611 147137 149618 180233 188186 228055
6438B28055J3000m6446J9842J7139J0984M2816l1327J3711n139J5908M2621l439
$$ 228055 241055 194609 214451 231590 242574 285390 254063 267774 262635 278543 321164 317725
6426C17725L3905n494L606l7545k1891N0527J2477m815k8305K4961J4833j0731
$$ 317725 351630 346136 349742 312197 290306 340833 353310 348495 320190 345151 359984 349253
6414C49253O561L6272J5496L5506K9198M508M4185K3014M0770m384K0049K8437
$$ 349253 355814 392086 407582 443088 472286 476794 520979 543993 584763 580379 600428 628865
6402F28865N6664L713K0101N353l863o76n5583j8376Q819m946O458P234k989L2920
$$ 628865 685529 689242 709343 714696 710833 710157 654574 636198 645017 640071 646529 653763 650774 683694
6388F83694j1780K4055K07m701l7839K6943O2838m247L1715M0735L7837L3176
$$ 683694 671914 695969 696176 691475 653636 680579 743417 739170 770885 811620 849457 882633
6376H82633K8682k615K745j1695L1945K450o258p97J282L2904l1970m817J0861
$$ 882633 911315 908700 911445 899750 931695 934145 927887 927090 928372 961276 929306 924489 935350
6363I35350r213j0778l1319n5170q2052j7906J3572k5405K595p053p533N304N0163
$$ 935350 926137 915359 884040 828870 746818 728912 742484 717079 719674 712621 705088 710392 760555
6350G60555l0388k4085M6434J9285M363J3476L1198K4902l56L1466j2065l0000
$$ 760555 730167 706082 752516 771801 776164 789640 820838 845740 845384 876850 864785 834785
6338H34785j7359l2788j2654m3568n8169o903n7564n0389k6479j3232l4248k0395
$$ 834785 817426 784638 771984 728416 670247 663344 605780 555391 528912 515680 481432 461037
6326D61037j8738o059M516R417k6297k1004N5966j0218L458K0031o091m972N68
$$ 461037 442299 436240 440756 450173 423876 402872 458838 448620 452078 472109 466018 461046 461614
6313D61614K424l1060j4696J2040l1038m7162o4826M2420M228j6095m2958J1674
$$ 461614 464038 432978 418282 430322 399284 352122 287296 329716 333944 317849 274891 286565
6301B86565J6122k1885j9616o408j4131o888j2117J6963K427L2921N311l1226
$$ 286565 302687 280802 261186 254778 240647 233759 221642 238605 241032 273953 279264 248038
6289B48038o284l3345J6763J6911j5443k8459L183P156K2881m0188j1762M9490
$$ 248038 241754 208409 225172 242083 226640 198181 201364 208520 231401 191213 179451 228941
6277B28941j2418j0201O857k1024J1283K3783Q483j2264L6006q506j9824p861
$$ 228941 216523 206322 213179 192155 203438 227221 235704 223440 259446 250940 231116 223255
6265B23255K864n15q172P118K4004j3932j7530k63J9715O760Q693j5270L2832
$$ 223255 226119 225604 217432 224550 248554 234622 217092 216829 236544 243304 251997 236727 269559
6252B69559R624J9278O2314j2958L1398J5588J3057n125K5962N167J5775K3144
$$ 269559 279183 298461 360775 347817 379215 394803 407860 402735 428697 433864 449639 472783
6240D72783J4496J5028M9897P831R95m887j658K7896L1161J9959L6475N8367J2577
$$ 472783 487279 502307 552204 560035 561030 556143 554485 582381 613542 633501 669976 728343 740920
6227G40920L3526O6855L5626O4737O6675N8017P5234K1702j1223p4002j13480
$$ 740920 774446 841301 876927 941664 1008339 1066356 1141590 1163292 1152069 1078067 964587
6216I64587o0310n0416j05492m0147n1040j1997J9184L9397j3699k2498K1076
$$ 964587 904277 853861 748369 708222 657182 645185 664369 703766 690067 667569 688645
6205F88645J4754N4409J5091J7409K1004L8257M49J5344J586k7001L9589K1944
$$ 688645 703399 757808 772899 790308 811312 849569 850018 865362 866948 839947 879536 901480
6193I01480L2770L3675O4656Q3963J11698M4083O0936Q7409J22714P0391N6068
$$ 901480 934250 967925 1032581 1116544 1228242 1272325 1333261 1420670 1543384 1613775 1669843
6182A669843M7014j1840n0373j18083j09934j51739j28636q4626j18732q4498
$$ 1669843 1716857 1705017 1654644 1536561 1426627 1274888 1146252 1061626 942894 858396
6172H58396m6111l9522j3007m0675l4019r592j3259K4854l425l229J7197l0307
$$ 858396 812285 772763 759756 719081 685062 675470 662211 687065 683640 680411 697608 667301
6160F67301k9493n947K6837P897K489K7308L43j3584O1261L2060N661J0120M6589
$$ 667301 637808 631861 658698 666595 669084 696392 696735 683151 744412 776472 782133 792253 838842
6147H38842N7371N5773L2805L3232j0230n7160q0270q4091r0418k9854o8415p3988
$$ 838842 896213 951986 984791 1018023 1007793 950633 870363 786272 695854 666000 597585 523597
6135E23597n1720L431M082p880j7047m6358k3042J7942q837J1007k4510j4848
$$ 523597 471877 475308 479390 471510 454463 408105 385063 403005 394168 405175 380665 365817
6123C65817J5435k6834N388J6239J4082j3780o242n3282N971J1037K1245p76J0173
$$ 365817 381252 354418 359806 376045 390127 376347 370105 316823 322794 333831 355076 354300 364473
6110C64473r274l4356L0342l6478K2177k0181j7306L1320k15n976j0220J2k0633
$$ 364473 355199 320843 351185 314707 336884 316703 299397 330717 330502 324526 314306 314318 293685
6097B93685L9655M9996j0988m5702K4103j8076r098k1290P636k4765j299J3034
$$ 293685 333340 383336 372348 326646 350749 332673 323575 302285 309921 285156 283857 296891
6085B96891j6573M060j438j4442j3288J8526J6805j0172l3479L472J744q148j378
$$ 296891 280318 284378 282940 268498 255210 273736 290541 280369 246890 250362 252106 243958 242580
6072B42580J7010J9193J927r752m383R624o372J1363r823k8663L0857k093J1262
$$ 242580 259590 278783 280710 270958 266575 276199 269827 281190 271367 242704 273561 271468 282730
6059B82730K7358R096j7245m5380K7387L1830J0677j3141k5200J751k548J8234
$$ 282730 310088 319184 301939 256559 283946 315776 326453 313312 288112 289863 287315 305549
6047C05549l0876K0418K324K1758K0714r841j700k694l92j475Q572l9028j2849
$$ 305549 274673 295091 297415 319173 339887 330046 328346 325652 325260 323785 332357 293329 280480
6034B80480o136J0288r07R114J787N5436p045q9p44j0077k9514k356K6784J3683
$$ 280480 274344 284632 283725 292839 294626 350062 343017 342928 342184 332107 302593 300237 327021 340704
6020C40704K4048L273N432j2030n69N4142P371M075J2460m1260j9728m1366j0814
$$ 340704 364752 368025 373457 361427 360858 415000 422371 426446 438906 397646 377918 336552 325738
6007C25738J9605k0003l7233J5704k4014p791O936K8610O296L999j7448n966L1331
$$ 325738 345343 325340 288107 303811 279797 272006 278942 307552 313848 317847 300399 294433 325764
5994C25764K052j566J18J1072M3275K4498L4234j1208k5785O709l1484l2553k874
$$ 325764 327816 326250 326368 337440 380715 405213 439447 428239 402454 409163 377679 345126 342252
5981C42252N5460o639l1818l2474j5628J8400Q974M5533J3406j5825L484j7991
$$ 342252 397712 391073 359255 326781 311153 329553 338527 384060 397466 381641 385125 367134
5969C67134p461J8073k9147k381K5034P036J327n0246k8026L4382M4835o361k0697
$$ 367134 359673 377746 348599 346218 371252 378288 379615 329369 301343 335725 380560 374199 353502
5956C53502J2324M5689r625m0616n758M9678J1425l4413n232J2892k906j5341
$$ 353502 365826 411515 401890 361274 355516 405194 416619 382206 376974 389866 386960 371619
5944C71619k0870k4170p648N36K967R282K2421k8569J793l3258J6857Q650M922
$$ 371619 350749 326579 318931 319467 322434 331716 354137 325568 327361 294103 310960 319610 324532
5931C24532j5475m562r549O613P847k888J5899J4906m376q751o972Q158J3769
$$ 324532 309057 304495 294946 301559 309406 306518 322417 337323 332947 324196 317224 325382 339151
5918C39151k7472J4800k2872m689J1064J0701J3612n337r426j32j3361K7941J1615
$$ 339151 311679 326479 303607 298918 309982 320683 334295 328958 319532 319400 306039 333980 345595
5905C45595K1164J3352J1884J3881k4982l1984J7240J184k529j2445J7237L247
$$ 345595 366759 380111 391995 405876 380894 348910 366150 367334 364805 352360 369597 372844
5893C72844L77k790r789M5211K431K9635j6439J1737K8322M0804N5898k4979l2116
$$ 372844 373221 370431 360642 405853 408284 437919 421480 433217 461539 502343 558241 533262 501146
5880E01146J4903L8956l0494l910J7704j5736L1647J5932J0687j9825k6766J4222
$$ 501146 516049 555005 524511 520601 538305 522569 554216 570148 580835 561010 534244 548466
5868E48466K2554K4805j3459j0082j5077L3860J250J4643M297O124O525N986K8980
$$ 548466 571020 595825 582366 572284 557207 591067 592317 606960 611257 617381 623906 629892 658872
5855F58872j3693j5284n203L1598j5127k1412K8384N1247j6798Q026J5287J8975
$$ 658872 645179 629895 624692 656290 641163 619751 648135 699382 682584 690610 705897 724872
5843G24872J1489J7279J0224M0390K2827n900M5944K5061M8015Q8608P7589L4428
$$ 724872 736361 753640 763864 804254 827081 821181 867125 892186 940201 1028809 1106398 1140826
5831A140826N6264J00055O5801N7102R3437O7232J7012n741l0358p7873r1459
$$ 1140826 1197090 1297145 1362946 1420048 1513485 1580717 1597729 1591988 1561630 1483757 1392298
5820A392298j01758p1805k9023l4818n7562Q55J7729m1121p501L2315j805M1947
$$ 1392298 1290540 1218735 1189712 1154894 1097332 1098187 1115916 1074795 1067294 1099609 1097804 1139751
5808A139751J0212J73K2791N1840M1475P5875P5581N8172P9250P7641Q5203M6744
$$ 1139751 1149963 1150136 1172927 1224767 1266242 1342117 1417698 1475870 1555120 1632761 1717964 1764708
5796A764708J4185j6407l6495p8932m2460l8983Q611L0899L4303J9058j3747L192
$$ 1764708 1778893 1762486 1725991 1647059 1604599 1565616 1574227 1605126 1639429 1658487 1644740 1647932
5784A647932m6519p6523p5538r7969q2517r7708n2877l5020k1041l2233K210K3007
$$ 1647932 1601413 1524890 1449352 1351383 1268866 1171158 1118281 1083261 1062220 1029987 1032197 1055204
5772A055204j5856J2344m478J3268N841L3764L4569K995L4558N9301O6701Q645
$$ 1055204 1039348 1051692 1047214 1060482 1066323 1100087 1134656 1137651 1172209 1231510 1298211 1306856
5760A306856J9673P3774O7849m924o5553p9108r1039p0712q9663o1010k8235j3931
$$ 1306856 1326529 1400303 1468152 1463228 1397675 1318567 1227528 1156816 1067153 1006143 977908 963977
5748I63977m9473l2209n7225M969j4004p522J4465M104L038K5014k914l7710K0068
$$ 963977 914504 882295 825070 830039 816035 808513 822978 827082 830120 855134 852220 814510 834578
5735H34578J9794L5009K467J3861K5938K3057J2543r91M4623K3778L320K960L1891
$$ 834578 854372 889381 891848 905709 931647 954704 967247 966256 1010879 1034657 1037977 1040937 1072828
5722A072828L2080k692L7252m969M4421L7551r816j570m3185j7928r106j6682
$$ 1072828 1104908 1102216 1139468 1134499 1178920 1216471 1206655 1205085 1161900 1143972 1134866 1118184
5710A118184L5535N564P314K1071o331j6702K3907k607P035l6485o8131k9739
$$ 1118184 1153719 1159283 1166597 1187668 1181337 1164635 1188542 1185935 1192970 1156485 1088354 1058615
5698A058615o1771l4233K2712o145k1846P85o2232k3882j9162l66j2622l7208
$$ 1058615 996844 962611 985323 979178 957332 958117 895885 872003 852841 852475 839853 802645
5686H02645k1026k659K2102j1629k115j7352j4604J7844P93k8376J6597R733N220
$$ 802645 781619 778960 801062 789433 787318 769966 755362 773206 773999 745623 762220 771953 777173
5673G77173j0280M738K9205J2203J4743K8567O33n049L7139N840O441J4083qL4451
$$ 777173 766893 771631 800836 813039 827782 856349 856982 851933 889072 894912 901353 915436 915428 949879
5659I49879J7238O4430j319K2022K8768K8296P1106O7993N1938J1270l737J4583
$$ 949879 967117 1031547 1030228 1052250 1081018 1109314 1180420 1248413 1300351 1311621 1307884 1322467
5647A322467j0975j0011k5291m122l5624N046L5821q00K598j4974J0318M6577
$$ 1322467 1311492 1301481 1276190 1272068 1236444 1241490 1277311 1276511 1279109 1264135 1274453 1321030
5635A321030K4222j7219m1120m3622r8275n2202j8714p5231m0225m2220m6970
$$ 1321030 1345252 1328033 1286913 1243291 1145016 1092814 1074100 998869 958644 916424 869454
5624H69454k9644m0716j5819j639l0354j114k357j7840k1317q611j5168L8963
$$ 869454 839810 799094 783275 781636 751282 750168 747811 729971 708654 700043 684875 723838
5612G23838Q426L5022j8924N471L938l625n362q715O3317M850n0088k4459j1867
$$ 723838 732264 767286 748362 753833 757771 754146 748784 740069 803386 808236 758148 733689 721822
5599G21822K1097j1658k8989m100p362L14J3961O55q20m508J2648O182K1167j5045
$$ 721822 742919 731261 702272 698172 690810 691124 705085 705740 704920 700412 713060 719242 740409 725364
5585G25364j9968l2946K4599j0313R853K2070R704K1715j5917m4860J9698J4456
$$ 725364 705396 672450 697049 686736 696589 718659 728363 750078 734161 689301 708999 723455
5573G23455k4257k9166k0488P53K3889J0996m47L422K2783q922M891P987O44J470
$$ 723455 699198 670032 649544 650297 674186 685182 684735 688157 710940 702018 706909 714896 715540 717010
5559G17010p441P032K3500l969l369k4452J3639K1951J5837K2881m368K2837r77
$$ 717010 709569 716601 740101 736132 732763 708311 721950 743901 759738 782619 778251 801088 800111
5546H00111q928P24k408R220L2397Q206m327M3811L0404J3389N914O638K1385
$$ 800111 791183 791907 789499 798719 831116 839322 834995 878806 909210 922599 928513 935151 956536
5533I56536K1363j049m038L7370O180J7848J410K0491K6395O7490q154J5782l7800
$$ 956536 977899 976850 972812 1010182 1016362 1034210 1035620 1056111 1082506 1149996 1141842 1157624 1119824
5520A119824K116L0745J6068j664L538J227K0488M761M444K3791L0396j4216n792
$$ 1119824 1121940 1152685 1168753 1167089 1170627 1171854 1192342 1197103 1201547 1225338 1255734 1241518 1235726
5507A235726J1300K6776M066J0798j9587K5950L6477M2718j6179k4868j9119K2691
$$ 1235726 1247026 1273802 1277868 1288666 1269079 1295029 1331506 1374224 1358045 1333177 1314058 1336749
5495A336749L1784k1651M6782L7875K849K4748J2117N7549J7665q618M7558J9324
$$ 1336749 1368533 1346882 1393664 1431539 1434388 1459136 1471253 1528802 1546467 1537849 1585407 1604731
5483A604731L8967M9346M4932L3462M027M1646O3379J7951k2866M8128M7613j8257
$$ 1604731 1643698 1693044 1737976 1771438 1775465 1817111 1880490 1898441 1875575 1923703 1971316 1953059
5471A953059l2756l5142k7302L9836N3612J2826N2037L3046P4942N9888O7765
$$ 1953059 1920303 1885161 1857859 1897695 1951307 1964133 2016170 2049216 2124158 2184046 2251811
5460B251811N6176L3405O0584j317P694j9379J3647K5258m0890j284p1586k3171
$$ 2251811 2307987 2341392 2401976 2400659 2408353 2388974 2402621 2427879 2386989 2385705 2314119 2290948
5448B290948p003J4837L3928J1770J5364L6200M7366N2135L9026L7302K4638L5083
$$ 2290948 2283945 2298782 2332710 2344480 2359844 2396044 2443410 2495545 2534571 2571873 2596511 2631594
5436B631594K1406l852r360J1650l0415j3422k9431n3141l7749j6365p003J3471
$$ 2631594 2653000 2649148 2639788 2651438 2621023 2607601 2578170 2525029 2487280 2470915 2463912 2477383
5424B477383r776q988J4840k6091J4181J7443L3111J7158R889k7456O44M7291
$$ 2477383 2467607 2458619 2473459 2447368 2461549 2478992 2512103 2529261 2539150 2511694 2512338 2559629
5412B559629l0119j1612o4529l5653n1590P675k7427k0252O857j1126k2745o0108
$$ 2559629 2529510 2517898 2453369 2417716 2366126 2373801 2346374 2326122 2332979 2321853 2299108 2239000
5400B239000k3188j8177n9600j8046j2668m6868o061R058P837k2746l0880q314
$$ 2239000 2215812 2197635 2138035 2119989 2107321 2060453 2054392 2063450 2071287 2048541 2017661 2009347
5388B009347m189j2561L0115K4195l9855O419L381K134L660N4077K4064J123o208
$$ 2009347 2005158 1992597 2022712 2046907 2007052 2013471 2016852 2018986 2022646 2076723 2100787 2101910 2095702
5375B095702J6028M0023N6491O4623K9203L7642L4709M9628O8770O8506n030M2504
$$ 2095702 2111730 2151753 2208244 2272867 2302070 2339712 2374421 2424049 2492819 2561325 2556295 2598799
5363B598799O0539L8883L7664N8097N5986Q2713O1439P1239N3649N1431P3385
$$ 2598799 2659338 2698221 2735885 2793982 2849968 2932681 2994120 3065359 3119008 3170439 3243824
5352C243824O2542Q5438J25586Q6755J04515J21965Q1833J06504J09860Q1339
$$ 3243824 3306366 3391804 3517390 3604145 3708660 3830625 3912458 4018962 4128822 4210161
5342D210161N0128Q330j0947K0260K1611J7690n424m2904m0814p9979l0454J2004
$$ 4210161 4260289 4268619 4257672 4277932 4299543 4317233 4311809 4268905 4228091 4148112 4117658 4129662
5330D129662K4981N3880M0545P1522N9818K5375J7934Q057q80j0329q0477o7365
$$ 4129662 4154643 4208523 4249068 4320590 4380408 4405783 4423717 4431774 4430894 4420565 4340088 4272723
5318D272723j5821p0849l9259o0690j44014j15866j37794j23376n8186p3000o9307
$$ 4272723 4256902 4186053 4146794 4086104 3942090 3826224 3688430 3565054 3506868 3433868 3364561
5307C364561l1095j3417L1496n001J397J8244L7181P7516j5704K9339q931l327
$$ 3364561 3333466 3320049 3351545 3346544 3347941 3366185 3403366 3480882 3465178 3494517 3485586 3482259
5295C482259p540J8433q767L7743J6390M4895O1799O4058Q8441J00598J06032
$$ 3482259 3474719 3493152 3484385 3522128 3538518 3583413 3645212 3709270 3797711 3898309 4004341
5284D004341Q1983L3226m7777j35205j70572j35235j41892o0200m1943k6130M645
$$ 4004341 4086324 4119550 4071773 3936568 3765996 3630761 3488869 3428669 3386726 3360596 3365241
5273C365241K0767O7522O757K630O1757L5139P0860R6919J27473R4558J04927
$$ 3365241 3386008 3453530 3460287 3462917 3524674 3559813 3630673 3727592 3855065 3949623 4054550
5262D054550k2671j51215j82131k51816k01670j54055j48971j09900r1048m7187
$$ 4054550 4031879 3880664 3698533 3446717 3245047 3090992 2942021 2832121 2741073 2693886
5252B693886l7051m2020m8563o1483p05l146J0113k0537n1316p998k9303j1607
$$ 2693886 2656835 2614815 2566252 2504769 2504064 2500918 2511031 2490494 2439178 2431180 2401877 2390270
5240B390270k1704j358K9598l2593P31J24K1386k1863j8234L2537L2584O892J1145
$$ 2390270 2368566 2367208 2396806 2364213 2364944 2365068 2386454 2364591 2346357 2378894 2411478 2418370 2429515
5227B429515L8954L4624M6095O5582P9692R8337N6712Q9290R3575O3574J67719
$$ 2429515 2468469 2503093 2549188 2614770 2694462 2792799 2849511 2938801 3032376 3095950 3263669
5216C263669J12864K4905k5339p1873j17768j39017j57950j06320p3070k4818
$$ 3263669 3376533 3401438 3376099 3304226 3186458 3047441 2889491 2783171 2710101 2685283
5206B685283j2928k857m7426k6209j0877P970k9712J0600O5542O5433R6622Q5227
$$ 2685283 2672355 2669498 2622072 2595863 2584986 2592956 2563244 2573844 2639386 2704819 2801441 2886668
5194B886668M6706Q6128R6227J12605J39195J29296J27884K9099p7661j35472
$$ 2886668 2933374 3019502 3115729 3228334 3367529 3496825 3624709 3653808 3576147 3440675
5184C440675j76969j70436j52354q7995r9946n7184m7184k8376j5947m1632j2247
$$ 3440675 3263706 3093270 2940916 2852921 2752975 2695791 2648607 2620231 2604284 2562652 2550405
5173B550405m967K4663P436l0218k2164K4840J6366k0525L1116O4380K7676L7196
$$ 2550405 2545438 2570101 2577537 2547319 2525155 2549995 2566361 2545836 2576952 2641332 2669008 2706204
5161B706204N7473L708m1234m6913p9192j9971l6890o6718j1464k0240k7228L1885
$$ 2706204 2763677 2767385 2726151 2679238 2600046 2580075 2543185 2476467 2465003 2444763 2417535 2449420
5149B449420m660L3039J4044K318M2673O4740M7626O0747M3512M9899R6174P8120
$$ 2449420 2444760 2477799 2491843 2494161 2536834 2601574 2649200 2709947 2753459 2803358 2899532 2977652
5137B977652N1316N2113J9033O0551J2533q7397n5589n3604m3384l8161K2482
$$ 2977652 3028968 3081081 3100114 3160665 3173198 3085801 3030212 2976608 2933224 2895063 2917545
5126B917545l5176O3597M1926O0834R1655J05064J09189J11046J53338J41211
$$ 2917545 2882369 2945966 2987892 3048726 3140381 3245445 3354634 3465680 3619018 3760229
5116C760229J67536J91421J76280J93349K11548K19397K74054K58468K54520K12156
$$ 3760229 3927765 4119186 4295466 4488815 4700363 4919760 5193814 5452282 5706802 5918958
5106E918958J19312m9553j93153k36581j75997j33279r7852m6608L6525R0525
$$ 5918958 6038270 5988717 5795564 5558983 5382986 5249707 5151855 5105247 5141772 5232297
5096E232297J10829J50855K07823J82865K55602K62017K45338K93060K69001K47747
$$ 5232297 5343126 5493981 5701804 5884669 6140271 6402288 6647626 6940686 7209687 7457434
5086G457434K16114J24296k1820q6681j27122j97931j64523j73576k61384k81340
$$ 7457434 7673548 7797844 7776024 7689343 7562221 7364290 7199767 7026191 6764807 6483467
5076F483467k77002k84243j99717j89432j04840o7480m3103j2393j3207J8076
$$ 6483467 6206465 5922222 5722505 5533073 5428233 5360753 5317650 5305257 5292050 5310126
5066E310126l618j03416q8515p5447j02817q7917o6705n7626j51549j27119r4957
$$ 5310126 5306508 5203092 5114577 5039130 4936313 4848396 4781691 4724065 4572516 4445397 4350440
5055D350440j46046j89567j67640j08732j03703j07716o7121r6436o5388k7169
$$ 4350440 4204394 4014827 3847187 3738455 3634752 3527036 3459915 3363479 3298091 3270922
5045C270922m9426O36j173n873J2646k183J293n7347n5745l7178l2136k3585O841
$$ 3270922 3221496 3222132 3220959 3215086 3227732 3225549 3226842 3169495 3113750 3076572 3044436 3020851 3027692
5032C027692K6578o418J296j8132J0179p583J2733l0323m575Q110n1665m0022
$$ 3027692 3054270 3047852 3049148 3031016 3041195 3033612 3046345 3016022 3011447 3019557 2967892 2927870
5020B927870m0387n984k0545j3909R308K7488M2307K8004k814K4274K797J0236
$$ 2927870 2887483 2881499 2860954 2847045 2856353 2883841 2926148 2954152 2951338 2975612 2978409 2988645
5008B988645Q39l6543m0892n4963l3664k6862O737J7601O541K6430o751l307L5155
$$ 2988645 2989484 2952941 2912049 2857086 2823422 2796560 2803297 2820898 2827439 2853869 2847118 2843811 2878966
4995B878966L5449N0025N2907Q4560O7686P9694J04342J09451J25226J14755J31710
$$ 2878966 2914415 2964440 3017347 3101907 3169593 3249287 3353629 3463080 3588306 3703061 3834771
4984C834771J64574J60566J58137K02380K16026K40253K54321J97688J29659j3395
$$ 3834771 3999345 4159911 4318048 4520428 4736454 4976707 5231028 5428716 5558375 5544980
4974E544980j75388k77794l04696k74644k14431j26645o6433k5394o287K8520
$$ 5544980 5369592 5091798 4787102 4512458 4298027 4171382 4104949 4079555 4073268 4101788
4964D101788L6660Q808M7679R3108J01347J21982O5881O7884M9857O4313P5066
$$ 4101788 4138448 4147256 4194935 4288043 4389390 4511372 4577253 4645137 4694994 4759307 4834373
4953D834373J05153J58696J67791J71145J40759J66765J85519R9613R1933R6532
$$ 4834373 4939526 5098222 5266013 5437158 5577917 5744682 5930201 6029814 6121747 6218279
4943F218279M8083L6330J24630J07099J13219J37598K07249K16383K45650L60405
$$ 6218279 6266362 6302692 6427322 6534421 6647640 6785238 6992487 7208870 7454520 7814925
4933G814925L15753L18388K69533K94115K92762K86346L35731L99699M66977L59929
$$ 7814925 8130678 8449066 8718599 9012714 9305476 9591822 9927553 10327252 10794229 11154158
4923A1154158K44123K03052J18872J4048j16975k73162l14237k85730j54147m0555
$$ 11154158 11398281 11601333 11720205 11734253 11617278 11344116 11029879 10744149 10590002 10549447
4913A0549447J00034J85087K49753J79664N1290L0614L0755J05743K38174L28474
$$ 10549447 10649481 10834568 11084321 11263985 11315275 11345889 11376644 11482387 11720561 12049035
4903A2049035L12382L66063M47561M88938N19738M39025K83567k2067l29639m81777
$$ 12049035 12361417 12727480 13175041 13663979 14183717 14622742 14906309 14884242 14554603 14072826
4893A4072826n19456n62591p37397q38303p64741o71832m52925l27341k48387
$$ 14072826 13553370 12990779 12253382 11415079 10650338 9978506 9525581 9198240 8949853
4884H949853j79219j59960r8251k2504j3172j8509q1310j31832j9432N6910J20312
$$ 8949853 8770634 8610674 8512423 8489919 8476747 8458238 8376928 8245096 8225664 8282574 8402886
4873H402886J72470J33935J9010n3855j30606k15651k72937k85089k13980j97122
$$ 8402886 8575356 8709291 8728301 8674446 8543840 8328189 8055252 7770163 7556183 7359061
4863G359061r8066J5235K5689N6518J21380J57799K10731K28158K60514L34800
$$ 7359061 7260995 7276230 7301919 7358437 7479817 7637616 7848347 8076505 8337019 8671819
4853H671819M08235M18759M23149L93478J84146j83191n25348o23487n87925m26846
$$ 8671819 9080054 9498813 9921962 10315440 10499586 10316395 9791047 9167560 8579635 8152789
4843H152789l37481k44876j89432j37092j27039j22988r4781o9903j00071n0019
$$ 8152789 7815308 7570432 7381000 7243908 7116869 6993881 6899100 6829197 6729126 6679107
4833F679107n4156m7401J9570N9897P6879J17841N6763R3272J06172R0829J27576
$$ 6679107 6624951 6577550 6597120 6657017 6733896 6851737 6908500 7001772 7107944 7198773 7326349
4822G326349J33975J45412J62222J54218J81465J84205K41341K63073L09741L47254
$$ 7326349 7460324 7605736 7767958 7922176 8103641 8287846 8529187 8792260 9102001 9449255
4812I449255L09776J93903J4654j95178l46658l82160k32120k03110j26253l9623
$$ 9449255 9759031 9952934 9967588 9772410 9425752 9043592 8811472 8608362 8482109 8442486
4802H442486L0922J05425J44923J67975J74920R3433r7199k43549l19904l24041
$$ 8442486 8473408 8578833 8723756 8891731 9066651 9160084 9062885 8819336 8499432 8175391
4792H175391l25382j99222o7517r2736p1915n4399q1815o8755o0400k737N1538
$$ 8175391 7850009 7650787 7583270 7490534 7418619 7364220 7282405 7213650 7153250 7150513 7202051
4781G202051P2417O5061R5984J04735P6839J17470R7704J36405J22329J31258
$$ 7202051 7274468 7339529 7435513 7540248 7617087 7734557 7832261 7968666 8090995 8222253
4771H222253J41891J59013K15578K41398K46907K48924K71976K33211K04650J38687
$$ 8222253 8364144 8523157 8738735 8980133 9227040 9475964 9747940 9981151 10185801 10324488
4761A0324488J45492J43852J29479N2178o6385o2028q0657k3363L5398J14703
$$ 10324488 10469980 10613832 10743311 10795489 10729104 10667076 10586419 10563056 10598454 10713157
4751A0713157J26251J31244J39430J55092J23260J65598J31324J75970K88064
$$ 10713157 10839408 10970652 11110082 11265174 11388434 11554032 11685356 11861326 12149390
4742A2149390L27052L99898L78230M09484L62992L25869K75689K59395K19402
$$ 12149390 12476442 12876340 13254570 13664054 14027046 14352915 14628604 14887999 15107401
4733A5107401J90099K29882K53307K46249L24108L55625M46232M89652N13879
$$ 15107401 15297500 15527382 15780689 16026938 16351046 16706671 17152903 17642555 18156434
4724A8156434M79388N00780M72412M91449N34109N83615N89767O44088O31135
$$ 18156434 18635822 19136602 19609014 20100463 20634572 21218187 21807954 22452042 23083177
4715B3083177O23419O20355O84774O71905O76161P11284Q25201P93840R28205
$$ 23083177 23706596 24326951 25011725 25683630 26359791 27071075 27896276 28690116 29618321
4706B9618321R30484J082063J159350J279314J406053J588618J638351J629230
$$ 29618321 30548805 31630868 32790218 34069532 35475585 37064203 38702554 40331784
4698D0331784J515324J582597J600099J750658J780810J934441K103579K362280
$$ 40331784 41847108 43429705 45029804 46780462 48561272 50495713 52599292 54961572
4690E4961572K657347L050610L344502L952375M380376M984829N442643O096335
$$ 54961572 57618919 60669529 64014031 67966406 72346782 77331611 82774254 88870589
4682H8870589O863078Q154847R838708J1845315J3878811J6087477J8432100K1149122
$$ 88870589 95733667 103888514 113727222 125572537 139451348 155538825 173970925 195120047
4674A95120047K3861231K6691827K9356942L1791139L4185675L8745022M0669617
$$ 195120047 218981278 245673105 275030047 306821186 341006861 379751883 420421500
4667D20421500L8948639K4779569q73557k6688673n2483363o1308366n8184978
$$ 420421500 459370139 484149708 483276151 456587478 404104115 342795749 284610771
4660B84610771m7648496l5107764k5534995j8977413j4981647j2503304j0672776
$$ 284610771 236962275 201854511 176319516 157342103 142360456 129857152 119184376
4653A19184376r317330q150093o978317o005870n042795m288653l629576l132117
$$ 119184376 109867046 101716953 94738636 88732766 83689971 79401318 75771742 72639625
4645G2639625k654745k323787k019629j735222j484538j277634r99709r27626
$$ 72639625 69984880 67661093 65641464 63906242 62421704 61144070 60144361 59216735
4637E9216735p26803o55178o07078o03501n36031m76456l49119k10683q6997J1613
$$ 59216735 58489932 57834754 57227676 56624175 56088144 55611688 55262569 55051886 54964889 54976502
4627E4976502O3813R0151J19673J36504K63713L73746N78402P82909R42445J191243
$$ 54976502 55040315 55130466 55250139 55386643 55650356 56024102 56602504 57385413 58327858 59519101
4617E9519101J356396J515920J759164J999300K267340K446557K670773K775446
$$ 59519101 60875497 62391417 64150581 66149881 68417221 70863778 73534551 76309997
4609G6309997K792811K884108L054076L477929L991472M716791N637158O804593
$$ 76309997 79102808 81986916 85040992 88518921 92510393 97227184 102864342 109668935
4601A09668935Q374652J0171449J2278467J4607309J7361037K0212925K3155148
$$ 109668935 118043587 128215036 140493503 155100812 172461849 192674774 215829922
4594B15829922K6063676K9366688L2491150L4824885L8609510M0672839L9045051
$$ 215829922 241893598 271260286 303751436 338576321 377185831 417858670 456903721
4587D56903721K4315478Q73983j4529548l6133078n3561950n6514560n1972020
$$ 456903721 481219199 482093182 467563634 431430556 377868606 321354046 269382026
4580B69382026m0818467k9795084k1684279j6542418j3277046j0957094r114206
$$ 269382026 228563559 198768475 177084196 160541778 147264732 136307638 127193432
4573A27193432p614906o284208n172320m141844l293211k470090j855744j370521
$$ 127193432 119578526 113294318 108121998 103980154 100686943 98216853 96361109 94990588
4565I4990588j088896j247594k129948l810736n037051n470187n167404m423515
$$ 94990588 93901692 92654098 90524150 86713414 81676363 76206176 71038772 66615257
4557F6615257l760186l156513k696852k426351k120935j917966j700053j595692
$$ 66615257 62855071 59698558 57001706 54575355 52454420 50536454 48836401 47240709
4549D7240709j443706j349526j399618j439314j448233j376474j310109j212917
$$ 47240709 45797003 44447477 43047859 41608545 40160312 38783838 37473729 36260812
4541C6260812j065390r10965r25693q15897p85842p03423o30210n86237n38080
$$ 36260812 35195422 34284457 33358764 32542867 31757025 31053602 30423392 29837155 29299075
4532B9299075n52452n22645m90042n13593n35713n14854n55153n49332m25022
$$ 29299075 28746623 28223978 27733936 27220343 26684630 26169776 25614623 25065291 24640269
4523B4640269m35422m62281m55189m26663l42539l66380l36578l06803k30540
$$ 24640269 24204847 23742566 23287377 22860714 22518175 22151795 21815217 21508414 21277874
4514B1277874j97761j99534j46608j69693j89560k04932k00726j71745j82514
$$ 21277874 21080113 20880579 20733971 20564278 20374718 20169786 19969060 19797315 19614801
4505A9614801j71635j41735j08664q9011j08735j04920n9102j8786j6152K2709
$$ 19614801 19443166 19301431 19192767 19103756 18995021 18890101 18830999 18812213 18796061 18818770
4495A8818770L2696J16430J16257K01415J97474K01797J19569N8136L4973L19
$$ 18818770 18851466 18967896 19084153 19285568 19483042 19684839 19804408 19862544 19897517 19897836
4485A9897836r4845j52252k03851k28194l24193l57545m09812n09610n06015m88962
$$ 19897836 19802991 19650739 19446888 19218694 18894501 18536956 18127144 17617534 17111519 16622557
4475A6622557m90129m23122l60784l61344k91004k90869k56989k11086j88164
$$ 16622557 16132428 15709306 15348522 14987178 14696174 14405305 14148316 13937230 13749066
4466A3749066j95520j25028r1798j01510k6097o4684j39225k94209l94456m21069
$$ 13749066 13553546 13428518 13336720 13235210 13209113 13144429 13005204 12710995 12316539 11895470
4456A1895470l50215l44853k40754j59529j32186j72734j62553j41462j41900
$$ 11895470 11545255 11200402 10959648 10800119 10667933 10495199 10332646 10191184 10049284
4447A0049284j86478j34238j23637j10731j16194j86631k32605k43980j63965
$$ 10049284 9862806 9728568 9604931 9494200 9378006 9191375 8958770 8714790 8550825
4438H550825j40939j15607j09000L34M7077L7179m018k1299q8867j68106j47735
$$ 8550825 8409886 8294279 8185279 8185613 8232690 8269869 8265851 8244552 8155685 7987579 7839844
4427G839844j38330o5014n1761k0004q153L0683j3612j08263j68614j88399j41606
$$ 7839844 7701514 7636500 7584739 7564735 7556582 7587265 7573653 7465390 7296776 7108377 6966771
4416F966771j05550o8797p1848m1419k0403L2236J2079q6596j23819j47851j39361
$$ 6966771 6861221 6792424 6720576 6679157 6658754 6690990 6703069 6616473 6492654 6344803 6205442
4405F205442j11340r1471q1453j6877o587J7800M5172K4550K6117P6164J18093
$$ 6205442 6094102 6002631 5921178 5904301 5897714 5915514 5960686 5985236 6011353 6087517 6205610
4394F205610J23785J60530J69203K10232K46608K69810L02590L44877L54340M23541
$$ 6205610 6329395 6489925 6659128 6869360 7115968 7385778 7688368 8033245 8387585 8811126
4384H811126M17608L12214O2425k03449k35491j98754j53020L47J36474K09304
$$ 8811126 9228734 9540948 9603373 9399924 9164433 8965679 8812659 8813006 8949480 9158784
4374I158784K23421P4074k64569l39113l59748k83471q6682K6884J06676K05093
$$ 9158784 9382205 9456279 9191710 8852597 8492849 8209378 8122696 8149580 8256256 8461349
4364H461349K81565L87912L62013K93946J30692r0676j71848j08231n0496J24881
$$ 8461349 8742914 9130826 9492839 9786785 9917477 9826801 9654953 9546722 9496226 9621107
4354I621107K54175K78825J98618j29347m80231p49698r18172p93020n97141m44358
$$ 9621107 9875282 10154107 10352725 10223378 9743147 8993449 8075277 7282257 6685116 6240758
4344F240758l47014k47279j88068j72692j17637j09762j27861j35417j23589p4212
$$ 6240758 5893744 5646465 5458397 5285705 5168068 5058306 4930445 4795028 4671439 4597227
4334D597227j24081q6566n9400q9306m7955K0371Q47k2797l7477l1610n195l3652
$$ 4597227 4473146 4386580 4327180 4237874 4189919 4210290 4211137 4188340 4150863 4119253 4114058 4080406
4322D080406q9601m7512j9062k8945R125l2470K5154Q529L1322L5330r270N7684
$$ 4080406 3990805 3943293 3924231 3895286 3904411 3871941 3897095 3905624 3936946 3972276 3963006 4020690
4310D020690J0089l0113J0703r056l7958k1888j0549k7507j0703J3337n2254m7454
$$ 4020690 4030779 4000666 4011369 4002313 3964355 3942467 3931918 3904411 3893708 3907045 3854791 3807337
4298C807337L985j797j0189k5632j6258R438J8401j7095l359q931Q861K4951l62
$$ 3807337 3811322 3809525 3799336 3773704 3757446 3766884 3785285 3768190 3764831 3755900 3764761 3789712 3789350
4285C789350r407l037K4350N9485N1631P5651J18791J52006J33535J37255J67304
$$ 3789350 3779943 3776906 3801256 3860741 3912372 3988023 4106814 4258820 4392355 4529610 4696914
4274D696914J82931J61715J67281N0383o1854j84784k66131l51525l67901k99679
$$ 4696914 4879845 5041560 5208841 5259224 5197370 5012586 4746455 4394930 4027029 3727350
4264C727350k37046j62092j30059j39723p9114q4094l2707l6466l9609r0070n3146
$$ 3727350 3490304 3328212 3198153 3058430 2979316 2895222 2862515 2826049 2786440 2696370 2643224
4253B643224p4157n0970o7692o4554j4124n4725m6441m826m0975n2973k0338j9050
$$ 2643224 2569067 2518097 2450405 2385851 2371727 2317002 2270561 2265735 2224760 2171787 2151449 2132399
4241B132399j4610m0159k2986m4212l4328o5046l2093j6732J8486J3343Q399k0642
$$ 2132399 2117789 2077630 2054644 2010432 1976104 1911058 1878965 1862233 1880719 1894062 1902461 1881819
4229A881819q737j0752k1242l0407j750n4275l1327k3571m6183l3623O626j4835
$$ 1881819 1873082 1862330 1841088 1810681 1808931 1754656 1723329 1699758 1653575 1619952 1626578 1611743
4217A611743k43k1489n1108k615k0388j9830k5926j1106q890k7078L695J7663
$$ 1611743 1611500 1590011 1538903 1536288 1515900 1496070 1470144 1459038 1450148 1423070 1426765 1444428
4205A444428J8119k0175m0649k2307n066O250m7290K4511j3758k9821J2590K7859
$$ 1444428 1462547 1442372 1401723 1379416 1374350 1380600 1333310 1357821 1344063 1314242 1326832 1354691
4193A354691m3570n8215k7143j7418o39P257M605j3653j3515M92q854l3167l3782
$$ 1354691 1311121 1252906 1225763 1208345 1207706 1214963 1219568 1205915 1192400 1192892 1184038 1150871 1117089
4180A117089Q58O292j5724k2087l0577M7087m9943l3963P42m6609k4836N919j624
$$ 1117089 1117947 1124239 1108515 1086428 1055851 1102938 1052995 1019032 1019774 973165 948329 954248 952624
4167I52624m1078J4429j5630J7658K2299K3383j8546O775o137j5569m098m826
$$ 952624 911546 925975 910345 928003 950302 973685 955139 961914 955777 940208 936110 931284
4155I31284k2592r945r305l2613j5640k9227K5175k9156r401k2366k4710r090
$$ 931284 908692 898747 889442 856829 841189 811962 837137 807981 798580 776214 751504 742414
4143G42414K1335J2604m8599l553J3951n029p844m2874j1472K6396J6870m4150
$$ 742414 763749 776353 727754 724201 738152 733123 725279 682405 670933 697329 714199 670049
4131F70049m4430J2196J4265o37j4496j7383q633n286L4713K5841Q756m3480K4693
$$ 670049 625619 637815 652080 651443 636947 619564 610931 605645 640358 666199 674955 631475 656168
4118F56168L0145j6311j3447k1368O314l641j0352l5729j9881J6671L83N286K17
$$ 656168 686313 670002 656555 635187 641501 637860 627508 591779 571898 588569 588952 594238 594455
4105E94455r717j2117J4836j0046j115K2433l519j7466k4404M935p394p509J5049
$$ 594455 584738 572621 587457 577411 576296 598729 595210 577744 553340 558275 550881 543372 558421
4092E58421K4688J8254j7073J2290L5426m092k9211L865j013k444k175J2143o338
$$ 558421 583109 601363 584290 596580 632006 627914 598703 602568 601555 599111 596936 609079 602741
4079F02741j4762n150k3492j1524J5138l648J230J0332j3934k224l4596l1058
$$ 602741 587979 582829 559337 547813 562951 559303 560533 570865 556931 554707 520111 489053
4067D89053K7421l637k4617j9703K9448L8055k1830l9865J4789J327k7226N3343
$$ 489053 516474 512837 488220 468517 497965 536020 514190 474325 489114 490441 463215 516558
4055E16558L5953m471l4145K7579M2913j5882m2239R49K3195R988k0794k4254
$$ 516558 552511 548040 513895 541474 584387 568505 526266 527215 550410 560398 539604 515350
4043E15350J1832K7971j0452l5938k6348J3688j4669n1204J7830J9687N669P504
$$ 515350 527182 555153 544701 508763 482415 496103 481434 430230 448060 467747 473416 480920
4031D80920K0680J6795l2089k1554j2460k9490k363J3042K1264J5128N712O237
$$ 480920 501600 518395 486306 464752 452292 422802 420439 433481 454745 469873 475585 481822
4019D81822k1784K2962L2874r552q148M176j8980j6995l2201J8450k679j179p109
$$ 481822 460038 483000 515874 506322 498174 502350 483370 466375 434174 452624 449945 448766 441657
4006D41657Q047n812j2922j5153J4178n821Q248p714J3741k8290J2399P103P038
$$ 441657 449704 443892 430970 415817 429995 424174 432422 424708 438449 410159 422558 429661 436699
3993D36699J6067m869k6671j36J451J0763K4350j6790J9767m884k7320l6331P544
$$ 436699 452766 447897 421226 421090 422541 433304 457654 440864 460631 455747 428427 392096 399640
3980C99640P473K5670K4266m218j0561k112M531M5746j3473o447K3346l3385j6225
$$ 399640 407113 432783 457049 452831 442270 440158 444689 490435 476962 470515 493861 460476 444251
3967D44251L1245j220M3264L5541p162L7049N4250R842L7263L8325L2081K4832
$$ 444251 475496 474276 517540 553081 545919 582968 637218 647060 684323 722648 754729 779561
3955G79561Q1721P7362M8841N4340J19190O7139N2197n0357j31222j47240j41548
$$ 779561 861282 938644 987485 1041825 1161015 1228154 1280351 1229994 1098772 951532 809984
3944H09984r8314n4967l6866j8975l4336l730J5630m394n619j6370l1712l7915
$$ 809984 711670 656703 619837 600862 566526 562796 578426 574032 568413 552043 520331 482416
3932D82416k8337k2131J8966M09l8434q295r720j9481R223M204j7321q393L980
$$ 482416 454079 431948 450914 451323 412889 404594 394874 375393 384616 388820 371499 363106 367086
3919C67086K759m227K5114j2826k0660j3082K3499L0056n1539k3935N1176j1847
$$ 367086 369845 365618 390732 377906 357246 344164 367663 397719 346180 322245 373421 361574
3907C61574r247P814j0023k874k0689K1455M4552K6133j7794J5077P270j0629
$$ 361574 352327 360141 350118 347244 326555 348010 392562 418695 400901 415978 423248 412619
3895D12619k0821M5500J0144l1885r570K0559K0455k5675J8622M5035k6765n751
$$ 412619 391798 437298 447442 415557 405987 426546 447001 421326 439948 484983 458218 452467
3883D52467P6n4327p173J2500r86Q717k8514j6471J1217P687j7714J22l3006q927
$$ 452467 452543 398216 391043 403543 402557 411274 382760 366289 377506 385193 367479 367601 334595 325668
3869C25668m801k2966j6162K5919j4565m3082Q216J4447j9525J2386j1325q228
$$ 325668 320867 297901 281739 307658 293093 250011 258227 272674 253149 265535 254210 245982
3857B45982J124J7164l362r496j62k1949j079J7787Q5J1949k0249j1148K1978
$$ 245982 247106 264270 260908 251412 251250 229301 228222 246009 246094 258043 237794 226646 248624
3844B48624k1237K6205p878o0457M0846J9232j252p183j3503Q176j518K5581M150
$$ 248624 227387 253592 245714 185257 226103 245335 244083 236900 223397 231573 230055 255636 259786
3831B59786N984k9028j8422N372j9906m762J6128o505N252l1658J2726K6934l106
$$ 259786 265770 236742 218320 223692 203786 199024 215152 208647 213899 182241 194967 221901 218795
3818B18795j6002J909Q366j0626j786J503K7892M905k4128J3770Q938m095L5361
$$ 218795 202793 204702 213068 202442 200656 202159 230051 234956 210828 224598 233536 229441 264802
3805B64802j4486j8559K1667j9561j2543l80J1021k7420j1153J7149L1483j7384
$$ 264802 250316 231757 253424 233863 221320 220940 231961 204541 193388 210537 242020 224636
3793B24636l5748K2558j2283m6170L3177m33j1761J9744j1035j8130J142m2167
$$ 224636 188888 211446 199163 152993 186170 185737 173976 193720 182685 164555 165697 123530
3781A23530K4282L3523j592J1171p776k1703k2612K1138J0583n13j6390K6269
$$ 123530 147812 181335 179743 190914 183138 161435 138823 159961 170544 170031 153641 179910
3769A79910r895l820L39j743j4555J0186k446l9051J3551L6924J2054p547j4476
$$ 179910 170015 166195 166534 164791 150236 160422 157976 118925 132476 169400 181454 173907 159431
3756A59431j7226J7482J1431k6101m0807m465J6668l28J1328J1765J7025N727
$$ 159431 142205 159687 171118 145017 104210 99745 116413 116085 127413 139178 156203 161930
3744A61930k6513J3607j1221K235j5554j9161L189L6300P782l7759j7172K3911
$$ 161930 135417 149024 137803 140038 124484 105323 108512 144812 152594 114835 97663 121574
3732A21574J3068P724K0039m7545O677N9357j9758k6817J3521J6970l3872m95
$$ 121574 134642 142366 162405 114860 121537 180894 161136 134319 147840 164810 130938 130443
3720A30443J1245j0768j4789j2328N674J0997R328q007m977k3708J8241L9897
$$ 130443 141688 130920 116131 103803 109477 120474 129802 121795 116818 93110 111351 151248
3708A51248p912J29j0582j6707J5092j0922r899M94j270M02J1337j5050r310K3504
$$ 151248 143336 143465 132883 116176 131268 120346 110447 110941 109671 110073 121410 106360 97050 120554
3694A20554J985j3713J7395J1186j9781j5641p413K1693j5790j4256K7769P949
$$ 120554 122539 108826 126221 137407 117626 101985 94572 116265 100475 86219 113988 121937
3682A21937k3852j9005j5291m457L0815q567J6575j0331q689k704J3983k0996
$$ 121937 98085 79080 63789 59332 90147 81580 98155 87824 79135 76431 90414 69418
3670F9418K4550R573k5657j0288N915m185K6373M7J4458m2644K2416J2633l7867
$$ 69418 93968 103541 77884 67596 73511 69326 95699 95746 110204 67560 89976 102609 64742
3657F4742L1379p783J030J9918l1769j8814k156Q871J3713J5271o590k210J0442
$$ 64742 96121 88338 89368 109286 77517 58703 56547 65418 79131 94402 87812 85602 96044
3644I6044j4710P536q400J4592M954k267k0927m785J274K3904K0237j7066j4216
$$ 96044 81334 88870 80470 95062 100016 97749 76822 72037 73311 97215 117452 100386 86170
3631H6170p12o727J1492j1154K3997J0522J8590k7229p318J6845j0725l1826l5746
$$ 86170 85458 78731 90223 79069 103066 113588 132178 104949 97631 114476 103751 71925 36179
3618C6179K8509K5136N825j167K5433p544n952k8249J6630N580k2815K1880j4523
$$ 36179 64688 89824 95649 94482 119915 112371 106419 78170 94800 100380 77565 99445 84922
3605H4922p880k3589M0198p745P656j2271J6278k0473l1462L8461n083k7229L0447
$$ 84922 77042 53453 93651 85906 93562 81291 97569 77096 45634 84095 79012 51783 82230
3592H2230J8137m0322J5967K3117P805J0410m1774l1321N737J593O453N148j6406
$$ 82230 100367 60045 76012 99129 106934 117344 75570 44249 49986 51579 58032 63180 46774
3579D6774q070J0880K2104J4925K0606j5440R236j6289m91j5520J3665q58l1507
$$ 46774 38704 49584 71688 86613 107219 91779 101015 84726 84235 68715 82380 81522 50015
3566E0015M2026n937n416J2357J3609k7890J7995q8j5388k9389o310R017J1584
$$ 50015 92041 86104 80688 93045 106654 78764 96759 96671 81283 51894 45584 54601 66185
3553F6185M3429m4214q342J9344q485K8013j3407k7753Q311K0025O718j7697J6231
$$ 66185 109614 65400 57058 76402 67917 95930 82523 54770 63081 83106 89824 72127 88358
3540H8358J4325K003m975l688J0487k6034L0234p112k5074K2115K1236M13j2699
$$ 88358 102683 104686 99711 96023 106510 80476 110710 103598 78524 100639 121875 122288 109589
3527A09589k456O856j8371k3971k0926J7050J9695k1834N656l77N705R19J4311
$$ 109589 107133 113989 95618 71647 50721 67771 87466 65632 71288 70911 76616 77535 91846
3514I1846J0536j7039j3024N532r101J287J4151Q840J2373m5471k2624j463K2854
$$ 91846 102382 85343 72319 77851 68750 70037 84188 93028 105401 59930 37306 35843 58697
3501E8697J5923n661K6292K951j4846M472k3637J9976j1417J7349J5870k6349
$$ 58697 74620 68959 95251 98202 83356 87828 64191 84167 72750 90099 105969 79620
3489G9620L1659o218r813j1223j0824J7291J1057j7619l8119j3021J2889K9459
$$ 79620 111279 105061 95248 84025 73201 90492 101549 83930 45811 32790 45679 75138
3477G5138K0321j2083P413L1255j5816j3295k135p588n716R511K3077Q318q630
$$ 75138 95459 83376 90789 122044 106228 92933 90798 83210 77494 87005 110082 118400 109770
3464A09770J610j6153R468k8805k849O650M966l814j7494j0413P25J3429M297
$$ 109770 111380 95227 104695 75890 73041 79691 84657 80843 63349 52936 53661 67090 71387
3451G1387K3787p062j3882J3552R536q832k1840J6521o584j9141L5689K7106j8081
$$ 71387 95174 88112 74230 87782 97318 88486 66646 83167 76583 57442 93131 120237 102156
3438A02156k1202J7845J3536l0175M206k9853K9121L3505m2585k2825j3445J8950
$$ 102156 80954 98799 112335 82160 86366 56513 85634 119139 76554 53729 40284 59234
3426E9234k035K4191J5701k3518l2970K1366k4391J612R908K710o480q565l132
$$ 59234 57199 81390 97091 73573 40603 61969 37578 39190 49098 51808 45328 36763 33631
3413C3631M0490L3895m3711j5039l949p987K2880j4572J3177L097J2698R972M363
$$ 33631 74121 108016 64305 49266 45317 37330 60210 45638 58815 61912 74610 84582 88945
3400H8945j3293j3246J0777j6083k4805Q355L5214l099k0550m833L2008l5723
$$ 88945 75652 62406 73183 57100 32295 40650 75864 72765 52215 47382 79390 43667
3388D3667o886P590k3000L8492J1975L2028K428r219J0940j8634k0463l671k0643
$$ 43667 36781 44371 21371 59863 71838 103866 106294 97075 108015 89381 68918 65247 44604
3375D4604K2315K5243m329M546j6591M062Q97k3115k6862N1192Q297m4475j5765
$$ 44604 66919 92162 87833 92379 75788 79850 80747 57632 30770 81962 90259 45784 30019
3362C0019r039L847m893N3936l4688K7881K5725j9186K922j7246M676k9634J3271
$$ 30019 20980 24827 19934 73870 39182 67063 92788 73602 76524 59278 63954 34320 47591
3349D7591J9072l0906o79m793K441R602j1581K170J3830J2978K656J6902j861
$$ 47591 66663 35757 35078 30285 32726 42328 30747 32917 46747 59725 62381 79283 77422
3336G7422j8889K715j0277J9844K813n100j9283l0986L8175k096Q711k4555j9338
$$ 77422 58533 61248 50971 70815 73628 68528 49245 18259 56434 54338 63049 38494 19156
3323A9156J2571j457l754J3019j383k075j0381k756K2722J1003J4029J074K273
$$ 19156 31727 30270 26516 39535 38152 36077 25696 22940 45662 56665 70694 71768 74041
3310G4041j1538p42M85k4487J9335k7421J6523K2727k0849J7881j0540l4260J0748
$$ 74041 62503 61761 62246 37759 57094 29673 46196 68923 48074 65955 55415 21155 31903
3297C1903J1517K1132o739l493m27J4271K0136r637j9126J7175K5202L620o625
$$ 31903 43420 64552 57813 54320 53893 68164 88300 78663 59537 76712 101914 105534 98909
3284I8909l4470J8742R846l9374O142j5749j2185j3819l916R71K8069K197K1874
$$ 98909 64439 83181 93027 53653 59795 44046 31861 18042 14126 15097 43166 45363 67237
3271F7237K1027m106J2198N660J1843L182j4033L650K3049K237k1046j7530k6160
$$ 67237 88264 84158 96356 102016 113859 117041 103008 106658 129707 131944 110898 93368 67208
3258F7208J0312J8119k996L0708L920k2924j9105J5106N407L6828j5782r977m808
$$ 67208 77520 95639 92643 123351 127271 104347 85242 100348 105755 142583 126801 116824 112016
3245A12016o037j6992L7734r328R426K3202m097j0107K63L6756L6716o1108j223
$$ 112016 105979 88987 126721 117393 126819 150021 145924 135817 136080 172836 209552 148444 147221
3232A47221J2873r372M1187m1179J343K452j5939K5074o056J900J3137j5127J6631
$$ 147221 160094 150722 191909 150730 152073 154525 138586 163660 157604 159504 172641 157514 174145
3219A74145K153K3345J954j0037r649J6032L1122J68m9128M4307J9604N732J7940
$$ 174145 176298 199643 201597 191560 181911 197943 229065 229233 180105 224412 244016 249748 267688
3206B67688L668j9419q099L911R131J3682j6502K8983J5800j3922j2275j9628
$$ 267688 271356 251937 243838 247749 256880 270562 254060 283043 298843 284921 272646 253018
3194B53018K2215K1996j6048N000l874N997P0508k0972m142K6347k1566K5833
$$ 253018 275233 297229 281181 286181 282307 288304 358812 337840 333698 360045 338479 364312
3182C64312K9447J1908K893L3462o876L1302N0217K514K6274m46n4938k0260k3176
$$ 364312 393759 405667 408560 442022 435146 466448 516665 519179 545453 545007 490069 469809 446633
3169D46633K5089j5300L7627J7506k3961J0528j6817J1773L57R982M4335L6185
$$ 446633 471722 456422 494049 511555 487594 498122 481305 493078 493435 503417 547752 583937
3157E83937k1717n06K9702K4072L2864n2816J6345L4343J4109L5067Q839K0380
$$ 583937 562220 561714 591416 615488 648352 595536 611881 646224 660333 695400 704239 724619
3145G24619P791L3863M6997M3079L2229J7969K0487K6341m126K7173R2975P9969
$$ 724619 732410 766273 813270 856349 888578 906547 927034 953375 949249 976422 1069397 1149366
3133A149366P8944M4897N7377P7821J14095P7924Q6088Q4342O6937N2585K2119
$$ 1149366 1228310 1273207 1330584 1408405 1522500 1600424 1686512 1770854 1837791 1890376 1912495
3122A912495q288p0372l8675m4106q6332r8903r4931k1845m8863j04382n7515
$$ 1912495 1904207 1833835 1795160 1751054 1664722 1565819 1470888 1449043 1400180 1295798 1238283
3111A238283k0438k7418j0465l7500j0873J5238j1086K1449K0673M9934J7324
$$ 1238283 1217845 1190427 1179962 1142462 1131589 1146827 1135741 1157190 1177863 1227797 1245121
3100A245121M0846P578J6881j745J8949J998q64l394J7127J335m1058O99q189
$$ 1245121 1285967 1293545 1310426 1308681 1327630 1329628 1328764 1325370 1342497 1343832 1302774 1303473 1295284
3087A295284k2950K1129Q676m9171n7341n7016o0190k0716j7970j8056K6254l697
$$ 1295284 1272334 1293463 1302139 1252968 1195627 1138611 1078421 1057705 1039735 1021679 1047933 1044236
3075A044236J3557N4285O4702M2401O156J6106O3993N5158K8321j7903o5420p7342
$$ 1044236 1057793 1112078 1176780 1219181 1225337 1241443 1305436 1360594 1388915 1371012 1305592 1228250
3063A228250l1862m4564p2615l5147j4835n0885o0468l3940j4684j5972k2506
$$ 1228250 1196388 1151824 1079209 1044062 1029227 978342 917874 883934 869250 853278 830772
3052H30772J4710m3399p4604l8506j5969k8480J4572j4576q529J0539K802J8525
$$ 830772 845482 802083 727479 688973 673004 644524 659096 644520 635991 646530 649332 667857
3040F67857J249k2520K0568O1613R7j0097l8796p8882n6300Q560k7146l9564l736
$$ 667857 669106 646586 667154 728767 728864 718767 679971 601089 544789 553349 526203 486639 482903
3027D82903m5284n654m5924k9122M051k382q356m2084J5571j5206R638l0882j2373
$$ 482903 437619 431965 386041 356919 360970 358588 350232 308148 323719 308513 318151 287269 274896
3014B74896k57k766l1706r4K5798k6088j5679J717j5952m359L9867k4318k3834
$$ 274896 274639 271873 240167 240073 265871 239783 224104 225821 209869 205510 245377 221059 197225
3001A97225k4317K208M460J4171p663p51J8383J2960p901K815l4682n458M3501
$$ 197225 172908 175116 179576 193747 186084 185333 203716 216676 208775 211590 176908 171450 214951
2988B14951J8411k0795m3959k749M6713J5649r541Q400j8840j1842j9568n726
$$ 214951 233362 212567 168608 165859 212572 228221 218680 227080 208240 196398 176830 171104
2976A71104n513k1356J0004N471l5034M3779o668k9960Q547J6460L915j4332j8773
$$ 171104 165591 144235 154239 159710 124676 168455 161787 131827 140374 156834 160749 146417 127644
2963A27644O089L9608j046j0529j3898O232J5023j064l020n320J0616Q743L6180
$$ 127644 133733 173341 172295 161766 147868 154100 169123 168059 165039 159719 170335 179078 215258
2950B15258j5758L252K8281j4789J140m0209K0248r34l2835k1764j3827R071J4337
$$ 215258 199500 202752 231033 216244 217384 177175 197423 196489 163654 141890 128063 137134 151471
2937A51471Q928K408n2285j6230P2131k2155j1341r936j6189J1724K2460R588
$$ 151471 160399 162807 110522 94292 166423 144268 132927 122991 106802 118526 140986 150574
2925A50574n190l1082K5596K4960l7214R664J5025R378K186j5542j60J14K3046
$$ 150574 145384 114302 139898 164858 127644 137308 152333 161711 163897 148355 148195 148309 171355
2912A71355K5303M543q447j8529L5784l159k1357l0311k0613L0925l912j5152
$$ 171355 196658 201201 192754 174225 210009 206850 185493 155182 134569 165494 161582 146430
2900A46430n524L094K9054L4741N955M0691J1232m7142l262M8178L8257N152j3246
$$ 146430 140906 144000 173054 207795 213750 254441 265673 218531 215269 263447 301704 306856 293610
2887B93610N534K2096J498N437R441j1273k7489N098j6330K1425M1938k6882k4906
$$ 293610 299144 321240 322738 328175 337616 326343 298854 303952 287622 309047 350985 324103 299197
2874B99197k2172l879J5176j2564K2187K0980j7307J613J7176m969J456L8205
$$ 299197 277025 273146 288322 275758 297945 318925 301618 303231 320407 315438 316894 355099
2862C55099Q435J1043j115M1718M0574L3640m884K5370L7923J7407o274r810o978
$$ 355099 363534 374577 373462 415180 455754 489394 484510 509880 547803 565210 558936 549126 542148
2849E42148j3455j3758n0949k1182N5123m084l4078K7950N58k0110R855q515l8335
$$ 542148 528693 514935 463986 442804 497927 493843 459765 487715 488273 468163 478018 469503 431168
2836D31168K2333k5632l7404m4535K7285K803k4955q028M975L210K720p426N505
$$ 431168 453501 427869 390465 345930 373215 376018 351063 343035 348010 351220 353940 346514 352019
2823C52019J0764K0162M3067J3878p313n168l890Q756K0370K6565n861j7572m0611
$$ 352019 362783 382945 426012 439890 432577 427409 423519 432275 452645 479210 473349 455777 415166
2810D15166N857J2732l6188J373j1937J1939j443j7403m052m2268j2338J0930
$$ 415166 421023 433755 397567 398940 387003 398942 397499 380096 376044 333776 321438 332368
2798C32368L948j8457k425L2019j1824k6497j6773j1892j732O187J118r12M007
$$ 332368 336316 317859 315434 347453 335629 309132 292359 280467 278735 284922 286040 285128 289135
2785B89135K7489k1842j6021J7165J3862L99l3175J0091q691j1453P662j7591
$$ 289135 316624 294782 278761 295926 309788 310187 277012 287103 278412 266959 274621 257030
2773B57030J308J1905n788M537j2005l0367J5980K6275o198q194j0592k100J8640
$$ 257030 258338 270243 264455 268992 256987 226620 242600 268875 262677 254483 243891 241791 260431
2760B60431n520j051R603l84J4683j7538l5202j0738K5140j8622k4288R737m115
$$ 260431 254911 253860 263463 263079 277762 260224 225022 214284 239424 220802 196514 206251 202136
2747B02136k3455l6385J6203K9286R295j7100k730j6556j9939j9446j775M7942
$$ 202136 178681 142296 158499 187785 197080 179980 177250 160694 140755 121309 119534 167476
2735A67476M333Q142k6673j7307K193J3292k1623M010l1276l6831K6186j9843
$$ 167476 171809 179951 153278 135971 138164 151456 129833 133843 102567 65736 91922 72079
2723G2079K579j8384K2006j4559k616J8991j1024j9604j2364l485O581j3737K9785
$$ 72079 74658 56274 78280 63721 61105 80096 69072 49468 37104 33619 40200 26463 56248
2710E6248j8797P981N110o383k0377o601Q326k2720L08m325L40Q575K2896J209
$$ 56248 37451 45432 50542 44159 23782 17181 25507 2787 3095 -1230 -890 7685 30581 31790
2696C1790j6400j9932k6381r165K3217J1682J4341o63k6090J4905P421J495l7580
$$ 31790 15390 -4542 -30923 -40088 -16871 -5189 9152 8489 -17601 -2696 4725 6220 -31360
2683c1360j7467N7316P687k8244j4705K490j6763K5337q075j127K4068j2415j6237
$$ -31360 -48827 8489 16176 -12068 -26773 -24283 -41046 -15709 -23784 -24911 -843 -13258 -29495
2670b9495m81K4462j2966j4775K7001m98M286N873M241m3790M271L0237j2331
$$ -29495 -29976 -5514 -18480 -33255 -6254 -6752 -2466 3407 7648 -36142 -31871 -1634 -13965
2657a3965J1215o257q085n051K496o705J7606k9398K3909L480n7917K724J1657
$$ -13965 -2750 -9007 -17092 -22143 -19647 -26352 -8746 -38144 -14235 -10755 -68672 -65948 -54291
2644e4291K5166M0538j1250j3946j2306j1715J8757O142l3977k5234l9m850L3735
$$ -54291 -29125 11413 163 -13783 -26089 -37804 -19047 -12905 -46882 -72116 -72155 -77005 -43270
2631d3270Q414k0161J0217k766o951K6199k7460J22K2237k2985p692j262k0326
$$ -43270 -34856 -55017 -44800 -47566 -54517 -28318 -55778 -55656 -33419 -56404 -64096 -65358 -85684
2618h5684J5661q428j4075J5457P045J2921k5980K9380Q34k0268N806J0823n958
$$ -85684 -70023 -78451 -92526 -77069 -70024 -57103 -83083 -53703 -52869 -73137 -67331 -56508 -62466
2605f2466l1607L4486J492j1201j8299J4227K0024j4691j5522L4354o010O45J0694
$$ -62466 -94073 -59587 -58095 -69296 -87595 -73368 -53344 -68035 -83557 -49203 -55213 -54568 -43874
2592d3874J5973j298o497l438j021j9652J7701r762m620J0323m925K2197j1261
$$ -43874 -27901 -29199 -35696 -39134 -40155 -59807 -42106 -51868 -56488 -46165 -51090 -28893 -40154
2579d0154M609j3910k883k9722O067K7356J3832j5906K3394N073M609K5956l4560
$$ -40154 -35545 -49455 -52338 -82060 -75993 -48637 -34805 -50711 -27317 -22244 -17635 8321 -26239
2566b6239o469j940j0935J3263j4601j805L2792l6811K0162L5388R900l410o466
$$ -26239 -32708 -34648 -45583 -32320 -46921 -48726 -15934 -52745 -32583 2805 12705 9295 2829
2553B829k468j0521k1572P481K065r687J136O099R699q178R649K2413J7892m232
$$ 2829 361 -10160 -31732 -24251 -22186 -31873 -30737 -24638 -14939 -23117 -13468 8945 26837 22605
2539B2605k2425j6682J7814o841J9837q033J505J6670M4949k1969j9445K4149
$$ 22605 180 -16502 1312 -5529 14308 6275 7780 24450 69399 47430 27985 52134
2527E2134l0407l1693M9952J8844o918n045k6810J7649j4181J0206J4086K9506
$$ 52134 21727 -9966 39986 58830 51912 46867 20057 37706 23525 33731 47817 77323
2515G7323o68j7839K4137o886k9258q852K269J8968O0706k3748R519K999k1372
$$ 77323 76655 58816 82953 76067 46809 37957 40226 59194 119900 96152 105671 108670 87298
2502H7298r636L222k6008j1664L8914J006O129j3482K0512k870J4134K2589j3558
$$ 87298 77662 80884 54876 43212 82126 83132 89261 75779 96291 93421 107555 130144 116586
2489A16586j4614o325N356P440o257o559k924K4695L8567l1870j018Q959p206
$$ 116586 101972 95647 101003 108443 102186 95627 92703 117398 155965 124095 123077 132036 124830
2476A24830L3521k14K9112j1417n1862j8434J8570K8284n948l5142J2866O280
$$ 124830 158351 158137 187249 175832 123970 105536 124106 152390 146442 111300 124166 130446
2464A30446K2138p752q917K005k2327N669J7754m0687l1693L8928n086Q558k1166
$$ 130446 152584 144832 135915 137920 115593 121262 139016 98329 66636 105564 100478 109036 87870
2451H7870J8101J1416J8078k3028j181j8338J6458q53n1221K4713k669n051M32
$$ 87870 105971 117387 135465 112437 111256 92918 109376 108523 57302 82015 79346 74295 74727
2438G4727L752j4119k4182k1259K4315J2637O994o858q477k7171j9302L745l2119
$$ 74727 78479 64360 40178 18919 43234 55871 62865 56007 47530 20359 1057 4802 -27317
2425b7317K251M2052r654N344k3889O800K9964q401q91n558J5519j0351k1703
$$ -27317 -25066 16986 7332 12676 -11213 -4413 25551 17150 16259 10701 26220 15869 -5834
2412e834L0746p687m0518j5563K4646Q439j2789J1755q325j8015q232J1433j5616
$$ -5834 24912 17225 -23293 -38856 -14210 -5771 -18560 -6805 -15130 -33145 -41377 -29944 -45560
2399d5560L7279L966L622j8688p241j060N254q870K2372J72k3788L0589j8541
$$ -45560 -8281 -4315 -693 -19381 -26622 -27682 -22428 -31298 -8926 -8754 -32542 -1953 -20494
2386b0494k9534q725R777K3982j4630l242j2175j0006L5960q618l2L660j7094
$$ -20494 -50028 -58753 -48976 -24994 -39624 -42866 -55041 -65047 -29087 -37705 -37737 -34077 -51171
2373e1171J686J6885j8919k071n218j202j514k802k1577j1761K0100k4123K0833
$$ -51171 -49485 -32600 -51519 -53590 -58808 -60010 -61524 -64326 -85903 -97664 -77564 -101687 -80854
2360h0854K3073k2002r159K7153L2102l2971N373n966j1238j3138N440K2843o440
$$ -80854 -57781 -79783 -88942 -61789 -29687 -62658 -57285 -63251 -74489 -87627 -82187 -59344 -65784
2347f5784P416M00j325P769K0113j6654k4999J3586k1454n890K8038J6320j7931
$$ -65784 -58368 -57968 -59293 -51524 -31411 -48065 -73064 -59478 -80932 -86822 -58784 -42464 -60395
2334f0395R372l857l998j7616m832J0014J7475K8346m1890l3498K0597M0859n615
$$ -60395 -51023 -54880 -58878 -76494 -81326 -71312 -53837 -25491 -67381 -100879 -80282 -39423 -45038
2321d5038l5728M24J1723m017p481K7122j5981Q275j5695J2203L2315k0523n021
$$ -45038 -80766 -80342 -68619 -72636 -80117 -52995 -68976 -60701 -76396 -64193 -31878 -52401 -57422
2308e7422k8878l1977j2231K1257Q038K5152j4108J3742M8188j3324Q267j1517
$$ -57422 -86300 -118277 -130508 -109251 -101213 -76061 -90169 -76427 -28239 -41563 -33296 -44813
2296d4813k4828l380M775j9921J1310J6164k7244q731k2147L7614N877J625m0162
$$ -44813 -69641 -73021 -68246 -88167 -76857 -60693 -87937 -96668 -118815 -81201 -75324 -73699 -113861
2283a13861J993J7550M551L6469J1144J3285j913J106j8673k0675j0787J0099
$$ -113861 -111868 -94318 -89767 -53298 -42154 -28869 -30782 -29676 -48349 -69024 -79811 -69712
2271f9712l5404K6932J0692k238N509J2668K0946m782M469n091l977j6942M0216
$$ -69712 -105116 -78184 -67492 -69730 -64221 -51553 -30607 -35389 -30920 -36011 -39988 -56930 -16714
2258a6714l6445r644k344j7297N001N684M0795n738K1517r76k793k0214O278J904
$$ -16714 -53159 -62803 -65147 -82444 -77443 -71759 -30964 -36702 -15185 -16161 -18954 -39168 -32890 -30986
2244c0986k5275k687P515n704o3l342n9799K1830L8860j3614k5525R575L4302
$$ -30986 -56261 -58948 -51433 -57137 -57200 -60542 -120341 -98511 -59651 -73265 -98790 -89215 -54913
2231e4913L882L407j832j5071j162q832J1390j0875M425P515j155J9772r006M180
$$ -54913 -51031 -47624 -49456 -64527 -65689 -74521 -63131 -74006 -69581 -62066 -63221 -43449 -52455 -48275
2217d8275M91q261J7377P118j7641j0512J6630j3498j3500K0600k2323L0792j1856
$$ -48275 -47784 -56045 -38668 -31550 -49191 -59703 -43073 -56571 -70071 -49471 -71794 -41002 -52858
2204e2858l4792L6448K7816J7380j9307k9670k4915O642n327m121l506J4989K8903
$$ -52858 -87650 -51202 -23386 -6006 -25313 -54983 -79898 -73256 -78583 -82704 -86210 -71221 -42318
2191d2318L2522l3365m302N055l926L719j7183j0951J2280j4147J6377m408j5866
$$ -42318 -9796 -43161 -47463 -42408 -46334 -42615 -59798 -70749 -58469 -72616 -56239 -60647 -76513
2178g6513K9334M8534k5009j3857j2138J001R159j0279J9387K9642j9574l1024
$$ -76513 -47179 1355 -23654 -37511 -49649 -48648 -39489 -49768 -30381 -739 -20313 -51337
2166e1337K3668K3745k2567p629R803l4780r415J1735L6729J8921l7066j2901
$$ -51337 -27669 -3924 -26491 -34120 -24317 -59097 -68512 -56777 -20048 -1127 -38193 -51094
2154e1094K517J2805Q917J0310l2936n715j1524J136N6729M807n22l0226K5103
$$ -51094 -48577 -35772 -26855 -16545 -49481 -55196 -66720 -65584 -8855 -4048 -4570 -34796 -9693
2141i693m2693L791K80p981j8513J4477P748j6017K3162J8534P653m206J0942
$$ -9693 -52386 -48595 -48315 -56296 -74809 -60332 -52584 -68601 -45439 -26905 -19252 -23458 -12516
2128a2516j7512k842J6019m801j0084k2167J3848K8952L2926j8389j1625L1321
$$ -12516 -30028 -32870 -16851 -21652 -31736 -53903 -40055 -11103 21823 3434 -8191 23130
2116B3130l6221o390J0490r402J0755o18p007P6L0355j3350j5106J4236N0996
$$ 23130 -13091 -19481 -8991 -18393 -7638 -8256 -15263 -15187 15168 1818 -13288 948 51944
2103E1944k4040Q875k8233j6456M974L5382L076M458k7067J8595Q820L062p6K070
$$ 51944 27904 36779 8546 -7910 -2936 32446 35522 39980 12913 31508 40328 43390 43314 45384
2089D5384l143j0573J3920J4341k2784o440r646j884k5668P241K2626l738L6539
$$ 45384 42241 31668 45588 59929 37145 30705 21059 19175 -6493 748 23374 19636 56175
2076E6175O691k468l828M838J574n666J4245K4136o271K6514j5531l902L2504
$$ 56175 62866 60398 56570 61408 62982 57316 71561 95697 89426 115940 100409 96507 129011
2063A29011P190R963J1390K6166M3839K1971M6074K088Q834o0537m1189j1999
$$ 129011 136201 146164 157554 183720 227559 249530 295604 297692 306526 245989 204800 192801
2051A92801j0068j8827j1909l3616N881L694J8480j8530M3009n567L7685J1530
$$ 192801 182733 163906 151997 118381 124262 127956 146436 127906 170915 165348 203033 214563
2039B14563R630k610o916R351o921p194k2835J4988M6517J1962l245J6652L1386
$$ 214563 224193 221583 214667 224018 217097 209903 187068 202056 248573 260535 257290 273942 305328
2026C05328J4978J3666j5701J7699J5382K2503R619k494J0798J2540M8423J4604
$$ 305328 320306 333972 318271 335970 351352 373855 383474 380980 391778 404318 452741 467345
2014D67345K8242K6262K7914N3836M1776M0316N0140L0427N6457Q4619N3465P2551
$$ 467345 495587 521849 549763 603599 645375 685691 735831 766258 822715 907334 960799 1033350
2002A033350P1576R1928J02284J51930J40805J40991J38320K14532K20957K88757
$$ 1033350 1104926 1196854 1299138 1451068 1591873 1732864 1871184 2085716 2306673 2595430
1992B595430L30316M06014N07066N53234N85979P60547P06975Q66328Q37634R90514
$$ 2595430 2925746 3331760 3838826 4392060 4978039 5738586 6445561 7311889 8149523 9140037
1982I140037N03145r37495j336890j527545j178291q47392n64732m07367l41984
$$ 9140037 9643182 8705687 7368797 5841252 4662961 3815569 3250837 2843470 2501486
1973B501486k60411j82340j78010j23049j07636q0985j02633j06270j28743q7484
$$ 2501486 2241075 2058735 1880725 1757676 1650040 1569055 1466422 1360152 1231409 1143925
1963A143925j01006o6789o1114k7284n4184m9715k6670m7923k7970k33l9719l5383
$$ 1143925 1042919 976130 915016 887732 833548 783833 757163 709240 681270 681037 641318 605935
1951F05935k70o4153l0095J087K9220j4566k4501j1886l9920n4651J2622l3694
$$ 605935 605665 541512 511417 512504 541724 527158 502657 490771 450851 396200 408822 375128
1939C75128l7960j7223k6971P804J7790j7923k478K343l1862j1519k5262m419
$$ 375128 337168 319945 292974 300778 318568 300645 298167 300510 268648 257129 231867 227448
1927B27448J9484l4624L456N271o713q598l3447K690K3912j067O00j6579J7957
$$ 227448 246932 212308 215764 221035 214322 205724 172277 174967 198879 197812 198412 181833 199790
1914A99790j6358k1026J20m026J151n135J295Q568k1184j8804J9302m0497n607
$$ 199790 183432 162406 162526 158500 159651 154516 155811 164379 143195 124391 143693 103196 97589
1901I7589n879L091J7761J9379l1524k1795k9855Q147K575r58l162N316N291j0953
$$ 97589 91710 94801 112562 131941 100417 78622 48767 56914 59489 58531 55369 60685 65976 55023
1887E5023J1718j647k6705o567o283L7258J3191k2425Q795k1013J1059j0079J2101
$$ 55023 66741 65094 38389 31822 25539 62797 75988 53563 62358 41345 52404 42325 54426
1874E4426k7570l5622k408m529l629K7186M268k8891j6958nK5700K2920l1718
$$ 54426 26856 -8766 -11174 -15703 -19332 7854 12122 -16769 -33727 -33732 -8032 14888 -16830
1861a6830J7325n72k1411K0788n332J2699P440j3758n506j6702J2424L3078j3826
$$ -16830 495 -77 -21488 -700 -6032 6667 14107 349 -5157 -21859 -9435 23643 9817
1848I817l8330K5959L2405m1938Q643J1164j5577j2680k9504K9769M910k4221
$$ 9817 -28513 -2554 29851 -12087 -3444 7720 -7857 -20537 -50041 -20272 -15362 -39583
1836c9583J1615K4023k1823K216J7191K6092j4146k5209j7903J0717P59L8765
$$ -39583 -27968 -3945 -25768 -23552 -6361 19731 5585 -19624 -37527 -26810 -26051 12714
1824A2714k4699j2610j8155m415r352R352O770Q952l780k4471K9524O503j2795
$$ 12714 -11985 -24595 -42750 -47165 -56517 -47165 -40395 -31443 -35223 -59694 -30170 -23667 -36462
1811c6462L347R355l7022l344K1658J323n874K350P56J5273n538J1671r967l168
$$ -36462 -33115 -23760 -60782 -64126 -42468 -41145 -47019 -44669 -43913 -28640 -34178 -22507 -32474 -35642
1797c5642K2149J4607j450l2232K002J6879K4954l1003k7507J0603J8821L401
$$ -35642 -13493 1114 -336 -32568 -30566 -13687 11267 -19736 -47243 -36640 -17819 -14418
1785a4418k3239P065k3870K2106J0271r001L3983m113l987J7707j6281k2585N852
$$ -14418 -37657 -30592 -54462 -32356 -22085 -31086 2897 -1216 -5203 12504 -3777 -26362 -20510
1772b0510j0262k3427k2902K6789J0580K4959J473L598l083l5093J839j404N210
$$ -20510 -30772 -54199 -77101 -50312 -39732 -14773 -13300 -9702 -12785 -47878 -46039 -47443 -42233
1759d2233k2946M5718K4415j5428J4532j9281l0752k135J2006J5137J7329J5252
$$ -42233 -65179 -19461 4954 -10474 4058 -15223 -45975 -48110 -36104 -20967 -3638 11614
1747A1614o9785R450O419L7308N233l4220m420P505r214J5885k299k1545m294
$$ 11614 -58171 -48721 -42302 -4994 239 -33981 -38401 -30896 -40110 -24225 -26524 -48069 -52363
1734e2363J1706o254l6540K7426K3017J090l5436o211K1414J0155k7976J6591
$$ -52363 -40657 -46911 -83451 -56025 -33008 -31918 -67354 -73565 -52151 -41996 -69972 -53381
1722e3381K2799K9599q40k5910P765k2354J5883J6572K0973J9752k7126k109K9846
$$ -53381 -30582 -983 -1823 -27733 -19968 -42322 -26439 -9867 11106 30858 3732 1623 31469
1709C1469j6208k1171J3618j1012q888q790l9495J1702L1676J1087M574K390n5276
$$ 31469 15261 -5910 7708 -3304 -12192 -20982 -60477 -48775 -17099 -6012 -1438 952 -54324
1696e4324J0271N629K3498K5318l7233k2597K541M601P27k1236L9472l3146K0070
$$ -54324 -44053 -38424 -14926 10392 -26841 -49438 -46897 -42296 -41569 -62805 -23333 -56479 -36409
1683c6409J5853p98j7164k940K6343k1667N726p903J1447M650k7555j097M3486
$$ -36409 -20556 -21354 -38518 -41458 -15115 -36782 -31056 -38959 -27512 -22862 -50417 -51514 -8028
1670h028o270j3871J4503j2092k636K2208j2204K3299j8014k4538q976k8732j2140
$$ -8028 -14298 -28169 -13666 -25758 -28394 -6186 -18390 4909 -13105 -37643 -46619 -75351 -87491
1657h7491M1150J272K8270K532m7910q444L028N045J6711P624K2228L812J979
$$ -87491 -46341 -45069 -16799 -14267 -62177 -70621 -67593 -62548 -45837 -38213 -15985 -12173 -10194
1644a0194k3873K0539L979j339j4001j0114k348J781M463L4194J4498j8182k5878
$$ -10194 -34067 -13528 -9549 -10888 -24889 -35003 -37351 -35570 -31107 3087 17585 -597 -26475
1631b6475L056R177k5494p543l2627R873M0990j7432j994j6333L4794O847j9137
$$ -26475 -23419 -14242 -39736 -47279 -79906 -70033 -29043 -46475 -48469 -64802 -30008 -23161 -42298
1618d2298R331K3365k7985J130j91l438K1018J4878k2772l9843k0296L4087J6836
$$ -42298 -32967 -9602 -37587 -36457 -36648 -40086 -19068 -4190 -26962 -66805 -87101 -53014 -36178
1605c6178J8710j6532p90J1289J5590R514N379k4740k3422J6467l6493q163M2573
$$ -36178 -17468 -34000 -34790 -23501 -7911 1603 6982 -17758 -41180 -24713 -61206 -69369 -26796
1592b6796K4044k2943K1858l4904j8131K2527J4493j598J4456K0945j2385o1373
$$ -26796 -2752 -25695 -3837 -38741 -56872 -34345 -19852 -21450 -6994 13951 1566 -59807
1580e9807q806M0124K7358n831r815k5942L7395k3624k3481m45l409J0910J5955
$$ -59807 -68613 -28489 -1131 -6962 -16777 -42719 -5324 -28948 -52429 -52874 -56283 -45373 -29418
1567b9418P53j7992J7894L2887m55p786j0575k651J5902Q139l7210J1425J6539
$$ -29418 -28665 -46657 -28763 4124 3669 -4117 -14692 -17343 -1441 6698 -30512 -19087 -2548
1554b548o195n723j5457j9577j5016m6137N0462N5546j9478k7199j5295N5139
$$ -2548 -8743 -14466 -29923 -49500 -64516 -110653 -60191 -4645 -24123 -51322 -66617 -11478
1542a1478j5315j8501j5119O393N441K2150j8892k3218J3412j5934K7306p20k695
$$ -11478 -26793 -45294 -60413 -54020 -48579 -26429 -45321 -68539 -55127 -71061 -43755 -44475 -47170
1529d7170R761J7802j3900K613o480R473j8484J1929K9465j8292j5306j9063L9893
$$ -47170 -37409 -19607 -33507 -30894 -37374 -27901 -46385 -34456 -4991 -23283 -38589 -57652 -17759
1516a7759J0726l8308J0357q944L6831J8135j6257k8315m429K3166K6302m1750
$$ -17759 -7033 -45341 -34984 -43928 -7097 11038 -5219 -33534 -37963 -14797 11505 -30245
1504c0245k5044M412k3167J9498M3616l577j0506k6765J5004K0964j4432J9531
$$ -30245 -55289 -50877 -74044 -54546 -10930 -14507 -25013 -51778 -36774 -15810 -30242 -10711
1492a0711j2483J0781j5983J4062j9664J4532j3719L1954M753j7064k4432L3056
$$ -10711 -23194 -12413 -28396 -14334 -33998 -19466 -33185 -1231 3522 -13542 -37974 -4918
1480d918j0970k012L3479o6830J2356j5924K5528k4450j479L0537R382J0341k1454
$$ -4918 -15888 -17900 15579 -51251 -38895 -54819 -29291 -53741 -55220 -24683 -15301 -4960 -26414
1467b6414j2391J0954L6817P680J0945m5082M48k2178J5677J8184K2708k630r443
$$ -26414 -38805 -27851 8966 16646 27591 -17491 -17043 -39221 -23544 -5360 17348 14718 5275
1454E275q73m2478j1480Q045r410j7977N701J746k315J1596o73k60K1934k4843
$$ 5275 4402 -38076 -49556 -41511 -50921 -68898 -63197 -61451 -63766 -52170 -52843 -53103 -31169 -56012
1440e6012K2967N473k5686K101m4078n193J9751J2474K9954O0861k9517o532p596
$$ -56012 -33045 -27572 -53258 -51157 -95235 -100428 -80677 -68203 -38249 22612 -6905 -13437 -21033
1427b1033n268K0416j0600k1884l6208J0234J8250K5630J2477n274j7415k5088
$$ -21033 -26301 -5885 -16485 -38369 -74577 -64343 -46093 -20463 -7986 -13260 -30675 -55763
1415e5763p586J4212N484r318N698j964P979J1617n814l5636J7038L5915l8874
$$ -55763 -63349 -49137 -43653 -52971 -47273 -49237 -41258 -29641 -35455 -71091 -54053 -18138 -57012
1402e7012K9199L0796Q834k5681l2846o296J3640r263l981R948q094j4695K7969
$$ -57012 -27813 2983 11817 -13864 -46710 -53006 -39366 -48629 -52610 -42662 -50756 -65451 -37482
1389c7482J4487k7426r227k1347L6457M369j7904J1558p22L1629k1354K5021K0818
$$ -37482 -22995 -50421 -59648 -80995 -44538 -40169 -58073 -46515 -47237 -15608 -36962 -11941 8877
1376H877m9863J216J04k1925K6386J4598Q347J5203j6219k8691o395J0595J1215
$$ 8877 -40986 -39770 -39666 -61591 -35205 -20607 -12260 2943 -13276 -41967 -48362 -37767 -26552
1363b6552j4250k5158J3801o557K9935j3090k5450P881J2753J7844j010K968P001
$$ -26552 -40802 -65960 -52159 -58716 -28781 -41871 -67321 -59440 -46687 -28843 -29853 -26885 -19884
1350a9884O203J2159M306O70L152o157n333k7032Q951Q539R260N084N720O573
$$ -19884 -13681 -1522 2784 3454 6606 449 -4884 -31916 -22965 -14426 -5166 -82 5638 12211
1336A2211J2550j7465L4302m4935j8800j4289L1559J5987l155r647m3318K5192
$$ 12211 24761 7296 41598 -3337 -22137 -36426 -4867 11120 7965 -1682 -45000 -19808
1324a9808O791o135r913K1017J862P994p108l1619n627L31j8206M5235j4775o480
$$ -19808 -13017 -19152 -29065 -8048 -6186 1808 -5300 -36919 -42546 -42215 -60421 -15186 -29961 -36441
1310c6441Q095J9129J1682J0758J670k3641l7162R497K179J2710j1407j2721j2638
$$ -36441 -28346 -9217 2465 13223 14893 -8748 -45910 -36413 -34234 -21524 -32931 -45652 -58290
1297e8290J7528J6209j1804K6062j1533J4013l7045M198k8567L2370J0502k43
$$ -58290 -40762 -24553 -36357 -10295 -21828 -7815 -44860 -40662 -69229 -36859 -26357 -26600
1285b6600K0553Q397k8777j155o3K7952L131l8475L3259k2628l1951M594L9827
$$ -26600 -6047 2350 -26427 -27582 -27645 307 3438 -35037 -1778 -24406 -56357 -51763 -11936
1272a1936j5526L4244R101k841k0650m599j2191j7437L980J3659r687r282n223
$$ -11936 -27462 6782 15883 13042 -7608 -12207 -24398 -41835 -37855 -24196 -33883 -43165 -48388
1259d8388J0826q514O179L1673J6857J3102j6742L798j6787L176j5393m187N292
$$ -48388 -37562 -46076 -39897 -8224 8633 21735 4993 8791 -7996 -4820 -20213 -24400 -19108
1246a9108l6464k5972M7699L2534l0919J2392J0178Q816j0137l2223P633J1870
$$ -19108 -55572 -81544 -33845 -1311 -32230 -19838 -9660 -844 -10981 -43204 -35571 -23701
1234b3701o950M6926Q660l2715m1699K9262O959J9085J0542m832j2900m2670K1496
$$ -23701 -30651 16275 24935 -7780 -49479 -20217 -13258 5827 16369 11537 -1363 -44033 -22537
1221b2537P48L4234K530J110n0819j4234L5206K5263R394R40j0806m3503K0220
$$ -22537 -21789 12445 14975 16085 -34734 -48968 -13762 11501 20895 21835 11029 -32474 -12254
1208a2254j2270k530N100J3757M559j7338P091J5323O713k0001R106l6806j9605
$$ -12254 -24524 -27054 -21954 -8197 -3638 -20976 -13885 1438 8151 -11850 -2744 -39550 -59155
1195e9155R912K920M571K5627r957K90J8422k911J7188l2752N90K9396k2538n822
$$ -59155 -49243 -46323 -41752 -16125 -26082 -25792 -7370 -10281 6907 -25845 -25255 4141 -18397 -24219
1181b4219J9357R622J6729j2148j0692k1751l2127L3173L0508j6342J324N699
$$ -24219 -4862 4760 21489 9341 -1351 -23102 -55229 -22056 8452 -7890 -6566 -867
1169h67J1581l5968j0285J2868j2156J4550L548j0903Q362J1679J3985k0728k6461
$$ -867 10714 -25254 -35539 -22671 -34827 -20277 -16729 -27632 -19270 -7591 6394 -14334 -40795
1156d0795J7813n38N060J8708K1903m3930j912K1412l1815k5683K2403L5905k1656
$$ -40795 -22982 -23520 -18460 248 22151 -21779 -23691 -2279 -34094 -59777 -37374 -1469 -23125
1143b3125j3891J2266M661O552Q295J0484j4148J6036o057qJ3128k2973M066J1309
$$ -23125 -37016 -24750 -20089 -13537 -5242 5242 -8906 7130 1073 1065 14193 -8780 -4714 6595
$$ [...]
##END NTUPLES=NMR SPECTRUM
##END=
