##TITLE=1H_CA-8930
 CDCl3,8 sc, 
 28.9.2021
##JCAMPDX= 6.0         $$ Bruker NMR JCAMP-DX V2.0
##DATA TYPE= NMR SPECTRUM
##DATA CLASS= NTUPLES
##ORIGIN= UXNMR, Bruker Analytische Messtechnik GmbH
##OWNER= root
$$ XWIN-NMR		Version 3.5
$$ Tue Sep 28 11:48:04 2021 Russian Standard Time (UT+4h)  she@DPX200
##.OBSERVE FREQUENCY= 200.1314
##.OBSERVE NUCLEUS= ^1H
##.ACQUISITION MODE= SIMULTANEOUS
##.ACQUISITION SCHEME= undefined
##.AVERAGES= 8
##.DIGITISER RES= 18
##SPECTROMETER/DATA SYSTEM= spect
##.PULSE SEQUENCE= zg30
##.SOLVENT NAME= CDCl3
##.SHIFT REFERENCE= (INTERNAL, CDCl3, 0, 16.9729)
##AUDIT TRAIL= $$ (NUMBER, WHEN, WHO, WHERE, WHAT)
$$ ##TITLE= Audit trail, XWIN-NMR		Version 3.5
$$ ##JCAMPDX= 5.01
$$ ##ORIGIN= Bruker BioSpin GmbH
$$ ##OWNER= she
$$ F:/spectra/data/she/nmr/H-F/1/pdata/1/auditp.txt
$$ ##AUDIT TRAIL=  $$ (NUMBER, WHEN, WHO, WHERE, WHAT)
(   1,<2021-09-28 11:45:38.31 +0400>,<she>,<DPX200>,
      <created by zg, POWCHK disabled, PULCHK disabled
       configuration hash MD5:
       00 E9 B6 7A A2 85 ED C7 34 08 36 98 17 FE 4E 26
       data hash MD5: 16K
       6B 4A ED CC 5A 40 7F 26 2F BF 59 08 7F 7C B7 73>)
(   2,<2021-09-28 11:45:40.92 +0400>,<she>,<DPX200>,
      <Start of raw data processing
       efp BC_mod = 2 LB = 0.24 FT_mod = 6 PKNL = 1 PHC0 = -14080.64 PHC1 = 17.00087 SI = 16K 
       data hash MD5: 16K
       C5 BA 39 84 DF 88 F4 47 0F 45 22 02 A6 F5 39 70>)
(   3,<2021-09-28 11:45:56.14 +0400>,<she>,<DPX200>,
      <pk PHC0 = 0.6820453 PHC1 = -0.8 
       data hash MD5: 16K
       D6 E6 EC 7F 95 4C 2C 32 52 A9 0B 0B 2A 75 FB F4>)
(   4,<2021-09-28 11:45:59.15 +0400>,<she>,<DPX200>,
      <abs ABSG = 5 
       data hash MD5: 16K
       C8 E9 1A E4 CA FB 90 39 21 8E 99 20 74 26 F5 7C>)
$$ ##END=
$$ 
$$ hash MD5
$$ 5E B0 08 89 AB 92 85 23 09 C1 E0 C5 1A A6 02 06
##$RELAX= 
##$RELAX= 
##$RELAX= 
##$RELAX= 
##$RELAX= 
##$RELAX= 
$$ Bruker specific parameters
$$ --------------------------
##$DU= <F:/spectra>
##$EXPNO= 1
##$NAME= <H-F>
##$PROCNO= 1
##$TYPE= <nmr>
##$USER= <she>
##$AMP= (0..31)
100 100 100 100 100 100 100 100 100 100 100 100 100 100 100 100 100 100 
100 100 100 100 100 100 100 100 100 100 100 100 100 100 
##$AQSEQ= 0
##$AQ_mod= 1
##$AUNM= <au_zg>
##$AUTOPOS= <>
##$BF1= 200.13
##$BF2= 200.13
##$BF3= 200.13
##$BF4= 200.13
##$BF5= 200.13
##$BF6= 200.13
##$BF7= 200.13
##$BF8= 200.13
##$BYTORDA= 1
##$CFDGTYP= 0
##$CFRGTYP= 5
##$CHEMSTR= <none>
##$CNST= (0..31)
1 1 145 1 1 1 1 1 1 1 1 1 1 1 1 1 1 1 1 1 1 1 1 1 1 1 1 1 1 1 1 1 
##$CPDPRG= <>
##$CPDPRG1= <>
##$CPDPRG2= <>
##$CPDPRG3= <>
##$CPDPRG4= <mlev>
##$CPDPRG5= <mlev>
##$CPDPRG6= <mlev>
##$CPDPRG7= <mlev>
##$CPDPRG8= <mlev>
##$CPDPRGB= <>
##$CPDPRGT= <>
##$D= (0..31)
0 1.2 0 0 0 0 0 0 0 0.06 0 0.03 0 0 0 0 0.0002 0 0 0 0 0 0 0 0 0 0 0 0 
0 0 0 
##$DATE= 1632815137
##$DBL= (0..7)
120 120 120 120 120 120 120 120 
##$DBP= (0..7)
150 150 150 150 150 150 150 150 
##$DBP07= 0
##$DBPNAM0= <>
##$DBPNAM1= <>
##$DBPNAM2= <>
##$DBPNAM3= <>
##$DBPNAM4= <>
##$DBPNAM5= <>
$$ [...]
##$SUBNAM2= <"">
##$SUBNAM3= <"">
##$SUBNAM4= <"">
##$SUBNAM5= <"">
##$SUBNAM6= <"">
##$SUBNAM7= <"">
##$SUBNAM8= <"">
##$SUBNAM9= <"">
##$SW= 20.0188988654967
##$SWIBOX= (0..15)
0 0 2 0 0 0 0 0 0 0 0 0 0 0 0 0 
##$SW_h= 4006.41025641026
##$TD= 16384
##$TD0= 1
##$TE= 0
##$TE2= 300
##$TE3= 300
##$TEG= 300
##$TL= (0..7)
0 120 120 120 120 120 120 120 
##$TP= (0..7)
150 150 150 150 150 150 150 150 
##$TP07= 0
##$TPNAME0= <>
##$TPNAME1= <>
##$TPNAME2= <>
##$TPNAME3= <>
##$TPNAME4= <>
##$TPNAME5= <>
##$TPNAME6= <>
##$TPNAME7= <>
##$TPOAL= (0..7)
0.5 0.5 0.5 0.5 0.5 0.5 0.5 0.5 
##$TPOFFS= (0..7)
0 0 0 0 0 0 0 0 
##$TUNHIN= 0
##$TUNHOUT= 0
##$TUNXOUT= 0
##$USERA1= <user>
##$USERA2= <user>
##$USERA3= <user>
##$USERA4= <user>
##$USERA5= <user>
##$V9= 5
##$VALIST= <valist>
##$VCLIST= <CCCCCCCCCCCCCCC>
##$VD= 0
##$VDLIST= <DDDDDDDDDDDDDDD>
##$VPLIST= <PPPPPPPPPPPPPPP>
##$VTLIST= <TTTTTTTTTTTTTTT>
##$WBST= 1024
##$WBSW= 4
##$XGAIN= (0..3)
0 0 0 0 
##$XL= 0
##$YL= 0
##$YMAX_a= 347152
##$YMIN_a= -500062
##$ZGOPTNS= <>
##$ZL1= 120
##$ZL2= 120
##$ZL3= 120
##$ZL4= 120
##$ABSF1= 16.97293
##$ABSF2= -3.046108
##$ABSG= 5
##$ABSL= 3
##$ALPHA= 0
##$AQORDER= 0
##$ASSFAC= 0
##$ASSFACI= 0
##$ASSFACX= 0
##$ASSWID= 0
##$AUNMP= <proc_1d>
##$AZFE= 0.1
##$AZFW= 0.1
##$BCFW= 0
##$BC_mod= 2
##$BYTORDP= 0
##$COROFFS= 0
##$CY= -3
##$DATMOD= 1
##$DC= 0
##$DFILT= <>
##$DTYPP= 0
##$F1P= 0
##$F2P= 0
##$FCOR= 1
##$FTSIZE= 16384
##$FT_mod= 6
##$GAMMA= 0
##$GB= 0
##$INTBC= 1
##$INTSCL= 0
##$ISEN= 128
##$LB= 0.24
##$LEV0= 0
##$LPBIN= 0
##$MAXI= 10000
##$MC2= 0
##$MEAN= 0
##$ME_mod= 0
##$MI= 1.114404
##$NCOEF= 0
##$NC_proc= -7
##$NLEV= 6
##$NOISF1= 3.799351
##$NOISF2= 2.8
##$NSP= 0
##$NTH_PI= 0
##$NZP= 0
##$OFFSET= 16.97293
##$PC= 1
##$PHC0= -14079.96
##$PHC1= 16.20087
##$PH_mod= 1
##$PKNL= yes
##$PPARMOD= 0
##$PSCAL= 0
##$PSIGN= 0
##$REVERSE= no
##$SF= 200.130006411915
##$SI= 16384
##$SIGF1= 3
##$SIGF2= 2
##$SINO= 5.538805
##$SIOLD= 16384
##$SREGLST= <1H.CDCl3>
##$SSB= 0
##$STSI= 16384
##$STSR= 0
##$SW_p= 4006.41025641027
##$SYMM= 0
##$S_DEV= 0
##$TDeff= 16384
##$TDoff= 0
##$TI= <>
##$TILT= no
##$TM1= 0
##$TM2= 0
##$TOPLEV= 0
##$USERP1= <user>
##$USERP2= <user>
##$USERP3= <user>
##$USERP4= <user>
##$USERP5= <user>
##$WDW= 1
##$XDIM= 16384
##$YMAX_p= 445786524
##$YMIN_p= -731739
$$ End of Bruker specific parameters
$$ ---------------------------------
##NTUPLES= NMR SPECTRUM
##VAR_NAME=  FREQUENCY,     SPECTRUM/REAL,   SPECTRUM/IMAG
##SYMBOL=    X,             R,               I
##VAR_TYPE=  INDEPENDENT,   DEPENDENT,       DEPENDENT
##VAR_FORM=  AFFN,          ASDF,            ASDF
##VAR_DIM=   16384,         16384,           16384
##UNITS=     HZ,            ARBITRARY UNITS, ARBITRARY UNITS
##FACTOR=    0.244546801953871, 1,           1
##FIRST=     3396.79277148768, 0,            0
##LAST=      -609.617484922589, 0,           0
##MIN=       -609.617484922589, -731739,     0
##MAX=       3396.79277148768, 445786524,    0
$$ Real data points
##PAGE= N=1
##DATA TABLE= (X++(R..R)), XYDATA
$$ [...]
6608A2045730O82651L88777L29386K74777K15921K6631l07856l76814m32020p28888
$$ 12045730 12728381 13117158 13446544 13721321 13937242 13963873 13656017 13279203 12847183 12118295
6598A2118295l76919o54757o63288l77315k26578K4268j34720m35592k93492j719
$$ 12118295 11741376 11086619 10423331 10046016 9819438 9843706 9708986 9273394 8979902 8978183
6588H978183k73409j28159J85843J92748k40278J72671J10170K12569l4203j50804
$$ 8978183 8704774 8576615 8762458 8955206 8714928 8887599 8997769 9210338 9176135 9025331
6578I025331n2822k50487l05480o0121l06505k96134j04150j91628j16310r1716
$$ 9025331 8972509 8722022 8416542 8356421 8049916 7753782 7649632 7458004 7341694 7249978
6568G249978o3805R992r3872k53628J83042k80858K0840L2229k93830R2046R0139
$$ 7249978 7186173 7196165 7102293 6848665 7031707 6750849 6771689 6803918 6510088 6602134 6692273
6557F692273Q6253j96310j06928L75824j57780l07857K41494K78574k17220j4386
$$ 6692273 6778526 6582216 6475288 6851112 6693332 6385475 6626969 6905543 6688323 6673937
6547F673937Q4771j44128j14304p833q25l8139M6572j53481j22151J92234k5663
$$ 6673937 6758708 6614580 6500276 6492443 6491618 6453479 6500051 6346570 6224419 6416653 6390990
6536F390990L0787j0453m1778L8085L0748J85403o4402r2768r179J1395L6079
$$ 6390990 6421777 6411324 6369546 6407631 6438379 6623782 6559380 6466612 6457433 6468828 6504907
6525F504907k0732J3055L6690L3492J42842j82454o4208O3148o5470n2857q5778
$$ 6504907 6484175 6497230 6533920 6567412 6710254 6527800 6463592 6526740 6461270 6408413 6322635
6514F322635m2186q9283k7861N5335N3537M29452j7003n3710p9672O0395J2377
$$ 6322635 6280449 6191166 6163305 6218640 6272177 6701629 6684626 6630916 6551244 6611639 6624016
6503F624016k4074o0563j88585j73637j38978K47196k30416K15543r0163k53570
$$ 6624016 6599942 6539379 6350794 6177157 6038179 6285375 6054959 6270502 6180339 5926769
6493E926769P9424J76978K11075J10961K8918R913k50171J89080l20454j58824
$$ 5926769 6006193 6183171 6394246 6505207 6534125 6544038 6293867 6482947 6162493 6003669
6483F003669N8732N6809Q3700k22865l12878N9404L09184k87097j6691J6886n6609
$$ 6003669 6062401 6119210 6202910 5980045 5667167 5726571 6035755 5748658 5731967 5748853 5692244
6472E692244L05504q1212K0583j37038r5962K3616p3300R864L6400j03725l4576
$$ 5692244 5997748 5916536 5937119 5800081 5704119 5727735 5654435 5664299 5700699 5596974 5562398
6461E562398M1699R442M4944j26321K84194j00460j20442N729r0774j88897Q710
$$ 5562398 5604097 5613539 5658483 5532162 5816356 5715896 5595454 5601183 5510409 5321512 5330222
6450E330222L6399K12137j4916j04965k14775L42614J26467J1586q2820N4843
$$ 5330222 5366621 5578758 5563842 5458877 5244102 5586716 5713183 5724769 5641949 5696792
6440E696792J58425j24621J14481j24493l9374O7035M3118j38755o1423M10936
$$ 5696792 5855217 5730596 5845077 5720584 5681210 5748245 5791363 5652608 5591185 6002121
6430F002121L1512k47994Q6060J0128j79913j23102k9243K67951L6679j61895
$$ 6002121 6033633 5785639 5871699 5881827 5701914 5578812 5549569 5817520 5854199 5692304
6420E692304J940J21541k99712o1362k5826L65931M6214J42381r2673j90268P6200
$$ 5692304 5694244 5815785 5516073 5454711 5428885 5794816 5841030 5983411 5890738 5700470 5776670
6409E776670j74643R1425k3322M6909K7582K10088k8453j73577J73915j1548r8293
$$ 5776670 5602027 5693452 5670130 5717039 5744621 5954709 5926256 5752679 5926594 5915046 5816753
6398E816753k2207K51418J15544j05810m636k4091j2291J87990J33545j86367
$$ 5816753 5794546 6045964 6161508 6055698 6051062 6026971 6014680 6202670 6336215 6149848
6388F149848J8356j60808J67224J53838O1204k58134o930J28422J04805J0891
$$ 6149848 6168204 6007396 6174620 6328458 6389662 6131528 6124598 6253020 6357825 6368716
6378F368716o4245J5169R5036O0555J5960O0516J2289P1217L5159J45277j08365
$$ 6368716 6304471 6319640 6414676 6475231 6491191 6551707 6563996 6635213 6670372 6815649 6707284
6367F707284J68721K05616J7015J51725J42678K92847j2196M45878M89325L89732
$$ 6707284 6876005 7081621 7098636 7250361 7393039 7685886 7673690 8119568 8608893 8998625
6357H998625M65561K64987K3127l54312j24304k57728n83987m63941j78338k70402
$$ 8998625 9464186 9729173 9752300 9397988 9273684 9015956 8431969 7968028 7789690 7519288
6347G519288j83910N0895j92261l09992M6912j11039j8067K5368j97829r6345
$$ 7519288 7335378 7386273 7194012 6884020 6930932 6819893 6801826 6827194 6629365 6533020
6337F533020Q1242J1985m2431O7999l74385Q1133K16637r5756M4670j4544l1105
$$ 6533020 6614262 6626247 6583816 6651815 6277430 6358563 6575200 6479444 6524114 6509570 6478465
6326F478465P9836j78172O5768L7694m8557o1321L2300k49127J73634r5700O1157
$$ 6478465 6558301 6380129 6445897 6483591 6435034 6373713 6406013 6156886 6330520 6234820 6295977
6315F295977L1540J25969k30981j4579J45094j43045K17208k1532n4255J08308
$$ 6295977 6327517 6453486 6222505 6207926 6353020 6209975 6427183 6405651 6351396 6459704
6305F459704m0405N6510J01494j84686J64440J10443j178j49665j7796J57302
$$ 6459704 6419299 6475809 6577303 6392617 6557057 6667500 6666322 6516657 6498861 6656163
6295F656163J05959J58973K8221k17720m387J5773K99727O979j97366K05452N4036
$$ 6656163 6762122 6921095 6949316 6731596 6727209 6742982 7042709 7049688 6852322 7057774 7111810
6284G111810J15898n4712q0501R1683j73381n0381Q5938N3043o7678K09698n8748
$$ 7111810 7227708 7172996 7092495 7184178 7010797 6960416 7046354 7099397 7031719 7241417 7182669
6273G182669k09707q371m0962J86079J41579J78235l51378J4281K77556O3399
$$ 7182669 6972962 6964591 6923629 7109708 7251287 7429522 7078144 7092425 7369981 7433380
6263G433380K42154j8073J74495J72288K24346O2050k9274p58k2273K4398J25940
$$ 7433380 7675534 7657461 7831956 8004244 8228590 8290640 8261366 8260608 8238335 8262733 8388673
6252H388673J31867J62578J41884J46472J34777j92270j37580r6010p9413j91450
$$ 8388673 8520540 8683118 8825002 8971474 9106251 8913981 8776401 8680391 8600978 8409528
6242H409528n5080k23993l06895J64007j51974j58689k56365J71559J46630m3142
$$ 8409528 8354448 8130455 7823560 7987567 7835593 7676904 7420539 7592098 7738728 7695586
6232G695586j93445M7758K3537j28387j21943K57227k00841m0462K49729J55750
$$ 7695586 7502141 7549899 7573436 7445049 7323106 7580333 7379492 7339030 7588759 7744509
6222G744509l56557k3453K1864r9362J26076q1949j63963j4292j40956P1618m2380
$$ 7744509 7387952 7364499 7386363 7287001 7413077 7331128 7167165 7152873 7011917 7083535 7041155
6211G041155j4449j45303m0904J24582r774k61776J55618Q0284j13081Q4470k42988
$$ 7041155 7026706 6881403 6840499 6965081 6955307 6693531 6849149 6929433 6816352 6900822 6657834
6200F657834J12188K60897Q7686j49870m2020p3359m2911j64371K88587k10695
$$ 6657834 6770022 7030919 7118605 6968735 6926715 6853356 6810445 6646074 6934661 6723966
6190F723966R9640K0413P2243R6842p1939J48600R3011n386m8154J49437k39777
$$ 6723966 6823606 6844019 6916262 7013104 6941165 7089765 7182776 7177390 7129236 7278673 7038896
6179G038896j03746J64700J77049j0278j36167Q8324j34492L1485J4606j14048
$$ 7038896 6935150 7099850 7276899 7266621 7130454 7218778 7084286 7115771 7130377 7016329
6169G016329J21942q6354j75614L65491j69848j22124N2631j07654J94062M0604
$$ 7016329 7138271 7051917 6876303 7241794 7071946 6949822 7002453 6894799 7088861 7129465
6159G129465J29037R2403o910J08905l28475j2148L0831j55408o3978J4709J66667
$$ 7129465 7258502 7350905 7343995 7452900 7124425 7112277 7143108 6987700 6923722 6938431 7105098
6148G105098J33732j37994J68510r8834K1291p8442J15387p6156J02032j65296
$$ 7105098 7238830 7100836 7269346 7170512 7191803 7113361 7228748 7152592 7254624 7089328
6138G089328j46444L2886l5848J95803O7856J46189j27203J71366p100r2419N3905
$$ 7089328 6942884 6975770 6939922 7135725 7203581 7349770 7222567 7393933 7386833 7294414 7348319
6127G348319l1550O750L24356q3592K06646L1777k39156j16730N109j60993J72522
$$ 7348319 7316769 7323519 7647875 7564283 7770929 7802706 7563550 7446820 7451929 7290936 7463458
6116G463458K20801j14515O7305J46241K7096j61524J60103N5127j65732r9996
$$ 7463458 7684259 7569744 7637049 7783290 7810386 7648862 7808965 7864092 7698360 7598364
6106G598364J11254J18317j9030P3665L6206k01330K0730n2123o8043o6555J04240
$$ 7598364 7709618 7827935 7808905 7882570 7918776 7717446 7738176 7686053 7618010 7551455 7655695
6095G655695N7087J39765L90427J35239o7625j51123o1231J87795K17296K30090
$$ 7655695 7712782 7852547 8242974 8378213 8310588 8159465 8098234 8286029 8503325 8733415
6085H733415J80008j4415j04538J41348J49199r1304l2741j30524P546L3710n1845
$$ 8733415 8913423 8899008 8794470 8935818 9085017 8993713 8960972 8830448 8837994 8871704 8819859
6074H819859K01497l00644P8481q0559l4266K85307j09543M9031P6071k01597
$$ 8819859 9021356 8720712 8799193 8718634 8684368 8969675 8860132 8909163 8985234 8783637
6064H783637P0793O0832k84508k7409R3255K12389l78472J8683J237j15330M3330
$$ 8783637 8854430 8915262 8630754 8603345 8696600 8908989 8530517 8549200 8550437 8435107 8478437
6053H478437m5064J37288L69421j59290k8850R6219K9753R412J05798K56424O5069
$$ 8478437 8433373 8570661 8940082 8780792 8751942 8848161 8877914 8887326 8993124 9249548 9314617
6042I314617M0175K3539K37868K43268K90360K29228L36859J62808j00400k87581
$$ 9314617 9354792 9378331 9616199 9859467 10149827 10379055 10715914 10878722 10778322 10490741
6032A0490741l85776Q6964k38581Q7566R2257L9457P0603K69598J4941k7392L06652
$$ 10490741 10104965 10191929 9953348 10040914 10133171 10172628 10243231 10512829 10527770 10500378 10807030
6021A0807030Q7922j49398q0310O1634J2365k98798k06570k19466p1185J4392
$$ 10807030 10894952 10745554 10665244 10726878 10739243 10440445 10233875 10014409 9943224 9957616
6011I957616J4091N5802j92762j35684L4095K73365k0295j92244j12024J1228
$$ 9957616 9971707 10027509 9834747 9699063 9733158 10006523 9986228 9793984 9681960 9693188
6001I693188O3806L07767N2609k35483J08480J52586J20924k01931N2449L01280
$$ 9693188 9756994 10064761 10117370 9881887 9990367 10142953 10263877 10061946 10114395 10415675
5991A0415675R8229J1403J27812L6710L0662K64706K14401M3121j48131P2288
$$ 10415675 10513904 10525307 10653119 10689829 10720491 10985197 11199598 11242719 11094588 11166876
5981A1166876K1301L38451J79087L21538J28267K23266K84443L13602q5611j34493
$$ 11166876 11188177 11526628 11705715 12027253 12155520 12378786 12663229 12976831 12891220 12756727
5971A2756727p0136o6934j46073J02490J47616n7661n1924j83302K28620K83138
$$ 12756727 12686591 12619657 12473584 12576074 12723690 12666029 12614105 12430803 12659423 12942561
5961A2942561k06747M5043J0773m3460K67314M8540M01895M9848K90568L66154
$$ 12942561 12735814 12780857 12791630 12748170 13015484 13064024 13465919 13515767 13806335 14172489
5951A4172489L17355J71877R4448L34350J72093p2737J12044k1833K96446J88550
$$ 14172489 14489844 14661721 14756169 15090519 15262612 15189875 15301919 15280086 15576532 15765082
5941A5765082R6623K56784L84383P44478M46947L49459K57335M88316M62024K39532
$$ 15765082 15861705 16118489 16502872 17247350 17694297 18043756 18301091 18789407 19251431 19490963
5931A9490963J5653j43051J95638Q3540J39038L39227K00720J37338J44542K16357
$$ 19490963 19506616 19363565 19559203 19642743 19781781 20121008 20321728 20459066 20603608 20819965
5921B0819965M73675M75612J45415Q1736J32582K66676J83226j24323j96703k80748
$$ 20819965 21293640 21769252 21914667 21996403 22128985 22395661 22578887 22454564 22257861 21977113
5911B1977113m36522k64736q0356J52681j66598J40285j15852k61434J33475L00406
$$ 21977113 21540591 21275855 21195499 21348180 21181582 21321867 21206015 20944581 21078056 21378462
5901B1378462K58335K60046R9391J1432K45077j14488K41741M23451K69586K84981
$$ 21378462 21636797 21896843 21996234 22007666 22252743 22138255 22379996 22803447 23073033 23358014
5891B3358014P1424P30085P12534O52296Q11987P29875J42360J50911Q6388o6439
$$ 23358014 23429438 24159523 24872057 25524353 26336340 27066215 27208575 27359486 27445874 27379435
5881B7379435k24622R5014K13443L22370L17586M72809N34166P67384N84406L66695
$$ 27379435 27154813 27249827 27463270 27785640 28103226 28576035 29110201 29877585 30461991 30828686
5871C0828686N83160J93180J85940j53639j8444m32503j066091q47881p25297
$$ 30828686 31411846 31605026 31790966 31637327 31618883 31186380 30120289 29272408 28547111
5862B8547111p16470m26015n35920k21814l71839n3650K5398n5172j0948l87699
$$ 28547111 27830641 27404626 26868706 26646892 26275053 26221403 26246801 26191629 26180681 25792982
5852B5792982o1672o7584l28732l59612p47712p27190p03824l77447l17037m56008
$$ 25792982 25731310 25663726 25334994 24975382 24227670 23500480 22796656 22419209 22102172 21646164
5842B1646164j68377j68970m41392l54700j94049j07007k77909p4966J76131K4637
$$ 21646164 21477787 21308817 20867425 20512725 20318676 20211669 19933760 19858794 20034925 20059562
5832B0059562K8316J36526M91316N29327K33460R3393O644q5222o33988m98764
$$ 20059562 20087878 20224404 20715720 21245047 21478507 21571900 21578544 21493322 20859334 20360570
5822B0360570n46632n53026m96507n41468m97167j41064k47534k64320R003k96871
$$ 20360570 19813938 19260912 18764405 18222937 17725770 17584706 17337172 17072852 17081855 16784984
5812A6784984q1644k15318j73774j2639J11964j67707K72037l5409k08089K76747
$$ 16784984 16703340 16488022 16314248 16301609 16413573 16245866 16517903 16482494 16274405 16551152
5802A6551152k17905R0596j60926Q7008m5007r7191J03110J01726m2808K95214
$$ 16551152 16333247 16423843 16262917 16349925 16304918 16207727 16310837 16412563 16369755 16664969
5792A6664969M42477L6837L26282K51113K66569J59321J93708N31918n0731O92561
$$ 16664969 17107446 17144283 17470565 17721678 17988247 18147568 18341276 18873194 18822463 19515024
5782A9515024N64650M08581L63127n02898l89753j2825m82367r70165m98306n98492
$$ 19515024 20079674 20488255 20851382 20348484 19958731 19945906 19463539 18493374 17995068 17396576
5772A7396576k96746m07014l36781k20429k91141k19804k16643j4373P9626m3057
$$ 17396576 17099830 16692816 16356035 16135606 15844465 15624661 15408018 15393645 15473271 15430214
5762A5430214R0539p0m4869J31190K49043J75532J62725n7973l7510K34313K18449
$$ 15430214 15520753 15520683 15475814 15607004 15856047 16031579 16194304 16136331 16098821 16333134 16551583
5751A6551583K27007K04804L5916K79907K19645j14215l52650k13770m8494m49125
$$ 16551583 16778590 16983394 17019310 17299217 17518862 17404647 17051997 16838227 16789733 16340608
5741A6340608k83600l28986l48617O3332J57582k06436l05655j22414J05865J76831
$$ 16340608 16057008 15728022 15379405 15442737 15600319 15393883 15088228 14965814 15071679 15248510
5731A5248510j06742J02714N165K95908p9291M1653K18647L45315J97527J72155
$$ 15248510 15141768 15244482 15249647 15545555 15466264 15507917 15726564 16071879 16269406 16441561
5721A6441561K82056L19771L70285K84640K06318N00669M3282J45933M5501o2374
$$ 16441561 16723617 17043388 17413673 17698313 17904631 18405300 18448582 18594515 18640016 18577642
5711A8577642k31950M8483j7499l7864p5945p9152L18284N3094l5638K20750K67014
$$ 18577642 18345692 18394175 18376676 18338812 18262867 18183715 18501999 18555093 18519455 18740205 19007219
5700A9007219L23985M23010L20121L50508L79568N00116N62674O13818L13271
$$ 19007219 19331204 19754214 20074335 20424843 20804411 21304527 21867201 22481019 22794290
5691B2794290N08416K23572j3457l35395j82067k60632r4981l34j29186j83625
$$ 22794290 23302706 23526278 23512821 23177426 22995359 22734727 22639746 22639412 22510226 22326601
5681B2326601J59005q7992r0673l4324K79466Q1406j98206l49255k59327m4148
$$ 22326601 22485606 22397614 22306941 22272617 22552083 22633489 22435283 22086028 21826701 21782553
5671B1782553k36645m28246K10177m89395l56773j17856R3444j20810j33218k47848
$$ 21782553 21545908 21117662 21327839 20838444 20481671 20363815 20457259 20336449 20203231 19955383
5661A9955383m2088K15907k05097l13625j36872O775k34534p6055j15613O9124
$$ 19955383 19913295 20129202 19924105 19610480 19473608 19480383 19245849 19169794 19054181 19123305
5651A9123305m7521j17519K40085J49866Q1611J70394j66753O9531O6011L3387
$$ 19123305 19075784 18958265 19198350 19348216 19429827 19600221 19433468 19502999 19569010 19602397
5641A9602397J43184M4236O2794L98760J45062L24782M04565K02834j19154j91489
$$ 19602397 19745581 19789817 19852611 20251371 20396433 20721215 21125780 21328614 21209460 21017971
5631B1017971n17046k81719m09446o19236n68658m43028n10896l83813k03364
$$ 21017971 20500925 20219206 19809760 19190524 18621866 18178838 17667942 17284129 17080765
5622A7080765l32686k99503j43721j47033k10876k89672j73208M6258r6840k20107
$$ 17080765 16748079 16448576 16304855 16157822 15946946 15657274 15484066 15530324 15433484 15213377
5612A5213377k09237J40646L8991k85304m31058k15140k3227q3143K31282j05931
$$ 15213377 15004140 15144786 15183777 14898473 14467415 14252275 14229048 14145905 14377187 14271256
5602A4271256m22317r0100m0157K3358J51919j98943k66046R456R6445J17326
$$ 14271256 13848939 13758839 13718682 13742040 13893959 13695016 13428970 13438426 13534871 13652197
5592A3652197J29404l10711l65484J60634L38219J23132j57151K7109j254j99610
$$ 13652197 13781601 13470890 13105406 13266040 13604259 13727391 13570240 13597349 13596095 13396485
5582A3396485J62650J02472k66650j17680j2603J03667Q6510J0332K1511n3371
$$ 13396485 13559135 13661607 13394957 13277277 13264674 13368341 13454851 13465183 13486694 13433323
5572A3433323L72611j35460k07261J94726p3128j54933k03349j28806q055m263
$$ 13433323 13805934 13670474 13463213 13657939 13584811 13429878 13226529 13097723 13089668 13085405
5562A3085405K5232l10094k08754q3994L8316l7143j38979K48616J50006m13262
$$ 13085405 13110637 12800543 12591789 12507795 12546111 12508968 12369989 12618605 12768611 12355349
5552A2355349P0009J43606m9791j77019k36057J56161J35948O3580P766o1176
$$ 12355349 12425358 12568964 12519173 12342154 12106097 12262258 12398206 12461786 12469552 12408376
5542A2408376n9924j22104p0809k95439O9543J66156j63304J13053l498K91275
$$ 12408376 12348452 12226348 12155539 11860100 11929643 12095799 11932495 12045548 12042050 12333325
5532A2333325J12851M9718l3918N7183o6084K1932J56526M7510K1837R1260L1671
$$ 12333325 12446176 12495894 12461976 12519159 12453075 12475007 12631533 12679043 12700880 12792140 12823811
5521A2823811K43524J92900P1045L98309L92633K34143M23030K60619r1402k54722
$$ 12823811 13067335 13260235 13331280 13729589 14122222 14356365 14779395 15040014 14948612 14693890
5511A4693890j05831o32494j90686k11000l74862j68637j21271p7129m03138o8550
$$ 14693890 14588059 13955565 13764879 13553879 13179017 13010380 12889109 12811980 12408842 12340292
5501A2340292l7088k26455p6849j35997l9673q4179j55938j92750J44828j8242
$$ 12340292 12303204 12076749 11999900 11863903 11824230 11740051 11584113 11391363 11536191 11517949
5491A1517949k53405j20646j65425L2418N2397P6294o923K48149J6826p4193J07508
$$ 11517949 11264544 11143898 10978473 11010891 11063288 11139582 11132659 11380808 11397634 11323441 11430949
5480A1430949O3326O7354N0277k3577L1047L5424J02850J4485J22419j30538J39524
$$ 11430949 11494275 11561629 11611906 11588329 11619376 11654800 11757650 11772135 11894554 11764016 11903540
5469A1903540K00275R5132Q5903l2601p6840J37027L86820K42892J31731K1627
$$ 11903540 12103815 12198947 12284850 12252249 12175409 12312436 12699256 12942148 13073879 13095506
5459A3095506J83787Q7985O25126M20271N48036p1155J3854J37875J38757K6893
$$ 13095506 13279293 13367278 13992404 14412675 14960711 14889556 14903410 15041285 15180042 15206935
5449A5206935o0433j36815r5150J47761n619J14757K57655L50583L57410M55476
$$ 15206935 15146502 15009687 14914537 15062298 15056679 15171436 15429091 15779674 16137084 16592560
5439A6592560M79017P91688O71149J176610J077535J185380J133384J066011N47470
$$ 16592560 17071577 17863265 18534414 19711024 20788559 21973939 23107323 24173334 24720804
5430B4720804l45237j38764O1619R9313N18224N69393M36573N8403q2311o66112
$$ 24720804 24375567 24236803 24298422 24397735 24915959 25485352 25921925 25980328 25898017 25231905
5420B5231905p79044p12400o99331o10803l15448M25037P7715J88710O22322O26523
$$ 25231905 24452861 23740461 23041130 22430327 22114879 22539916 22617631 22806341 23428663 24055186
5410B4055186J180201J247875J586433J788743J547435J174493P60011O71148
$$ 24055186 25235387 26483262 28069695 29858438 31405873 32580366 33340377 34011525
5402C4011525M10662L02714J26351p3354p5130o67936q83446j657911j930920
$$ 34011525 34422187 34724901 34851252 34777898 34702768 34034832 33151386 31493475 29562555
5393B9562555k068015j914493j444958j327956r92401o19447o75135l54537r309
$$ 29562555 27494540 25580047 24135089 22807133 21814732 21195285 20520150 20165613 20156304
5384B0156304q5153J25997L14276J88285M52260P24706M47067O98923L46307K27603
$$ 20156304 20071151 20197148 20511424 20699709 21151969 21876675 22323742 23022665 23368972 23596575
5374B3596575J85065J90582L50341O8134m74683r34984j195299j584799j211688
$$ 23596575 23781640 23972222 24322563 24390697 23916014 22981030 21785731 20200932 18989244
5365A8989244j049806j261375o68611p88000n60481m36135m22815O0461l89609
$$ 18989244 17939438 16678063 16009452 15221452 14660971 14224836 13802021 13862482 13472873
5356A3472873k74973j09513k32415l66174p2137j97671m80640k28321k08707j89123
$$ 13472873 13197900 13088387 12855972 12489798 12417661 12219990 11739350 11511029 11302322 11113199
5346A1113199j27851j66415j88663p9623l31456m27290P3625N6996j88375j07864
$$ 11113199 10985348 10818933 10630270 10550647 10219191 9791901 9865526 9922522 9734147 9626283
5336I626283k14261m8753P6165j09709J21971l01738m18052j88392j70416m8913
$$ 9626283 9412022 9363269 9439434 9329725 9451696 9149958 8731906 8543514 8373098 8324185
5326H324185K2484J76004L0154j88488j99197J19756J8865j34395k33098L5647
$$ 8324185 8346669 8522673 8552827 8364339 8165142 8284898 8303763 8169368 7936270 7971917
5316G971917J44887j31678J06528J02970j67832J7146j25105J36315M2218O4933
$$ 7971917 8116804 7985126 8091654 8194624 8026792 8043938 7918833 8055148 8097366 8162299
5306H162299j37106J08592J93413n0197j87362j60070K6126J72160k03133J34350
$$ 8162299 8025193 8133785 8327198 8277001 8089639 7929569 7955695 8127855 7924722 8059072
5296H059072j15470J95527K9254j3701J0451J97900j13787K9230K85321j43693
$$ 8059072 7943602 8139129 8168383 8154682 8165133 8363033 8249246 8278476 8563797 8420104
5286H420104k0620P2271J12505K99840L781O6260J55958j78791L29747K38970
$$ 8420104 8399484 8471755 8584260 8884100 8887881 8954141 9110099 8931308 9261055 9500025
5276I500025k42017k069M55775K65763K45146J47298K26844J67123M11891L92440
$$ 9500025 9258008 9255939 9711714 9977477 10222623 10369921 10596765 10763888 11175779 11568219
5266A1568219Q1161M23522O23632N68837M12175M78497J086878O77180O65212
$$ 11568219 11649380 12072902 12696534 13265371 13677546 14156043 15242921 15920101 16585313
5257A6585313R73020P64424P03887N84036l763l38354n04600p19733r12094q03756
$$ 16585313 17558333 18322757 19026644 19610680 19606917 19268563 18763963 18044230 17132136 16328380
5247A6328380p30498o69967r33166n21550p35939n21334l42406l22695k12515
$$ 16328380 15597882 14927915 13994749 13473199 12737260 12215926 11873520 11550825 11338310
5238A1338310l55061j10667m1169l15147k02678j27018k54384j99398j39697J04222
$$ 11338310 10983249 10872582 10831413 10516266 10313588 10186570 9932186 9732788 9593091 9697313
5228I697313k20423l4739O606J14315J6111j32341r5310j365J51297N3672O0339
$$ 9697313 9476890 9442151 9448757 9563072 9579183 9446842 9351532 9350167 9501464 9555136 9615475
5217I615475N8409R3458j3812J07919O5510N2046J38519K37303R1492L95462O4147
$$ 9615475 9673884 9767342 9753530 9861449 9926959 9979005 10117524 10354827 10446319 10841781 10905928
5206A0905928M37218L79429N04091P21064P36755Q88587Q42375J216249J174234
$$ 10905928 11343146 11722575 12226666 12947730 13684485 14573072 15415447 16631696 17805930
5197A7805930J187713Q31646J81279l13216p50781o81119n56731j84244l99740
$$ 17805930 18993643 19825289 20006568 19693352 18942571 18261452 17704721 17520477 17120737
5188A7120737k48694k62599o17453m76579k81508j338K92284L18503N57703Q15432
$$ 17120737 16872043 16609444 15991991 15515412 15233904 15232566 15524850 15843353 16401056 17216488
5178A7216488O88287J060818J182832R72845P82358M47607l11698j40162j62291
$$ 17216488 17904775 18965593 20148425 21121270 21903628 22351235 22039537 21899375 21737084
5169B1737084j16807Q6289k93328m04398l20170n53877m62318k7250J03021n0956
$$ 21737084 21620277 21706566 21413238 21008840 20688670 20134793 19672475 19645225 19748246 19697290
5159A9697290n90329q11032j087002j200948m90501m57745n01035m32170k62988
$$ 19697290 19106961 18295929 17208927 16007979 15517478 15059733 14558698 14126528 13863540
5150A3863540m7803J00376K21094L56538M68490J79127L3037J34138K86233L54405
$$ 13863540 13815737 13916113 14137207 14493745 14962235 15141362 15174399 15308537 15594770 15949175
5140A5949175L52564J31736j44150m41953q28641j103716r51432r97609o27748
$$ 15949175 16301739 16433475 16289325 15847372 15018731 13915015 12963583 11965974 11338226
5131A1338226l47641o51233l65224j41241l58920k84586j46113k69853j99187
$$ 11338226 10990585 10339352 9974128 9832887 9473967 9189381 9043268 8773415 8574228
5122H574228k76477j93118q8515K8244k56485M457j78084j51893j4169j40195
$$ 8574228 8297751 8104633 8016118 8044362 7787877 7792334 7614250 7462357 7448188 7307993
5112G307993j30076J71937J62912k67626k13195N6490m39817J3501O5785N8122
$$ 7307993 7177917 7349854 7512766 7245140 7031945 7088435 6648618 6662119 6727904 6786026
5102F786026k31762j95539J18442O3547K04434l5026m9560L8734J20874k69063
$$ 6786026 6554264 6358725 6477167 6540714 6745148 6710122 6660562 6699296 6820170 6551107
5092F551107k14488J22050k4440k02671j5936J38941j33840O7395K24804j71891
$$ 6551107 6336619 6458669 6434229 6231558 6215622 6354563 6220723 6288118 6512922 6341031
5082F341031P7334l5680k87951K18928J07837k1000L09911j59386J6207q0063
$$ 6341031 6418365 6382685 6094734 6313662 6421499 6400499 6710410 6551024 6567231 6487168
5072F487168R8413l8645j89191J43736N5117n5042m4016j5854j65688j40685J82807
$$ 6487168 6585581 6546936 6357745 6501481 6556598 6501556 6457540 6441686 6275998 6135313 6318120
5061F318120J23717N6061j27361J28512Q0659n59387j63539L6676J4123M2350
$$ 6318120 6441837 6497898 6370537 6499049 6579708 6020321 5856782 5893458 5907581 5949931
5051E949931O4919J05603Q2708J289k25314R2329K94581j35293m970P0451K5395
$$ 5949931 6014850 6120453 6203161 6204450 5979136 6071465 6366046 6230753 6225783 6296234 6321629
5040F321629m0139J50293n2950L6161Q1936R4257o8042J25172J1250k64067J60493
$$ 6321629 6281490 6431783 6378833 6414994 6496930 6591187 6523145 6648317 6659567 6395500 6555993
5029F555993K2351j44499j57920L26636m3196r0973O3538l88R7350N9781k91224
$$ 6555993 6578344 6433845 6275925 6602561 6559365 6468392 6531930 6531542 6628892 6688673 6397449
5018F397449l1431K60138K43108o027J90454M0984r7391Q3046p9110k10428K1917
$$ 6397449 6366018 6626156 6869264 6863237 7053691 7094675 6997284 7080330 7001220 6790792 6812709
5007F812709L01181L640J00744j60865m6395P5643R7057K9171L1111K00955j4272
$$ 6812709 7113890 7117530 7218274 7057409 7011014 7086657 7183714 7212885 7243996 7444951 7430679
4996G430679j30766R09J3140J88022l1585J39270K1878r2433j9990J35332K77605
$$ 7430679 7299913 7300822 7313962 7501984 7470399 7609669 7631547 7539114 7519124 7654456 7932061
4985G932061l41599K20847J8605P6730p5131K7281j7581K0187J81928K9414K1051
$$ 7932061 7590462 7811309 7829914 7906644 7831513 7858794 7841213 7861400 8043328 8072742 8093793
4974H093793j40290k3633L51917J6048N0587l0148R928L20822J02673j27430J80317
$$ 8093793 7953503 7929870 8281787 8297835 8348422 8318274 8328202 8649024 8751697 8624267 8804584
4963H804584M07440o5456K44339L76730J37221K95753K32651L07219M7274L73149
$$ 8804584 9212024 9146568 9390907 9767637 9904858 10200611 10433262 10740481 10787755 11160904
4953A1160904J91132k3093o0661o1320r9738k64844K2025m9270M0792o7963k83622
$$ 11160904 11352036 11328943 11268282 11206962 11107224 10842380 10864405 10815135 10855927 10787964 10504342
4942A0504342J35358P1610j0886K28802j01782M45532K80000R9573J16066j87352
$$ 10504342 10639700 10711310 10700424 10929226 10827444 11272976 11552976 11652549 11768615 11581263
4932A1581263k19326n025m30679k47810R8481l03067l15968l69125j17173k7320
$$ 11581263 11361937 11356912 10926233 10678423 10776904 10473837 10157869 9788744 9671571 9644251
4922I644251P9605J74238J1713r1848J3401J37670o705K0933n2968N0249p9275
$$ 9644251 9723856 9898094 9909807 9817959 9831360 9969030 9962325 9983258 9930290 9980539 9901264
4911I901264J22521J50816K70916J39432J13257r4489P2051N5034J60061J43856
$$ 9901264 10023785 10174601 10445517 10584949 10698206 10603717 10675768 10730802 10890863 11034719
4901A1034719K63629k12002K24655M7435r032K27012J7921j15325R8292r4658
$$ 11034719 11298348 11086346 11311001 11358436 11349404 11576416 11594337 11479012 11577304 11482646
4891A1482646j84106K44857J96274P2424Q0558J11860J04183J38588K16858o3381
$$ 11482646 11298540 11543397 11739671 11812095 11892653 12004513 12108696 12247284 12464142 12400761
4881A2400761j08651K47142q076p8618q149J15499J37463K10728r4603j33040
$$ 12400761 12292110 12539252 12531176 12452558 12444409 12559908 12697371 12908099 12813496 12680456
4871A2680456K74531L03718Q9043J45158r7100Q5293n6929L3134J54834K9429
$$ 12680456 12954987 13258705 13347748 13492906 13395806 13481099 13424170 13457304 13612138 13641567
4861A3641567J06150K51032j13529K49140L33637K48606J05261L91756L8206L54212
$$ 13641567 13747717 13998749 13885220 14134360 14467997 14716603 14821864 15213620 15251826 15606038
4851A5606038J67129J07070p6280J04703K40378K9642J6425R1611l1366J68974
$$ 15606038 15773167 15880237 15803957 15908660 16149038 16178680 16195105 16286716 16255350 16424324
4841A6424324L54519o6392j12025K91086N14670p2973P6426k0114K837N4266M28808
$$ 16424324 16778843 16712451 16600426 16891512 17406182 17333209 17409635 17389521 17392358 17446624 17875432
4830A7875432j32465J71372J19628j2293L78871K93736O0290K53254K09968K78161
$$ 17875432 17742967 17914339 18033967 18021674 18400545 18694281 18754571 19007825 19217793 19495954
4820A9495954J63524M10741J21157j56614M2258L5429L7114L36947J52793l5535
$$ 19495954 19659478 20070219 20191376 20034762 20077020 20112449 20149563 20486510 20639303 20603768
4810B0603768K52730K97201K97763P8655K91197L45261M38542L53272L26019L89823
$$ 20603768 20856498 21153699 21451462 21530117 21821314 22166575 22605117 22958389 23284408 23674231
4800B3674231K58511R9536L72870M9441L08114L65529M20984L32002K17510L3570
$$ 23674231 23932742 24032278 24405148 24454589 24762703 25128232 25549216 25881218 26098728 26132298
4790B6132298K53784Q5598L36916M97563N01565M89019R5141j85733m09363m27667
$$ 26132298 26386082 26471680 26808596 27306159 27807724 28296743 28391884 28206151 27796788 27369121
4780B7369121l40916j88510k9604L09625K34089P24145O65719Q78389R07258J100385
$$ 27369121 27028205 26839695 26810091 27119716 27353805 28077950 28743669 29622058 30529316 31629701
4770C1629701J375873P37817J196496P46189M39354K49358k33347l29213j24000
$$ 31629701 33005574 33743391 34939887 35686076 36125430 36374788 36141441 35812228 35688228
4761C5688228l89057m77624k23175p37009n35587l10462M1076m84J84966J03220
$$ 35688228 35299171 34821547 34598372 33861363 33325776 33015314 33056390 33055906 33240872 33344092
4751C3344092L96261M67405O88546Q73208L67689J74158L30268J24785N8522L9910
$$ 33344092 33740353 34207758 34896304 35769512 36137201 36311359 36641627 36766412 36824934 36864844
4741C6864844j44637j88861k25882m19159o37139n31107m98247p41730r16334
$$ 36864844 36720207 36531346 36305464 35886305 35249166 34718059 34219812 33478082 32561748
4732C2561748q59868q50424n88256l46992l41334j28331j89037q1394J62789M50349
$$ 32561748 31701880 30851456 30263200 29916208 29574874 29446543 29257506 29176112 29338901 29789250
4722B9789250N41030O33606J67842J25411K65887l53922n05522k81654j87146
$$ 29789250 30330280 30963886 31131728 31257139 31523026 31169104 30663582 30381928 30194782
4713C0194782m46866q26302o48699o74004m17496k62115r17509l30185l86701
$$ 30194782 29747916 28921614 28272915 27598911 27181415 26919300 26001791 25671606 25284905
4704B5284905k21846m9393k4437k40877j88415j42528J79013j73015l65584L8545
$$ 25284905 25063059 25013666 24989229 24748352 24559937 24417409 24596422 24423407 24057823 24096368
4694B4096368j94930l08432j89513k81564m55756l35070q2910q420k61171N390
$$ 24096368 23901438 23593006 23403493 23121929 22666173 22331103 22248193 22239773 21978602 21983992
4684B1983992R215Q711j10912k10724j02606K2642p8591j85568m61363k20349
$$ 21983992 21993207 22001918 21891006 21680282 21577676 21600318 21521727 21336159 20874796 20654447
4674B0654447N4720j95518k24331J1792L1487k08138O1342m2655m50603k11827
$$ 20654447 20709167 20513649 20289318 20301110 20332597 20124459 20185801 20143146 19692543 19480716
4664A9480716j43774k2749l35402l08281k89389k32021l04761k06000J96002n6370
$$ 19480716 19336942 19314193 18978791 18670510 18381121 18149100 17844339 17638339 17834341 17777971
4654A7777971l32575p3886K78259R3274j69872K66981L17393J9933L34124K2673
$$ 17777971 17445396 17371510 17649769 17743043 17573171 17840152 18157545 18177478 18511602 18534275
4644A8534275k21743l91426n87494m33101l25688k53263m20166k60798n4022k64958
$$ 18534275 18312532 17921106 17333612 16900511 16574823 16321560 15901394 15640596 15586574 15321616
4634A5321616q7142j05075j20379J46188P0096j00056k10915o7674J35453R4381
$$ 15321616 15234474 15129399 15009020 15155208 15225304 15125248 14914333 14846659 14982112 15076493
4624A5076493q2924l74760n4350P4049L50930J22736M06142J0711l0267M07354
$$ 15076493 14993569 14618809 14564459 14638508 14989438 15112174 15518316 15529027 15498760 15906114
4614A5906114L66958K52698L41929J48807k16833o7255l88097j88376n30143m04111
$$ 15906114 16273072 16525770 16867699 17016506 16799673 16732418 16344321 16155945 15625802 15221691
4604A5221691j83114j40943m84002j70304K02999m3679J13211P8513p2616j29180
$$ 15221691 15038577 14897634 14413632 14243328 14446327 14402648 14515859 14594372 14521756 14392576
4594A4392576k25824k61179k69814j49607l59331l55280J84684n5031J46676j09790
$$ 14392576 14166752 13905573 13635759 13486152 13126821 12771541 12956225 12901194 13047870 12938080
4584A2938080N4460L16112k45875m1120k6488k0900k07434K702N4020J5224l16269
$$ 12938080 12992540 13308652 13062777 13021657 12995169 12974269 12766835 12769537 12823557 12838781 12522512
4573A2522512j53701J77740l80031K69901N8980j64288K30915j25184J84236L61108
$$ 12522512 12368811 12546551 12166520 12436421 12495401 12331113 12562028 12436844 12621080 12982188
4563A2982188j15798j09040J1433j14733k46812j43040k23783m64082l6659l6757
$$ 12982188 12866390 12757350 12768783 12654050 12407238 12264198 12040415 11576333 11539674 11502917
4553A1502917j20233K058r903j29654j08844j33393r4368l81117j24372j15466
$$ 11502917 11382684 11384742 11374839 11245185 11136341 11002948 10908580 10527463 10403091 10287625
4543A0287625J19703k74302k27627J37777j14676J09628k55946j79802J58175
$$ 10287625 10407328 10133026 9905399 10043176 9928500 10038128 9782182 9602380 9760555
4534I760555j34452l1042N8839j17983k38810p4813J20695j03742n6662j93642
$$ 9760555 9626103 9595061 9653900 9535917 9297107 9222294 9342989 9239247 9182585 8988943
4524H988943P615P4299n1348q5661J10522k42326m9768j60645J04594O2122k5380
$$ 8988943 8996558 9070857 9019509 8933848 9044370 8802044 8752276 8591631 8696225 8758347 8732967
4513H732967j58753j12843j5356n5117K61016q5141J68871q4195J5302k60381
$$ 8732967 8574214 8461371 8446015 8390898 8651914 8566773 8735644 8651449 8666751 8406370
4503H406370j71578K39860j1769k12968M7934J04974j1438J20497j44566J61649
$$ 8406370 8234792 8474652 8462883 8249915 8297849 8402823 8391385 8511882 8367316 8528965
4493H528965n3470k6275l15388j00775Q3073Q9475j18793j24729Q7488J2867l4905
$$ 8528965 8475495 8449220 8133832 8033057 8116130 8205605 8086812 7962083 8049571 8062438 8027533
4482H027533K26721k3901l72703M121L9562K9973J15368j7248p6027K97556L1013
$$ 8027533 8254254 8230353 7857650 7861771 7901333 7931306 8046674 8029426 7953399 8250955 8281968
4471H281968j914K98965P9403k19581L1709J07707J39413J96493P0739J49665
$$ 8281968 8280054 8579019 8658422 8438841 8470550 8578257 8717670 8914163 8984902 9134567
4461I134567k3181J0691P1195K02416M9091N8371K05472J48267J08034R9360L28863
$$ 9134567 9111386 9122077 9193272 9395688 9444779 9503150 9708622 9856889 9964923 10064283 10393146
4450A0393146K17719J50639M2292K08150O6993J68289L38073P7999J30608L85013
$$ 10393146 10610865 10761504 10803796 11011946 11078939 11247228 11585301 11663300 11793908 12178921
4440A2178921K42836K13251p5142J64556K89318K62996N04043L66971L05665N06562
$$ 12178921 12421757 12635008 12559866 12724422 13013740 13276736 13780779 14147750 14453415 14959977
4430A4959977P20858R19991R87535J407418J270887J366323J628821K071694J863616
$$ 14959977 15680835 16600826 17588361 18995779 20266666 21632989 23261810 25333504 27197120
4421B7197120J788838J108856J201155J573863J670535J948710J535312P50694
$$ 27197120 28985958 30094814 31295969 32869832 34540367 36489077 38024389 38775083
4413C8775083l52657j302899k218494k127665k449729k025069j355944r81787
$$ 38775083 38422426 37119527 34901033 32773368 30323639 28298570 26942626 25960839
4405B5960839o57524J05071L24086O27319P23368J306552J932295J979543K340821
$$ 25960839 25303315 25408386 25732472 26359791 27083159 28389711 30322006 32301549 34642370
4396C4642370L003909L678971M221332M119313K609956M14637k141820m521796
$$ 34642370 37646279 41325250 45546582 49665895 52275851 52690488 50548668 46026872
4388D6026872n076782m737839m155411l373866k770079k199689j727533j597515
$$ 46026872 40950090 36212251 32056840 28682974 25912895 23713206 21985673 20388158
4380B0388158j279502j110315o24029p59957p45789q39423o83768l30479l59109
$$ 20388158 19108656 17998341 17374312 16614355 15868566 15029143 14345375 14014896 13655787
4371A3655787p56576l89702l12581m95218r1250j16342k14564m81247q3702k76344
$$ 13655787 12899211 12509509 12196928 11701710 11610460 11494118 11279554 10798307 10714605 10438261
4361A0438261k65984J09752p6617l02702j44657j73814m3164J31007R159j33114
$$ 10438261 10172277 10282029 10205412 9902710 9758053 9584239 9541075 9672082 9681241 9548127
4351I548127n4711n2741q8746j94513m8947J99641L20861J21462Q269j40466R6999
$$ 9548127 9493416 9440675 9351929 9157416 9108469 9308110 9628971 9750433 9758702 9618236 9715235
4340I715235l95522K07585K5236p8153l8609O1760l40841k1925m653K818O5366
$$ 9715235 9319713 9527298 9552534 9474381 9435772 9497532 9156691 9134766 9130113 9132931 9198297
4329I198297R6372K96002l26457n8134n1220q7576M06161J55897m9544J83692
$$ 9198297 9294669 9590671 9264214 9206080 9154860 9067284 9473445 9629342 9579798 9763490
4319I763490l5833q4677Q2966R3742K14141j82899o6152J84398K40076K82603
$$ 9763490 9727657 9642980 9725946 9819688 10033829 9850930 9784778 9969176 10209252 10491855
4309A0491855j10120L4919J00490n7527J06470K63152j66941P2734Q7209M390
$$ 10491855 10381735 10416654 10517144 10459617 10566087 10829239 10662298 10735032 10822241 10826631
4299A0826631o737l5065P3391N648J53305K81694Q4497J53615k3452L39136L6179
$$ 10826631 10819894 10784829 10858220 10863868 11017173 11298867 11383364 11536979 11513527 11852663 11888842
4288A1888842J61638J30674K10466K11819R5972K48513M46769L67525K62124K95402
$$ 11888842 12050480 12181154 12391620 12603439 12699411 12947924 13394693 13762218 14024342 14319744
4278A4319744O72563N98379M66386O52914N75457O81282J012004Q57099R45772
$$ 14319744 14992307 15590686 16057072 16709986 17285443 17966725 18978729 19835828 20781600
4269B0781600P22882N90728M4246l00707o37145n84357l35335k02125J14394J73599
$$ 20781600 21504482 22095210 22139456 21838749 21201604 20617247 20281912 20079787 20194181 20367780
4259B0367780k70745O4615J01787o0179J93111M44531M36942J91976R7537M22566
$$ 20367780 20097035 20161650 20263437 20203258 20396369 20840900 21277842 21469818 21567355 21989921
4249B1989921L84062N71551N40925L92596N04431O52262M71738N60316N94710
$$ 21989921 22373983 22945534 23486459 23879055 24383486 25035748 25507486 26067802 26662512
4240B6662512L73209N43219Q02564R48157Q24330R29890J002961J068926O89234
$$ 26662512 27035721 27578940 28381504 29329661 30153991 31083881 32086842 33155768 33845002
4231C3845002J059076J240623J514773J213693J092647J436133J826612J738934
$$ 33845002 34904078 36144701 37659474 38873167 39965814 41401947 43228559 44967493
4223D4967493K020796K168478K376662K225339K559224K047995K202801K231106
$$ 44967493 46988289 49156767 51533429 53758768 56317992 58365987 60568788 62799894
4215F2799894K383762K875631K286768K436183K792608L396801L625079L156003
$$ 62799894 65183656 68059287 70346055 72782238 75574846 78971647 82596726 85752729
4207H5752729K577643J660488J963599K547023K878655L716939M425533M751135
$$ 85752729 88330372 89990860 91954459 94501482 97380137 101097076 105522609 110273744
4199A10273744M586864L972971K051294J575357K267857K296986L412688M660381
$$ 110273744 114860608 118833579 120884873 122460230 124728087 127025073 130437761 135098142
4191A35098142N354239O004072P034056Q150024Q758704Q855036Q404232O900786
$$ 135098142 140452381 146456453 153490509 161640533 170399237 179254273 187658505 194559291
4183A94559291O237825M138940M57165K08117J962461M575622P605151Q694116
$$ 194559291 200797116 204936056 205393221 205601338 207563799 212139421 219744572 228438688
4175B28438688P030186N65575q968388j1962211j0368267r575127p023377n333588
$$ 228438688 235468874 236034449 227066061 215103850 204735583 195160456 188137079 182803491
4167A82803491l540556k527109k024046j671998j170942r29703r59722j162780
$$ 182803491 179262935 176735826 174711780 173039782 171868840 170939137 169979415 168816635
4159A68816635j439885j855875j922742k025944k129495j915987j686073k013311
$$ 168816635 167376750 165520875 163598133 161572189 159442694 157526707 155840634 153827323
4151A53827323k140576k094221k220970k069834k138185j990088k189579k366321
$$ 153827323 151686747 149592526 147371556 145301722 143163537 141173449 138983870 136617549
4143A36617549k053034k068694k422175k417388l149761k897663k992107l243855
$$ 136617549 134564515 132495821 130073646 127656258 124506497 121608834 118616727 115372872
4135A15372872l199484k799168k994638k731131k659635k778920k786716k755421
$$ 115372872 112173388 109374220 106379582 103648451 100988816 98209896 95423180 92667759
4127I2667759k658696k825933k621608k585095k785247k583925k197003k409424
$$ 92667759 90009063 87183130 84561522 81976427 79191180 76607255 74410252 72000828
4119G2000828k448753k183850j991797j850105j892393j748103j628171j794859
$$ 72000828 69552075 67368225 65376428 63526323 61633930 59885827 58257656 56462797
4111E6462797j773740j472169j580110j528957j339247j266176j215218j091133
$$ 56462797 54689057 53216888 51636778 50107821 48768574 47502398 46287180 45196047
4103D5196047j016343r29880j227761r48356p89788p20005j136361r70779q28707
$$ 45196047 44179704 43249824 42022063 41073707 40283919 39563914 38427553 37456774 36628067
4094C6628067p92814p39434r50780o04972m38949n98117n30310n64810j24337
$$ 36628067 35835253 35095819 34145039 33540067 33101118 32503001 31972691 31407881 31283544
4085C1283544l58652o76214k24929l34839l30709l20142o1983k05103j55164j44311
$$ 31283544 30924892 30248678 30023749 29688910 29358201 29038059 28976076 28770973 28615809 28471498
4075B8471498l54459l63894p14646o76174p27575l01038l46701m97100k53849
$$ 28471498 28117039 27753145 27038499 26362325 25634750 25333712 24987011 24489911 24236062
4066B4236062o92991k50311m0363m73428k93303k98801K0169k17406n57059k58309
$$ 24236062 23543071 23292760 23252397 22778969 22485666 22186865 22207034 21989628 21432569 21174260
4056B1174260j370m93047l15166k28915j2953K2688j74943l89904k76718o4853
$$ 21174260 21172890 20679843 20364677 20135762 20122809 20145497 19970554 19580650 19303932 19239079
4046A9239079j31740k08349o04746j79549o9302l60473m95434k0391n7313q5148
$$ 19239079 19107339 18898990 18294244 18114695 18045393 17684920 17189486 17169095 17111782 17026634
4036A7026634j50528k69412j52082m95391q3878q3903j40091r0467k38627q1528
$$ 17026634 16876106 16606694 16454612 15959221 15875343 15791440 15651349 15560882 15322255 15240727
4026A5240727l94913Q5429k53661L1434j44266j73812J65823J56757J3457o3971
$$ 15240727 14845814 14931243 14677582 14709016 14564750 14390938 14556761 14713518 14726975 14663004
4016A4663004l8850K59842m9704M0438n4461o345q0370J29398K32628J74367j1816
$$ 14663004 14624154 14883996 14834292 14874730 14820269 14813924 14733554 14862952 15095580 15269947 15258131
4005A5258131R5582J71125L11335J39622J40271K41659L01611J37192K61266L39487
$$ 15258131 15353713 15524838 15836173 15975795 16116066 16357725 16659336 16796528 17057794 17397281
3995A7397281L16620J38658J1287K48924q4605N7820r1668L8246L88580Q868j11102
$$ 17397281 17713901 17852559 17863846 18112770 18028165 18085985 17994317 18032563 18421143 18430011 18318909
3984A8318909K59020M17790J88577k3919j40874q869j36980k57556q0851M5764
$$ 18318909 18577929 18995719 19184296 19160377 19019503 19010634 18873654 18616098 18535247 18581011
3974A8581011L1746K3578J93430P6081K83729Q9863K05011m3245L3843K82911
$$ 18581011 18612757 18636335 18829765 18905846 19189575 19279438 19484449 19441204 19475047 19757958
3964A9757958M95523L71770K40854N23308N91950N10915N87856N12593P51659
$$ 19757958 20253481 20625251 20866105 21389413 21981363 22492278 23080134 23592727 24344386
3955B4344386M16994P67959O62047O79873N56630O80361Q37023M87437J082503
$$ 24344386 24761380 25529339 26191386 26871259 27427889 28108250 28945273 29432710 30515213
3946C0515213P65354P06617P07289N94257O24833O94994Q68715M36265N86392
$$ 30515213 31280567 31987184 32694473 33288730 33913563 34608557 35477272 35913537 36499929
3937C6499929M79402N90048M46315P28164O13055N93587M88860N31719Q06388
$$ 36499929 36979331 37569379 38015694 38743858 39356913 39950500 40439360 40971079 41777467
3928D1777467O89711M73184M42523P73690P55202O77832O02685Q05278P13905
$$ 41777467 42467178 42940362 43382885 44156575 44911777 45589609 46192294 46997572 47711477
3919D7711477J069553N45604R38924P61861Q27175Q18044P74299R49649R88637
$$ 47711477 48781030 49326634 50265558 51027419 51854594 52672638 53446937 54396586 55385223
3910E5385223Q53426Q88838R83091R37497J230440Q12424J054767J166228J094831
$$ 55385223 56238649 57127487 58110578 59048075 60278515 61090939 62145706 63311934 64406765
3901F4406765R67742J447690J317933J534348J450441J415139J650252J874348
$$ 64406765 65374507 66822197 68140130 69674478 71124919 72540058 74190310 76064658
3893G6064658J599819J675582J990872J812902J810583K248802J918089J812406
$$ 76064658 77664477 79340059 81330931 83143833 84954416 87203218 89121307 90933713
3885I0933713J919578J904325J993658J932098K077403K080912J987413J558394
$$ 90933713 92853291 94757616 96751274 98683372 100760775 102841687 104829100 106387494
3877A06387494J767183J802710J475492J358386J700410J740965J600547J118174
$$ 106387494 108154677 109957387 111432879 112791265 114491675 116232640 117833187 118951361
3869A18951361J475323J731618J552474J536120J426448J685256J931924J403443
$$ 118951361 120426684 122158302 123710776 125246896 126673344 128358600 130290524 131693967
3861A31693967J906347J891702J809832K104629K394221K579237K735319K836778
$$ 131693967 133600314 135492016 137301848 139406477 141800698 144379935 147115254 149952032
3853A49952032L210648L461035L568064L921196M236130M350527M619112N119869
$$ 149952032 153162680 156623715 160191779 164112975 168349105 172699632 177318744 182438613
3845A82438613N382837N374083N440991N426116N492551N911716O041547O099443
$$ 182438613 187821450 193195533 198636524 204062640 209555191 215466907 221508454 227607897
3837B27607897O245456O626207O722704O746191O622268O863074O692803O450822
$$ 227607897 233853353 240479560 247202264 253948455 260570723 267433797 274126600 280577422
3829B80577422O420598O300864O101284O045576O190101O301031O369422O817854
$$ 280577422 286998020 293298884 299400168 305445744 311635845 317936876 324306298 331124152
3821C31124152O642030O808712P430768P882802Q150483Q348720Q849447Q943536
$$ 331124152 337766182 344574894 352005662 359888464 368038947 376387667 385237114 394180650
3813C94180650Q744721Q314325P665849O986083O031090M720049L487139K611304
$$ 394180650 402925371 411239696 418905545 425891628 431922718 436642767 440129906 442741210
3805D42741210J598377R79205M67732j90136m33575n56046j461454j933915k555796
$$ 442741210 444339587 445318792 445786524 445596388 445162813 444606767 443145313 441211398 438655602
3796D38655602l617136m552909n976938o814253p662591q287590q509332q608832
$$ 438655602 435038466 430485557 424508619 417694366 410031775 401744185 393234853 384626021
3788C84626021q306322q332150q288765p879541p657280p390951p302203o690107
$$ 384626021 376319699 367987549 359698784 351819243 344161963 336771012 329468809 322778702
3780C22778702o444603o526435o568852o328201o181874o066526n954807n840582
$$ 322778702 316334099 309807664 303238812 296910611 290728737 284662211 278707404 272866822
3772B72866822o000716n815876n704078n225227n064677m793506m421035m134587
$$ 272866822 266866106 261050230 255346152 250120925 245056248 240262742 235841707 231707120
3764B31707120l326078l105556k833240k476819j739462j284265j040407p16186
$$ 231707120 228381042 225275486 222442246 219965427 218225965 216941700 215901293 215185107
3756B15185107M4748M09190Q84265J249403J726716K028717J926167J044066P52696
$$ 215185107 215229855 215639045 216523310 217772713 219499429 221528146 223454313 224498379 225251075
3747B25251075J38038o10344j385352k274262k580301k973177k865687k768289
$$ 225251075 225389113 224778769 223393417 221119155 218538854 215565677 212699990 209931701
3739B09931701k475518k703937k976249l071678l937729m897708n396464o157356
$$ 209931701 207456183 204752246 201775997 198704319 194766590 189868882 184472418 178315062
3731A78315062o470706o674079o801286o698000o040136n630803n277709m852259
$$ 178315062 171844356 165170277 158368991 151670991 145630855 140000052 134722343 129870084
3723A29870084m452348m009292l640042l328770l109634k719286k802277k796927
$$ 129870084 125417736 121408444 117768402 114439632 111329998 108610712 105808435 103011508
3715A03011508k473104k655324k332817k074084j994661k122573k284481k018436
$$ 103011508 100538404 97883080 95550263 93476179 91481518 89358945 87074464 85056028
3707H5056028j901158j968829j886593j733508j711550j787334j620499j676852
$$ 85056028 83154870 81186041 79299448 77565940 75854390 74067056 72446557 70769705
3699G0769705j792160j438512j504641j743732j353182j485895j372327j175335
$$ 70769705 68977545 67539033 66034392 64290660 62937478 61451583 60079256 58903921
3691E8903921j132556j220919r50270q66906j027899j038281j106032r68799j102165
$$ 58903921 57771365 56550446 55600176 54733270 53705371 52667090 51561058 50592259 49490094
3682D9490094r60429q73470j096277r57910r66769r07389q39982q83804q05313
$$ 49490094 48529665 47656195 46559918 45602008 44635239 43727850 42887868 42004064 41198751
3673D1198751j072983r70934q10112r00021q42623m72582q29784n79775q43083
$$ 41198751 40125768 39154834 38344722 37444701 36602078 36129496 35299712 34719937 33876854
3664C3876854q81416q39252o28643p88378o88976l97582n23387p86892o94384
$$ 33876854 32995438 32156186 31527543 30739165 30050189 29652607 29129220 28342328 27647944
3655B7647944m68525l25448n86210o87819j87601k46257o24852n54376o47347
$$ 27647944 27179419 26853971 26267761 25579942 25392341 25146084 24521232 23966856 23319509
3646B3319509n32855j44745m03947n95949j05302l73117n28383k90819j83473
$$ 23319509 22786654 22641909 22237962 21642013 21536711 21163594 20635211 20344392 20160919
3637B0160919l19207l00829m89038l49962j01708l65702m88475l16722j12728
$$ 20160919 19841712 19540883 19051845 18701883 18600175 18234473 17745998 17429276 17316548
3628A7316548j77860p3866l66099k79893l03521j68454j42402j30553j50406j93039
$$ 17316548 17138688 17064822 16698723 16418830 16115309 15946855 15804453 15673900 15523494 15330455
3618A5330455j00247k75910j85588l76519o5377m30086J6150L30052l03959m28738
$$ 15330455 15230208 14954298 14768710 14392191 14326814 13896728 13912878 14242930 13938971 13510233
3608A3510233k02701p3316j29582K8449j43570j77071k07225R4250j34392l25700
$$ 13510233 13307532 13234216 13104634 13133083 12989513 12812442 12605217 12699467 12565075 12239375
3598A2239375j57638J89421j73876k16931j78546j04246l1497J42072l08494r049
$$ 12239375 12081737 12271158 12097282 11880351 11701805 11597559 11566062 11708134 11399640 11390591
3588A1390591Q9787q0518j81609r748l83717j33924j83375k36376M8841q513J0531
$$ 11390591 11480378 11399860 11218251 11208503 10824786 10690862 10507487 10271111 10319952 10311439 10321970
3577A0321970J47327J02197J00899m22731Q3683r8564j09544K52517r5226j9538
$$ 10321970 10469297 10571494 10672393 10249662 10333345 10234781 10125237 10377754 10282528 10262990
3567A0262990k58250K13084J41511j82132k3983N7452J67321k48678j46602K25608
$$ 10262990 10004740 10217824 10359335 10177203 10153220 10210672 10377993 10129315 9982713 10208321
3557A0208321n1394J59501r0297q3017n2175k8855K34165P503O915J51383K6143
$$ 10208321 10156927 10316428 10226131 10143114 10090939 10062084 10296249 10303752 10310667 10462050 10488193
3546A0488193K37206k44568p7960J66528J86952k10188Q769N9823J66887L5241
$$ 10488193 10725399 10480831 10402871 10569399 10756351 10546163 10554932 10614755 10781642 10816883
3536A0816883K62345J70255N0431J73720K51708K17359J38612J56324L82357K98703
$$ 10816883 11079228 11249483 11299914 11473634 11725342 11942701 12081313 12237637 12619994 12918697
3526A2918697M2641L84178L09491j04437k53758j69702k81392k35596m62634l14639
$$ 12918697 12961338 13345516 13655007 13550570 13296812 13127110 12845718 12610122 12147488 11832849
3516A1832849k04690l10494l19708m00683l86484l79157l1522j93963k86719m03660
$$ 11832849 11628159 11317665 10997957 10597274 10210790 9831633 9800111 9606148 9319429 8915769
3506H915769j02536J64439n0563n7491p1267j92623k51541j97955M9472n5804
$$ 8915769 8813233 8977672 8927109 8869618 8798351 8605728 8354187 8156232 8205704 8149900
3496H149900k79958j98895L9972j88512q6845j508L1461k23907k15657K72315
$$ 8149900 7869942 7671047 7711019 7522507 7435662 7434154 7465615 7241708 7026051 7298366
3486G298366j34788j57415q5625j35575N2539k54483r8766j39818m26046K46862
$$ 7298366 7163578 7006163 6920538 6784963 6837502 6583019 6484253 6344435 5918389 6165251
3476F165251k24734l4222n0898K13844j54895k53222k40963j0083p1660L0151
$$ 6165251 5940517 5906295 5855397 6069241 5914346 5661124 5420161 5410078 5338418 5368569
3466E368569Q5235j51358j44050o225n9602j48348L238k31611J17788k7389L2027
$$ 5368569 5453804 5302446 5158396 5152171 5092569 4944221 4947459 4715848 4833636 4806247 4838274
3455D838274k4840j25166j83668O4226j43909l83205L1424l055J24737J79518
$$ 4838274 4813434 4688268 4504600 4568826 4424917 4041712 4073136 4070081 4194818 4374336
3445D374336p1201j93486j8967k22159R0172j25070k04247J40246l5635j13518
$$ 4374336 4303135 4109649 4090682 3868523 3958695 3833625 3629378 3769624 3733989 3620471
3435C620471m2047J02931m4290J42847j9723j46039J34347r8269k55671m4298
$$ 3620471 3578424 3681355 3637065 3779912 3760189 3614150 3748497 3650228 3394557 3350259
3425C350259Q1935o8781j19310p5161m8152K65818j49955K45094k55014j06676
$$ 3350259 3432194 3363413 3244103 3168942 3120790 3386608 3236653 3481747 3226733 3120057
3415C120057L1300r6251n6452K0082k8919j8861M6259K55830r2326k7758L2093
$$ 3120057 3151357 3055106 2998654 3018736 2989817 2970956 3017215 3273045 3180719 3152961 3185054
3404C185054O36j32348k33672M3820k3144N2197j46912J19871k8710k61265O5721
$$ 3185054 3185690 3053342 2819670 2863490 2840346 2892543 2745631 2865502 2836792 2575527 2641248
3393B641248J88285j04523j63982J35165J41382K60369K8390j98052j24787K03153
$$ 2641248 2829533 2725010 2561028 2696193 2837575 3097944 3126334 2928282 2803495 3006648
3383C006648J23424J7070J38797p4884r3829j92382J1210j63446O2552J04890
$$ 3006648 3130072 3147142 3285939 3211055 3117226 2924844 2936054 2772608 2835160 2940050
3373B940050J10475k286r6050j63534J0195l836Q1868r4367k23765m93l1543J01313
$$ 2940050 3050525 3048239 2952189 2788655 2798850 2795014 2876882 2782515 2558750 2558257 2526714 2628027
3361B628027L04521j23576k13423m5303K92052J21617j10062j7800K81489J27844
$$ 2628027 2932548 2808972 2595549 2550246 2842298 2963915 2853853 2836053 3117542 3245386
3351C245386J22785p941j16016k01428j86672L8971M1339q4810k90718M0533R4546
$$ 3245386 3368171 3360230 3244214 3042786 2856114 2895085 2936424 2851614 2560896 2601429 2695975
3340B695975k3535j2187K2610n2817J44993J4548k61815J06281j54201J25069
$$ 2695975 2672440 2660253 2682863 2630046 2775039 2789587 2527772 2634053 2479852 2604921
3330B604921o3705J04899O3396L4790k1179l4689J71228K0515K90847Q1462o2540
$$ 2604921 2541216 2646115 2709511 2744301 2723122 2688433 2859661 2880176 3171023 3252485 3189945
3319C189945K78969P3235R3313L3475k10262q8830l6792j0260j6110Q2416R5707
$$ 3189945 3468914 3542149 3635462 3668937 3458675 3369845 3333053 3322793 3306683 3389099 3484806
3308C484806q9162q0295l0041j4983J01530j17388J3336R1378j03466k68245O449
$$ 3484806 3395644 3315349 3285308 3270325 3371855 3254467 3267803 3359181 3255715 2987470 2993919
3297B993919m8202J87943K32930q6755L1824K71936l2900K05359p0787j84630
$$ 2993919 2945717 3133660 3366590 3279835 3311659 3583595 3550695 3756054 3685267 3500637
3287C500637L78636M10495K19454J90571j2040J53604j41274R14k6927j77331
$$ 3500637 3879273 4289768 4509222 4699793 4687753 4841357 4700083 4700997 4674070 4496739
3277D496739j77521p555k31240r3538R0519m7778N4236j26748j77727q3227o4296
$$ 4496739 4319218 4311663 4080423 3986885 4077404 4029626 4083862 3957114 3779387 3696160 3631864
3266C631864P1350k71371k11082p5637n2259k5841k45128j05090K33977J96489
$$ 3631864 3703214 3431843 3220761 3145124 3092865 3067024 2821896 2716806 2950783 3147272
3256C147272J72267R1068O0594K68161R1152k3577M2882J5051j27625j26757j26555
$$ 3147272 3319539 3410607 3471201 3739362 3830514 3806937 3849819 3864870 3737245 3610488 3483933
3245C483933p0420k42167l4272R8116J45282K51707k91456k09887O1769r6648
$$ 3483933 3413513 3171346 3137074 3235190 3380472 3632179 3340723 3130836 3192605 3095957
3235C095957k04015M4222k1111k46842L351O2904k6912j49211j88886o5129J54342
$$ 3095957 2891942 2936164 2915053 2668211 2671562 2734466 2707554 2558343 2369457 2304328 2458670
3224B458670l3598O4816p7702m8814K43169K17468j32089k49230k3334J64973
$$ 2458670 2425072 2489888 2412186 2363372 2606541 2824009 2691920 2442690 2419356 2584329
3214B584329J9012m9605o2931O2661q8685K670R9699L264J55454m13226j68037
$$ 2584329 2603341 2553736 2490805 2553466 2464781 2467451 2567150 2570414 2725868 2312642 2144605
3203B144605L17013R2057r386j67852r6565N3816j20537k49490K03603J81191
$$ 2144605 2461618 2553675 2544289 2376437 2279872 2333688 2213151 1963661 2167264 2348455
3193B348455q7530N7506K54637j56736j33400j7650j96990K8492k7217m6647l663
$$ 2348455 2260925 2318431 2573068 2416332 2282932 2265282 2068292 2096784 2069567 2022920 2019257
3182B019257q893N9245N131J51741j74067J76412p6838r3051q4228R841j27741
$$ 2019257 2010364 2069609 2074740 2226481 2052414 2228826 2151988 2058937 1974709 1984550 1856809
3171A856809j98398J77310j41086J97458l47785J33901J24141r1094M1155J50394
$$ 1856809 1658411 1835721 1694635 1892093 1544308 1678209 1802350 1711256 1752411 1902805
3161A902805m4374j86286q8383j02850J76223K7878l7202M148m9036p9025L3778
$$ 1902805 1858431 1672145 1583762 1480912 1657135 1685013 1647811 1651959 1602923 1523898 1557676
3150A557676J0134j70731J67899Q3591q8121J63098n9184m5358k20626K2367N5406
$$ 1557676 1567810 1397079 1564978 1648569 1560448 1723546 1664362 1619004 1398378 1420745 1476151
3139A476151R134j07179n7840l2921J13559q7086m1548K63354M9732m2764O0634
$$ 1476151 1485285 1378106 1320266 1287345 1400904 1313818 1272270 1535624 1585356 1542592 1603226
3128A603226O6698p5170j05044J29076M1111j55p9375J00356M4344j37337j66124
$$ 1603226 1669924 1594754 1489710 1618786 1659897 1659742 1580367 1680723 1725067 1587730 1421606
3117A421606J30891Q3635l3628k25071N0673m9796r3253J17969M9895p3616n5282
$$ 1421606 1552497 1636132 1602504 1377433 1428106 1378310 1285057 1403026 1452921 1379305 1324023
3106A324023K5466q6110N2705k21073q6688j01365J17538j05901J72232o374P3950
$$ 1324023 1349489 1263379 1316084 1095011 1008323 906958 1024496 918595 1090827 1084453 1158403
3095A158403J48871k72818J0416k21523l7911O0903k2138J36424M4882n6252J45670
$$ 1158403 1307274 1034456 1044872 823349 785438 846341 824203 960627 1005509 949257 1094927
3084A094927n3366j76728K10146l04903J6005K36493k7209j46626K31878o2939
$$ 1094927 1041561 864833 1074979 770076 786081 1022574 995365 848739 1080617 1017678
3074A017678n779n7619R9922P4689j2643k63844J92216R0165k74550Q7906j53062
$$ 1017678 1011899 954280 1054202 1128891 1116248 852404 1044620 1134785 860235 948141 795079
3063G95079j24780K51640j32911k7735P4540p5977R810j36576J02830j40725J30690
$$ 795079 670299 921939 789028 761293 835833 759856 769666 633090 735920 595195 725885
3052G25885j00069K7111K58994K9942k34594k8540Q125o2495J5473J16416J52869
$$ 725885 625816 652927 911921 941863 707269 678729 686854 624359 639832 756248 909117
3041I09117k15405k0008P5466n6187J58074J567j83294K7833K31896P7870O8055
$$ 909117 693712 673704 749170 692983 851057 852624 669330 697163 929059 1006929 1074984
3030A074984J8295j61124K980J37063m9281o278K23308k94223J98071J94740k93751
$$ 1074984 1093279 932155 935135 1072198 1022917 1016639 1239947 945724 1143795 1338535 1044784
3019A044784j43909K20307k0702l6080j05020l5515J06601j92818l3442K2309
$$ 1044784 900875 1121182 1100480 1064400 959380 923865 1030466 837648 804206 826515
3009H26515j0519J19017M3863J03734R5237m017r6002l05934J05207J7259J17773
$$ 826515 815996 935013 978876 1082610 1177847 1173830 1077828 771894 877101 894360 1012133
2998A012133k31067L3711K08870o1109K34038J99118k09849J02510O4919N2873
$$ 1012133 781066 814777 1023647 962538 1196576 1395694 1185845 1288355 1353274 1406147
2988A406147o2707j62849k02607J76179j43995k6152j14175J68820K00495R4260
$$ 1406147 1343440 1180591 977984 1154163 1010168 984016 869841 1038661 1239156 1333416
2978A333416N8189R7676K6052j79700R7368j40858N2558n0753R8120k1030j44354
$$ 1333416 1391605 1489281 1515333 1335633 1433001 1292143 1344701 1293948 1392068 1371038 1226684
2967A226684O139J41724j6171N4845L17235l0580K2056j35890p9720J81135j1932
$$ 1226684 1232823 1374547 1358376 1413221 1730456 1699876 1721932 1586042 1506322 1687457 1675525
2956A675525L8728n2594J8581L7514J81540j55046j13468J1219J59911j06268
$$ 1675525 1714253 1661659 1680240 1717754 1899294 1744248 1630780 1641999 1801910 1695642
2946A695642L7351J34681R2664j1207J20547j71884j13029J30542J13459l25084
$$ 1695642 1732993 1867674 1960338 1949131 2069678 1897794 1784765 1915307 2028766 1703682
2936A703682j45799R635j12033K04413M1256K3270k83588M6432r6606j13572J23148
$$ 1703682 1557883 1567518 1455485 1659898 1701154 1724424 1440836 1487268 1390662 1277090 1400238
2925A400238J05163J25279K27068P2108j2573k39134j01633o8129j7919j8160
$$ 1400238 1505401 1630680 1857748 1929856 1917283 1678149 1576516 1508387 1490468 1472308
2915A472308N4441m4417n6572j4282j37084J78685J49017O1596k46571n0281O0888
$$ 1472308 1526749 1482332 1425760 1411478 1274394 1453079 1602096 1663692 1417121 1366840 1427728
2904A427728P4324o2375k34842q1028l4431L7132O4669R8982k77613J2260J64773
$$ 1427728 1502052 1439677 1204835 1123807 1089376 1126508 1191177 1290159 1012546 1024806 1189579
2893A189579p2382L4501o8807k92855R5848J19973j81147K7036J9245P7137p4138
$$ 1189579 1117197 1151698 1082891 790036 885884 1005857 824710 851746 870991 948128 873990
2882H73990O4517j79411J47195J86224j89284m716J68109M4218l01141k31893
$$ 873990 938507 759096 906291 1092515 903231 898515 1066624 1110842 809701 577808
2872E77808J5450J5852j65683K71848k2660k2740k06847Q9501O0590l8978m924
$$ 577808 593258 609110 443427 715275 692615 669875 463028 552529 613119 574141 569217
2861E69217P5001J88904k14836j95437J07841L9157R9816r9123J93475r5147j07247
$$ 569217 644218 833122 618286 422849 530690 569847 669663 570540 764015 668868 561621
2850E61621M7838j67759J43865j21760o2805m4481J55374Q685k3690L0316j77934
$$ 561621 609459 441700 585565 463805 401000 356519 511893 520578 496888 527204 349270
2839C49270M125J31270l4519J32309j65055P12J67143k43454j28455m5267J35449
$$ 349270 353395 484665 450146 582455 417400 418112 585255 341801 213346 168079 303528
2828C03528M332l9101R3090m7359N2835l4175J36365j19166l6659L714J47284
$$ 303528 307860 268759 361849 314490 367325 333150 469515 350349 313690 317404 464688
2817D64688M2762q9560J2224r0966J32034j28361l16206L25259J64056j51065
$$ 464688 507450 417890 430114 339148 471182 342821 26615 351874 515930 364865
2807C64865m5474J42933j54860J46050P2806j39338k46088K50962j35897k1168
$$ 364865 319391 462324 307464 453514 526320 386982 140894 391856 255959 234791
2797B34791J61822J75404l3078j9156r8955q8185J4773j30284L2925n1629j14138
$$ 234791 396613 572017 538939 519783 420828 332643 347416 217132 250057 198428 84290
2786H4290K99183k8295P3617l8245N6618J48014k50808k2496J3289K52570r7980
$$ 84290 383473 355178 428795 390550 447168 595182 344374 321878 335167 587737 489757
2775D89757j03451m5620M2345m0161j49112O0052K55780p2900j5096j41807L09310
$$ 489757 386306 340686 383031 342870 193758 253810 509590 436690 421594 279787 589097
2764E89097Q7921j7880j87383r7101J66575n2630J869O0239k3858p6680k41879
$$ 589097 677018 659138 471755 374654 541229 488599 490468 550707 526849 450169 208290
2753B08290Q3853k6394K55334j97445J09145P8688k86509m537o3190j8662J1768
$$ 208290 292143 265749 521083 323638 432783 511471 224962 220425 157235 138573 150341
2742A50341j64169K96705K48207j93455R190J62100o3962L25587K08617l71830
$$ 150341 -13828 282877 531084 337629 346819 508919 444957 770544 979161 607331
2732F07331o2974R5709j6721j48075O9988K2191k1288j9040k60343N7156m1423
$$ 607331 544357 640066 623345 475270 545258 567449 546161 527121 266778 323934 282511
2721B82511R2225P8767j9158j38663N7518J0302J29818P7300j23592J24051j31527
$$ 282511 374736 453503 434345 295682 353200 363502 493320 570620 447028 571079 439552
2710D39552j73677P5551J34813r2543k3502L031J18204l25126K10611P7k47032
$$ 439552 265875 341426 476239 383696 360194 363225 481429 156303 366914 366991 119959
2699A19959L33983R2356k21562R6948J16107j49847J38928J29278n2560j54172
$$ 119959 453942 546298 324736 421684 537791 387944 526872 656150 603590 449418
2689D49418j2234k05821J92563p4215l15117R9442K28312q0751j27642J54319
$$ 449418 437184 231363 423926 349711 34594 134036 362348 281597 153955 308274
2679C08274k50688R9151L74579p9727j71116K60409O931j68980O0832K30491j33250
$$ 308274 57586 156737 531316 451589 280473 540882 547813 378833 439665 670156 536906
2668E36906k25258J44864L01306J9241l63263k13493J30398Q8423L3390j17283
$$ 536906 311648 456512 757818 777059 413796 200303 330701 419124 452514 335231
2658C35231N77n4542N1152k9267p9474n704J39710J51247j7127j90279K8021J01145
$$ 335231 335808 281266 332418 303151 223677 217973 357683 508930 491803 301524 329545 430690
2646D30690O5474j12746R4573L4507k7296q4244o6928L1986k46619J50556L60172
$$ 430690 496164 383418 477991 512498 485202 400958 334030 366016 119397 269953 630125
2635F30125k52344j83882o7741J13604M8389M0601J62303j79095r3975m2740J67623
$$ 630125 377781 193899 126158 239762 288151 328752 491055 311960 217985 175245 342868
2624C42868R4770K95770j68864K37411J97915k53141O1676j50218r9424j02454
$$ 342868 437638 733408 564544 801955 999870 746729 808405 658187 558763 456309
2614D56309p3218P0911J16013J58782Q7272k51308k05515J29471K63592r4819
$$ 456309 383091 454002 570015 728797 816069 564761 359246 488717 752309 657490
2604F57490K27207P3505K1196k50419j22338J06981j12095m2915L9009J13867
$$ 657490 884697 958202 979398 728979 606641 713622 601527 558612 597621 711488
2594G11488m4591q8593O4309J25522K0846J91777l00304q6668J14548k04581K50574
$$ 711488 666897 578304 642613 768135 788981 980758 680454 593786 708334 503753 754327
2583G54327q1888q348J38789k22030K04109Q5380j0451J1683J93440j70785J66965
$$ 754327 672439 664091 802880 580850 784959 870339 859888 871571 1065011 894226 1061191
2572A061191J14437l01642K9923L7685L05745O3904k20211k07059L01467R9145
$$ 1061191 1175628 873986 903909 941594 1247339 1311243 1091032 883973 1185440 1284585
2562A284585J1636m452K9723j99628J6060J07431q8524m5804K17166J39503R7568
$$ 1284585 1296221 1291769 1321492 1121864 1137924 1245355 1156831 1111027 1328193 1467696 1565264
2551A565264J07971k75713J47952Q5834p1801Q7174J58801j50895K8965J49294
$$ 1565264 1673235 1397522 1545474 1631308 1559507 1646681 1805482 1654587 1683552 1832846
2541A832846K00664K83373l986j40495K01570j99065J56459J98140K0132J49663
$$ 1832846 2033510 2316883 2312897 2172402 2373972 2174907 2331366 2529506 2549638 2699301
2531B699301j48382J15315L21391Q2081K10807L39423J29809r0018M00095Q0146
$$ 2699301 2550919 2666234 2987625 3069706 3280513 3619936 3749745 3659727 4059822 4139968
2521D139968o0423J39079J58052J92995N55158J69596M07635K52635K41224N03771
$$ 4139968 4079545 4218624 4376676 4569671 5124829 5294425 5702060 5954695 6195919 6699690
2511F699690P46145P30717Q81355P52592R87439J113325P66942J298411J538883
$$ 6699690 7445835 8176552 9057907 9810499 10797938 11911263 12678205 13976616 15515499
2502A5515499J810885J911591K589385L364220M123496N635625O930581Q593350
$$ 15515499 17326384 19237975 21827360 25191580 29315076 34950701 41881282 50474632
2494E0474632Q240807O311714j992619j0398210q831537q023653o788762m909890
$$ 50474632 58715439 65027153 63034534 52636324 43804787 35781134 28992372 24082482
2486B4082482l452746k596381j945394j490632j179450j032279q33487n00848
$$ 24082482 20629736 18033355 16087961 14597329 13417879 12385600 11552113 11051265
2478A1051265q33806j000983n14900o67978p47953l11082l57346l88693l84396
$$ 11051265 10217459 9216476 8701576 8033598 7285645 6974563 6617217 6228524 5844128
2469E844128k71617l33689j72175l54250m14613k21299O3519L9960l35821l90859
$$ 5844128 5572511 5238822 5066647 4712397 4297784 4076485 4140004 4179964 3844143 3453284
2459C453284q7177Q5108j50704q8300j55558k00986o7027k3257r6867p6034k61098
$$ 3453284 3366107 3451215 3300511 3212211 3056653 2855667 2788640 2765383 2668516 2592482 2331384
2448B331384j5764J30749j57394j03408J01683p6440j37444k70569k96586K39803
$$ 2331384 2315620 2446369 2288975 2185567 2287250 2210810 2073366 1802797 1506211 1746014
2438A746014o4465k64514K39793k592l8194k25382j59033K82164L05274l5433
$$ 1746014 1681549 1417035 1656828 1654236 1616042 1390660 1231627 1513791 1819065 1783632
2428A783632l24305R1561j18540j68464J28385J54859k2366l44615j93108M7792
$$ 1783632 1459327 1550888 1432348 1263884 1392269 1547128 1524762 1180147 987039 1034831
2418A034831o4725L6171K1054j76363J8175K42034m6018J92299j19319o4019k95462
$$ 1034831 970106 1006277 1027331 850968 869143 1111177 1065159 1257458 1138139 1074120 778658
2407G78658k28218J90835O8834R646j57860R7753L9895l3581j46506K15501j30034
$$ 778658 550440 741275 810109 819755 661895 759648 799543 765962 619456 834957 704923
2396G04923J6305J67140J3283l87019r9688J87860j19772J76533J51854j8975
$$ 704923 721228 888368 901651 514632 414944 602804 483032 659565 811419 792444
2386G92444K31521l55734j08818J61197M7407o8007k8807n3922J36197k04172
$$ 792444 1023965 668231 559413 720610 768017 700010 671203 617281 753478 549306
2376E49306M080O4131p2745O9670O8653J29584O3631o037l71237R8058R7910M6697
$$ 549306 553386 617517 544772 614442 683095 812679 876310 870273 499036 597094 695004 741701
2364G41701r0826p7299j24171K484j21660L7235j23974J10442K45113k0794o9016
$$ 741701 650875 573576 449405 451889 330229 367464 243490 353932 599045 578251 509235
2353E09235k43570l2840K83104k57710J02784j06967L4753O9046J80834R8811
$$ 509235 265665 232825 515929 258219 361003 254036 288789 357835 538669 637480
2343F37480k38953q8887J0194L48240j58843k70982Q4853r4621R8869Q5963L26155
$$ 637480 398527 309640 319834 668074 509231 238249 323102 228481 327350 413313 739468
2332G39468O0428m13038J12404M1301m1660j51925M1755m3509K5040K1422J65867
$$ 739468 799896 386858 499262 540563 498903 346978 388733 345224 370264 391686 557553
2321E57553j54405l24359J96898L99725n4576j47485k9465l823P8036K15537q8540
$$ 557553 403148 78789 275687 675412 620836 473351 443886 440063 518099 733636 645096
2310F45096j69536r2716K4681p7300J31848k3996k21631o0516m9787K83305O1626
$$ 645096 475560 382844 407525 330225 462073 438077 216446 155930 106143 389448 451074
2299D51074k4549K2910j16374j61573J99572k15278K71681j9713j3923k57585
$$ 451074 426525 449435 333061 171488 371060 155782 427463 407750 393827 136242
2289A36242J64116p2143j46815N47218j84600Q7966Q1907j37582r8331m5978q2634
$$ 136242 300358 228215 81400 628618 444018 531984 613891 476309 377978 332000 249366
2278B49366j05392K65023M7338l4505o2023m8464j6590q1178J37467P1514k02052
$$ 249366 143974 408997 456335 421830 359807 311343 294753 213575 351042 422556 220504
2267B20504n4147R1245J45782k5122j10466K28618k05246L7852O8492k22284j0492
$$ 220504 166357 257602 403384 378262 267796 496414 291168 329020 397512 175228 164736
2256A64736R9548K11718m1256L6586l888K12356n3340J769j60878J5662n0520
$$ 164736 264284 476002 434746 471332 467444 679800 626460 628229 467351 483013 432493
2245D32493j25624O8433J01236J8650m11442J01292J2398q312P7350J56096l33431
$$ 432493 306869 375302 476538 495188 83746 185038 197436 189124 266474 422570 89139
2234H9139J49246L7685J35841j04267l13157J88400J04830j47909q8901j0679
$$ 89139 238385 276070 411911 307644 -5513 182887 287717 139808 50907 40228
2224D0228J44786j02348O7963l4362J33738r0090O1066o4925j43697J67703j60076
$$ 40228 185014 82666 150629 116267 250005 159915 220981 156056 12359 180062 19986
2213A9986K43506O470k37081p6026K14278K70119r7814l6408k29137l4815L857
$$ 19986 263492 269962 32881 -43145 171133 441252 343438 307030 77893 43078 46935
2202D6935j07554K45920P0963n3537r5131j2246R8987k31072k7409Q9689p7384
$$ 46935 -60619 185301 256264 202727 107596 95350 194337 -36735 -64144 25545 -51839
2191e1839O5859K6859L03313k38983J04125j83l0408J50862k36510O2135r0495
$$ -51839 14020 40879 344192 105209 209334 209151 178743 329605 93095 155230 64735
2180F4735K85921j93510j26346L449N2599q2470P9401J21543k66127j11348j16843
$$ 64735 350656 157146 30800 34249 86848 4378 83779 205322 -60805 -172153 -288996
2169b88996J69280J69449Q7043j48178m341O3619J98715j9106J11383p8669J6674
$$ -288996 -119716 49733 136776 -11402 -15743 47876 246591 227485 338868 260199 276873
2158B76873j29886k2963o876o4723j48882J21954O8626R8669M115o9525o8537
$$ 276873 146987 124024 117148 52425 -96457 25497 94123 192792 196907 127382 58845
2147E8845R9591K1003J08116l0269k06620R3292n2201p358Q8685R1368q1372J05609
$$ 58845 158436 179439 287555 257286 50666 143958 91757 84399 173084 264452 183080 288689
2135B88689j04445Q1531l7078k26150m5950N3714J16035L3505J1604k7731N014
$$ 288689 184244 265775 228697 2547 -43403 10311 126346 159851 171455 143724 148738
2124A48738J5706k03922P6001R4072j30899n669q9635K34603j5092j49825K14962
$$ 148738 164444 -39478 36523 130595 -304 -5973 -95608 138995 123903 -25922 189040
2113A89040K7264J65936J09262q7286j73775j0354N7267J30897k93977L574j73396
$$ 189040 216304 382240 491502 404216 230441 220087 277354 408251 114274 117848 -55548
2102e5548J70441K20036J61268N9039k09330M6893K9582r6517j93124p3010Q6374
$$ -55548 114893 334929 496197 555236 345906 392799 422381 325864 132740 59730 146104
2091A46104R4026l00062q0858J97150K36510r6873j50235L5692J37304j40272
$$ 146104 240130 -59932 -140790 56360 292870 195997 45762 81454 218758 78486
2081G8486J81614M3561m537J3206k811r6255l2137j10119j196Q1801m5086j50435
$$ 78486 260100 303661 299124 312330 309519 213264 181127 71008 69812 151613 106527 -43908
2069d3908J4875J28707j46345M1938n234J4699K11740k6890M5263n8965j90812
$$ -43908 -29033 99674 -46671 -4733 -9967 4732 216472 189582 234845 175880 -14932
2058a4932J59010q5247J73734N8184L8449j56130m1562l4622O1709q6437j60586
$$ -14932 144078 58831 232565 290749 329198 173068 131506 96884 158593 72156 -88430
2047h8430o9963J29355K49533j10989m4185l8429o9212J29031P1754k22144J24350
$$ -88430 -158393 -29038 220495 109506 65321 26892 -42320 86711 158465 -63679 60671
2036F0671J38068Q186J95596j65513j4976j45890k25566K65440O965N6541j81297
$$ 60671 198739 206925 402521 237008 222032 76142 -149424 116016 122981 179522 -1775
2025a775R0539M8723Q056J71334j48770j5492j5108l2966m0616j21534R1390J03665
$$ -1775 88764 137487 145543 316877 168107 152615 137507 104541 63925 -57609 33781 137446
2013A37446j00736k36096Q8179J61550J16891J12231o8183j61549q5064J39831
$$ 137446 36710 -199386 -111207 50343 167234 279465 211282 49733 -35331 104500
2003A04500J94670o8418M566l28091q0462J3878J01053J51320J72529R0576l24660
$$ 104500 299170 230752 235318 -92773 -173235 -159357 -58304 93016 265545 356121 31461
1992C1461j05485K7620j44038J56243M1544Q7592L14989p9570k04563O4324J18444
$$ 31461 -74024 -46404 -190442 -34199 7345 94937 409926 330356 125793 190117 308561
1981C08561k85102O5272K3000q2623J02705O4281k11249K8416N2226j18455R3216
$$ 308561 23459 88731 111731 29108 131813 196094 -15155 13261 65487 -52968 40248
1970D0248k7283K83005k9344L2330n493o6374j54560k7245J58395j88013j14332
$$ 40248 12965 295970 266626 298956 293463 227089 72529 45284 203679 15666 -98666
1959i8666L1187J70846n1398K3744k21232J08955K60688M3412k73414r7571K4131
$$ -98666 -67479 103367 51969 75713 -145519 -36564 224124 267536 -5878 -103449 -79318
1948g9318K01882n1631l2935J16235J02264j38113j81230R5760J71402j49820
$$ -79318 122564 70933 37998 154233 256497 118384 -62846 32914 204316 54496
1938E4496k9617J78881j10402k27655J96607J55390j42956j77047K61934K196
$$ 54496 24879 203760 93358 -134297 62310 217700 74744 -102303 159631 161827
1928A61827j13408J4639K5686J774J53000l5820j52845J76646j61087j7380R6443
$$ 161827 48419 63058 88744 90518 243518 207698 54853 231499 70412 53032 149475
1917A49475Q5701p3479R5750K410k03805J52647j51595l11373l1068K46627j10878
$$ 149475 235176 161697 257447 259857 56052 208699 57104 -254269 -285337 -38710 -149588
1906a49588J19701R1573q1511J15763L9117o6160j36561K24035L5197K3042j13299
$$ -149588 -29887 61686 -19825 95938 135055 68895 -67666 156369 191566 214608 101309
1895A01309p810p2518o9137j782J74216k76672J25603P7851j6764P6480L3656
$$ 101309 93499 20981 -48156 -49938 124278 -152394 -26791 51060 34296 110776 144432
1884A44432P1443j8554R5790j64202j08644j6545j0571J82833K4661n4964p1099
$$ 144432 215875 197321 293111 128909 20265 3720 -6851 175982 200643 145679 74580
1873G4580j25954l0156K10593R2416j01932K1434k19631R7272N5550n3497j9421
$$ 74580 -51374 -81530 129063 221479 119547 140981 -78650 18622 74172 20675 1254
1862A254K68115k78318n0416K68792k23815l816j83670J77154q6311J95761l7336
$$ 1254 269369 -8949 -59365 209427 -14388 -18204 -201874 -24720 -111031 84730 47394
1851D7394M4805j34531P7910j92310K8904J14641k94607J59995p1260Q6110N2323
$$ 47394 92199 -42332 35578 -156732 -127828 -13187 -307794 -147799 -219059 -132949 -80626
1840h0626J32292J22190k39538K8201j7174J92640k0234k23079K67709j0408q2866
$$ -80626 51666 173856 -65682 -37481 -54655 137985 117751 -105328 162381 151973 69107
1829F9107M6207k90493J08024J39828P5015J11427k77521q6572J21964L1890k92092
$$ 69107 115314 -175179 -67155 72673 147688 259115 -18406 -104978 16986 48876 -243216
1818b43216J91893M7508j8767K32878j14603j60591K04708n9035j009n4621j09848
$$ -243216 -51323 -3815 -22582 210296 95693 -64898 139810 80775 79766 25145 -84703
1807h4703k7451J26368O1132l8913l778L79338k90900m7272j60239n3662l4861
$$ -84703 -112154 14214 75346 36433 32655 411993 121093 73821 -86418 -140080 -174941
1796a74941j15818O9831q3261K83669k6555K86376o5965j41195K7836p2897O5954
$$ -174941 -290759 -220928 -304189 -20520 -47075 239301 173336 32141 59977 -12920 53034
1785E3034J28715J041j44061k06929m4712J18390j05731J38713j89299j49750
$$ 53034 181749 182790 38729 -168200 -212912 -94522 -200253 -61540 -250839 -400589
1775d00589J94197R7122K4846k15279J48236M74962M1984p5740O1318j06174j85709
$$ -400589 -206392 -109270 -84424 -299703 -151467 323495 365479 289739 351057 244883 59174
1764E9174J21106O4100m04728m0246J30351K67759j09511j57876K7410J60039
$$ 59174 180280 244380 -160348 -200594 -70243 197516 88005 -69871 -42461 117578
1754A17578j06182k8495K17876R4065q9346J50173K4644o9072Q0746j75955j67619
$$ 117578 11396 -17099 200777 294842 205496 355669 380313 311241 391987 216032 48413
1743D8413p5266M64498k65458m8299K73302k28093J2367N2984p7103j58318j60306
$$ 48413 -26853 437645 172187 123888 397190 169097 181464 234448 157345 -973 -161279
1732a61279L45629o9891Q6744O2264j13969j35951j7432J45753l3858L0657q8587
$$ -161279 184350 114459 201203 263467 149498 13547 -3885 141868 108010 138667 50080
1721E0080K6199k58780K34257N0672j6310P4932J24905r4760k07258r5659q5348
$$ 50080 76279 -182501 51756 102428 86118 161050 285955 191195 -16063 -111722 -197070
1710a97070J51414J18851L0542p1197r9787L6625K34996r1707q9293p2817K06491
$$ -197070 -45656 73195 103737 32540 -67247 -30622 204374 112667 23374 -49443 157048
1699A57048l1696m1114n1938j86066K75307N287k50j57240j90763J13147L5555
$$ 157048 125352 84238 32300 -153766 121541 126828 126578 -30662 -221425 -108278 -72723
1688g2723K89144L3996j97870k3683q3938J70627O9151k29976J23J97469k7014
$$ -72723 216421 250417 52547 28864 -55074 115553 184704 -45272 -45149 152320 125306
1677A25306j78505j49385J8972P7821j3108L6946j2069J32383J38831j96847L5811
$$ 125306 -53199 -202584 -183612 -105791 -118899 -81953 -94022 38361 177192 -19655 16156
1666A6156j7168j18651m404J55803q7585j10686R5397P8142J78341j41816j05943
$$ 16156 -1012 -119663 -124067 31736 -55849 -166535 -71138 7004 185345 43529 -62414
1655f2414L02619M6281j76172j39232M0375J17308o0592l2481j19728K03853M689
$$ -62414 240205 286486 110314 -28918 11457 128765 68173 35692 -84036 119817 124506
1644A24506j24547o5577J07555j28628j05798L30674L04866k68459k32745r8580
$$ 124506 -41 -65618 41937 -86691 -192489 138185 443051 174592 -58153 -156733
1634a56733p3722J84437J48778R4904j73999n4949M0117q248J71444l1244j81393
$$ -156733 -230455 -46018 102760 197664 23665 -31284 8833 585 172029 140785 -40608
1623d0608N976J52953J18300n9P2447l77276M0265M7668Q2308j48024k6745J10492
$$ -40608 -34632 118321 236621 236562 309009 -68267 -28002 19666 101974 -46050 -72795 37697
1611C7697k53912O9338J17067k5182m6230J16894l5773j88997J68282n308j32170
$$ 37697 -216215 -146877 -29810 -54992 -101222 15672 -20101 -209098 -40816 -46124 -178294
1600a78294L9655j2011K54371j43159P39l3649l9030K20863j61045j55828q2318
$$ -178294 -138639 -150650 103721 -39438 -38699 -72348 -111378 109485 -51560 -207388 -289706
1589b89706K56879J22064k42044j8697j56873J43355R8643R6455L00570r3241
$$ -289706 -32827 89237 -152807 -171504 -328377 -185022 -86379 10076 310646 217405
1579B17405k06365m5817N5139j89958K45270r4065k1888j2394P2705k4302r9920
$$ 217405 11040 -34777 20362 -169596 75674 -18391 -40279 -52673 20032 -4270 -104190
1568a04190k6697L8568o913p798J64947R0901M5800o4263K47307J71326l08728
$$ -104190 -130887 -92319 -99232 -107030 57917 148818 194618 130355 377662 548988 240260
1557B40260j51869O2715J07356j18283k06820o6793n3811L02160j29200k4739
$$ 240260 88391 151106 258462 140179 -66641 -133434 -187245 114915 -14285 -39024
1547c9024N6299l3132K4500P2226M9526n2278k2965r5728j30360L06992J87281
$$ -39024 17275 -15857 8643 80869 130395 78117 55152 -40576 -170936 136056 323337
1536C23337q2404p0535l71996R9754N3861m2146J12673j09048l2705J70847J09580
$$ 323337 240933 170398 -201598 -101844 -47983 -90129 22544 -86504 -119209 51638 161218
1525A61218j82589M1831O8691j571r2760J45640o6193k81101j61031K72947K8956
$$ 161218 -21371 20460 89151 87580 -5180 140460 74267 -206834 -367865 -94918 -65962
1514f5962P8530Q1362J15217O5908l54136N6020M4951j54401K33050j28541j01668
$$ -65962 12568 93930 209147 275055 -79081 -23061 21890 -132511 100539 -28002 -129670
1503a29670M1500j09096Q3918J22131M9714l5171K52558J4133j79723k8402P0783
$$ -129670 -88170 -197266 -113348 8783 58497 23326 275884 290017 110294 81892 152675
1492A52675j38902Q5321j28344j61432K1161K7672N6826J59073K49519k89810
$$ 152675 13773 99094 -29250 -190682 -169521 -141849 -85023 74050 323569 33759
1482C3759J51613J3136j23017p7283O3365Q9411j628j31246k74293J12071L66858
$$ 33759 185372 198508 75491 -1792 61573 150984 149356 18110 -256183 -144112 222746
1471B22746K1368q8593j2370j92378k4116R9175p1962K01528r5355l08751K25724
$$ 222746 244114 155521 143151 -49227 -73343 25832 -46130 155398 60043 -248708 -22984
1460b2984Q1199m62M6244J08720j72406J59586m0276j81649J12950M1040k31744
$$ -22984 58215 57753 103997 212717 40311 199897 159621 -22028 90922 131962 -99782
1449i9782r227r3276Q8158J28685K7525j6549j81908l321J42750N2754R97N4824
$$ -99782 -109009 -202285 -114127 14558 42083 25534 -156374 -159695 -16945 35809 36806 91630
1437I1630k41191N6103J23760o0110M0463r2704J30012k28525J24249J23902j86281
$$ 91630 -149561 -93458 30302 -29808 10655 -82049 47963 -180562 -56313 67589 -118692
1426a18692K1957j4215k7013k6762l1448N4128J18090R2666N8916M6169l3989
$$ -118692 -96735 -110950 -137963 -164725 -196173 -142045 -23955 68711 127627 173796 139807
1415A39807j60753r1460n897J25450O7333J65656j20346j65882P7797J25133N1599
$$ 139807 -20946 -112406 -118303 7147 74480 240136 119790 -46092 31705 156838 208437
1404B08437k97467L8773K01731n1651n3336m0522M1605n4849j23122L4800L5939
$$ 208437 -89030 -50257 151474 99823 46487 5965 47570 -7279 -130401 -95601 -59662
1393e9662J79899R0796l29508K63810L7338j47098j67934m5369q033K29040n7557
$$ -59662 120237 211033 -118475 145335 182673 35575 -132359 -177728 -185761 43279 -14278
1382a4278O2004K8673m20374K20627N7730k3891L1460p4646r5449J92898J71589
$$ -14278 47726 76399 -343975 -123348 -65618 -89509 -58049 -132695 -228144 -35246 136343
1371A36343p8603j10897J90948j40307q4113L7478p3346J06519j98704j69650
$$ 136343 57740 -53157 137791 -2516 -86629 -49151 -122497 -15978 -214682 -384332
1361c84332K48291J53393n2196K01674j24447q5765J34831l5929r5273j94151
$$ -384332 -136041 17352 -34844 166830 42383 -43382 91449 55520 -39753 -233904
1351b33904n9783N0787q2835L6658q9955N7030J27080R3868J35119j9605j31080
$$ -233904 -293687 -242900 -325735 -289077 -379032 -322002 -194922 -101054 34065 14460 -116620
1340a16620j29507R9844K94410J52762r0082j81016k20617J31109O1160J18953
$$ -116620 -246127 -146283 148127 300889 210807 29791 -190826 -59717 1443 120396
1330A20396j21119R8311j10889j6655j7944j75442J83759J14297j0165p9077r0977
$$ 120396 -723 97588 -13301 -29956 -47900 -223342 -39583 74714 64549 -14528 -105505
1319a05505p5612l481J59190N2481l2757O9190k46972j82691L93424l6064j18835
$$ -105505 -181117 -184598 -25408 27073 -5684 63506 -183466 -366157 27267 -8797 -127632
1308a27632j3095k70849K43063l4661j47086N4761J23585q7695K43406o552j3680
$$ -127632 -140727 -411576 -168513 -203174 -350260 -295499 -171914 -259609 -16203 -22755 -36435
1297c6435o684k27222J17238J4674r963J97211p0093j19258k29603L09081J62235
$$ -36435 -43119 -270341 -153103 -138429 -148392 48819 -21274 -140532 -370135 -61054 101181
1286A01181j07142L790j14340J44334j49774l2929k26388J77454J03712K91598
$$ 101181 -5961 -2171 -116511 27823 -121951 -154880 -381268 -203814 -100102 191496
1276A91496M9586k80557K23902j52341j65677O2891O6429m1292J73324J6621k62130
$$ 191496 241082 -39475 184427 32086 -133591 -70700 -4271 -45563 127761 144382 -117748
1265a17748j09793K22896J59880o4578j76329k18930J04614J72383Q3130l38641
$$ -117748 -227541 -4645 155235 90657 -85672 -304602 -199988 -27605 55525 -283116
1255b83116J44127L73400k96604j45213Q2342L40010p4199q4921j95777J34582
$$ -283116 -138989 234411 -62193 -207406 -125064 214946 140747 55826 -139951 -5369
1245e369Q7072j34563Q0801j25320J17818Q2319j11617n8417k5823J94584L2708
$$ -5369 81703 -52860 27941 -97379 20439 102758 -8859 -67276 -93099 101485 134193
1234A34193k01027J9730j37127n9407R3506K98947L06361k98639j36269J11673
$$ 134193 -66834 -47104 -184231 -243638 -150132 148815 455176 156537 20268 131941
1224A31941l91445J72853M9674j13814M1963P7147P0179k2437N1217j70193O7129
$$ 131941 -259504 -86651 -36977 -150791 -108828 -31681 38498 16061 67278 -102915 -35786
1213c5786n4338j03906P101Q0994M2043j56157J94675j15798M9868l1626j54105
$$ -35786 -90124 -194030 -186929 -105935 -63892 -220049 -25374 -141172 -91304 -122930 -277035
1202b77035k3708J16545L48940N5345k42727o0255J04505L2293P1339j53867K1715
$$ -277035 -300743 -184198 164742 220087 -22640 -82895 21610 53903 125242 -28625 -6910
1191f910M8913j87748r2335j44354N621K24666j18129M3868j72693K93240J75592
$$ -6910 42003 -145745 -238080 -382434 -376813 -152147 -270276 -226408 -399101 -105861 69731
1180F9731j62468k47464p6521J19232k550K46724j10993j77053J62451K3034Q3385
$$ 69731 -92737 -340201 -416722 -297490 -300040 -53316 -164309 -341362 -178911 -155877 -72492
1169g2492K33900j32793J17532j80562k06862P0713K17178L28158j31696j61030
$$ -72492 161408 28615 146147 -34415 -241277 -170564 46614 374772 243076 82046
1159H2046P4277j69645j4660P9979j76561O2867J19186L704J22163k39488k11797
$$ 82046 156323 -13322 -27982 51997 -124564 -61697 57489 61193 183356 -56132 -267929
1148b67929L87930N4125m5192j09021j04877Q6229L1534l3858n357L2401l492
$$ -267929 120001 174126 128934 19913 -84964 1265 32799 -1059 -6416 25985 22493
1137B2493n0752o7834K44628k33949j16721J66468K7039M0556j69111J14573k5755
$$ 22493 -28259 -96093 148535 -85414 -202135 -35667 -8628 31928 -137183 -22610 -48365
1126d8365J3753L5283j22536K77279R5753j24106o372K00380j4945O4009k38383
$$ -48365 -34612 671 -121865 155414 251167 127061 120689 321069 306124 370133 131750
1115A31750L883o2030m0899J95114j20968m3625j3780p7016q414P328O3365j93242
$$ 131750 135633 73603 32704 227818 106850 63225 49445 -27571 -35985 -28657 34708 -158534
1103a58534j9829k0053K49503K1207k24685m854l2025N841j59259J74545j79568
$$ -158534 -178363 -198416 51087 72294 -152391 -157245 -189270 -183429 -342688 -168143 -347711
1092c47711M18820J33728j75282l34291J04691K28199q5764Q9941j02878P6759
$$ -347711 71109 204837 29555 -304736 -200045 28154 -57610 32331 -70547 6212
1082F212K2022j05329O0725M9234j70061J02926j07193j0198J75470N24O1790
$$ 6212 28234 -77095 -16370 32864 -137197 -34271 -141464 -151662 23808 24332 86122
1071H6122L3858K491o5388k5971j46496J62864J19082j81032q6348m9134J24908
$$ 86122 119980 122471 57083 31112 -115384 47480 166562 -14470 -100818 -149952 -25044
1060b5044k5677j96067J62175J6149j7303j31120N574j48233k0976K02966j1560
$$ -25044 -50721 -246788 -84613 -68464 -85767 -216887 -211313 -359546 -380522 -177556 -189116
1049a89116P7851K4832P9078M2714j43416j39327j4987K64389L04773j05923j57613
$$ -189116 -111265 -86433 -7355 35359 -108057 -247384 -262371 2018 306791 200868 43255
1038D3255k9927j62751M4403J11512j12794N0486K22476R9987l52889n6677J59329
$$ 43255 13328 -149423 -105020 6492 -106302 -55816 166660 266647 -86242 -142919 16410
1027A6410o2524o6814j09262m0365J38721K3561L7426k17763k06890J97739R8677
$$ 16410 -46114 -112928 -222190 -262555 -123834 -100273 -62847 -280610 -487500 -289761 -191084
1016a91084J59331k26866r9116L21140j51993P3680J77507j11592j39618O1595
$$ -191084 -31753 -258619 -357735 -36595 -188588 -114908 62599 -48993 -188611 -127016
1006a27016n4856K82614J8262j06328N987j15696L25590m8526j22221j40446R5545
$$ -127016 -181872 100742 119004 12676 18663 -97033 228557 180031 57810 -82636 12909
995A2909M7737R816k26154p5553j01864K6208N7190o3688K67567r6463J24183
$$ 12909 60646 70462 -155692 -231245 -333109 -306901 -249711 -313399 -45832 -142295 -18112
984a8112r247J69352q8476N647j01682j2918J39049j60925j91622P4213L23024
$$ -18112 -27359 141993 53517 59164 -42518 -55436 83613 -77312 -268934 -194721 128303
973A28303m9366j20175r4835p4721J2353K22300O8194j72223o5994K17917Q2096
$$ 128303 78937 -41238 -136073 -210794 -198441 23859 92053 -80170 -146164 71753 153849
962A53849j5433k24137m5557O3121k242m8719K6827R9464j0049n425j04856K80242
$$ 153849 138416 -85721 -131278 -68157 -70399 -119118 -92291 7173 -2876 -8301 -113157 167085
950A67085j19576l71335L46238K8579n9298j10186K7223J74243J13352k89175
$$ 167085 47509 -323826 22412 50991 -8307 -118493 -91270 82973 196325 -92850
940i2850k01848K04709R7343l577l2367p6140j12369O9413J66937M2041o9213
$$ -92850 -294698 -89989 7354 3777 -28590 -104730 -217099 -147686 19251 61292 -7921
929g921J90933p2760k3391M9522Q6140r4067r0045k03851j17142j06733M7917
$$ -7921 183012 110252 86861 136383 222523 128456 38411 -165440 -282582 -389315 -341398
918c41398J1493J41789K07878l4293J44148j60008j19628K53891N253k46489k6778
$$ -341398 -329905 -188116 19762 -14531 129617 -30391 -150019 103872 109125 -137364 -164142
907a64142L95540j06823j53462K5669m1147J23911j4722q9460k6777j00208j19786
$$ -164142 231398 124575 -28887 -3218 -44365 79546 64824 -24636 -51413 -151621 -271407
896b71407K30997R1775O1000K5510n615q3055m0992o2179o939M0649j0708J12255
$$ -271407 -40410 51365 112365 137875 132260 49205 8213 -53966 -60905 -20256 -30964 81291
884H1291q5313j64186k1305J92050j22042j4478L5889N9038J53471k05779o500
$$ 81291 -4022 -168208 -189513 2537 -119505 -133983 -98094 -39056 114415 -91364 -97864
873i7864L1656p3683J51445j7970o4200j07951K9302K42321j07868j24172J66193
$$ -97864 -66208 -139891 11554 -6416 -70616 -178567 -149265 93056 -14812 -138984 27209
862B7209K48081l04373k7953K18432n9971n0715J74213k5844k02866p1443J96375
$$ 27209 275290 -29083 -57036 161396 101425 50710 224923 199079 -3787 -75230 121145
851A21145J27823r3589P4219k4199l88241J63625k2796J53456J56933j79999j41211
$$ 121145 248968 155379 229598 205399 -182842 -19217 -42013 111443 268376 88377 -52834
840e2834j63143J42588J6457N2774k77590K30393p0472L234m2594l137K50711
$$ -52834 -215977 -73389 -56932 -4158 -281748 -51355 -121827 -118593 -161187 -164324 86387
829H6387j13508R2210l33446K06666o0188j7545K57029l3210J55018R2693k11907
$$ 86387 -27121 65089 -268357 -61691 -121879 -139424 117605 84395 239413 332106 120199
818A20199n6115m1414K26953m7248k35943j11492K77K29887j92820m0285K32491
$$ 120199 64084 22670 249623 202375 -33568 -145060 -144783 85104 -107716 -148001 84490
807H4490j85883q2620O4855O3158K06085k67062k02165J48781J05516j0516j12837
$$ 84490 -101393 -184013 -119158 -56000 150085 -116977 -319142 -170361 -64845 -75361 -188198
796a88198j03069J49144k7424k4287M4172J072M120J8027M3485K01768l43268
$$ -188198 -291267 -142123 -169547 -193834 -149662 -148590 -144470 -126443 -82958 118810 -224458
$$ [...]
##END NTUPLES=NMR SPECTRUM
##END=
