##TITLE=1H_CA-8929-4
 DMSO,8 sc, 
 29.9.2021
##JCAMPDX= 6.0         $$ Bruker NMR JCAMP-DX V2.0
##DATA TYPE= NMR SPECTRUM
##DATA CLASS= NTUPLES
##ORIGIN= UXNMR, Bruker Analytische Messtechnik GmbH
##OWNER= root
$$ XWIN-NMR		Version 3.5
$$ Wed Sep 29 11:21:10 2021 Russian Standard Time (UT+4h)  she@DPX200
##.OBSERVE FREQUENCY= 200.1314
##.OBSERVE NUCLEUS= ^1H
##.ACQUISITION MODE= SIMULTANEOUS
##.ACQUISITION SCHEME= undefined
##.AVERAGES= 8
##.DIGITISER RES= 18
##SPECTROMETER/DATA SYSTEM= spect
##.PULSE SEQUENCE= zg30
##.SOLVENT NAME= CDCl3
##.SHIFT REFERENCE= (INTERNAL, CDCl3, 0, 15.4302)
##AUDIT TRAIL= $$ (NUMBER, WHEN, WHO, WHERE, WHAT)
$$ ##TITLE= Audit trail, XWIN-NMR		Version 3.5
$$ ##JCAMPDX= 5.01
$$ ##ORIGIN= Bruker BioSpin GmbH
$$ ##OWNER= she
$$ F:/spectra/data/she/nmr/H-F/1/pdata/1/auditp.txt
$$ ##AUDIT TRAIL=  $$ (NUMBER, WHEN, WHO, WHERE, WHAT)
(   1,<2021-09-29 11:19:29.42 +0400>,<she>,<DPX200>,
      <created by zg, POWCHK disabled, PULCHK disabled
       configuration hash MD5:
       00 E9 B6 7A A2 85 ED C7 34 08 36 98 17 FE 4E 26
       data hash MD5: 16K
       E4 2C A0 2C F4 B4 D6 B6 FD 17 CA 37 FB 77 03 08>)
(   2,<2021-09-29 11:19:53.15 +0400>,<she>,<DPX200>,
      <Start of raw data processing
       efp BC_mod = 2 LB = 0.24 FT_mod = 6 PKNL = 1 PHC0 = -14075.34 PHC1 = 8.000892 SI = 16K 
       data hash MD5: 16K
       3B 92 37 83 EA 3C EB 20 35 7E 1A 35 1C 36 B6 8A>)
(   3,<2021-09-29 11:20:19.48 +0400>,<she>,<DPX200>,
      <pk PHC0 = -13.81998 PHC1 = 16 
       data hash MD5: 16K
       ED 16 3E 1A DA 8E 20 9D 9F B7 51 52 2D 5A B0 0D>)
(   4,<2021-09-29 11:20:22.79 +0400>,<she>,<DPX200>,
      <abs ABSG = 5 
       data hash MD5: 16K
       98 BA BB 09 5B 3C B3 1E 2D 0C FF 86 40 8F 61 2E>)
$$ ##END=
$$ 
$$ hash MD5
$$ 21 73 63 69 0C B4 29 C4 3A 73 47 A9 CD 82 0B 81
##$RELAX= 
##$RELAX= 
##$RELAX= 
##$RELAX= 
##$RELAX= 
##$RELAX= 
$$ Bruker specific parameters
$$ --------------------------
##$DU= <F:/spectra>
##$EXPNO= 1
##$NAME= <H-F>
##$PROCNO= 1
##$TYPE= <nmr>
##$USER= <she>
##$AMP= (0..31)
100 100 100 100 100 100 100 100 100 100 100 100 100 100 100 100 100 100 
100 100 100 100 100 100 100 100 100 100 100 100 100 100 
##$AQSEQ= 0
##$AQ_mod= 1
##$AUNM= <au_zg>
##$AUTOPOS= <>
##$BF1= 200.13
##$BF2= 200.13
##$BF3= 200.13
##$BF4= 200.13
##$BF5= 200.13
##$BF6= 200.13
##$BF7= 200.13
##$BF8= 200.13
##$BYTORDA= 1
##$CFDGTYP= 0
##$CFRGTYP= 5
##$CHEMSTR= <none>
##$CNST= (0..31)
1 1 145 1 1 1 1 1 1 1 1 1 1 1 1 1 1 1 1 1 1 1 1 1 1 1 1 1 1 1 1 1 
##$CPDPRG= <>
##$CPDPRG1= <>
##$CPDPRG2= <>
##$CPDPRG3= <>
##$CPDPRG4= <mlev>
##$CPDPRG5= <mlev>
##$CPDPRG6= <mlev>
##$CPDPRG7= <mlev>
##$CPDPRG8= <mlev>
##$CPDPRGB= <>
##$CPDPRGT= <>
##$D= (0..31)
0 1.2 0 0 0 0 0 0 0 0.06 0 0.03 0 0 0 0 0.0002 0 0 0 0 0 0 0 0 0 0 0 0 
0 0 0 
##$DATE= 1632899968
##$DBL= (0..7)
120 120 120 120 120 120 120 120 
##$DBP= (0..7)
150 150 150 150 150 150 150 150 
##$DBP07= 0
##$DBPNAM0= <>
##$DBPNAM1= <>
##$DBPNAM2= <>
##$DBPNAM3= <>
##$DBPNAM4= <>
##$DBPNAM5= <>
$$ [...]
##$SUBNAM2= <"">
##$SUBNAM3= <"">
##$SUBNAM4= <"">
##$SUBNAM5= <"">
##$SUBNAM6= <"">
##$SUBNAM7= <"">
##$SUBNAM8= <"">
##$SUBNAM9= <"">
##$SW= 16.8808012054999
##$SWIBOX= (0..15)
0 0 2 0 0 0 0 0 0 0 0 0 0 0 0 0 
##$SW_h= 3378.37837837838
##$TD= 16384
##$TD0= 1
##$TE= 0
##$TE2= 300
##$TE3= 300
##$TEG= 300
##$TL= (0..7)
0 120 120 120 120 120 120 120 
##$TP= (0..7)
150 150 150 150 150 150 150 150 
##$TP07= 0
##$TPNAME0= <>
##$TPNAME1= <>
##$TPNAME2= <>
##$TPNAME3= <>
##$TPNAME4= <>
##$TPNAME5= <>
##$TPNAME6= <>
##$TPNAME7= <>
##$TPOAL= (0..7)
0.5 0.5 0.5 0.5 0.5 0.5 0.5 0.5 
##$TPOFFS= (0..7)
0 0 0 0 0 0 0 0 
##$TUNHIN= 0
##$TUNHOUT= 0
##$TUNXOUT= 0
##$USERA1= <user>
##$USERA2= <user>
##$USERA3= <user>
##$USERA4= <user>
##$USERA5= <user>
##$V9= 5
##$VALIST= <valist>
##$VCLIST= <CCCCCCCCCCCCCCC>
##$VD= 0
##$VDLIST= <DDDDDDDDDDDDDDD>
##$VPLIST= <PPPPPPPPPPPPPPP>
##$VTLIST= <TTTTTTTTTTTTTTT>
##$WBST= 1024
##$WBSW= 4
##$XGAIN= (0..3)
0 0 0 0 
##$XL= 0
##$YL= 0
##$YMAX_a= 243762
##$YMIN_a= -420320
##$ZGOPTNS= <>
##$ZL1= 120
##$ZL2= 120
##$ZL3= 120
##$ZL4= 120
##$ABSF1= 15.41991
##$ABSF2= -1.461008
##$ABSG= 5
##$ABSL= 3
##$ALPHA= 0
##$AQORDER= 0
##$ASSFAC= 0
##$ASSFACI= 0
##$ASSFACX= 0
##$ASSWID= 0
##$AUNMP= <proc_1d>
##$AZFE= 0.1
##$AZFW= 0.1
##$BCFW= 0
##$BC_mod= 2
##$BYTORDP= 0
##$COROFFS= 0
##$CY= -3
##$DATMOD= 1
##$DC= 0
##$DFILT= <>
##$DTYPP= 0
##$F1P= 0
##$F2P= 0
##$FCOR= 1
##$FTSIZE= 16384
##$FT_mod= 6
##$GAMMA= 0
##$GB= 0
##$INTBC= 1
##$INTSCL= 0
##$ISEN= 128
##$LB= 0.24
##$LEV0= 0
##$LPBIN= 0
##$MAXI= 10000
##$MC2= 0
##$MEAN= 0
##$ME_mod= 0
##$MI= 1.114404
##$NCOEF= 0
##$NC_proc= -5
##$NLEV= 6
##$NOISF1= 3.799351
##$NOISF2= 2.8
##$NSP= 0
##$NTH_PI= 0
##$NZP= 0
##$OFFSET= 15.43021
##$PC= 1
##$PHC0= -14089.16
##$PHC1= 24.00089
##$PH_mod= 1
##$PKNL= yes
##$PPARMOD= 0
##$PSCAL= 0
##$PSIGN= 0
##$REVERSE= no
##$SF= 200.130001140014
##$SI= 16384
##$SIGF1= 3
##$SIGF2= 2
##$SINO= 5.538805
##$SIOLD= 16384
##$SREGLST= <1H.CDCl3>
##$SSB= 0
##$STSI= 16384
##$STSR= 0
##$SW_p= 3378.37837837838
##$SYMM= 0
##$S_DEV= 0
##$TDeff= 16384
##$TDoff= 0
##$TI= <>
##$TILT= no
##$TM1= 0
##$TM2= 0
##$TOPLEV= 0
##$USERP1= <user>
##$USERP2= <user>
##$USERP3= <user>
##$USERP4= <user>
##$USERP5= <user>
##$WDW= 1
##$XDIM= 16384
##$YMAX_p= 387441177
##$YMIN_p= -179880
$$ End of Bruker specific parameters
$$ ---------------------------------
##NTUPLES= NMR SPECTRUM
##VAR_NAME=  FREQUENCY,     SPECTRUM/REAL,   SPECTRUM/IMAG
##SYMBOL=    X,             R,               I
##VAR_TYPE=  INDEPENDENT,   DEPENDENT,       DEPENDENT
##VAR_FORM=  AFFN,          ASDF,            ASDF
##VAR_DIM=   16384,         16384,           16384
##UNITS=     HZ,            ARBITRARY UNITS, ARBITRARY UNITS
##FACTOR=    0.206212438404345, 1,           1
##FIRST=     3088.04796761049, 0,            0
##LAST=      -290.330410767888, 0,           0
##MIN=       -290.330410767888, -179880,     0
##MAX=       3088.04796761049, 387441177,    0
$$ Real data points
##PAGE= N=1
##DATA TABLE= (X++(R..R)), XYDATA
$$ [...]
$$ plain form
6681 -45413 -45177 7891 18830 19090 19708 20320 -11542 -39815 23213 46414 17442 61078 61954 -11470
6667 -11470 -42719 -28482 9364 -163 64286 53687 14397 -34782 -33000 -22213 -2503 65925
6655 65925 25844 47038 22691 -17803 10674 3085 67945 -2288 -38242 -4113 -18051 1254
6643 1254 -783 5482 -13838 -1438 20786 16965 28446 19117 11539 -21783 -23985 -14017 -7845 -1591
6629 -1591 -4913 10977 -24698 5147 33586 8772 20459 -16838 12327 35977 24590 44428
6617 44428 36293 11105 -7507 -6509 -16822 -26090 20213 28133 -7283 -12454 -49980 -56007 -51459
6604 -51459 -3332 -3793 18810 53845 57471 23915 28600 51274 64621 31675 9401 14364 30541
6591 30541 18567 8032 22612 41287 62696 92207 84228 34002 26265 -3194 577 70298
$$ packed form
6681d5413K36N3068J0939K60O18O12l1862k8273O3028K3201k8972M3636Q76p3424
6667a1470l1249J4237L7846r527O4449j0599l9290m9179J782J0787J9710O8428
6655F5925m0081K1194k4347m0494K8477p589O4860p0233l5954L4129j3938J9305
6643A254k037O265j9320J2400K2224l821J1481r329p578l3322k202R968O172O254
6629a591l322J5890l5675K9845K8439k4814J1687l7297K9165K3650j1387J9838
6617D4428q135k5188j8612R98j0313r268M6303P920l5416n171l7526o027M548
6604e1459M8127m61K2603L5035L626l3556M685K2674J3347l2946k2274M963J6177
6591C0541j1974j0535J4580J8675K1409K9511p979n0226p737k9459L771O9721
$$ plain form
6579 70298 109903 88717 61402 79888 100559 27902 18971 43075 47246 -7072 56009 103191
6567 103191 75309 40860 10775 66052 50289 57789 37767 43112 27716 -2842 61032 87253
6555 87253 97392 121462 58833 48486 38887 124049 70855 50901 133094 76725 50969 64794
6543 64794 49487 10411 56102 25607 -7823 -2307 42922 31261 63583 60396 24206 99784
6531 99784 129497 97558 62023 106393 166414 133978 136533 169289 156166 81892 69408 84489
6519 84489 57784 76007 57444 49506 118488 125275 128924 153404 134082 105330 139963 148709 147887
6506 147887 117256 129733 105444 64613 44359 33827 58091 122827 116055 84052 98813 89561
6494 89561 124229 137080 154271 141280 128772 128720 139983 153729 106459 91164 109830 149878
$$ packed form
6579G0298L9605k1186k7315J8486K0671p2657q931K4104M171n4318O3081M7182
6567A03191k7882l4449l0085N5277j5763P500k0022N345j5396l0558O3874K6221
6555H7253J0139K4070o2629j0347r599Q5162n3194j9954Q2193n6369k5756J3825
6543F4794j5307l9076M5691l0495l3430N516M5229j1661L2322l187l6190P5578
6531I9784K9713l1939l5535M4370O0021l2436K555L2756j3123p4274j2484J5081
6519H4489k6705J8223j8563p938O8982O787L649K4480j9322k8752L4633Q746q22
6506A47887l0631J2477k4289m0831k0254j0532K4264O4736o772l2003J4761r252
6494H9561L4668J2851J7191j2991j2508n2J1263J3746m7270j5295J8666M0048
$$ plain form
6482 149878 144096 151339 151940 113955 142235 129897 160269 162232 186310 204118 214837 223105 220430
6469 220430 186559 144729 182031 193137 181139 208620 190380 172555 198175 194306 212855 231713
6457 231713 167692 201466 225908 186747 203781 157561 140032 199327 190216 190487 219519 227647
6445 227647 236866 234640 215914 230168 239501 226808 276136 254298 236688 257681 269029 215459
6433 215459 210804 280565 254253 265630 213346 257298 346774 349313 372965 337171 341945 382666
6421 382666 357667 383392 396540 359847 359591 408456 424786 407034 452298 437379 472915 450044
6409 450044 413643 431717 390549 432523 474936 465423 506632 526747 491125 393228 368917 398912
6397 398912 433083 441701 437690 479063 478784 453241 444754 462174 480280 485938 466358 442942 433728
$$ packed form
6482A49878n782P243O01l7985K8280j2338L0372J963K4078J7808J0719Q268k675
6469B20430l3871m1830L7302J1106j1998K7481j8240j7825K5620l869J8549J8858
6457B31713o4021L3774K4442l9161J7034m6220j7529N9295r111K71K9032Q128
6445B27647R219k226j8726J4254R333j2693M9328k1838j7610K0993J1348n3570
6433B15459m655O9761k6312J1377n2284M3952Q9476K539K3652l5794M774M0721
6421C82666k4999K5725J3148l6693k56M8865J6330j7752M5264j4919L5536k2871
6409D50044l6401J8074m1168M1974M2413r513M1209K0115l5622r7897k4311K9995
6397C98912L4171Q618m011M1373k79k5543q487J7420J8106N658j9580k3416r214
$$ plain form
6384 433728 454543 491011 494650 474385 463926 459094 464524 535889 523722 549563 614097 614678 640503
6371 640503 562720 570651 564539 529100 534171 597893 626664 626957 612727 614626 596365 592037 623583
6358 623583 609212 596309 596564 542562 524982 556137 471179 412010 423954 469734 419284 448104
6346 448104 425637 390892 379198 395274 381441 360722 363627 391787 397286 393422 420313 383308
6334 383308 342523 377858 411377 352504 336662 357111 387313 319473 296409 320898 321812 348499
6322 348499 317634 252011 269766 281752 285836 263911 294600 316892 259538 289910 321344 325277
6310 325277 328285 289902 310304 287465 263954 312265 289430 293800 296830 246617 284677 331513
6298 331513 275259 217198 271028 316293 316158 367601 345180 286135 336961 352155 405370 408281
$$ packed form
6384D33728K0815L6468L639k0265j0459m832N430P1365j2167K5841O4534N81K5825
6371F40503p7783P931o112l5439N071O3722K8771K93j4230J899j8261m328L1546
6358F23583j4371j2903K55n4002j7580L1155q4958n9169J1944M5780n0450K8820
6346D48104k2467l4745j1694J6076j3833k0719K905K8160N499l864K6891l7005
6334C83308m0785L5335L3519n8873j5842K0449L0202o7840k3064K4489R14K6687
6322C48499l0865o5623J7755J1986M084k1925L0689K2292n7354L0372L1434L933
6310C25277L008l8383K0402k2839k3511M8311k2835M370L030n0213L8060M6836
6298C31513n6254n8061N3830M5265j35N1443k2421n9045N0826J5194N3215K911
$$ plain form
6286 408281 339561 336162 334808 348011 334029 342768 393021 372451 391023 452494 491402 483264
6274 483264 418636 429603 411493 399554 374926 399484 415338 411394 387005 418988 397260 445466
6262 445466 437227 391314 424785 477280 456564 466992 490628 452354 467015 559183 564765 536873
6250 536873 548131 518277 542018 581684 570164 510706 598096 587509 654215 677765 669549 633793
6238 633793 662101 726790 733153 696322 667743 708027 735739 717491 725227 756189 786085 774437
6226 774437 793298 801721 832225 919139 898835 940948 970933 968113 842936 822570 883528 836935
6214 836935 836818 890992 914594 896722 896471 869439 869084 829863 832871 907464 850461 748730 753848
6201 753848 778329 801971 781934 782147 758202 714794 762722 722221 711259 726892 730833 694188
$$ packed form
6286D08281o8720l399j354J3203j3982Q739N0253k0570J8572O1471L8908q138
6274D83264o4628J0967j8110j1939k4628K4558J5854l944k4389L1983k1728M8206
6262D45466q239m5913L3471N2495k0716J0428K3636l8274J4661R2168N582k7892
6250E36873J1258k9854K3741L9666j1520n9458Q7390j0587O6706K3550q216l5756
6238F33793K8308O4689O363l6831k8579M0284K7712j8248P736L0962K9896j1648
6226G74437J8861Q423L0504Q6914k0304M2113K9985k820j25177k0366O0958m6593
6214H36935j17N4174K3602j7872k51k7032l55l9221L008P4593n7003j01731N118
6201G53848K4481K3642k0037K13k3945m3408M7928m0501j0962J5633L941l6645
$$ plain form
6189 694188 726031 685979 667496 694846 721233 663764 652833 672961 632155 657921 599898 598978
6177 598978 577231 535301 542841 593308 525325 505895 486515 470559 457556 412905 387810 373388
6165 373388 412152 435184 417324 416079 404336 416522 401721 422813 460895 432185 395422 408239
6153 408239 425559 397111 356863 383472 386733 400746 394945 389203 382003 388025 386528 416734 458605
6140 458605 416889 407108 340972 314881 335505 333657 370414 314374 342746 343773 300444 342682
6128 342682 306509 364632 354035 303690 290062 332105 311583 368169 384657 395081 372585 396421
6116 396421 458169 439481 481244 441448 402979 387043 313643 295888 336149 324062 300369 312130
6104 312130 337157 358213 354158 335720 318081 339315 378140 398907 385487 388573 366218 377835
$$ packed form
6189F94188L1843m0052j8483K7350K6387n7469j0931K0128m0806K5766n8023r20
6177E98978k1747m1930P540N0467o7983j9430j9380j5956j3003m4651k5095j4422
6165C73388L8764K3032j7860j245j1743J2186j4801K1092L8082k8710l6763J2817
6153D08239J7320k8448m0248K6609L261J4013n801n742p200O022j497L0206M1871
6140D58605m1716r781o6136k6091K0624j848L6757n6040K8372J027m3329M2238
6128C42682l6173N8123j0597n0345j3628M2043k0522N6586J6488J0424k2496K3836
6116C96421O1748j8688M1763l9796l8469j5936p3400j7755M0261j2087k3693J1761
6104C12130K5027K1056m055j8438j7639K1234L8825K0767j3420L086k2355J1617
$$ plain form
6092 377835 414129 402707 437567 414638 333207 374317 419375 455431 416143 350005 325092 343817
6080 343817 375466 379080 327678 354230 352244 349507 407520 435288 408842 369098 376188 473151
6068 473151 473305 466438 396233 402431 385022 358387 362663 296555 364616 334248 300923 313828 348604
6055 348604 372861 373767 328259 404446 415330 391270 400735 384519 382622 360911 377896 431319
6043 431319 404517 440624 420713 434504 397778 372533 357096 395735 372783 408835 426712 352161
6031 352161 367165 430463 479123 432032 426170 398795 367310 357276 358480 382006 389811 440064
6019 440064 464795 490497 487890 482027 512795 509096 504657 470684 489558 503810 481525 510373
6007 510373 512008 500714 520930 498051 502070 552538 571511 623116 590967 598842 585275 549780
$$ packed form
6092C77835L6294j1422L4860k2929q1431M1110M5058L6056l9288o6138k4913J8725
6080C43817L1649L614n1402K6552j986k737N8013K7768k6446l9744P090R6963
6068D73151J54o867p0205O198j7409k6635M276o6108O8061l0368l3325J2905L4776
6055C48604K4257R06m5508P6187J0884k4060R465j6216j897k1711J6985N3423
6043D31319k6802L6107j9911J3791l6726k5245j5437L8639k2952L6052J7877p4551
6031C52161J5004O3298M8660m7091n862k7375l1485j0034J204K3526P805N0253
6019D40064K4731K5702k607n863L0768l699m439l3973J8874J4252k2285K8848
6007E10373J635j1294K0216k2879M019N0468J8973N1605l2149P875j3567l5495
$$ plain form
5995 549780 511083 512674 564957 591130 664550 661632 659793 605947 639803 683203 711455 700202
5983 700202 708783 705443 716493 767107 771681 790789 788327 785195 840004 836758 851748 836921 798226
5970 798226 759851 747139 726930 695749 771987 747477 726346 692630 710987 727608 713231 726969
5958 726969 759073 759246 731305 725177 731823 758266 738311 796080 827508 861443 852789 829185 815660
5945 815660 875293 902368 899999 943525 910044 930184 905729 892032 951925 989762 915144 856370
5933 856370 873480 926865 1014291 1066487 1019835 1012796 1034462 1058815 1107993 1118440 1149464 1173941
5921 1173941 1210995 1299698 1353781 1401597 1479100 1487841 1526537 1551445 1639381 1781071 1858758
5910 1858758 1973043 2067215 2194500 2302409 2418395 2544489 2642626 2805446 2853428 2977077
$$ packed form
5995E49780l8697J591N2283K6173P3420k918j839n3846L3856M3400K8252j1253
5983G00202Q581l340J1050N0614M574J9108k462l132N4809l246J4990j4827l8695
5970G98226l8375j2712k0209l1181P6238k4510k1131l3716J8357J6621j4377J3738
5958G26969L2104J73k7941o128O646K6443j9955N7769L1428L3935q654k3604j3525
5945H15660N9633K7075k369M3526l3481K0140k4455j3697N9893L7837p4618n8774
5933H56370J7110N3385Q7426N2196m6652p039K1666K4353M9178J0447L1024K4477
5921A173941L7054Q8703N4083M7816P7503Q741L8696K4908Q7936J41690P7687
5910A858758J14285R4172J27285J07909J15986J26094R8137J62820M7982J23649
$$ plain form
5900 2977077 3129125 3227672 3284939 3255995 3214724 3158004 2976803 2789093 2620714 2420555
5890 2420555 2236954 2108856 1946962 1839934 1760890 1613660 1507469 1466146 1412129 1352816
5880 1352816 1282683 1247272 1184225 1169460 1242075 1154944 1056187 1047657 1031735 1012766 1021654 974982
5868 974982 976912 972881 977240 1002034 937194 911474 906525 941027 997157 950106 826014 766891
5856 766891 846810 830508 767897 768056 771118 772798 718000 758239 827417 767905 687124 688008 735238
5843 735238 702316 720055 717196 704823 724079 723538 719906 700841 693182 720314 758681 740125 727848
5830 727848 702843 680329 712627 740744 700713 654166 676681 647293 657660 644627 628130 682857
5818 682857 674166 668793 645484 620871 610019 611711 622069 565721 570380 607362 631250 579606
$$ packed form
5900B977077J52048R8547N7267k8944m1271n6720j81201j87710j68379k00159
5890B420555j83601j28098j61894j07028p9044j47230j06191m1323n4017n9313
5880A352816p0133l5411o3047j4765P2615q7131r8757q530j5922j8969Q888m6672
5868I74982J930m031M359K4794o4840k5720m949L4502N6130m7051j24092n9123
5856G66891P9919j6302o2611J59L062J680n4798M0239O9178n9512q0781Q84M7230
5843G35238l2922J7739k859j2373J9256n41l632j9065p659K7132L8367j8556j2277
5830G27848k5005k2514L2298K8117m0031m6547K2515k9388J0367j3033j6497N4727
5818F82857q691n373k3309k4613j0852J692J0358n6348M659L6982K3888n1644
$$ plain form
5806 579606 616087 641626 617883 630378 663975 605789 602438 588905 577804 627450 553580 512437
5794 512437 478416 554980 610134 563712 617540 626099 589935 596395 591896 632878 587482 541081
5782 541081 576613 599303 612338 588683 630450 628084 622393 636313 627430 614409 645384 642994
5770 642994 591005 603497 660233 747975 690399 678601 711632 708531 692920 644250 630507 646856
5758 646856 650722 621375 616634 634263 616366 639135 645592 658006 708121 664810 671445 714574
5746 714574 720962 678210 636688 663986 640067 640909 645012 627488 620560 628863 661485 680100 705211
5733 705211 737932 681480 642296 622917 610429 676423 647033 636374 685318 729912 738196 675566
5721 675566 697312 723146 717698 738962 786336 682196 692934 729124 614194 697045 722669
$$ packed form
5806E79606L6481K5539k3743J2495L3597n8186l351j3533j1101M9646p3870m1143
5794E12437l4021P6564N5154m6422N3828Q559l6164O460m499M0982m5396m6401
5782E41081L5532K2690J3035k3655M1767k366n691J3920q883j3021L0975k390
5770F42994n1989J2492N6736Q7742n7576j1798L3031l101j5611m8670j3743J6349
5758F46856L866k9347m741J7629j7897K2769O457J2414N0115m3311O635M3129
5746G14574O388m2752m1522K7298k3919Q42M103j7524o928Q303L2622J8615K5111
5733G05211L2721n6452l9184j9379j2488O5994k9390j0659M8944M4594Q284o2630
5721F75566K1746K5834n448K1264M7374j04140J0738L6190j14930Q2851K5624
$$ plain form
5710 722669 691845 706276 672859 688993 674093 653082 688401 665756 654845 732987 740349 706380
5698 706380 729100 713538 728839 759856 724200 765762 766284 815025 789318 762435 767722 763131
5686 763131 787362 815862 819413 778128 721009 708808 757849 740141 783678 768774 766061 793111
5674 793111 802490 735657 683178 702011 739120 737535 800087 819348 804829 818939 816723 800300
5662 800300 763396 810831 805651 786259 739040 790607 792620 843200 854737 818925 786072 798252
5650 798252 842860 843415 863137 865679 853867 799165 782873 766702 790195 813430 861474 818898
5638 818898 795102 820716 827368 849280 897014 872093 858516 818214 800875 862271 870358 856470
5626 856470 841116 813089 838249 877950 830926 845858 872732 880755 863998 858204 817296 839089
$$ packed form
5710G22669l0824J4431l3417J6134j4900k1011L5319k2645j0911P8142P362l3969
5698G06380K2720j5562J5301L1017l5656M1562N22M8741k5707k6883N287m591
5686G63131K4231K8500L551m1285n7119j2201M9041j7708M3537j4904k713K7050
5674G93111R379o6833n2479J8833L7109j585O2552J9261j4519J4110k216j6423
5662H00300l6904M7435n180j9392m7219N1567K013N0580J1537l5812l2853J2180
5650G98252M4608N55J9722K542j1812n4702j6292j6171K3493K3235M8044m2576
5638H18898k3796K5614O652K1912M7734k4921j3577m0302j7339O1396Q087j3888
5626H56470j5354k8027K5160L9701m7024J4932K6874Q023j6757n794m0908K1793
$$ plain form
5614 839089 817616 844618 888516 869965 886966 876766 847936 832572 888857 914364 913048 884376
5602 884376 883769 875885 921143 925955 935638 938786 982489 980064 926223 906074 938998 967899 944038
5589 944038 976640 1040673 1053596 1020128 1038473 1066914 1043747 1010190 1012830 1038707 1020955 1059986
5577 1059986 983005 935704 1020836 1028662 998712 1060746 1059747 1032927 1101865 1063707 1031465 1012952
5565 1012952 1049811 1061773 1000639 1045020 1090162 1119628 1113490 1068637 1064107 1120502 1061660 1075263
5553 1075263 1140354 1163408 1110228 1043775 1062094 1049593 1097984 1097014 1094932 1056769 1109036 1112989
5541 1112989 1129796 1089173 1086700 1073326 1076995 1083408 1043950 1073082 1127254 1120021 1117192 1116551 1113074
5528 1113074 1123552 1091031 1122278 1064580 1115285 1182692 1165824 1146290 1114636 1162974 1193685
$$ packed form
5614H39089k1473K7002M3898j8551J7001j0200k8830j5364N6285K5507j316k8672
5602H84376o07p884M5258M812R683L148M3703k425n3841k0149L2924K8901k3861
5589I44038L2602O4033J2923l3468J8345K8441k3167l3557K640K5877j7752L9031
5577A059986p6981m7301Q5132P826k9950O2034r99k6820O8938l8158l2242j8513
5565A012952L6859J1962o1134M4381M5142K9466o138m4853m530N6395n8842J3603
5553A075263O5091K3054n3180o6453J8319j2501M8391r70k082l8163N2267L953
5541A112989J6807m0623k473j3374L669O413l9458K9132N4172p233k829o41l477
5528A113074J0478l2521L1247n7698N0705O7407j6868j9534l1654M8338L0711
$$ plain form
5517 1193685 1208799 1215704 1257979 1255791 1203225 1215006 1193680 1169744 1156478 1201398 1239355 1250880
5505 1250880 1202229 1201224 1215721 1244689 1237404 1217066 1219997 1298222 1315255 1253164 1318343 1355367
5493 1355367 1369740 1342895 1314407 1313922 1313038 1354585 1354577 1335197 1321227 1298504 1291923 1270677 1355489
5480 1355489 1343028 1321123 1305977 1314775 1328451 1331832 1360910 1344587 1319045 1347828 1390883 1393634
5468 1393634 1375492 1390518 1347728 1355604 1377065 1342813 1375656 1403498 1434780 1430761 1464988 1487243
5456 1487243 1410173 1355854 1381927 1419205 1454604 1441395 1437587 1480196 1474300 1487741 1524581 1489676
5444 1489676 1514363 1561414 1561024 1526617 1581062 1607193 1543042 1567500 1568532 1545813 1526535 1533581
5432 1533581 1549297 1562054 1525963 1521286 1580329 1611685 1563923 1562067 1561581 1559250 1566656 1549979 1564173
$$ packed form
5517A193685J5114O905M2275k188n2566J1781k1326k3936j3266M4920L7957J1525
5505A250880m8651j005J4497K8968p285k0338K931P8225J7033o2091O5179L7024
5493A355367J4373k6845k8488m85q84M1547qj9380j3970k2723o581k1246Q4812
5480A355489j2461k1905j5146Q798J3676L381K9078j6323k5542K8783M3055K751
5468A393634j8142J5026m2790P876K1461l4252L2843K7842L1282m019L4227K2255
5456A487243p7070n4319K6073L7278L5399j3209l808M2609n896J3441L6840l4905
5444A489676K4687M7051l90l4407N4445K6131o4151K4458J032k2719j9278P046
5432A533581J5716J2757l6091m677N9043L1356m7762j856m86k331P406j6677J4194
$$ plain form
5419 1564173 1592781 1649388 1668743 1645456 1642211 1666788 1678348 1647093 1701630 1715482 1667158 1690568
5407 1690568 1694012 1734107 1681009 1728788 1783496 1826473 1850248 1834446 1771776 1737072 1718666 1746868
5395 1746868 1778332 1785488 1828894 1823494 1842374 1882294 1893377 1875569 1904458 1815701 1797484 1865905
5383 1865905 1879865 1916671 1913966 1880688 1879078 1905494 1858959 1879980 1866284 1872300 1927228 1884867
5371 1884867 1958965 2005343 1977116 1945141 1973681 1983670 1970031 2044458 2089205 2088822 2088771 2070970 2121630
5358 2121630 2172438 2203756 2197030 2184080 2239580 2187517 2169648 2235222 2260244 2309402 2307581 2344447
5346 2344447 2370139 2353073 2424501 2453244 2430682 2405538 2423833 2443697 2439707 2410514 2393964 2340632
5334 2340632 2329846 2331501 2319697 2309038 2329527 2381193 2343743 2332453 2310688 2342480 2337434 2314620
$$ packed form
5419A564173K8608N6607J9355k3287l245K4577J1560l1255N4537J3852m8324K3410
5407A690568L444M0095n3098M7779N4708M2977K3775j5802o2670l4704j8406K8202
5395A746868L1464P156M3406n400J8880L9920J1083j7808K8889q8757j8217O8421
5383A865905J3960L6806k705l3278j610K6416m6535K1021j3696O016N4928m2361
5371A884867P4098M6378k8227l1975K8540R989j3639P4427M4747l83n1j7801N0660
5358B121630N0808L1318o726j2950N5500n2063j7869O5574K5022M9158j821L6866
5346B344447K5692j7066P1428K8743k2562k5144J8295J9864l990k9193j6550n3332
5334B340632j0786J655j1804j0659K0489N1666l7450j1290k1765L1792n046k2814
$$ plain form
5322 2314620 2352901 2350616 2365518 2463181 2425621 2355077 2387788 2380700 2381191 2419813 2450954 2452477
5310 2452477 2468023 2480443 2465411 2451381 2458933 2463705 2468247 2484443 2525775 2523129 2499444 2485585
5298 2485585 2515319 2473796 2474960 2525958 2552868 2617738 2671068 2626634 2596541 2630158 2666498 2641136
5286 2641136 2639176 2662249 2694748 2698829 2704044 2708087 2674284 2658940 2689148 2711314 2740180 2728282
5274 2728282 2728351 2722955 2714716 2778361 2838090 2852900 2836246 2758379 2766582 2853525 2924127 2896279 2875596
5261 2875596 2891677 2873986 2918469 2911681 2921934 2913447 2961735 2946595 2950322 2943533 2998271 2957674
5249 2957674 2925468 3033995 3119090 3162126 3160837 3098242 3084515 3152336 3233016 3218529 3173603
5238 3173603 3183549 3244183 3265744 3270353 3273467 3333526 3318534 3339191 3345031 3312470 3328224 3382656
$$ packed form
5322B314620L8281k285J4902R7663l7560p0544L2711p088M91L8622L1141J523
5310B452477J5546J2420j5032j4030P552M772M542J6196M1332k646k3685j3859
5298B485585K9734m1523J164N0998K6910O4870N3330m4434l0093L3617L6340k5362
5286B641136j960K3073L2499M081N215M043l3803j5344L0208K2166K8866j1898
5274B728282O9n396q239O3645N9729J4810j6654p7867Q203Q6943P0602k7848k0683
5261B875596J6081j7691M4483o788J0253q487M8288j5140L727o789N4738m0597
5249B957674l2206J08527Q5095M3036j289o2595j3727O7821Q0680j4487m4926
5238C173603R946O0634K1561M609L114O0059j4992K0657N840l2561J5754N4432
$$ plain form
5226 3382656 3397576 3387700 3444049 3436368 3412637 3429011 3394916 3439339 3451656 3468541 3483163 3495800
5214 3495800 3525129 3539456 3542215 3529471 3593617 3665397 3626834 3683033 3693233 3658387 3682369 3679344
5202 3679344 3709371 3742954 3807598 3751840 3754055 3823343 3860478 3827779 3895503 3932121 3934931 3925924
5190 3925924 3949649 3967585 3956844 4028940 4086058 4017037 4020819 4082013 4062831 4079008 4120273 4091679
5178 4091679 4163608 4179776 4228911 4235785 4244700 4268009 4279236 4364612 4369334 4350518 4365256 4407961
5166 4407961 4468547 4480244 4485373 4459104 4487280 4514419 4526021 4487174 4522545 4557207 4579370 4676302
5154 4676302 4710510 4761139 4762437 4771405 4782827 4767504 4813730 4851397 4884543 4944634 4969922 4974642
5142 4974642 4931533 4923431 4997219 5063659 5091796 5124461 5197305 5168127 5189994 5219057 5205483 5255464
$$ packed form
5226C382656J4920r876N6349p681k3731J6374l4095M4423J2317J6885J4622J2637
5214C495800K9329J4327K759j2744O4146P1780l8563N6199J0200l4846K3982l025
5202C679344L0027L3583O4644n5758K215O9288L7135l2699O7724L6618K810r007
5190C925924K3725J7936j0741P2096N7118o9021L782O1194j9182J6177M1265k8594
5178D091679P1929J6168M9135O874Q915K3309J1227Q5376M722j8816J4738M2705
5166D407961O0586J1697N129k6269K8176K7139J1602l8847L5371L4662K2163R6932
5154D676302L4208N0629J298Q968J1422j5323M6226L7667L3146O0091K5288M720
5142D974642m3109q102P3788O6440K8137L2665P2844k9178K1867K9063j3574M9981
$$ plain form
5130 5255464 5322067 5370918 5411961 5384008 5433833 5496417 5477167 5521771 5565879 5622938 5632480 5636532
5118 5636532 5668192 5646266 5682369 5748757 5798209 5823960 5867662 5917568 5887542 5938934 5935586 5978676
5106 5978676 6078779 6141288 6154656 6161249 6166682 6180645 6241184 6243094 6324470 6330261 6299047 6386775
5094 6386775 6445275 6450490 6515890 6588376 6576479 6613610 6668278 6683145 6712062 6779371 6797643 6852056
5082 6852056 6918129 6973923 6976968 6993061 7032276 7093540 7069000 7147217 7233737 7274147 7284151 7287049
5070 7287049 7344822 7394065 7422366 7478501 7541297 7600076 7525720 7586224 7623423 7655353 7691285
5059 7691285 7716692 7799120 7826911 7935418 7992860 8033643 8026402 8141386 8180159 8223677 8314619
5048 8314619 8344079 8367467 8367507 8455573 8489395 8571290 8623464 8694986 8753601 8790814 8842261 8920604
$$ packed form
5130E255464O6603M8851M1043k7953M9825O2584j9250M4604M4108N7059R542M052
5118E636532L1660k1926L6103O6388M9452K5751M3702M9906l0026N1392l348M3090
5106E978676J00103O2509J3368O593N433J3963O0539J910Q1376N791l1214Q7728
5094F386775N8500N215O5400P2486j1897L7131N4668J4867K8917O7309J8272N4413
5082F852056O6073N5794L045J6093L9215O1264k4540P8217Q6520M0410J0004K898
5070G287049N7773M9243K8301N6135O2796N8779p4356O0504L7199L1930L5932
5059G691285K5407Q2428K7791J08507N7442M0783p241J14984L8773M3518R0942
5048H314619K9460K3388M0Q8066L3822Q1895N2174P1522N8615L7213N1447P8343
$$ plain form
5036 8920604 9033463 9109915 9185743 9219142 9207842 9234276 9262474 9273790 9376507 9436286 9444977
5025 9444977 9509603 9646507 9704499 9787214 9845953 9853065 9881647 9918404 9983326 10076863 10119321
5014 10119321 10195560 10284580 10398646 10484735 10506089 10526489 10548256 10616705 10708017 10803410 10820819
5003 10820819 10904488 11022040 11039898 11050824 11126261 11265577 11317729 11401576 11459306 11540576 11627761
4992 11627761 11652824 11715972 11792210 11890539 12026556 12070114 12124693 12154833 12226427 12325455 12372722
4981 12372722 12491315 12583241 12667050 12740893 12742771 12839188 13001615 13098309 13074416 13119448 13266641
4970 13266641 13342250 13404999 13461368 13466427 13586917 13683931 13746654 13849095 14027985 14104174 14166431
4959 14166431 14250006 14349524 14450205 14504643 14605578 14719646 14815790 14892738 14973171 15043551 15108095
$$ packed form
5036H920604J12859P6452P5828L3399j1300K6434K8198J1316J02717N9779Q691
5025I444977O4626J36904N7992Q2715N8739P112K8582L6757O4922R3537M2458
5014A0119321P6239Q9020J14066Q6089K1354K0400K1767O8449R1312R5393J7409
5003A0820819Q3669J17552J7858J0926P5437J39316N2152Q3847N7730Q1270Q7185
4992A1627761K5063O3148P6238R8329J36017M3558N4579L0140P1594R9028M7267
4981A2372722J18593R1926Q3809P3843J878R6417J62427R6694k3893M5032J47193
4970A3266641P5609O2749N6369N059J20490R7014O2723J02441J78890P6189O2257
4959A4166431Q3575R9518J00681N4438J00935J14068R6144P6948Q0433P0380O4544
$$ plain form
4948 15108095 15138296 15233374 15351434 15422459 15514031 15623092 15686204 15803165 15959220 16037951
4938 16037951 16095807 16170876 16201494 16239791 16325713 16424100 16518572 16653790 16763124 16865915 16973302
4927 16973302 17047246 17080172 17167264 17225964 17344213 17433728 17618902 17698716 17744100 17800186 17902124
4916 17902124 18044937 18088365 18144077 18229217 18325066 18371634 18457456 18595626 18685556 18744139 18842246
4905 18842246 18949613 19021057 19084879 19169144 19240686 19273563 19327885 19422639 19486280 19539181 19682293
4894 19682293 19770837 19781805 19883453 19996583 20043967 20077662 20107741 20235146 20306325 20337050 20417208
4883 20417208 20490426 20552075 20614925 20664509 20711284 20803206 20866445 20947824 21022017 21029023 21131934
4872 21131934 21170250 21207149 21278376 21337478 21354132 21415131 21485693 21508547 21528216 21527410 21608817 21612563
$$ packed form
4948A5108095L0201R5078J18060P1025R1572J09061O3112J16961J56055P8731
4938A6037951N7856P5069L0618L8297Q5922R8387R4472J35218J09334J02791J07387
4927A6973302P3944L2926Q7092N8700J18249Q9515J85174P9814M5384N6086J01938
4916A7902124J42813M3428N5712Q5140R5849M6568Q5822J38170Q9930N8583R8107
4905A8842246J07367P1444O3822Q4265P1542L2877N4322R4754O3641N2901J43112
4894A9682293Q8544J0968J01648J13130M7384L3695L0079J27405P1179L0725Q0158
4883B0417208P3218O1649O2850M9584M6775R1922O3239Q1379P4193P006J02911
4872B1131934L8316L6899P1227N9102J6654O0999P0562K2854J9669q06Q1407L746
$$ plain form
4860 21612563 21625868 21657397 21705616 21759117 21824661 21843034 21859842 21828436 21846757 21931602 22006616
4849 22006616 22025131 22041836 22033630 22035597 21997056 21999582 21988076 21994564 22023550 22011059 21952170 21969856
4837 21969856 21992495 22049328 22077331 22059717 22073014 22068293 22013230 21996947 22024716 21956417 21960895 21955792
4825 21955792 21902934 21933471 21898000 21790747 21814845 21777674 21753444 21767952 21762671 21692058 21634126
4814 21634126 21596730 21531234 21513886 21504349 21480660 21388762 21341130 21312686 21275061 21217515 21212033 21090520
4802 21090520 20994620 20989372 20876026 20800801 20731559 20729720 20675015 20580420 20528242 20468180 20398346
4791 20398346 20339580 20248613 20185968 20218823 20170365 20071488 20031868 19959794 19879201 19868491 19817307
4780 19817307 19666302 19641204 19605033 19451058 19353906 19245082 19147148 19053120 18998894 18916084 18817590
$$ packed form
4860B1612563J3305L1529M8219N3501O5544J8373J6808l1406J8321Q4845P5014
4849B2006616J8515J6705q206J967l8541K526j1506O488K8986j2491n8889J7686
4837B1969856K2639N6833K8003j7614J3297m721n5063j6283K7769o8299M478n103
4825B1955792n2858L0537l5471j07253K4098l7171k4230J4508n281p0613n7932
4814B1634126l7396o5496j7348r537k3689r1898m7632k8444l7625n7546n482j21513
4802B1090520r5900n248j13346p5225o9242j839n4705r4595n2178o0062o9834
4791B0398346n8766r0967o2645L2855m8458r8877l9620p2074q0593j0710n1184
4780A9817307j51005k5098l6171j53975r7152j08824r7934r4028n4226q2810r8494
$$ plain form
4769 18817590 18745270 18655946 18560294 18455430 18308165 18284512 18202209 18120639 17990968 17896583 17826755
4758 17826755 17752260 17735904 17645870 17601850 17516660 17441115 17272944 17199554 17148049 17117086 17008328
4747 17008328 16918940 16842825 16791504 16676911 16577240 16459034 16325873 16219575 16180475 16112142
4737 16112142 15983856 15829399 15712219 15641832 15578038 15487800 15381005 15279352 15202723 15137513
4727 15137513 15056120 14946890 14861654 14769272 14696178 14631373 14584789 14571424 14477319 14314801 14215150
4716 14215150 14102012 14020567 13974229 13873076 13872773 13776269 13682489 13600058 13495158 13434998 13391720
4705 13391720 13313971 13219249 13071670 13035811 12978449 12898015 12829643 12767631 12699587 12621548 12574346
4694 12574346 12500351 12400272 12335053 12271370 12157628 12094580 12024961 11920469 11934851 11910817 11822708
$$ packed form
4769A8817590p2320q9324r5652j04864j47265k3653q2303q1570j29671r4385o9828
4758A7826755p4495j6356r0034m4020q5190p5545j68171p3390n1505l0963j08758
4747A7008328q9388p6115n1321j14593r9671j18206j33161j06298l9100o8333
4737A6112142j28286j54457j17180p0387o3794r0238j06795j01653p6629o5210
4727A5137513q1393j09230q5236r2382p3094o4805m6584j3365r4105j62518r9651
4716A4215150j13138q1445m6338j01153l03r6504r3780q2431j04900o0160m3278
4705A3391720p7749r4722j47579l5859n7362q0434o8372o2012o8044p8039m7202
4694A2574346p3995j00079o5219o3683j13742o3048o9619j04492J4382k4034q8109
$$ plain form
4683 11822708 11741132 11636029 11571682 11511506 11349810 11331427 11286248 11218779 11134458 11055667 11032314
4672 11032314 10970655 10911825 10862273 10828372 10690271 10629323 10584665 10513718 10484769 10441312 10425863
4661 10425863 10384321 10330075 10195666 10161349 10114277 10041508 9993513 9917266 9886177 9841502 9831689
4650 9831689 9802694 9703789 9639550 9615785 9569184 9513908 9462019 9339997 9307029 9330616 9269054
4639 9269054 9237076 9191193 9151095 9147789 9065816 9004411 8947792 8910136 8867044 8764823 8771146 8768732
4627 8768732 8712102 8651276 8648622 8584603 8570993 8507631 8443450 8410208 8317466 8251410 8259178 8281162
4615 8281162 8224971 8204564 8179182 8166290 8161752 8090832 8048248 8060598 7987480 7972948 7879197 7815536
4603 7815536 7793910 7753592 7801824 7798419 7684379 7665008 7677179 7651345 7617132 7580911 7558955
$$ packed form
4683A1822708q1576j05103o4347o0176j61696j8383m5179o7469q4321p8791k3353
4672A1032314o1659n8830m9552l3901j38101o0948m4658p0947k8949m3457j5449
4661A0425863m1542n4246j34409l4317m7072p2769m7995p6247l1089m4675r813
4650I831689k8995r8905o4239k3765m6601n5276n1889j22022l2968K3587o1562
4639I269054l1978m5883m0098l306q1973o1405n6619l7656m3092j02221O323k414
4627H768732n6630o0826k654o4019j3610o3362o4181l3242r2742o6056P768K1984
4615H281162n6191k0407k5382j2892m538p0920m2584J2350p3118j4532r3751o3661
4603G815536k1626m0318M8232l405j14040j9371J2171k5834l4213l6221k1956
$$ plain form
4592 7558955 7531336 7488923 7448240 7485751 7415495 7384104 7373539 7367117 7334480 7289400 7198584 7168079
4580 7168079 7175555 7127820 7092396 7167400 7119412 7051097 7007761 6960858 6966052 6905803 6903849 6898925
4568 6898925 6890110 6841926 6733492 6736228 6640508 6630148 6588965 6559862 6502386 6485689 6499615 6412381
4556 6412381 6389330 6347367 6284952 6289327 6240238 6180938 6148473 6072574 6084166 6060800 6015373 5989513
4544 5989513 5950046 5935601 5921201 5902369 5827528 5761422 5782422 5783019 5793372 5697557 5624545 5584974
4532 5584974 5574339 5527087 5479758 5476839 5430562 5423213 5386289 5351630 5295990 5258858 5273656 5229871
4520 5229871 5191622 5147678 5146570 5121390 5060838 4991426 4992921 5002830 4986847 4929998 4907014 4889898
4508 4889898 4896763 4926617 4889942 4847475 4811819 4828986 4838228 4803697 4758498 4665026 4667873 4700503
$$ packed form
4592G558955k7619m2413m0683L7511p0256l1391j0565o422l2637m5080r0816l0505
4580G168079P476m7735l5424P5004m7988o8315m3336m6903N194o0249j954m924
4568F898925q815m8184j08434K736r5720j0360m1183k9103n7476j6697J3926q7234
4556F412381k3051m1963o2415M375m9089n9300l2465p5899J1592k3366m5427k5860
4544E989513l9467j4445j4400j8832p4841o6106K1000N97J0353r5815p3012l9571
4532E584974j0635m7252m7329k919m6277p349l6924l4659n5640l7132J4798m3785
4520E229871l8249m3944j108k5180o0552o9412J495R909j5983n6849k2984j7116
4508D889898O865K9854l6675m2467l5656J7167R242l4531m5199r3472K847L2630
$$ plain form
4496 4700503 4704678 4622034 4626515 4646165 4596562 4563493 4498806 4494382 4456885 4438973 4420986 4423099
4484 4423099 4427731 4391130 4367328 4312526 4316565 4310094 4325818 4309264 4282480 4295315 4299369 4334713
4472 4334713 4285638 4226655 4203435 4187366 4215744 4170696 4106916 4113129 4082549 4035938 4069020 4049894
4460 4049894 4019640 4051629 4113019 4093847 4053703 4017774 3960265 3952961 3974333 3981823 3970720 3921047
4448 3921047 3929133 3961382 3901527 3895263 3844973 3817737 3875858 3861559 3844129 3867776 3904314 3879361
4436 3879361 3904160 3931807 3861820 3862965 3867159 3896009 3950368 3976811 3957405 3950441 3913608 3914788
4424 3914788 3928967 3936248 3952795 4017898 4055743 4006328 4043769 4105674 4097923 4138668 4163293 4203183
4412 4203183 4237033 4236461 4220406 4217825 4157483 4208863 4266915 4269967 4277055 4265020 4257986 4263600 4294780
$$ packed form
4496D700503M175q2644M481J9650m9603l3069o4687m424l7497j7912j7987K113
4484D423099M632l6601k3802n4802M039o471J5724j6554k6784J2835M054L5344
4472D334713m9075n8983k3220j6069K8378m5048o3780O213l0580m6611L3082j9126
4460D049894l0254L1989O1390j9172m0144l5929n7509p304K1372P490j1103m9673
4448C921047Q086L2249n9855o264n0290k7236N8121j4299j7430K3647L6538k4953
4436C879361K4799K7647o9987J145M194K8850N4359K6443j9406o964l6833J180
4424C914788J4179P281J6547O5103L7845m9415L7441O1905p751M0745K4625L9890
4412D203183L3850n72j6055k581o0342N1380N8052L052P088j2035p034N614L1180
$$ plain form
4399 4294780 4357940 4333934 4288998 4282990 4266874 4292215 4282807 4230199 4194956 4166210 4110314 4044176
4387 4044176 4072536 4021103 3925552 3885742 3881704 3881086 3822838 3819510 3776483 3780072 3786870 3714867 3663110
4374 3663110 3627857 3602256 3572307 3551332 3509941 3479399 3496278 3482942 3497841 3371102 3409624
4363 3409624 3430677 3343278 3324749 3316278 3260624 3269129 3297892 3277470 3304056 3314843 3302992 3275476
4351 3275476 3218251 3219464 3190173 3151175 3174913 3151972 3184757 3174981 3150648 3186266 3196208 3156280
4339 3156280 3144935 3120254 3090861 3107417 3086025 3064707 3032432 3046213 3006514 3012055 3021673 3009216
4327 3009216 3032601 3071910 3062612 3044925 3058381 3052480 3022989 2970417 2984165 3024739 2989388 2943275
4315 2943275 2963120 2974744 3015508 2969686 2951930 3000052 3053659 3032843 3055330 3035421 3017377
$$ packed form
4399D294780O3160k4006m4936o008j6116K5341r408n2608l5243k8746n5896o6138
4387D044176K8360n1433r5551l9810m038o18n8248l328m3027L589O798p2003n1757
4374C663110l5253k5601k9949k0975m1391l0542J6879j3336J4899j26739L8522
4363C409624K1053q7399j8529q471n5654Q505K8763k0422K6586J0787j1851k7516
4351C275476n7225J213k9291l8998K3738k2941L2785r776k4333L5618R942l9928
4339C156280j1345k4681k9393J6556k1392k1318l2275J3781l9699N541R618j2457
4327C009216K3385L9309r298j7687J3456n901k9491n2572J3748M0574l5351m6113
4315B943275J9845J1624M0764m5822j7756M8122N3607k0816K2487j9909j8044
$$ plain form
4304 3017377 3069020 3066225 3062945 3051901 3080827 3119682 3088614 3028616 3046620 3065416 3082753 3134965
4292 3134965 3135001 3180926 3134218 3212504 3235789 3205590 3244575 3291400 3299658 3319223 3310179 3269955
4280 3269955 3302139 3301630 3319333 3367150 3368787 3366490 3423290 3429141 3492317 3493705 3548766 3519221 3462145
4267 3462145 3516064 3589721 3616436 3654266 3625837 3684435 3763651 3762935 3809665 3831231 3867369 3907689
4255 3907689 3896071 3953316 3963154 3991543 4066853 4064719 4068841 4112582 4127644 4106939 4164115 4221058
4243 4221058 4257633 4317922 4365819 4359076 4359545 4431188 4530910 4561388 4646461 4630344 4746392 4813461
4231 4813461 4858848 4912230 4959741 4999713 4977663 5047957 5123047 5182256 5194072 5196318 5284364 5271597
4219 5271597 5211520 5243654 5251275 5259695 5277738 5269772 5247204 5220583 5176937 5144520 5096709 5104626
$$ packed form
4304C017377N1643k795l280j1044K8926L8855l1068n9998J8004J8796J7337N2212
4292C134965L6M5925m6708P8286K3285l0199L8985M6825Q258J9565r044m0224
4280C269955L2184n09J7703M7817J637k297N6800N851O3176J388N5061k9545n7076
4267C462145N3919P3657K6715L7830k8429N8598P9216p16M6730K1566L6138M0320
4255C907689j1618N7245R838K8389P5310k134M122M3741J5062k0705N7176N6943
4243D221058L6575O0289M7897o743M69P1643R9722L0478Q5073j6117J16048O7069
4231D813461M5387N3382M7511L9972k2050P0294P5090N9209J1816K246Q8046j2767
4219E271597o0077L2134P621Q420J8043p966k2568k6621m3646l2417m7811P917
$$ plain form
4207 5104626 5095095 5057516 4990353 4917347 4940918 4974319 4983558 4982328 4975457 4933834 4908526 4926324
4195 4926324 4871505 4899701 4876065 4866110 4841371 4790286 4811628 4854463 4893982 4853846 4827047 4843197
4183 4843197 4867759 4892366 4902404 4924559 4931714 4964693 4962313 4986620 4918715 4918548 4952334 5010576
4171 5010576 5075589 5105201 5148463 5226778 5300099 5348511 5361669 5374243 5411806 5491195 5601403
4160 5601403 5665054 5698081 5745535 5825183 5855136 5883068 6003682 6177340 6293627 6341603 6454493
4149 6454493 6500180 6623809 6738534 6799070 6862953 6988357 7224511 7326680 7481581 7669666
4139 7669666 7821278 7960566 8137897 8283053 8445167 8602291 8811409 8976349 9174913 9347049
4129 9347049 9517033 9706769 9893590 10061382 10187091 10376160 10583250 10726279 10856367 10946385
$$ packed form
4207E104626r531l7579o7163p3006K3571L3401R239j230o871m1623k5308J7798
4195D926324n4819K8196k3636r955k4739n1085K1342M2835L9519m0136k6799J6150
4183D843197K4562K4607J0038K2155P155L2979k380K4307o7905j67L3786N8242
4171E010576O5013K9612M3262P8315P3321M8412J3158J2574L7563P9389J10208
4160E601403O3651L3027M7454P9648K9953K7932J20614J73658J16287M7976J12890
4149F454493M5687J23629J14725O0536O3883J25404K36154J02169J54901J88085
4139G669666J51612J39288J77331J45156J62114J57124K09118J64940J98564J72136
4129I347049J69984J89736J86821J67792J25709J89069K07090J43029J30088R0018
$$ plain form
4119 10946385 11053100 11137516 11187532 11172351 11133800 11033812 10986291 10923578 10800660 10662490 10623382
4108 10623382 10563325 10509851 10513456 10452402 10484888 10468100 10495472 10564324 10602447 10674823 10715195
4097 10715195 10816605 10888035 10977058 11064853 11198614 11304059 11364655 11468534 11580593 11694871
4087 11694871 11848873 11967396 12065580 12170640 12215790 12284347 12360736 12485037 12544115 12566397
4077 12566397 12572558 12523142 12489269 12446863 12362689 12237695 12134777 12021356 11870118 11707959
4067 11707959 11532661 11387942 11213181 10984454 10803515 10581504 10390257 10156550 9965828
4058 9965828 9809325 9579384 9400377 9199522 9026638 8913954 8751077 8579655 8449079 8215838
4048 8215838 8036055 7877230 7736133 7565745 7403958 7249681 7160291 6984246 6847414 6760788
$$ packed form
4119A0946385J06715Q4416N0016j5181l8551r9988m7521o2713j22918j38170l9108
4108A0623382o0057n3474L605o1054L2486j6788K7372O8852L8123P2376M0372
4097A0715195J01410P1430Q9023Q7795J33761J05445O0596J03879J12059J14278
4087A1694871J54002J18523R8184J05060M5150O8557P6389J24301N9078K2282
4077A2566397O161m9416l3873m2406q4174j24994j02918j13421j51238j62159
4067A1707959j75298j44719j74761k28727j80939k22011j91247k33707j90722
4058I965828j56503k29941j79007k00855j72884j12684j62877j71422j30576k33241
4048H215838j79783j58825j41097j70388j61787j54277q9390j76045j36832q6626
$$ plain form
4038 6760788 6674483 6515165 6384397 6221568 6162699 6055079 5907879 5827567 5716298 5597462
4028 5597462 5554283 5495274 5408853 5347901 5215307 5122021 5103040 5035245 4968988 4877858 4811189
4017 4811189 4823847 4791257 4658753 4560685 4487664 4409705 4335012 4254613 4277173 4243971 4193180
4006 4193180 4073329 4039544 4054756 4055653 3959734 3869952 3844997 3819170 3780089 3728780 3705022 3666512
3994 3666512 3657786 3613003 3556907 3518820 3485647 3461359 3424830 3380074 3355404 3347740 3336530 3315797
3982 3315797 3328489 3237857 3181264 3153745 3130488 3099276 3038262 2996149 3061512 3094140 3021439
3971 3021439 2942289 2902218 2958263 2844404 2827503 2855657 2852873 2830365 2849886 2860993 2878418
3960 2878418 2827023 2749722 2733006 2699855 2705760 2741555 2713056 2738575 2706518 2700146 2702462 2599105
$$ packed form
4038F760788q6305j59318j30768j62829n8869j07620j47200q0312j11269j18836
4028E597462m3179n9009q6421o0952j32594r3286j8981o7795o6257r1130o6669
4017D811189J2658l2590j32504r8068p3021p7959p4693q0399K2560l3202n0791
4006D193180j19851l3785J5212Q97r5919q9782k4955k5827l9081n1309k3758l8510
3994C666512q726m4783n6096l8087l3173k4288l6529m4756k4670p664j1210k0733
3982C315797J2692r0632n6593k7519k3257l1212o1014m2113O5363L2628p2701
3971C021439p9150m0071N6045j13859j6901K8154k784k2508J9521J1107J7425
3960B878418n1395p7301j6716l3151N905L5795k8499K5519l2057o372K316j03357
$$ plain form
3948 2599105 2604075 2619053 2618789 2602864 2599202 2643247 2652406 2677529 2669213 2728703 2668743 2636938 2639822
3935 2639822 2593398 2662465 2644449 2622739 2634713 2597639 2633502 2657611 2628089 2655016 2690695
3924 2690695 2717817 2740968 2742880 2767699 2736856 2791150 2791562 2770539 2837244 2846266 2843671 2862921
3912 2862921 2829613 2850467 2902060 2948224 3017896 3012134 3067895 3120132 3150821 3176151 3154176 3243622
3900 3243622 3374283 3455469 3500987 3555941 3635056 3656194 3687550 3784733 3950191 3972706 4048394
3889 4048394 4127913 4274249 4421194 4588985 4811170 5021140 5149822 5353982 5614722 5877281
3879 5877281 6133903 6410172 6681729 6983430 7350469 7723017 8162444 8633551 9102458 9521682
3869 9521682 9969528 10404763 10847653 11315656 11774447 12195834 12682287 13144054 13580296 13974941
$$ packed form
3948B599105M970J4978k64j5925l662M4045R159K5123q316N9490n9960l1805K884
3935B639822m6424O9067j8016k1710J1974l7074L5863K4109k9522K6927L5679
3924B690695K7122K3151J912K4819l0843N4294M12k1023O6705R022k595J9250
3912B862921l3308K0854N1593M6164O9672n762N5761N2237L0689K5330k1975Q9446
3900C243622J30661Q1186M5518N4954P9115K1138L1356R7183J65458K2515P5688
3889D048394P9519J46336J46945J67791K22185K09970J28682K04160K60740K62559
3879E877281K56622K76269K71557L01701L67039L72548M39427M71107M68907M19224
3869I521682M47846M35235M42890M68003M58791M21387M86453M61767M36242L94645
$$ plain form
3859 13974941 14248596 14513096 14790953 15015335 15188645 15360463 15529729 15636776 15621679 15563185
3849 15563185 15386794 15150773 14824119 14510579 14147991 13760095 13410011 13045207 12599834
3840 12599834 12163777 11717942 11213067 10677543 10228998 9790485 9293256 8836970 8426963
3831 8426963 7942968 7494022 7147119 6753588 6336048 6003895 5685303 5341688 5153335 4921175
3821 4921175 4722103 4456083 4300404 4205495 4021133 3889675 3790228 3696822 3595433 3497619
3811 3497619 3407376 3297633 3180191 3143392 3083845 2932337 2897479 2809423 2750205 2701652 2659286
3800 2659286 2584818 2502857 2510340 2492860 2465800 2424077 2366523 2371832 2348262 2334837 2336619 2263265
3788 2263265 2258177 2258422 2297556 2286598 2215126 2165500 2122061 2133091 2109292 2088520 2094472 2106836
$$ packed form
3859A3974941K73655K64500K77857K24382J73310J71818J69266J07047j5097n8494
3849A5563185j76391k36021l26654l13540l62588l87896l50084l64804m45373
3840A2599834m36057m45835n04875n35524m48545m38513m97229m56286m10007
3831H426963m83995m48946l46903l93531m17540l32153l18592l43615j88353k32160
3821D921175j99072k66020j55679r4909j84362j31458r9447r3406j01389r7814
3811C497619r0243j09743j17442l6799n9547j51508l4858q8056n9218m8553m2366
3800B659286p4468q1961P483j7480k7060m1723n7554N309k3570j3425J782p3354
3788B263265n088K45L9134j0958p1472m9626m3439J1030k3799k0772N952J2364
$$ plain form
3776 2106836 2141253 2073437 2085816 2116858 2113240 2076437 2069704 2075011 2104260 2125282 2126200 2128292 2143048
3763 2143048 2172805 2239132 2290783 2310015 2362821 2385430 2498423 2603163 2675116 2697401 2854880
3752 2854880 2914125 3045779 3223432 3295072 3321419 3333669 3372131 3327062 3255474 3138424 2971489
3741 2971489 2799655 2674835 2556309 2435101 2322042 2207251 2184845 2118496 2091725 2036531
3731 2036531 1997105 1955989 1856125 1823869 1806988 1793595 1850087 1897016 1835728 1798442 1749212
3720 1749212 1755757 1753422 1703153 1656968 1686829 1626787 1602669 1589359 1564012 1521611 1499851 1534969
3708 1534969 1525104 1495313 1539629 1512610 1438878 1490850 1557143 1558831 1502363 1479190 1465538 1487496
3696 1487496 1499336 1451291 1385999 1412413 1456202 1455849 1402785 1387776 1427144 1429390 1399066 1358874
$$ packed form
3776B106836L4417o7816J2379L1042l618l6803o733N307K9249K1022R18K092J4756
3763B143048K9757O6327N1651J9232N2806K2609J12993J04740P1953K2285J57479
3752B854880N9245J31654J77653P1640K6347J2250L8462m5069p1588j17050j66935
3741B971489j71834j24820j18526j21208j13059j14791k2406o6349k6771n5194
3731B036531l9426m1116r9864l2256j6881j3393N6492M6929o1288l7286m9230
3720A749212O545k335n0269m6185K9861o0042k4118j3310k5347m2401k1760L5118
3708A534969r865k9791M4316k7019p3732N1972O6293J688n6468k3173j3652K1958
3696A487496J1840m8045o5292K6414M3789l53n3064j5009L9368K246l0324m0192
$$ plain form
3684 1358874 1355141 1379389 1388039 1396490 1367872 1331232 1373918 1355229 1412035 1428161 1452046 1472945
3672 1472945 1481613 1501829 1497702 1521173 1502130 1465268 1533029 1570510 1582335 1561208 1562043 1568504
3660 1568504 1595473 1662479 1656414 1631607 1644711 1673572 1694945 1676142 1642083 1664263 1674865 1683309
3648 1683309 1711954 1716787 1676057 1649866 1664696 1698420 1728633 1689372 1695731 1722715 1701565 1665145
3636 1665145 1598517 1623871 1645273 1621688 1636854 1577483 1577145 1642946 1635421 1619509 1658251 1691976
3624 1691976 1702441 1790860 1846748 1901715 1996346 2067754 2126496 2197695 2243420 2262898 2243962
3613 2243962 2343757 2386204 2422725 2417922 2428680 2514242 2525778 2562398 2586971 2603526 2651485 2667041
3601 2667041 2726884 2764207 2817998 2835921 2855032 2919121 2926257 2900734 2928553 2971253 3057658 3124249
$$ packed form
3684A358874l733K4248Q650Q451k8618l6640M2686j8689N6806J6126K3885K0899
3672A472945Q668K0216m127K3471j9043l6862O7761L7481J1825k1127Q35O461
3660A568504K6969O7006o065k4807J3104K8861K1373j8803l4059K2180J0602Q444
3648A683309K8645M833m0730k6191J4830L3724L0213l9261O359K6984k1150l6420
3636A665145o6628K5354K1402k3585J5166n9371l38O5801p525j5912L8742L3725
3624A691976J0465Q8419N5888N4967R4631P1408N8742P1199M5725J9478j8936
3613B243962R9795M2447L6521m803J0758Q5562J1536L6620K4573J6555M7959J5556
3601B667041N9843L7323N3791J7923J9111O4089P136k5523K7819M2700Q6405O6591
$$ plain form
3589 3124249 3142189 3175120 3203710 3231595 3295679 3338286 3352716 3409588 3455998 3491953 3526547
3578 3526547 3568779 3548982 3612074 3694281 3705957 3679213 3705165 3778394 3800993 3850784 3851569 3880395
3566 3880395 3963592 4043982 4043720 4077935 4170945 4169917 4202768 4246373 4266716 4379675 4496608 4581163
3554 4581163 4713942 4801987 4913836 5002583 5121224 5267291 5383216 5534983 5732790 5893363
3544 5893363 6039165 6223796 6361855 6463741 6635160 6802860 6935938 7108349 7250843 7444511
3534 7444511 7613424 7764025 7963412 8110437 8301060 8500914 8706311 8940429 9193661 9474085
3524 9474085 9749712 10071585 10413711 10754699 11077696 11392085 11683079 11983019 12301102 12588325
3514 12588325 12889162 13197148 13543810 13847813 14166456 14452511 14734462 15077151 15490382
$$ packed form
3589C124249J7940L2931K8590K7885O4084M2607J4430N6872M6410L5955L4594
3578C526547M2232j9797O3092Q2207J1676k6744K5952P3229K2599M9791P85K8826
3566C880395Q3197Q0390k62L4215R3010j028L2851M3605K0343J12959J16933Q4555
3554D581163J32779Q8045J11849Q8747J18641J46067J15925J51767J97807J60573
3544E893363J45802J84631J38059J01886J71419J67700J33078J72411J42494J93668
3534G444511J68913J50601J99387J47025J90623J99854K05397K34118K53232K80424
3524I474085K75627L21873L42126L40988L22997L14389K90994K99940L18083K87223
3514A2588325L00837L07986L46662L04003L18643K86055K81951L42689M13231
$$ plain form
3505 15490382 15926264 16355169 16821199 17258434 17718131 18215919 18749100 19282680 19813524
3496 19813524 20418059 20984917 21564585 22204978 22815127 23407613 24127824 24841522 25474172
3487 25474172 26300646 27170581 28092352 29072992 30102857 31209177 32317839 33503431 34823800
3478 34823800 36131451 37558341 39152139 40839878 42625622 44511840 46484800 48668021
3470 48668021 51063050 53589445 56310796 59236298 62499355 66023088 70011092 74342744
3462 74342744 79027095 84118456 89636598 95629595 102234150 109666664 118197629 128014575
3454 128014575 139338905 151846518 165196177 179443911 194933282 211817796 230299999
3447 230299999 250535196 272804132 297075149 322425353 347508754 369894437 384949373
$$ packed form
3505A5490382M35882M28905M66030M37235M59697M97788N33181N33580N30844
3496A9813524O04535N66858N79668O40393O10149N92486P20211P13698O32650
3487B5474172Q26474Q69935R21771R80640J029865J106320J108662J185592J320369
3478C4823800J307651J426890J593798J687739J785744J886218J972960K183221
3470D8668021K395029K526395K721351K925502L263057L523733L988004M331652
3462G4342744M684351N091361N518142N992997O604555P432514Q530965R816946
3454A28014575J1324330J2507613J3349659J4247734J5489371J6884514J8482203
3447B30299999K0235197K2268936K4271017K5350204K5083401K2385683J5054936
$$ plain form
3440 384949373 387441177 374824874 349463151 316899614 282297068 249781745 221323376
3433 221323376 197392231 177435464 160698776 146274782 133812937 122952333 113441543
3426 113441543 105142119 97797257 91228040 85411088 80126363 75393937 71085245 67145253
3418 67145253 63492818 60200876 57253610 54514914 52042399 49789548 47730836 45692925
3410 45692925 43817248 42063207 40389166 38830495 37380828 35943378 34601273 33424313
3402 33424313 32336983 31193598 30120048 29074980 28001886 27047562 26217634 25351780 24503110
3393 24503110 23681491 22911992 22158612 21454758 20737775 20043171 19378255 18736540 18146162
3384 18146162 17552264 17044648 16621786 16221929 15851788 15471226 15077819 14744996 14375481
$$ packed form
3440C84949373K491804j2616303k5361723l2563537l4602546l2515323k8458369
3433B21323376k3931145j9956767j6736688j4423994j2461845j0860604r510790
3426A13441543q299424p344862o569217n816952n284725m732426m308692l939992
3418F7145253l652435l291942k947266k738696k472515k252851k058712k037911
3410D5692925j875677j754041j674041j558671j449667j437450j342105j176960
3402C3424313j087330j143385j073550j045068j073094r54324q29928q65854q48670
3393B4503110q21619p69499p53380p03854p16983o94604o64916o41715n90378
3384A8146162n93898n07616m22862l99857l70141l80562l93407l32823l69515
$$ plain form
3375 14375481 14117575 13873934 13637525 13375901 13079236 12789211 12507518 12263147 12026437
3366 12026437 11721108 11484709 11295116 11057947 10834316 10598861 10375612 10175101 9991899
3357 9991899 9658009 9366525 9152458 8912607 8710370 8478930 8248527 8029469 7811067 7605442
3347 7605442 7503059 7330759 7129000 7018653 6876143 6740406 6619207 6524155 6407114 6303002
3337 6303002 6189554 6084034 6014451 5930489 5827191 5710712 5653896 5564440 5482451 5429803 5337848
3326 5337848 5219910 5112395 5011239 4934852 4841315 4736385 4644604 4519860 4389434 4348568
3316 4348568 4323926 4222434 4107072 4001857 3869742 3857919 3814721 3698965 3592713 3508898
3306 3508898 3468415 3416868 3364946 3329971 3303508 3232861 3209431 3154154 3123094 3080302 3055359
$$ packed form
3375A4375481k57906k43641k36409k61624k96665k90025k81693k44371k36710
3366A2026437l05329k36399j89593k37169k23631k35455k23249k00511j83202
3357I991899l33890k91484k14067k39851k02237k31440k30403k19058k18402k05625
3347G605442j02383j72300k01759j10347j42510j35737j21199r5052j17041j04112
3337F303002j13448j05520o9583q3962j03298j16479n6816q9456q1989n2648r1955
3326E337848j17938j07515j01156p6387r3537j04930r1781j24744j30426m0866
3316D348568k4642j01492j15362j05215j32115j1823m3198j15756j06252q3815
3306C508898m0483n1547n1922l4975k6463p0647k3430n5277l1060m2792k4943
$$ plain form
3295 3055359 3025925 2998070 2933666 2876655 2851431 2757124 2719252 2737114 2645536 2615624 2598372
3284 2598372 2568999 2538320 2541715 2523139 2543729 2459696 2437981 2464366 2368412 2335042 2302227 2262489
3272 2262489 2224650 2178427 2203789 2242822 2212540 2157684 2143629 2199391 2231094 2240722 2251683 2311438
3260 2311438 2317799 2311539 2263898 2294519 2295270 2312459 2267338 2189626 2146139 2134637 2099793 1992040
3248 1992040 1968440 1953922 1881602 1802878 1821532 1765695 1713425 1646119 1610970 1678911 1683272 1661263
3236 1661263 1584026 1524961 1516972 1472360 1481063 1469844 1457696 1426225 1419068 1450502 1402740 1325642
3224 1325642 1337718 1334136 1320431 1348021 1342322 1337001 1351374 1315315 1277224 1309558 1261958 1248402
3212 1248402 1268257 1236225 1213007 1228929 1275138 1235568 1183016 1218574 1222554 1277345 1222018 1198421
$$ packed form
3295C055359k9434k7855o4404n7011k5224r4307l7872J7862r1578k9912j7252
3284B598372k9373l0679L395j8576K0590q4033k1715K6385r5954l3370l2815l9738
3272B262489l7839m6223K5362L9033l0282n4856j4055N5762L1703R628J0961N9755
3260B311438O361o260m7641L0621P51J7189m5121p7712m3487j1502l4844j07753
3248A992040k3600j4518p2320p8724J8654n5837n2270o7306l5149O7941M361k2009
3236A661263p7237n9065p989m4612Q703j1219j2148l1471p157L1434m7762p7098
3224A325642J2076l582j3705K7590n699n321J4373l6059l8091L2334m7600j3556
3212A248402J9855l2032k3218J5922M6209l9570n2552L5558L980N4791n5327k3597
$$ plain form
3200 1198421 1153808 1107699 1179382 1230763 1182371 1138218 1118258 1122590 1124562 1070351 1071262 1034560
3188 1034560 1058738 1032917 1012953 1015367 1051352 1007260 923537 935677 959281 953398 983143 1012505
3176 1012505 1041007 1011582 989470 1010145 991831 911244 866787 899678 922704 897734 904199 938948
3164 938948 884201 881448 915391 916823 871722 905014 914610 888320 885229 965871 969634 981763 1026266
3151 1026266 1063945 1103976 1143505 1182956 1222032 1229512 1251979 1337198 1355358 1416175 1537250
3140 1537250 1668337 1809302 1930093 2033263 2090396 2171683 2281366 2359646 2353987 2396168 2376523
3129 2376523 2348781 2308436 2137443 1995841 1805615 1687752 1503142 1396985 1335935 1259446
3119 1259446 1201869 1130835 1072753 1025131 989680 921653 849081 814338 783085 782302 762455 696522
$$ packed form
3200A198421m4613m6109P1683N1381m8392m4153j9960M332J972n4211R11l6702
3188A034560K4178k5821j9964K414L5985m4092q3723J2140K3604n883K9745K9362
3176A012505K8502k9425k2112K0675j8314q0587m4457L2891K3026k4970O465L4749
3164I38948n4747k753L3943J432m5101L3292R596k6290l091Q0642L763J2129M4503
3151A026266L7679M0031L9529L9451L9076P480K2467Q5219J8160O0817J21075
3140A537250J31087J40965J20791J03170N7133Q1287J09683P8280n659M2181j9645
3129B376523k7742m0345j70993j41602j90226j17863j84610j06157o1050p6489
3119A259446n7577p1034n8082m7622l5451o8027p2572l4743l1253p83j9847o5933
$$ plain form
3107 696522 765835 757424 740950 703171 649965 606713 617069 618836 601387 566571 501808 502462
3095 502462 523496 541595 527083 490545 490125 475613 407893 483709 477645 419006 441125 450395
3083 450395 448478 444614 479849 461844 388892 380118 361598 317810 343808 352596 312244 328230
3071 328230 354311 355529 346388 322197 337752 376792 360449 326326 307784 312385 305309 286373
3059 286373 266310 251844 271393 327472 294884 301372 264236 258288 289552 229218 267864 271764
3047 271764 298384 316979 265230 266177 239902 211958 243417 195914 175130 177589 200547 243166
3035 243166 221710 313385 372580 328567 272209 267205 256566 228837 287304 281128 273953 293811
3023 293811 278340 252387 228869 240470 193061 235850 319709 276118 243282 245037 162317 244427
$$ packed form
3107F96522O9313q411j6474l7779n3206m3252J0356J767j7449l4816o4763O54
3095E02462K1034J8099j4512l6538m20j4512o7720P5816o064n8639K2119R270
3083D50395j917l864L5235j8005p2952q774j8520m3788K5998Q788m0352J5986
3071C28230K6081J218r141k4191J5555L9040j6343l4123j8542M601p076j8936
3059B86373k0063j4466J9549N6079l2588O488l7136n948L1264o0334L8646L900
3047B71764K6620J8595n1749R47k6275k7944L1459m7503k0784K459K2958M2619
3035B43166k1456R1675N9195m4013n6358n004j0639k7729N8467o176p175J9858
3023B93811j5471k5953k3518J1601m7409M2789Q3859m3591l2836J755q2720Q2110
$$ plain form
3011 244427 324202 261047 209291 226763 175224 193234 207713 216632 228584 255078 222903 176270
2999 176270 195187 189259 159243 155311 177767 164526 151484 149583 176223 205151 193291 196806
2987 196806 220465 135084 139475 178313 156191 164371 182059 179474 162018 158190 169043 150974
2975 150974 162396 140621 130083 143429 211651 186528 204973 217598 177342 99930 144571 175154
2963 175154 170258 139569 121038 166789 122849 96002 192655 176133 205414 221421 163666 165456
2951 165456 158504 115905 99039 124487 162403 181569 174832 73003 87792 163153 153048 174233
2939 174233 126634 64680 18686 69088 112388 144205 144834 128700 108143 126537 158258 132698
2927 132698 100939 136035 164027 203388 178745 138091 179062 202629 169728 143963 115904 126512
$$ packed form
3011B44427P9775o3155n1756J7472n1539J8010J4479Q919J1952K6494l2175m6633
2999A76270J8917n928l0016l932K2456j3241j3042j901K6640K8928j1860L515
2987A96806K3659q5381M391L8838k2122Q180J7688k585j7456l828J0853j8069
2975A50974J1422k1775j0538J3346O8222k5123J8445J2625m0256p7412M4641L0583
2963A75154m896l0689j8531M5751m3940k6847R6653j6522K9281J6007n7755J790
2951A65456o952m2599j6866K5448L7916J9166o737j01829J4789P5361j0105K1185
2939A74233m7599o1954m5994N0402M3300L1817O29j6134k0557J8394L1721k5560
2927A32698l1759L5096K7992L9361k4643m0654M0971K3567l2901k5765k8059J0608
$$ plain form
2915 126512 108207 102000 188620 250779 205769 136748 114141 120106 219309 223193 133572 119133
2903 119133 163693 179537 172000 149251 201276 229375 183475 198437 174054 199532 263936 255145
2891 255145 233010 228416 265391 296532 352253 331434 318932 354748 390276 400233 374003 376146
2879 376146 380326 419542 432779 483948 485544 530659 569394 580946 540286 456403 441673 417852
2867 417852 492326 461488 369299 369711 330943 280165 304832 311080 298013 294402 278880 263173
2855 263173 237315 214044 147558 164102 152452 186394 194985 218598 202288 211226 232000 177031
2843 177031 161105 177323 120055 140440 136025 88683 102167 82980 137967 133490 137424 141123
2831 141123 110682 118053 147460 130417 132632 193938 168234 152746 111441 113090 101970 166136
$$ packed form
2915A26512j8305o207Q6620O2159m5010o9021k2607N965R9203L884q9621j4439
2903A19133M4560J5844p537k2749N2025K8099m5900J4962k4383K5478O4404q791
2891B55145k2135m594L6975L1141N5721k0819j2502L5816L5528R957k6230K143
2879C76146M180L9216J3237N1169J596M5115L8735J1552m0660q3883j4730k3821
2867D17852P4474l0838r2189M12l8768n0778K4667O248j3067l611j5522j5707
2855B63173k5858k3271o6486J6544j1650L3942Q591K3613j6310Q938K0774n4969
2843A77031j5926J6218n7268K0385m415m7342J3484j9187N4987m477L934L699
2831A41123l0441P371K9407j7043K215O1306k5704j5488m1305J649j1120O4166
$$ plain form
2819 166136 141223 126752 151712 74753 119768 112810 151614 182086 145971 109638 120592 139086
2807 139086 129088 97392 107379 89808 127437 116203 107153 74532 47971 64795 81442 43761
2795 43761 7529 37000 41598 19411 3536 11509 56752 62193 100867 93784 61280 76492 120188
2782 120188 66500 19311 56705 28955 69896 32846 65294 76793 35415 52069 9979 64535
2770 64535 69622 62246 93929 105624 110751 71700 73614 78679 89246 58487 106081 36789 21750
2757 21750 14084 38621 65553 69036 94388 26100 39925 95046 97609 53236 28438 51422
2745 51422 50543 19155 44463 66711 81406 56985 40672 39374 67688 50621 65820 98050
2733 98050 36409 33804 40153 69368 111064 107314 88010 17945 20943 72069 9162 -482 59554
$$ packed form
2819A66136k4913j4471K4960p6959M5015o958L8804L0472l6115l6333J0954J8494
2807A39086r998l1696R987j7571L7629j1234r050l2621k6561J6824J6647l7681
2795D3761l6232K9471M598k2187j5875P973M5243N441L8674p083l2504J5212M3696
2782A20188n3688m7189L7394k7750M0941l7050L2448J1499m1378J6654m2090N4556
2770F4535N087p376L1683J1695N127l9051J914N065J0567l0759M7594o9292j5039
2757B1750p666K4537K6932L483K5352o8288J3825N5121K563m4373k4798K2984
2745E1422q79l1388K5308K2248J4695k4421j6313j298K8314j7067J5199L2230
2733I8050o1641k605O349K9215M1696l750j9304p0065K998N1126o2907r644O0036
$$ plain form
2720 59554 53774 55484 75862 70895 35177 26083 -12036 829 80493 58927 27098 69649 86772
2707 86772 61536 59827 87005 8966 46684 83887 116506 99548 49322 28866 8954 34303
2695 34303 76383 78301 37072 50622 54559 -20744 -6796 -6112 -67004 15065 72358 62438 -3698
2682 -3698 -24782 -33331 1256 -19904 25710 67864 56072 65119 18209 5577 27943 34185 40003
2669 40003 52785 40909 31749 56642 70796 47328 96685 51106 25782 -26806 -18293 14199
2657 14199 -4075 -847 18639 42768 55066 107159 92757 43573 93334 99330 74698 84597
2645 84597 84557 46185 18667 12853 -35692 25612 138968 104156 30801 80251 84566 37995 29691
2632 29691 -376 40987 60187 54613 78182 67987 123946 82244 29472 31154 54590 97246
$$ packed form
2720E9554n780J710K0378m967l5718r094l8119J2865P9664k1566l1829M2551J7123
2707H6772k5236j709K7178p8039L7718L7203L2619j6958n0226k0456j9912K5349
2695C4303M2080J918m1229J3550L937p5303J3948O84o0892Q2069N7293r920o6136
2682c698k1084q549L4587k1160M5614M2154j1792R047m6910j2632K2366O242N818
2669D0003J2782j1876r160K4893J4154k3468M9357m5579k5324n2588Q513L2492
2657A4199j8274L228J9486K4129J2298N2093j4402m9184M9761N996k4632R899
2645H4597m0l8372k7518n814m8545O1304J13356l4812p3355M9450M315m6571q304
2632B9691l0067M1363J9200n574K3569j0195N5959m1702n2772J682K3436M2656
$$ plain form
2620 97246 165637 112382 89543 116721 36913 1326 32799 49434 83678 91412 59698 45688
2608 45688 52497 39864 112030 138484 130970 148249 78134 36108 35683 54345 79023 116795 98954
2595 98954 80564 114331 84308 135562 145100 180815 142669 130589 196000 184762 148372 128685
2583 128685 120081 74225 22687 56690 122676 98205 69592 76673 75749 65120 56920 79591 86675
2570 86675 83927 98655 134956 119819 82838 89770 65198 30549 45057 77629 40249 72013
2558 72013 101207 95974 123215 102908 104562 147169 146019 164450 160018 108214 105815 108199 140057
2545 140057 187450 169543 170200 151459 132199 154873 113242 96323 145330 205417 212613 169687
2533 169687 223987 224395 187319 187734 218276 207895 205550 196265 195540 231025 266921 229827 188321
$$ packed form
2620I7246O8391n3255k2839K7178p9808l5587L1473J6635L4244P734l1714j4010
2608D5688O809j2633P2166K6454p514J7279p0115m2026m25J8662K4678L7772j7841
2595I8954j8390L3767l0023N1254R538L5715l8146j2080O5411j1238l6390j9687
2583A28685q604m5856n1538L4003O5986k4471k8613P081r24j0629q200K2671P084
2570H6675k748J4728L6301j5137l6981O932k4572l4649J4508L2572l7380L1764
2558G2013K9194n233K7241k0307J654M2607j150J8431m432n1804k399K384L1858
2545A40057M7393j7907O57j8741j9260K2674m1631j6919M9007O0087P196m2926
2533A69687N4300M08l7076M15L0542j0381k345r285p25L5485L5896l7094m1506
$$ plain form
2520 188321 142953 128947 141694 228068 290469 215133 235533 233561 210495 197488 186112 208136
2508 208136 151718 159404 168853 153397 151122 140040 149175 185077 221242 175072 155403 150202 150155
2495 150155 152879 106766 156437 144081 182131 186663 180337 238911 272958 257613 288656 319113
2483 319113 327091 336465 401805 408479 379029 366385 316226 288657 285283 307656 316556 366358 297332
2470 297332 288382 303233 291105 298729 306437 284634 243741 280628 302807 290160 297831 267794
2458 267794 270264 258672 287146 237267 240430 343360 345380 395186 332640 354406 412080 396423
2446 396423 496001 545689 540355 548904 515922 558244 542918 462028 400318 380844 389629 326960
2434 326960 291201 301572 280355 250728 275674 258277 234689 240347 242740 192397 136534 143479
$$ packed form
2520A88321m5368j4006J2747Q6374O2401p5336K0400j972k3066j3007j1376K2024
2508B08136n6418P686R449j5456k275j1082R135L5902L6165m6170j9669n201m7
2495A50155K724m6113M9671j2356L8050M532o326N8574L4047j5345L1043L0457
2483C19113P978R374O5340O674k9450j2644n0159k7569l374K2373Q900M9802o9026
2470B97332q950J4851j2128P624P708k1803m0893L6887K2179j2647P671l0037
2458B67794K470j1592K8474m9879L163J02930K020M9806o2546K1766N7674j5657
2446C96423R9578M9688n334Q549l2982M2322j5326q0890o1710j9474Q785o2669
2434C26960l5759J0371k1217k9627K4946j7397k3588N658K393n0343n5863O945
$$ plain form
2422 143479 153279 204836 236476 221985 226162 224434 295536 300915 235304 269597 271129 251477 315180
2409 315180 304711 272471 265825 249976 229274 155932 112137 147726 181644 168336 126724 152513
2397 152513 114235 102255 150266 173796 179349 180225 151032 163420 87906 60658 78389 61634
2385 61634 36909 21163 53008 69102 5475 5608 16407 27508 -24050 -20031 145 23936
2373 23936 9860 3724 40162 24639 28572 37334 78007 73065 31168 -3279 -7875 18425 55550
2360 55550 28813 80617 41802 23109 49126 7533 45446 44428 34548 38864 103840 74226
2348 74226 -45033 -3920 25121 -3284 13748 8264 -44449 -61742 -10441 1506 29239 1631
2336 1631 8149 26311 -57818 -19743 2691 20536 -16311 -18462 -42208 -77449 -42535 29590
$$ packed form
2422A43479R800N1557L1640j4491M177j728P1102N379o5611L4293J532j9652O3703
2409C15180j0469l2240o646j5849k0702p3342m3795L5589L3918j3308m1612K5789
2397A52513l8278j1980M8011K3530N553Q76k9193J2388p5514k7248J7731j6755
2385F1634k4725j5746L1845J6094o3627J33J0799J1101n1558M019K0176K3791
2373B3936j4076o136L6438j5523L933Q762M0673m942m1897l4447m596K6300L7125
2360E5550k6737N1804l8815j8693K6017m1593L7913j018r880M316O4976k9614
2348G4226j19259M1113K9041k8405J7032n484n2713j7293N1301J1947K7733k7608
2336A631O518J8162q4129L8075K2434J7845l6847k151k3746l5241L4914P2125
$$ plain form
2324 29590 12218 -59512 -90693 -87246 -64059 -51303 -9306 15658 9876 46431 48224 14096
2312 14096 -6037 -30840 -21440 -36584 -48194 -69812 -31330 -2094 -25687 41783 33441 24503
2300 24503 4442 -34141 -42576 -10294 -26916 -44145 -19473 -2449 -32985 17623 4774 13442
2288 13442 49207 27371 -6176 -58123 -53354 11108 52110 37104 25154 -55840 -51036 -91785
2276 -91785 -62284 -2454 18512 32356 -48713 29795 51451 9383 -27552 -7312 -15306 -15475
2264 -15475 -39835 -119361 -96631 -24216 -38415 -19280 -30501 -72362 -118049 -61304 -92940 -83760
2252 -83760 9802 33188 -25125 -19610 -10304 -98350 -46641 2318 39541 23682 -19655 10491
2240 10491 23987 871 10617 10940 66196 116576 12048 -17487 58281 14749 19457 2748
$$ packed form
2324B9590j7372p1730l1181L447K3187J2756M1997K4964n782L6555J793l4128
2312A4096k0133k4803R400j5144j1610k1618L8482K9236k3593O7470q342q938
2300B4503k0061l8583q435L2282j6622j7229K4672J7024l0536N0608j2849Q668
2288A3442L5765k1836l3547n1947M769O4462M1002j5006j1950q0994M804m0749
2276i1785K9501N9830K0966J3844q1069P8508K1656m2068l6935K0240p994j69
2264a5475k4360p9526K2730P2415j4199J9135j1221m1861m5687N6745l1636R180
2252h3760R3562K3386n8313N515R306q8046N1709M8959L7223j5859m3337L0146
2240A0491J3496k3116R746L23N5256N0380j04528k9535P5768m3532M708j6709
$$ plain form
2228 2748 -29340 -56781 42484 51690 36735 40644 -26925 -36168 -8570 -36688 -20113 8598 41461
2215 41461 36863 -4830 10094 61040 -12343 -38402 -22752 -10526 -5807 31320 13103 -56054
2203 -56054 -53372 -62912 -51778 -11917 -68131 -20413 58911 39167 33347 37302 20725 5496 -15705
2190 -15705 -20163 36610 16030 -13388 -6599 -53375 -26062 -40283 1281 -26623 -6394 7137
2178 7137 57521 -6632 -52762 -53941 -66540 -18427 34732 24513 -8729 1760 26387 -12392
2166 -12392 -41153 -25522 -76271 -45604 -26863 -33066 -75533 -92466 -101266 -66547 -70699 -66295 -126736
2153 -126736 -80467 -18345 18079 -4820 -26717 -40086 -77726 -94561 -74118 -98189 -91313 -96351
2141 -96351 -86728 -75829 -89450 -60897 -88367 -87954 -65734 -33861 -32805 -48851 -34569 -56446 -20985
$$ packed form
2228B748l2088k7441R9265R206j4955L909o7569r243K7598k8118J6575K8711L2863
2215D1461m598m1693J4924N0946p3383k6059J5650J2226M719L7127j8217o9157
2203e6054K682r540J1134L9861n6214M7718P9324j9744n820L955j6577j5229k1201
2190a5705m458N6773k0580k9418O789m6776K7313j4221M1564k7904K0229J3531
2178G137N0384o4153m6130j179j2599M8113N3159j0219l3242J0489K4627l8779
2166a2392k8761J5631n0749L0667J8741o203m2467j6933q800L4719m152M404o0441
2153a26736M6269O2122L6424k2899k1897j3369l7640j6835K0443k4071O876n038
2141i6351R623J0899j3621K8553k7470M13K2220L1873J056j6046J4282k1877L5461
$$ plain form
2128 -20985 -72263 -101559 -79718 -32635 -6543 23268 -8477 -15757 -37414 -97923 -121599 -115711
2116 -115711 -90645 -145681 -109640 -28349 -24713 -47123 -52910 -64178 -52401 -17025 -42267 -83483
2104 -83483 -58325 -17259 -33033 -11889 -19744 -49485 -76707 -62994 -53801 4830 -2399 -66166
2092 -66166 -90284 -27723 -2772 -51722 -74073 -35556 -73925 -72912 -52400 -35414 -38965 -70503
2080 -70503 -5754 -39302 -58888 -24294 -10926 -6761 26935 -1723 -28690 -33704 -8419 -27912
2068 -27912 5405 40089 -19907 -55312 7253 -47367 -96154 -59488 -59963 -77102 -89381 -57764
2056 -57764 -74844 -62040 -86001 -45775 -48219 -69310 -31286 -15120 -14199 -49161 -1491 2285 -6947
2043 -6947 -7468 -5159 4041 13730 30448 -30351 -50221 -71382 -68450 -63567 -65467 -68030 -106184 -96081
$$ packed form
2128b0985n1278k9296K1841M7083K6092K9811l1745p280k1657o0509k3676N888
2116a15711K5066n5036L6041Q1291L636k2410n787j1268J1777L5376k5242m1216
2104h3483K5158M1066j5774K1144p855k9741k7222J3713R193N8631p229o3767
2092f6166k4118O2561K4951m8950k2351L8517l8369J013K0512J6986l551l1538
2080g0503O4749l3548j9586L4594J3368M165L3696k8658k6967n014K5285j9493
2068b7912L3317L4684n9996l5405O2565n4620m8787L6666m75j7139j2279L1617
2056e7764j7080J2804k3961M0226k444k1091L8024J6166R21l4962M7670L776r232
2043f947n21K309R200R689J6718o0799j9870k1161K932M883j900k563l8154J0103
$$ plain form
2029 -96081 -83457 -35380 -78976 -93578 -11914 45186 -1534 35545 17786 -4038 -13731 -34227
2017 -34227 -96818 -96824 -81966 -53681 -46476 -58736 -81207 -96799 -114646 -116763 -115940 -98619 -60349
2004 -60349 -42216 23407 74795 31084 40899 14514 9690 18623 -48098 -86434 -54179 -44247 -108025
1991 -108025 -87325 -50250 -53484 -56687 -46207 -79396 -47109 -60208 -58147 -96063 -105807 -17502
1979 -17502 -6696 -20504 8319 -7304 -57819 -72687 -99781 -84375 -50019 -37562 -31086 -2264
1967 -2264 43669 12048 -114223 -129271 -112320 -91873 -64486 -92967 -55724 -72976 -83966 -80384
1955 -80384 -73895 -64259 6103 -24420 -47522 -69015 -56188 -5315 39645 -54211 -45846 18707
1943 18707 -23877 -24956 -42808 -48106 -49729 -39896 -41798 -91975 -75317 -34629 -56912 -18781 4174
$$ packed form
2029i6081J2624M8077m3596j4602Q1664N7100m6720L7079j7759k1824r693k0496
2017c4227o2591oJ4858K8285P205j2260k2471j5592j7847k117Q23J7321L8270
2004f0349J8133O5623N1388m3711R815k6385m824Q933o6721l8336L2255R932o3778
1991a08025K0700L7075l234l203J0480l3189L2287j3099K061l7916r744Q8305
1979a7502J0806j3808K8823j5623n0515j4868k7094J5406L4356J2457O476K8822
1967b264M5933l1621j26271j5048J6951K0447K7387k8481L7243j7252j0990L582
1955h0384O489R636P0362l0523k3102k1493J2827N0873M4960r3856Q365O4553
1943A8707m2584j079j7852n298j623R833j902n0177J6658M0688k2283L8131K2955
$$ plain form
1930 4174 15546 26359 -94361 -129387 -76083 -14275 5822 -5498 -26114 -69728 -41460 -12482
1918 -12482 -25696 9870 -4049 -44016 -4789 -35497 5765 -78415 -53247 -18536 -42715 -40793
1906 -40793 -40578 -19236 -7275 -21638 -73278 -73962 -58073 -41113 -87846 -40976 -19391 -8440 -48493
1893 -48493 -55105 9826 -20626 -12712 -83772 -97587 -59842 -65561 -69403 -55600 -2769 -75406 -92272
1880 -92272 -64549 -93350 -102099 -83915 -90700 -58721 -6845 -18016 -27553 -60565 -53176 -50726 -72561
1867 -72561 -36261 -33909 -47427 -40408 -46665 -79104 -51608 -52794 -68071 -54109 -25861 3906 3553
1854 3553 -46866 -38939 -22867 -18157 -21964 -9989 -35636 -54990 -36189 -76587 -53022 -36910 -26875
1841 -26875 -18648 -44560 -18643 -36037 -60368 -42391 -42109 -36631 -43634 -125441 -61449 -449 -54037
$$ packed form
1930D174J1372J0813j20720l5026N3304O1808K0097j1320k0616m3614K8268K8978
1918a2482j3214L5566j3919l9967L9227l0708M1262q4180K5168L4711k4179J922
1906d0793K15K1342J1961j4363n1640o84J5889J6960m6733M6870K1585J0951m0053
1893d8493o612O4931l0452P914p1060j3815L7745n719l842J3803N2831p2637j6866
1880i2272K7723k8801q749J8184o785L1979N1876j1171r537l3012P389K450k1835
1867g2561L6300K352j3518P019o257l2439K7496j186j5277J3962K8248K9767l53
1854C553n0419P927J6072M710l807J1975k5647j9354J8801m0398K3565J6112J0035
1841b6875Q227k5912K5917j7394k4331J7977K82N478p003q1807O3992O1000n3588
$$ plain form
1828 -54037 -49714 -54782 -56 2099 12565 -27031 -12614 -9544 -66238 -73220 -43625 -17512 -1904
1815 -1904 -58395 -118344 -97824 -39378 -7513 -4960 -18252 -11855 -45438 -38851 -9915 -9450 -22081
1802 -22081 -37634 -23734 -29271 -33612 -32206 -30220 39275 -9530 -24610 -26456 -5322 -66726 -47191
1789 -47191 -6985 9205 -59444 -30008 -17000 -70126 -48503 -54383 9416 26270 -31501 -51531
1777 -51531 -53397 -60901 -22790 -36641 -3914 -35557 -9629 -34799 -67036 -85300 -33243 25425
1765 25425 -46581 -73934 -77458 -92264 -34630 -68328 -61526 -38708 -25809 -55547 -39381 -55426
1753 -55426 -84539 -140368 -97593 -43121 -23127 -21081 12806 35023 32861 -7877 11656 7910
1741 7910 -53797 -61309 -3620 -13295 -69895 -55690 -113175 -96712 -117143 -103818 -94542 -136045 -67074
$$ packed form
1828e4037M323n068N4726K155J0466l9596J4417L070n6694o982K9595K6113J5608
1815a904n6491n9949K0520N8446L1865K553j3292O397l3583O587K8936M65j2631
1802b2081j5553J3900n537m341J406J986O9495m8805j5080j846K1134o1404J9535
1789d7191M0206J6190o8649K9436J3008n3126K1623n880O3799J6854n7771k0030
1777e1531j866p504L8111j3851L2727l1643K5928k5170l2237j8264N2057N8668
1765B5425p2006k7353l524j4806N7634l3698O802K2818J2899k9738J6166j6045
1753e5426k9113n5829M2775N4472J9994K046L3887K2217k162m0738J9533l746
1741G910o1707p512N7689r675n6600J4205n7485J6463k0431J3325R276m1503O8971
$$ plain form
1728 -67074 -106584 -126695 -133048 -83233 -31029 -92043 -55571 -28408 -23243 8604 -15938 -70147
1716 -70147 -84432 -158907 -161173 -111086 -104360 -39909 22803 59752 50600 44634 -4314 -17432 21573
1703 21573 -23635 7476 43256 68492 79705 57589 23115 86702 115994 118332 96407 68999
1691 68999 6178 16218 25521 -5515 40957 27080 -2270 -23921 -36802 46811 -6402 -7536
1679 -7536 -14497 14058 66667 -14515 -35555 -18896 -27838 -9954 8042 49683 32505 422
1667 422 -3717 -27347 255 -9033 -35609 -33940 -47661 -59112 -49713 -46205 -30380 -24264 -33166 -77024
1653 -77024 -71747 -53249 -78432 -2980 6357 -40491 -4002 -54713 -58692 -93716 -75499 -92738
1641 -92738 -55537 -58769 -42312 23866 49845 73712 31653 25963 38347 18564 -3008 -21117
$$ packed form
1728f7074l9510k0111o353M9815N2204o1014L6472K7163N165L1847k4542n4209
1716g0147j4285p4475k266N0087O726O4451O2712L6949r152n966m8948j3118L9005
1703B1573m5208L1111L5780K5236J1213k2116l4474O3587K9292K338k1925k7408
1691F8999o2821J0040R303l1036M6472j3877k9350k1651j2881Q3613n3213j134
1679g536o961K8555N2609q1182k1040J6659q942J7884J7996M1641j7178l2083
1667D22m139k3630K7602r288k6576J669j3721j1451R399L508J5825O116q902m3858
1653g7024N277J8498k5183P5452R337m6848L6489n0711l979l5024J8217j7239
1641i2738L7201l232J6457O6178K5979K3867m2059n690J2384j9783k1572j8109
$$ plain form
1629 -21117 -37690 -26960 -35520 -4155 -18752 -34884 -29264 -78127 -71202 -63781 -18186 -27997 -34529
1616 -34529 8100 6354 28544 -3106 17803 76957 37936 23925 29097 -17580 -13228 -31776
1604 -31776 -410 -71593 -49343 -23611 -100202 -70091 -18829 -10505 -18749 -6422 -6483 -31647 14561
1591 14561 42655 -19918 34618 107062 35475 54879 59920 49198 86049 31710 -14626 27227
1579 27227 50139 46648 74358 35136 28353 86811 113572 60942 5868 -27364 6491 42467
1567 42467 48509 39581 40634 19415 30268 29015 13068 -12860 66253 53156 20463 62306 69735
1554 69735 73331 44254 10574 -10191 24093 63102 72019 18808 66183 89293 104651 47010
1542 47010 36236 101013 52229 15850 31700 68114 68693 41007 72175 68210 44001 85170
$$ packed form
1629b1117j6573J0730q560L1365j4597j6132N620m8863O925P421M5595r811o532
1616c4529M2629j746K2190l1650K0909N9154l9021j4011N172m6677M352j8548
1604c1776L1366p1183K2250K5732p6591L0111N1262Q324q244J2327o1k5164M6208
1591A4561K8094o2573N4536P2444p1587J9404N041j0722L6851n4339m6336M1853
1579B7227K2912l491K7710l9222o783N8458K6761n2630n5074l3232L3855L5976
1567D2467O042q928J053k1219J0853j253j5947k5928P9113j3097l2693M1843P429
1554F9735L596k9077l3680k0765L4284L9009Q917n3211M7375K3110J5358n7641
1542D7010j0774O4777m8784l6379J5850L6414N79k7686L1168l965k4209M1169
$$ plain form
1530 85170 71060 47091 73612 90457 78582 102278 89012 82394 88892 116297 178046 201946
1518 201946 142882 150305 154674 172065 178106 142678 184101 191072 158222 148942 190905 203430 186119
1505 186119 205804 203099 207502 203450 264828 249965 235674 239360 269517 323281 325767 261514 294171
1492 294171 310219 331686 384887 358483 365315 363363 424729 394115 461429 525536 427092 433639
1480 433639 476217 416718 488764 503242 512531 513956 531835 591107 645667 664806 652563 692147
1468 692147 739793 743154 780878 798130 862334 902018 882136 842586 886539 925712 980765 1056398
1456 1056398 1081179 1126540 1159032 1170104 1184876 1261548 1282302 1379168 1449486 1478811 1558728
1445 1558728 1594248 1647764 1729187 1877401 1959062 2005091 2022457 2123666 2310346 2474166 2601635
$$ packed form
1530H5170j4110k3969K6521J6845j1875K3696j3266o618O498K7405O1749K3900
1518B01946n9064P423M369J7391O041l5428M1423O971l2850r280M1963J2525j7311
1505A86119J9685k705M403m052O1378j4863j4291L686L0157N3764K486o4253L2657
1492B94171J6048K1467N3201k6404O832j952O1366l0614O7314O4107r8444O547
1480D33639M2578n9499P2046J4478R289J425J7879N9272N4560J9139j2243L9584
1468F92147M7646L361L7724J7252O4204L9684j9882l9550M3953L9173N5053P5633
1456A056398K4781M5361L2492J1072J4772P6672K0754R6866P0318K9325P9917
1445A558728L5520N3516Q1423J48214Q1661M6029J7366J01209J86680J63820J27469
$$ plain form
1434 2601635 2690421 2920198 3096538 3295759 3490165 3713770 4042722 4384781 4654447 5010234
1424 5010234 5381776 5783535 6248673 6737307 7334929 7934297 8576481 9310073 10150398 11060666
1414 11060666 12014319 13070075 14231326 15343858 16467500 17472446 18002111 17921225 17193134
1405 17193134 15930272 14435983 12956953 11578529 10315464 9285181 8486254 7774666
1397 7774666 7189859 6594221 6099162 5685169 5276513 5001597 4765859 4454409 4180595 3897588
1387 3897588 3677389 3511682 3306340 3126668 2957129 2723371 2596997 2541670 2477782 2333962
1377 2333962 2238916 2176168 2063913 2007969 1911896 1867411 1777866 1673015 1591287 1552090 1484892
1366 1484892 1365094 1384521 1337188 1276290 1247420 1195391 1182995 1140694 1127353 1077487 1011868
$$ packed form
1434B601635Q8786K29777J76340J99221J94406K23605L28952L42059K69666L55787
1424E010234L71542M01759M65138M88634N97622N99368O42184P33592Q40325R10268
1414A1060666R53653J055756J161251J112532J123642J004946N29665q0886p28091
1405A7193134j262862j494289j479030j378424j263065j030283p98927p11588
1397G774666n84807n95638m95059m13993m08656k74916k35738l11450k73814k83007
1387C897588k20199j65707k05342j79672j69539k33758j26374n5327o3888j43820
1377B333962r5046o2748j12255n5944r6073m4485q9545j04851q1728l9197o7198
1366A484892j19798J9427m7333o0898k8870n2029j2396m2301j3341m9866o5619
$$ plain form
1355 1011868 1022384 979534 939180 937700 913761 855634 851475 876253 785374 771469 789593 836157
1343 836157 717645 665584 711842 679827 623633 654755 662881 632759 580343 584590 628242 576699
1331 576699 497999 539602 565940 528652 515322 548228 567396 483464 437752 430270 449477 425747
1319 425747 406348 389343 391319 429734 363543 354393 388827 403307 403133 392804 358258 371903
1307 371903 316055 308589 354473 336326 319035 297976 284970 254313 314297 358472 338690 288903
1295 288903 244170 246474 249501 227594 209468 162927 241858 258466 243976 218328 276148 243674
1283 243674 235787 217803 263441 233905 141904 185834 180180 109218 130584 150940 154149 163730
1271 163730 198328 220025 183599 158445 125451 148727 121305 95338 166549 162580 175552 118356
$$ packed form
1355A011868J0516m2850m0354j480k3939n8127m159K4778r0879j3905J8124M6564
1343H36157j18512n2061M6258l2015n6194L1122Q126l0122n2416M247M3652n1543
1331E76699p8700M1603K6338l7288j3330L2906J9168q3932m5712p482J9207k3730
1319D25747j9399j7005J976L8415o6191r150L4434J4480j74j0329l4546J3645
1307C71903n5848p466M5884j8147j7291k1059j3006l0657N9984M4175j9782m9787
1295B88903m4733K304L027k1907j8126m6541P8931J6608j4490k5648N7820l2474
1283B43674p887j7984M5638k9536r2001M3930n654p0962K1366K0356L209R581
1271A63730L4598K1697l6426k5154l2994K3276k7422k5967P1211l969J2972n7196
$$ plain form
1259 118356 119061 162002 186756 220151 196119 165327 80906 101791 154323 143110 136824 132782
1247 132782 143944 155019 137810 108063 89851 139618 109656 195437 154234 119554 119984 128907
1235 128907 115256 104762 116767 104728 99350 100450 141333 150414 111257 68101 44760 87330
1223 87330 60760 27251 63445 104979 93288 39719 43801 69836 111111 129817 107135 116854
1211 116854 79016 90787 95360 80261 60834 88668 95640 57457 96262 81637 61486 85460
1199 85460 96735 96897 129982 116575 74924 42392 86703 96750 32954 51632 96511 69192
1187 69192 90770 139559 107371 49084 20588 86564 88561 60262 91634 120567 115534 46161
1175 46161 22023 67072 121969 49417 49597 93422 85747 91778 78532 63907 54068 94401 129786
$$ packed form
1259A18356P05M2941K4754L3395k4032l0792q4421K0885N2532j1213o286m042
1247A32782J1162J1075j7209k9747j8212M9767k9962Q5781m1203l4680M30Q923
1235A28907j3651j0494J2005j2039n378J100M0883R081l9157m3156k3341M2570
1223H7330k6570l3509L6194M1534j1691n3569M082K6035M1275J8706k2682R719
1211A16854l7838J1771M573j5099j9427K7834O972l8183L8805j4625k0151K3974
1199H5460J1275J62L3085j3407m1651l2532M4311J0047o3796J8678M4879k7319
1187F9192K1578M8789l2188n8287k8496O5976J997k8299L1372K8933n033o9373
1175D6161k4138M5049N4897p2552J80M3825p675O031j3246j4625r839M0333L5385
$$ plain form
1162 129786 77707 36554 53758 86958 112980 127833 139023 111682 61514 36499 32598 88657
1150 88657 23127 -38256 -35961 -593 34653 55982 36582 3240 11675 17559 -13857 1960
1138 1960 38064 22673 55947 90959 45671 20674 47449 40258 66259 63131 36402 62526
1126 62526 84528 89736 107990 82672 77548 134353 108379 79399 82713 85516 111725 85276 111885
1113 111885 58616 31915 84728 117449 80831 59997 80313 100239 90488 80362 57062 113571
1101 113571 125024 66087 44370 24015 25643 -34894 -31751 38800 29975 25668 9238 14451 21664
1088 21664 -18046 26450 13386 14556 25749 -10765 -9234 18124 52581 71029 11232 -34047
1076 -34047 -19375 11026 11357 757 26250 3960 -35504 -14717 13728 12988 44511 31319 -4032
$$ packed form
1162A29786n2079m1153J7204L3200K6022J4853J1190k7341n0168k5015l901N6059
1150H8657o5530o1383K295L5368L5246K1329j9400l3342Q435N884l1416J5817
1138A960L6104j5391L3274L5012m5288k4997K6775p191K6001l128k6729K6124
1126F2526K2002N208J8254k5318n124N6805k5974k8980L314K803K6209k6449K6609
1113A11885n3269k6701N2813L2721l6618k0834K0316J9926r751j0126k3300N6509
1101A13571J1453n8937k1717k0355J628o0537L143P0551q825m307j6430N213P213
1088B1664l9710M4496j3064J170J1193l6514J531K7358L4457J8448n9797m5279
1076c4047J4672L0401L31j0600K5493k2290l9464K0787K8445p40L1523j3192l5351
$$ plain form
1063 -4032 38879 21256 -25043 -32906 -16976 -13628 -12806 -36415 -38608 -71583 -2636 52850 11257
1050 11257 -44725 35766 57473 15514 11871 8250 80487 137380 120006 69699 77117 18352
1038 18352 51996 30461 -18467 -41393 -21121 2830 34558 -13488 -11868 33664 20192 80682
1026 80682 62359 41187 45603 87153 52111 47247 11825 10718 2266 24709 -39248 11013 21545
1013 21545 12178 29321 12649 2897 -17819 8491 -6810 -5463 -1295 24230 38869 50171 -6510
1000 -6510 21190 -834 -54409 -23414 -12944 -353 -18373 -50153 11589 17732 -8215 16745
988 16745 16555 -50779 -48908 -9429 50682 -3168 62194 64277 -13930 -39585 -11082 336 50810
975 50810 28375 -17568 -5270 39676 64730 46038 17392 91742 52476 11615 56515 39425
$$ packed form
1063d032M2911j7623m6299p863J5930L348Q22k3609k193l2975O8947N5486m1593
1050A1257n5982Q0491K1707m1959l643l621P2237N6893j7374n0307P418n8765
1038A8352L3644k1535m8928k2926K0272K3951L1728m8046J620M5532j3472O0490
1026H0682j8323k1172M416M1550l5042m864l5422j107q452K2443o3957N0261J0532
1013B1545r367J7143j6672r752k0716K6310j5301J347M168K5525J4639J1302n6681
1000f510K7700k2024n3575L0995J0470J2591j8020l1780O1742O143k5947K4960
988A6745j90o7334J871L9479O0111n3850O5362K083p8207k5655K8503J1418N0474
975E0810k2435m5943J2298M4946K5054j8692k8646P4350l9266m0861M4900j7090
$$ plain form
963 39425 4999 7666 57440 24712 -2291 20951 49300 57727 41874 34185 18738 -32311 -1346
950 -1346 -10271 -51705 -77679 -14087 -10522 -41925 -45160 -13510 34223 125 9587 -13814 -55249
937 -55249 -19558 14053 6296 -11921 -9593 -39840 -59406 -58818 -87258 -77409 -72329 -75998 -53413
924 -53413 -59696 -42754 -21088 345 1848 -55429 -44407 -17092 -40498 -21843 -23489 774 -29077
911 -29077 1339 -13775 -1984 4025 29207 16110 867 -102184 -54035 23749 44124 75996
899 75996 65821 12241 -30457 -30991 -3016 8928 -18030 14808 -14561 19769 11703 24368 23084
886 23084 19498 -5672 -11507 48922 40005 -40040 -35914 -20179 -53299 -55960 8444 -12169 20891
873 20891 -10174 -29516 -35085 -60551 -71066 -59006 -15915 -52357 -17548 12943 11703 25986
$$ packed form
963C9425l4426K667M9774l2728k7003K3242K8349Q427j5853p689j5447n1049L0965
950a346q925m1434k5974O3592L565l1403l235L1650M7733l4098R462k3401m1435
937e5249L5691L3611p757j8217K328l0247j9566N88k8440R849N080l669K2585
924e3413o283J6942K1666K1433J503n7277J1022K7315k3406J8655j646K4263k9851
911b9077L0416j5114J1791O009K5182j3097j5243j03051M8149P7784K0375L1872
899G5996j0175n3580m2698n34K7975J1944k6958L2838k9369L4330q066J2665j284
886B3084l586k5170n835O0429q917q0045M126J5735l3120k661O4404k0613L3060
873B0891l1065j9342n569k5466j0515J2060M3091l6442L4809L0491j240J4283
$$ plain form
861 25986 42297 -14542 -30871 -28418 -25838 7915 18617 -79314 -71846 -27128 -40536 13567 -21164
848 -21164 -117454 -44480 7931 -3656 -7603 -5708 -36807 -70527 -13292 59666 41087 -49833
836 -49833 -66459 -12248 34812 44662 -48799 -57141 -17234 -51402 -30687 -14890 41254 29194
824 29194 -30755 -27025 -14417 -23525 9338 53643 10752 -36738 -7732 -18496 -56338 -28573
812 -28573 -11881 -52 -8621 -9487 33814 -28089 -80845 -31586 -28482 -15099 -4187 -27420 22228
799 22228 46786 55641 -2947 4251 12492 -4995 -15062 -13881 -4430 -55569 -66360 -19694 -1734
786 -1734 47587 24702 25027 65129 -13493 -41076 -43102 31316 24710 -22836 13829 59966 47730
773 47730 -5540 -39492 29834 74110 50688 45390 -27750 10935 -12774 -44085 -49968 -8909
$$ packed form
861B5986J6311n6839j6329K453K580L3753J0702r7931P468M4718j3408N4103l4731
848b1164r6290P2974N2411j1587l947J895l1099l3720N7235P2958j8579r0920
836d9833j6626N4211M7060R850r3461q342L9907l4168K0715J5797N6144j2060
824B9194n9949L730J2608r108L2863M4305m2891m7490K9006j0764l7842K7765
812b8573J6692J1829q569q66M3301o1903n2756M9259L104J3383J0912k3233M9648
799B2228K4558Q855n8588P198Q241j7487j0067J181R451n1139j0791M6666J7960
786a734M9321k2885L25M0102p8622k7583k026P4418o606m7546L6665M6137j2236
773D7730n3270l3952O9326M4276k3422n298p3140L8685k3709l1311n883M1059
$$ plain form
761 -8909 67580 59806 42291 76087 105509 83606 70658 34049 35909 -6713 -112006 -112408 -40656
748 -40656 -58905 -35100 24619 -17767 4226 19553 31918 -3015 21615 28629 1460 56767
736 56767 69862 66252 10108 -4210 28494 23971 12742 -38744 -41372 46027 32272 -32291 7814
723 7814 60152 37335 -6939 11874 65074 50891 46875 20755 -50133 -59023 -57725 -79175 9905
710 9905 5958 -63667 -13240 -3872 -12288 7097 47923 16768 -14746 16163 4076 -39346 -53332
697 -53332 -28157 -77769 -69155 -76173 -59290 -21258 -46870 -67632 -50226 -51176 -29177 4702 4668
684 4668 -65370 -93133 -51323 -25528 -45541 -40760 -35466 -21240 -47066 -74090 -44128 -65705 -56727
671 -56727 -44321 -24485 -8924 43927 31397 19886 72977 49388 -28041 -53546 -24195 53563
$$ packed form
761h909P6489p774j7515L3796K9422k1903j2948l6609J860m2622j05293m02P1752
748d0656j8249K3805N9719m2386K1993J5327J2365l4933K4630P014k7169N5307
736E6767J3095l610n6144j4318L2704m523j1229n1486k628Q7399j3755o4563M0105
723G814N2338k2817m4274J8813N3200j4183m016k6120p0888q890J298k1450Q9080
710I905l947o9625N0427R368q416J9385M0826l1155l1514L0909j2087m3422j3986
697e3332K5175m9612Q614p018J6883L8032k5612k0762J7406r50K1999L3879l4
684D668p0038k7763M1810K5795k0013M781N294J4226k5826k7024K9962k1577Q978
671e6727J2406J9836J5561N2851j2530j1511N3091k3589p7429k5505K9351P7758
$$ plain form
659 53563 -16049 -483 59785 76106 73556 60896 31785 42742 39167 10334 10191 -34684 -5359
646 -5359 23748 43166 7538 17498 20334 39109 -12333 -6140 -12342 3523 -1741 911 -23212
633 -23212 -59266 -81618 -39603 -1919 -1328 -28488 -56863 -41833 -18158 43111 21470 -3420
621 -3420 15754 -32974 -47327 -25682 -8583 16940 19701 -13002 -7839 25980 90438 153870 52813
608 52813 -10844 15117 36512 -7284 -8752 12184 43515 -3650 -41523 -1926 19588 27079
596 27079 -1929 -12582 -1802 -67112 -30246 -55532 -56311 12490 -1559 15163 -2015 31927
584 31927 -18309 -73764 -20610 27254 32452 6620 56453 71236 72674 20725 43341 57467
572 57467 68439 34142 21759 27708 26073 -10124 -60068 -32241 -8687 61229 58547 73554 48197
$$ packed form
659E3563o9612J5566O0268J6321k550j2660k9111J0957l575k8833j43m4875K9325
646e359K9107J9418l5628R960K836J8775n1442O193o202J5865n264K652k4123
633b3212l6054k2352M2015L7684N91k7160k8375J5030K3675O1269k1641k4890
621c420J9174m8728j4353K1645J7099K5523K761l2703N163L3819O4458O3432j01057
608E2813o3657K5961K1395m3796j468K0936L1331m7165l7873L9597K1514P491
596B7079k9008j0653J0780o5310L6866k5286p79O8801j4049J6722j7178L3942
584C1927n0236n5455N3154M7864N198k5832M9833J4783J438n1949K2616J4126
572E7467J0972l4297j2383N949j635l6197m9944K7827K3554O9916k682J5007k5357
$$ plain form
559 48197 41111 40083 15199 -13091 -44637 493 12284 23787 31082 33285 -37826 -38051 528
546 528 12339 67516 44431 2245 -4906 -34369 -18048 -25954 14941 34862 -27316 -69795 -79228
533 -79228 -77629 -80090 -62711 2217 50933 45084 44814 2387 -47321 -46430 -49006 -34981 -22461 -21361
519 -21361 -13792 -34693 -75731 -79328 -55097 22907 21416 22496 7594 -22430 -11121 -31077 40451
506 40451 57294 65455 25747 9122 -1677 421 -10873 38400 20178 -52692 -16241 -8875 20230
493 20230 -2049 -21937 4891 -21472 -1530 -32484 -43257 -54619 -17039 -11841 -11490 -21114 -42505
480 -42505 10391 61646 15175 27520 28147 -22760 -68785 -52516 -37330 14017 -2830 -27686
468 -27686 -828 -38363 -39408 -64380 -47868 -21363 9951 25598 -44540 -19912 21864 -15864
$$ packed form
559D8197p086j028k4884k8290l1546M5130J1791J1503P295K203p1111k25L8579
546E28J1811N5177k3085m2186p151k9463J6321p906M0895J9921o2178m2479r433
533g9228J599k461J7379O4928M8716n849k70m2427m9708Q91k576J4025J2520J100
519b1361P569k0901m1038l597K4231P8004j491J080j4902l0024J1309j9956P1528
506D0451J6843Q161l9708j6625j0799K098j1294M9273j8222p2870L6451P366K9105
493B0230k2279j9888K6828k6363J9942l0954j0773j1362L7580N198L51r624k1391
480d2505N2896N1255m6471J2345O27n0907m6025J6269J5186N1347j6847k4856
468b7686K6858l7535j045k4972J6512K6505L1314J5647p0138K4628M1776l7728
$$ plain form
456 -15864 -27603 -25673 -3868 -17410 -12690 -33928 -9078 -13611 -38872 -36692 -25862 -6524 -62722
443 -62722 -55535 -21263 -100930 -26826 17148 -27271 -51757 -33397 -53434 -60433 -16390 20222
431 20222 -8714 -42029 -50599 -18370 -15369 -22142 31929 27246 44616 38029 -42437 -76468 -121801
418 -121801 -58445 -48971 -31468 -13413 -11997 5406 -55336 -120311 -89557 -30088 1873 -48929
406 -48929 -61348 1680 -23684 522 -4755 -22042 -25401 2353 9168 35394 57753 64883 49272
393 49272 3732 -27646 1063 -11208 -10985 12823 43087 54829 -25153 -33985 -35736 -43367 -23774
380 -23774 -43900 5739 50487 13105 11154 53872 -2312 5827 30620 -13023 -10245 -7815 14380
367 14380 61375 -22798 -14810 -33670 -41690 -54916 -36852 -29910 25635 4996 -1982 -330 -71505
$$ packed form
456a5864j1739J930K1805j3542M720k1238K4850m533k5261K180J0830J9338n6198
443f2722P187L4272p9667P4104M3974m4419k4486J8360k0037o999M4043L6612
431B0222k8936l3315q570L2229L001o773N4071m683J7370o587q0466l4031m5333
418a21801O3356R474J7503J8055J416J7403o0742o4975L0754N9469L1961n0802
406d8929j2419O3028k5364K4206n277j7287l359K7754O815K6226K2359P130j5611
393D9272m5540l1378K8709j2271K23K3808L0264J1742p9982q832j751p631J9593
380b3774k0126M9639M4748l7382j951M2718n6184Q139K4793m3643K778K430K2195
367A4380M6995q4173P988j8860q020j3226J8064O942N5545k0639o978J652p1175
$$ plain form
354 -71505 -83868 -136788 -71838 -3137 -30474 -31571 -61094 -51447 -34991 -40453 -9468 -9305 -32760
341 -32760 -40349 10751 33883 64147 7022 -64340 3750 28530 -71933 -61411 -22055 31769
329 31769 23815 31605 -8356 23469 23592 10189 12983 28414 15531 14524 30925 -6570 8751
316 8751 -14567 -22546 20463 -28785 -53290 -20923 42667 12710 -45591 -55864 -21701 3371
304 3371 -24556 -13604 -33467 -38798 -28304 43344 58331 9053 41011 43607 27242 18001 39609
291 39609 25332 -31183 -40905 -18513 1084 -24533 -9514 -20514 -40913 -105159 -77356 -86832
279 -86832 -88059 -22605 -54606 -50991 15665 21698 -20797 -43357 -55167 24413 15024 -41088 -46089
266 -46089 -30590 -16062 -23130 4430 26091 -37495 -43073 17603 38868 -5201 25977 1189
$$ packed form
354g1505j2363n2920O4950O8701k7337j097k9523R647J6456n462L0985J63k3455
341c2760p589N1100K3132L0264n7125p1362O8090K4780j00463J0522L9356N3824
329C1769p954P790l9961L1825J23j3403K794J5431j2883j007J6401l7495J5321
316H751k3318p979M3009m9248k4505L2367O3590k9957n8301j0273L4163K5072
304C371k7927J0952j9863n331J0494P1648J4987m9278L1958K596j6365r241K1608
291C9609j4277n6515r722K2392J9597k5617J5019j1000k0399o4246K7803r476
279h6832j227O5454l2001L615O6656O033m2495k2560j1810P9580r389n6112n001
266d6089J5499J4528p068K7560K1661o3586n578O0676K1265m4069L1178k4788
$$ plain form
254 1189 -8744 9932 -11250 -17139 -20692 2789 11096 -1000 -31386 -12561 27990 10147 -34154
241 -34154 -19204 -23655 -71340 -55442 28443 6023 23756 47399 24021 15728 15228 -13935 -17289
228 -17289 2981 17660 9238 49172 74225 -6397 -13567 -34987 11492 49759 11398 -23463
216 -23463 -61576 -38656 19720 -21319 -64661 -7520 -7981 -24580 -57329 -84756 -38267 -57447
204 -57447 -65918 -43919 -45282 -8903 5068 14302 -7316 -36379 -50550 -53730 -51621 -29245 -43810
191 -43810 -9863 -30165 -21138 -3336 -10968 30761 98943 50213 14535 -22581 -9275 -26025
179 -26025 1528 33030 2691 -12479 -9190 -17359 2653 -27551 -26826 28467 33474 -2748 -41051
166 -41051 -96751 -64732 -40385 -69174 -85166 -105787 -41680 -30221 -97204 -118723 -77359 -62650
$$ packed form
254A189r933J8676k1182n889l553K3481Q307j2096l0386J8825M0551j7843m4301
241c4154J4950m451m7685J5898Q3885k2420J7733K3643k3378q293n00k9163l354
228a7289K0270J4679q422L9934K5053q0622p170k1420M6479L8267l8361l4861
216b3463l8113K2920N8376m1039m3342N7141m61j6599l2749k7427M6489j9180
204e7447q471K1999j363L6379J3971R234k1618k9063j4171l180K109K2376j4565
191d3810L3947k0302R027J7802p632M1729O8182m8730l5678l7116J3306j6750
179b6025K7553L1502l0339j5170L289q169K0012l0204P25N5293N007l6222l8303
166d1051n5700L2019K4347k8789j5992k0621O4107J1459o6983k1519M1364J4709
$$ plain form
154 -62650 -27137 -52396 -58155 -53652 -40304 -17018 16043 24645 -10431 -30018 -21285 -41984 369
141 369 45209 2087 -5681 -7147 -50282 -26306 -60849 -28233 30761 14655 -39856 -154 -12354
128 -12354 -46779 -57029 -4315 1076 19994 51569 32291 21167 1255 9786 13574 -3140 32066
115 32066 -3590 -28789 5162 -51619 -109755 -63700 -19362 -81084 -111856 -65565 -29212 21303
103 21303 25731 -5345 -11726 18641 32673 27137 -6773 -28926 -17678 22504 32962 -1749 -47813
90 -47813 2884 50035 3843 -17479 -48013 -44823 -27163 -51383 -54760 -19944 -943 22608 -12852
77 -12852 -48631 22349 14690 -59489 -22994 -24201 -54259 -20036 -33078 -51097 -14793 -6455 -24865
64 -24865 -27287 -16091 -41940 -73077 -89256 -59935 -23854 -87268 -96904 -32466 -3263 -31616 -46873
$$ packed form
154f2650L5513k5259n759M503J3348K3286L3061Q602l5076j9587Q733k0699M2353
141C69M4840m3122p768j466m3135K3976l4543L2616N8994j6106n4511L9702j2200
128a2354l4425j0250N2714N391J8918L1575j9278j1124j9912Q531L788j6714L5206
115C2066l5656k5199L3951n6781n8136M6055M4338o1722l0772M6291L6353N0515
103B1303M428l1076o381L0367J4032n536l3910k2153J1248M0182J0458l4711m6064
90d7813N0697M7151m6192k1322l0534L190J7660k4220l377L4816J9001K3551l5460
77a2852l5779P0980p659p4179L6495j207l0058L4223j3042j8019L6304Q338j8410
64b4865k422J1196k5849l1137j6179K9321L6081o3414r636O4438K9203k8353j5257
$$ plain form
51 -46873 -2918 -22695 -12279 -43612 -64782 -41673 -39397 -69171 -58746 -2158 -788 -11518 35271
38 35271 -87 -51866 -43564 -14454 -11036 -2510 -44969 -21178 -5737 -2972 21969 34839 25867
$$ packed form
51d6873M3955j9777J0416l1333k1170K3109K276k9774J0425N6588J370j0730M6789
38C5271l5358n1779Q302K9110L418Q526m2459K3791J5441K765K4941J2870q972
$$ [...]
##END NTUPLES=NMR SPECTRUM
##END=
