##TITLE=1H_CA-8929-3
 DMSO,32 sc, 
 29.9.2021
##JCAMPDX= 6.0         $$ Bruker NMR JCAMP-DX V2.0
##DATA TYPE= NMR SPECTRUM
##DATA CLASS= NTUPLES
##ORIGIN= UXNMR, Bruker Analytische Messtechnik GmbH
##OWNER= root
$$ XWIN-NMR		Version 3.5
$$ Wed Sep 29 11:14:41 2021 Russian Standard Time (UT+4h)  she@DPX200
##.OBSERVE FREQUENCY= 200.1314
##.OBSERVE NUCLEUS= ^1H
##.ACQUISITION MODE= SIMULTANEOUS
##.ACQUISITION SCHEME= undefined
##.AVERAGES= 32
##.DIGITISER RES= 18
##SPECTROMETER/DATA SYSTEM= spect
##.PULSE SEQUENCE= zg30
##.SOLVENT NAME= CDCl3
##.SHIFT REFERENCE= (INTERNAL, CDCl3, 0, 15.4199)
##AUDIT TRAIL= $$ (NUMBER, WHEN, WHO, WHERE, WHAT)
$$ ##TITLE= Audit trail, XWIN-NMR		Version 3.5
$$ ##JCAMPDX= 5.01
$$ ##ORIGIN= Bruker BioSpin GmbH
$$ ##OWNER= she
$$ F:/spectra/data/she/nmr/H-F/1/pdata/1/auditp.txt
$$ ##AUDIT TRAIL=  $$ (NUMBER, WHEN, WHO, WHERE, WHAT)
(   1,<2021-09-29 11:13:45.14 +0400>,<she>,<DPX200>,
      <continue with go, POWCHK disabled, PULCHK disabled
       configuration hash MD5:
       00 E9 B6 7A A2 85 ED C7 34 08 36 98 17 FE 4E 26
       data hash MD5: 16K
       A6 8C C5 34 0F 3C B6 32 91 AA 6D F4 74 00 D8 63>)
(   2,<2021-09-29 11:13:48.00 +0400>,<she>,<DPX200>,
      <Start of raw data processing
       efp BC_mod = 2 LB = 0.24 FT_mod = 6 PKNL = 1 PHC0 = -14072.07 PHC1 = 3.20089 SI = 16K 
       data hash MD5: 16K
       00 BD 10 A0 CA DD 94 A1 99 86 D3 93 42 5A C0 6B>)
(   3,<2021-09-29 11:13:52.64 +0400>,<she>,<DPX200>,
      <abs ABSG = 5 
       data hash MD5: 16K
       8A 42 25 77 27 0C 99 82 8B D7 04 0E F5 D1 70 8A>)
(   4,<2021-09-29 11:14:10.96 +0400>,<she>,<DPX200>,
      <pk PHC0 = -3.274776 PHC1 = 4.800002 
       data hash MD5: 16K
       A3 06 3C C2 51 E6 D1 D3 20 BF 45 32 C0 92 06 17>)
(   5,<2021-09-29 11:14:14.17 +0400>,<she>,<DPX200>,
      <abs ABSG = 5 
       data hash MD5: 16K
       61 6C 8A DE 7C CA AB 3E 41 14 3F DC 38 D8 C0 90>)
$$ ##END=
$$ 
$$ hash MD5
$$ 89 CE 5E E0 6D 6A 9E C9 02 A1 05 15 CF 61 BB BA
##$RELAX= 
##$RELAX= 
##$RELAX= 
##$RELAX= 
##$RELAX= 
##$RELAX= 
$$ Bruker specific parameters
$$ --------------------------
##$DU= <F:/spectra>
##$EXPNO= 1
##$NAME= <H-F>
##$PROCNO= 1
##$TYPE= <nmr>
##$USER= <she>
##$AMP= (0..31)
100 100 100 100 100 100 100 100 100 100 100 100 100 100 100 100 100 100 
100 100 100 100 100 100 100 100 100 100 100 100 100 100 
##$AQSEQ= 0
##$AQ_mod= 1
##$AUNM= <au_zg>
##$AUTOPOS= <>
##$BF1= 200.13
##$BF2= 200.13
##$BF3= 200.13
##$BF4= 200.13
##$BF5= 200.13
##$BF6= 200.13
##$BF7= 200.13
##$BF8= 200.13
##$BYTORDA= 1
##$CFDGTYP= 0
##$CFRGTYP= 5
##$CHEMSTR= <none>
##$CNST= (0..31)
1 1 145 1 1 1 1 1 1 1 1 1 1 1 1 1 1 1 1 1 1 1 1 1 1 1 1 1 1 1 1 1 
##$CPDPRG= <>
##$CPDPRG1= <>
##$CPDPRG2= <>
##$CPDPRG3= <>
##$CPDPRG4= <mlev>
##$CPDPRG5= <mlev>
##$CPDPRG6= <mlev>
##$CPDPRG7= <mlev>
##$CPDPRG8= <mlev>
##$CPDPRGB= <>
##$CPDPRGT= <>
##$D= (0..31)
0 1.2 0 0 0 0 0 0 0 0.06 0 0.03 0 0 0 0 0.0002 0 0 0 0 0 0 0 0 0 0 0 0 
0 0 0 
##$DATE= 1632899465
##$DBL= (0..7)
$$ [...]
##$SUBNAM2= <"">
##$SUBNAM3= <"">
##$SUBNAM4= <"">
##$SUBNAM5= <"">
##$SUBNAM6= <"">
##$SUBNAM7= <"">
##$SUBNAM8= <"">
##$SUBNAM9= <"">
##$SW= 16.8808012054999
##$SWIBOX= (0..15)
0 0 2 0 0 0 0 0 0 0 0 0 0 0 0 0 
##$SW_h= 3378.37837837838
##$TD= 16384
##$TD0= 1
##$TE= 0
##$TE2= 300
##$TE3= 300
##$TEG= 300
##$TL= (0..7)
0 120 120 120 120 120 120 120 
##$TP= (0..7)
150 150 150 150 150 150 150 150 
##$TP07= 0
##$TPNAME0= <>
##$TPNAME1= <>
##$TPNAME2= <>
##$TPNAME3= <>
##$TPNAME4= <>
##$TPNAME5= <>
##$TPNAME6= <>
##$TPNAME7= <>
##$TPOAL= (0..7)
0.5 0.5 0.5 0.5 0.5 0.5 0.5 0.5 
##$TPOFFS= (0..7)
0 0 0 0 0 0 0 0 
##$TUNHIN= 0
##$TUNHOUT= 0
##$TUNXOUT= 0
##$USERA1= <user>
##$USERA2= <user>
##$USERA3= <user>
##$USERA4= <user>
##$USERA5= <user>
##$V9= 5
##$VALIST= <valist>
##$VCLIST= <CCCCCCCCCCCCCCC>
##$VD= 0
##$VDLIST= <DDDDDDDDDDDDDDD>
##$VPLIST= <PPPPPPPPPPPPPPP>
##$VTLIST= <TTTTTTTTTTTTTTT>
##$WBST= 1024
##$WBSW= 4
##$XGAIN= (0..3)
0 0 0 0 
##$XL= 0
##$YL= 0
##$YMAX_a= 144228
##$YMIN_a= -252846
##$ZGOPTNS= <>
##$ZL1= 120
##$ZL2= 120
##$ZL3= 120
##$ZL4= 120
##$ABSF1= 15.41991
##$ABSF2= -1.461008
##$ABSG= 5
##$ABSL= 3
##$ALPHA= 0
##$AQORDER= 0
##$ASSFAC= 0
##$ASSFACI= 0
##$ASSFACX= 0
##$ASSWID= 0
##$AUNMP= <proc_1d>
##$AZFE= 0.1
##$AZFW= 0.1
##$BCFW= 0
##$BC_mod= 2
##$BYTORDP= 0
##$COROFFS= 0
##$CY= -3
##$DATMOD= 1
##$DC= 0
##$DFILT= <>
##$DTYPP= 0
##$F1P= 0
##$F2P= 0
##$FCOR= 1
##$FTSIZE= 16384
##$FT_mod= 6
##$GAMMA= 0
##$GB= 0
##$INTBC= 1
##$INTSCL= 0
##$ISEN= 128
##$LB= 0.24
##$LEV0= 0
##$LPBIN= 0
##$MAXI= 10000
##$MC2= 0
##$MEAN= 0
##$ME_mod= 0
##$MI= 1.114404
##$NCOEF= 0
##$NC_proc= -7
##$NLEV= 6
##$NOISF1= 3.799351
##$NOISF2= 2.8
##$NSP= 0
##$NTH_PI= 0
##$NZP= 0
##$OFFSET= 15.41991
##$PC= 1
##$PHC0= -14075.34
##$PHC1= 8.000893
##$PH_mod= 1
##$PKNL= yes
##$PPARMOD= 0
##$PSCAL= 0
##$PSIGN= 0
##$REVERSE= no
##$SF= 200.130003202277
##$SI= 16384
##$SIGF1= 3
##$SIGF2= 2
##$SINO= 5.538805
##$SIOLD= 16384
##$SREGLST= <1H.CDCl3>
##$SSB= 0
##$STSI= 16384
##$STSR= 0
##$SW_p= 3378.37837837838
##$SYMM= 0
##$S_DEV= 0
##$TDeff= 16384
##$TDoff= 0
##$TI= <>
##$TILT= no
##$TM1= 0
##$TM2= 0
##$TOPLEV= 0
##$USERP1= <user>
##$USERP2= <user>
##$USERP3= <user>
##$USERP4= <user>
##$USERP5= <user>
##$WDW= 1
##$XDIM= 16384
##$YMAX_p= 372522582
##$YMIN_p= -1552374
$$ End of Bruker specific parameters
$$ ---------------------------------
##NTUPLES= NMR SPECTRUM
##VAR_NAME=  FREQUENCY,     SPECTRUM/REAL,   SPECTRUM/IMAG
##SYMBOL=    X,             R,               I
##VAR_TYPE=  INDEPENDENT,   DEPENDENT,       DEPENDENT
##VAR_FORM=  AFFN,          ASDF,            ASDF
##VAR_DIM=   16384,         16384,           16384
##UNITS=     HZ,            ARBITRARY UNITS, ARBITRARY UNITS
##FACTOR=    0.206212438404345, 1,           1
##FIRST=     3085.98672391648, 0,            0
##LAST=      -292.391654461897, 0,           0
##MIN=       -292.391654461897, -1552374,    0
##MAX=       3085.98672391648, 372522582,    0
$$ Real data points
##PAGE= N=1
##DATA TABLE= (X++(R..R)), XYDATA
$$ [...]
7647A121155j5503L59476j92615K67106m35414J45162K90919l75668K29454k70631
7637A123441m0180l47720L31953J42592O568K038L370r5799L41502j45335l69555
7626I52875j71529j93782K52003Q352L22873j18271Q789j0773k88408J3541K36302
7615A011972J27322K58059k86142j6101p1684o1771J4587L42918k1283j4773j52196
7604A130908l1080K83209j98322k67606L67189j94292L77069k08507P0628N25585
7594A854781k59247j93753l6680k38095j70507L41517L60295o49987r1204j6316
7584I00804J65648L88878J66990P5220J39670j5267l34276l8447l31047Q2510
7574A200683J34780K35339r8395M5063j86470j75277J88503J80480k26656J41217
$$ plain form
7647 1121155 1105652 1465128 1272513 1539619 1104205 1249367 1540286 1164618 1394072 1123441
7637 1123441 1083261 735541 1067494 1210086 1216654 1218692 1222062 1126263 1467765 1322430 952875
7626 952875 781346 587564 839567 847919 1170792 1052521 1061310 1050537 762129 775670 1011972
7615 1011972 1139294 1397353 1111211 1095110 1023426 961655 976242 1319160 1297877 1283104 1130908
7604 1130908 1099828 1383037 1184715 917109 1284298 1090006 1467075 1258568 1329196 1854781
7594 1854781 1595534 1401781 1365101 1127006 956499 1298016 1658311 1008324 917120 900804
7584 900804 1066452 1455330 1622320 1697540 1837210 1821943 1487667 1449220 1118173 1200683
7574 1200683 1335463 1570802 1472407 1517470 1331000 1155723 1344226 1524706 1298050 1439267
7564A439267r4559m64430n88198M80854N73924R0251j25646j51179k00481j36261
7554H23542M11499J8052j12898K04225j59127n72106l10983K18395M86410q4667
7544I22342J74582L49899M04047r9399o86171l38633k57424K2259k8654L5946
7534D98794n3793l1186j49614J3871j2492O04416o6906O075m7161k54981l6932
7523D70091L1949K82567J19057O9642J13074j98788M4341J03726j15489q510O9978
7512I81638m06952p959K60888j17009Q0417k55352Q118R3370O4447q4103M757
7501F22260J74690p7727j77506N1267K49404M43020K051k44144l09922N0474r936
7490G73931l73879q688J40822J80675J23490r8809j2932p9940k56889M9863K33810
$$ plain form
7564 1439267 1344708 880278 292080 772934 1346858 1437109 1311463 1160284 959803 823542
7554 823542 1235041 1253093 1140195 1344420 1185293 613187 302204 520599 1007009 922342
7544 922342 1096924 1446823 1850870 1751471 1065300 726667 469243 491502 462848 498794
7534 498794 445001 413815 264201 278072 265580 869996 803090 809165 762004 507023 470091
7523 470091 502040 784607 903664 973306 1086380 887592 931933 1035659 920170 911660 981638
7512 981638 574686 566727 827615 710606 791023 535671 543789 637159 701606 617503 622260
7501 622260 796950 719223 541717 592984 842388 1285408 1287459 1043315 733393 783867 773931
7490 773931 400052 391364 532186 712861 836351 737542 724610 644670 387781 437644 671454
7479F71454J2932j33079J00822p2879r6716J79524O8075N0283j58086J04331J98279
7468I24940l15099K41019K85450m92222j90128p4756J97551O8948l16575J22061
7458D51189o1933m0288L08984M1043k71106m91k64999J7875M83227k47042K01707
7447F18166n58338J13808J18961Q7992K26362O3647l32824M6639j0472j48401
7437B25540L71612J73858J62765j17633j75365J7730k53164p2039j24093k23895
7427a4684J36917m6294k7183P0595K673m5931R9044J56431j61815l08874J08202
7416c0919K15830J34982k9466k54919k07014J8456K38559L93586m29074p6788
7406b6767n0213P4932q2303r6715O35388J80829L34361k02006k51094j30717m1109
$$ plain form
7479 671454 684386 551307 652129 579250 482534 662058 730133 780416 622330 726661 924940
7468 924940 609841 850860 1136310 644088 453960 379204 576755 645703 329128 451189
7458 451189 389256 348968 657952 698995 427889 427398 162399 180274 663501 416459 618166
7447 618166 59828 173636 292597 380589 606951 670598 337774 384413 373941 225540
7437 225540 597152 771010 933775 816142 640777 658507 405343 333304 209211 -14684
7427 -14684 122233 75939 48756 119351 122024 76093 175137 331568 169753 -139121 -30919
7416 -30919 184911 319893 290427 35508 -171506 -153050 85509 479095 50021 -26767
7406 -26767 -76980 -2048 -84351 -181066 454322 635151 969512 767506 516412 385695 344586
7395C44586l16893k08096K90440j72090L25876m4812K33503J30509l33591K24697
7385D74129J52221m09999J98125J49573l05342l69700K31520l6618r7906j02048
7375a16045J9002O9J50619K22703j07152K18335k88071j99280J4402J39555j17674
7364f3537o4978O5010N9685j96130l6163K30019K17720m5908J85725Q4456l59696
7353G6203m36271L90321R2002j1821q6677j40258J61775O8345K22456l9270o2631
7342B34174j80822K40550l54937K59739r789p0612M7523l8202l68345n1527L78438
7331H6190J45148j61788m42383l2393J2451K59838k24245R2108N37376k53920
7321A8382k56033m5557K00729K66820l16229l27097K50527k09124J34358k39491
$$ plain form
7395 344586 27693 -180403 110037 -62053 263823 219011 452514 583023 249432 474129
7385 474129 626350 216351 414476 564049 258707 -110993 120527 83909 -13997 -116045
7375 -116045 -97043 -96974 53645 276348 169196 387531 99460 -99820 -85418 54137 -63537
7364 -63537 -128515 -63505 -3820 -199950 -236113 -6094 211626 165718 351443 435899 76203
7353 76203 -360068 30253 122255 110434 23757 -116501 45274 113619 336075 296805 234174
7342 234174 53352 293902 -61035 198704 188915 118303 165826 127624 -240721 -292248 86190
7331 86190 231338 69550 -372833 -405226 -392775 -132937 -357182 -265074 272302 18382
7321 18382 -237651 -283208 -82479 184341 -131888 -458985 -208458 -417582 -283224 -522715
7311e22715l70829L87088P72799J91013j32840j72845L15189L2070m68111L85931
7301D16750L02563k57560K85258r8931o77015J86960l8987J55109m124m0870j03329
7290A25824j44671k71762Q0654O0824K95622q2105j62466l8143N5689p4934L77105
7279B21637n4504J46759L3681l26521J00211j75342J62301k37888j22593L02230
7269D9971K38653J84028k93589k26905q1524l70442P2317J27116Q9139K84670
7259G3434M37597O7127j81671J78254j93536j20734n9896M63711J8751m12128
7249B70909J2508l467K02776p010r624l00505l62201J14821K94082L7978O8722
7238C18989K1024n8273j88609m2929k58484J81326K16268j07376K22397n727j13154
$$ plain form
7311 -522715 -893544 -506456 266343 457356 324516 151671 466860 498930 30819 416750
7301 416750 719313 461753 747011 648080 -28935 158025 119038 274147 270023 229153 125824
7290 125824 -18847 -290609 -209955 -149131 146491 64386 -98080 -136223 -80534 -155468 221637
7279 221637 167133 313892 347573 21052 121263 -54079 108222 -129666 -252259 49971
7269 49971 288624 472652 179063 -47842 -129366 -499808 -427491 -300375 -211236 73434
7259 73434 511031 578158 396487 574741 381205 260471 200575 664286 683037 270909
7249 270909 283417 279950 482726 475716 466092 165587 -196614 -81793 212289 250267 318989
7238 318989 340013 281740 93131 50202 -208282 -26956 189312 81936 304333 298606 185452
7227A85452P9232j95541o2774J43416j59839j10986K66048N6782K96399q3897
7217D14292m31252r1489n6499j13606L09536M03394P6147J23678j95861Q5039
7207E23379l47410k37182L8735o8312j68946L84696K96353r1747l86078K17584
7197A61072K01808k9414r1366j17639L0149N5407J01204J07239l29183l33188
7187b43911J87935l64395j61021L27510L93894q77p0111j80689l12321j19518
7177e43504n0448J63532m9157j289L1967k4134r2519m50546p2783L66584k08772
7166i31069K24437L36309J06964n8898L2225K14475K27575J39776m6676Q0343
7156C25461j40203o24675L9480O462m47661P6013J69013L06924l0766J34248n34786
$$ plain form
7227 185452 264684 69143 6369 149785 -10054 -121040 145008 201790 498189 414292
7217 414292 -16960 -108449 -164948 -278554 30982 434376 510523 634201 438340 523379
7207 523379 175969 -61213 -22478 -90790 -259736 124960 421313 329566 -56512 161072
7197 161072 362880 333466 242100 124461 154610 210017 311221 418460 89277 -243911
7187 -243911 -55976 -420371 -581392 -253882 140012 139135 69024 -111665 -423986 -543504
7177 -543504 -593952 -430420 -479577 -480866 -448899 -473033 -565552 -1016098 -1088881 -722297 -931069
7166 -931069 -706632 -370323 -263359 -322257 -290032 -75557 152018 291794 245118 325461
7156 325461 185258 -439417 -399937 -393475 -841136 -765123 -596110 -289186 -319952 -185704 -720490
7145g20490K14690J17725J86163j13217l0171j84972N5809j03771k00600K89640
7135d89194P1843k50793m9722K63082L63985l1388p4845n724k39184n3612q1696
7124e77248j02J43225L0375K6599p0374k37761R0485J28009K1523j54560l46875
7113i46704K96114L30766p1643l2549k16939n6316J56027j9502P4238O3441N0321
7102c72746n2614o4551L65683n8035p1951j22024J08968n6074n7074J36570l49009
7091e92857K16269L78947j52721j14666j6940M9471J88278o2804j01703l71130
7081e79856k72646M67048r8060k18140j78944P65901J360k45692l07773n6314
7071g23116J62610O1877k29015J41647L33470K38220l15098j31165l1092M983
$$ plain form
7145 -720490 -505800 -388075 -201912 -315129 -345300 -530272 -474463 -578234 -778834 -489194
7135 -489194 -417351 -668144 -717866 -454784 -90799 -122187 -197032 -202756 -441940 -495552 -577248
7124 -577248 -577350 -434125 -403750 -377151 -447525 -685286 -594801 -466792 -445269 -599829 -946704
7113 -946704 -650590 -319824 -391467 -424016 -640955 -697271 -541244 -560746 -486508 -423067 -372746
7102 -372746 -425360 -489911 -124228 -182263 -254214 -376238 -267270 -323344 -380418 -243848 -592857
7091 -592857 -376588 2359 -150362 -265028 -281968 -232497 -44219 -107023 -208726 -579856
7081 -579856 -852502 -385454 -483514 -701654 -880598 -114697 -113337 -359029 -666802 -723116
7071 -723116 -560506 -498629 -727644 -585997 -252527 -14307 -329405 -460570 -491662 -486679
7061d86679q4035J3821Q353l39640l0857M62290j0298n03862J81357K47637l6488
7050e78401k86526J22361k45253J54447r8577N5676J00042j84581J05523Q3170
7040g72119M77234J8819k43572J43241l26651k15495L04926O4800k0297J24939
7030d44175j47679r7238k81553K18007k51643J14048j37373L19262M2395J28778
7020e37171p5979J4200O4581P7014R9281o17933N12231j42741k91359L9512K80816
7009e77548O4305m30053Q409P3323q0878J00170k12786J19723P6697K17434K3545
6998f17659l05742n2957J41350j73974l2604M34825J24835J9049l52543q9263
6988i04683O4228J78105r5999J77536o5075m81140M56242P7140M1564K44196j37997
$$ plain form
7061 -486679 -570714 -556893 -548540 -888180 -919037 -456747 -467045 -970907 -789550 -541913 -578401
7050 -578401 -864927 -742566 -987819 -833372 -931949 -876273 -776231 -960812 -855289 -772119
7040 -772119 -294885 -276066 -519638 -376397 -703048 -918543 -613617 -548817 -569114 -444175
7030 -444175 -591854 -689092 -970645 -752638 -1004281 -890233 -1027606 -708344 -665949 -537171
7020 -537171 -613150 -598950 -534369 -457355 -358074 -976007 -463776 -606517 -897876 -858364 -577548
7009 -577548 -513243 -943296 -934887 -861564 -942442 -842272 -1055058 -935335 -858638 -641204 -617659
6998 -617659 -923401 -976358 -835008 -1008982 -1041586 -606761 -481926 -462877 -815420 -904683
6988 -904683 -840455 -662350 -758349 -580813 -645888 -1127028 -670786 -593646 -552082 -307886 -445883
6977d45883l31800j62239p566K23252K18518k12728K83843r7402l10472K24396
6967f18081l10449k12195o7806J9677L08948N15781q8913k53442j62200M0257
6957h28423l26815k46492j50644J11852K7332n1605L86644R943P8125J88701j43583
6946i44965q2687j10080K72819k9312l49399J38998J09823O7776K82218j80851
6936h25660j95065L12671j6376k10274P1199J46987l62169K8183L9507k44686
6926a255683K5609m5364L70355K80195k6163j26680k65369M70718J87564m53864
6916h38682k77695J19473M04345J83646o04932J58040k58787R6372K86351k32572
6906i64441k25181L96114L07247j45135j81484k18965P8727j22380L8162O21800
$$ plain form
6977 -445883 -777683 -939922 -947488 -724236 -505718 -718446 -434603 -532005 -842477 -618081
6967 -618081 -928530 -1140725 -1208531 -1188854 -879906 -364125 -453038 -706480 -868680 -828423
6957 -828423 -1155238 -1401730 -1552374 -1440522 -1413190 -1464795 -1078151 -1068208 -990083 -801382 -944965
6946 -944965 -1027652 -1137732 -864913 -894225 -1243624 -1104626 -994803 -927027 -644809 -825660
6936 -825660 -1020725 -708054 -724430 -934704 -863505 -716518 -1078687 -1050504 -1010997 -1255683
6926 -1255683 -1230074 -1275438 -905083 -624888 -651051 -777731 -1043100 -572382 -384818 -838682
6916 -838682 -1116377 -996904 -592559 -408913 -1013845 -855805 -1114592 -1018220 -731869 -964441
6906 -964441 -1189622 -793508 -486261 -631396 -812880 -1031845 -953118 -1075498 -1037336 -415536
6896d15536j6550k00188n96J2091j21219k09881K19784L85827k5062p4224k04986
6885f50540l10805J01228k22375K2978m4056o6655K3048N67095m7272O089p030
6874f28295j69407m3560L87551Q4981l88678J8222m90261p1589K87921o4637j04967
6863a182719K55457O4016K32583N3326j62722J15757k35198p0793o5148k7912
6853a023353j06885Q0411O8331j39810J32719R3185P1281k20929k55360L33618
6843i66792j4787p2883n17J02091N38636j48779m40835K54583P6019l05650m022
6832i82936J36230R4214K81793M2091k93029k83240M06098O1237j68721L9950
6822f66313k20902n7441N1817r5203o8278L98393L40643j77413k74877r6325n994
$$ plain form
6896 -415536 -432086 -632274 -632870 -620779 -741998 -951879 -732095 -346268 -371330 -445554 -650540
6885 -650540 -961345 -860117 -1082492 -1059514 -1103570 -1170225 -1147177 -580082 -627354 -621265 -628295
6874 -628295 -797702 -841262 -453711 -368730 -757408 -739186 -1229447 -1301036 -1013115 -1077752 -1182719
6863 -1182719 -927262 -863246 -630663 -577337 -740059 -624302 -859500 -930293 -995441 -1023353
6853 -1023353 -1130238 -1049827 -981496 -1121306 -988587 -895402 -824121 -1045050 -1300410 -966792
6843 -966792 -981579 -1054462 -1054979 -952888 -414252 -563031 -1003866 -749283 -673264 -978914 -982936
6832 -982936 -846706 -752492 -470699 -428608 -721637 -1004877 -598779 -537542 -706263 -666313
6822 -666313 -887215 -944656 -892839 -988042 -1056320 -657927 -317284 -494697 -769574 -865899 -871893
6811h71893j9890j99755n1214J27695N39922n00316j37854L07509N03558q3264
6801c85502m6156k05139k99290K91715L09349K28530l58831m59107j57534K23019
6791h58946L54807l4970P8448J08262j48361P2713o4342m40566k47675O78000
6781e02630j7648m8331l47247L16442K80823j65670j85492N5452q6283J39817
6771e60767K16300r4301j32188Q5896N28142m6692J3830k34925J63006j09008
6761a70707o09218j2059J62117M02692k56210j22115l3473m9105K73801M170m7226
6750d57333m81920K39576N8119k21706L32910L15166k63092M3083L05523k80863
6740d10537J8217n4306J06646P9454k95246k35645J19333L91946j08759k67946
$$ plain form
6811 -871893 -891783 -1091538 -1142752 -1015057 -475135 -975451 -1113305 -805796 -302238 -385502
6801 -385502 -431658 -636797 -936087 -644372 -335023 -106493 -465324 -924431 -1081965 -858946
6791 -858946 -504139 -539109 -460661 -352399 -500760 -428047 -492389 -932955 -1180630 -502630
6781 -502630 -520278 -568609 -915856 -599414 -318591 -484261 -669753 -614301 -700584 -560767
6771 -560767 -344467 -438768 -570956 -485060 43082 -3610 10220 -224705 -61699 -170707
6761 -170707 -779925 -791984 -629867 -227175 -483385 -605500 -638973 -688078 -414277 -410107 -457333
6750 -457333 -939253 -699677 -641558 -863264 -530354 -215188 -478280 -435197 -129674 -410537
6740 -410537 -392320 -446626 -339980 -260526 -555772 -791417 -672084 -280138 -388897 -656843
6730f56843r7944l19118L96381L12892k93384K07719J57213J38090p9401k15480
6720d49875j59092L38392r7176n2292J20843L4729L56784o03460L5974J84449
6710b90724k3388k7079j29125K00934j01571K04163k08341Q5938N59712Q6173
6700C56692l1390j85439r7718q9804N2099q9276p8069j54463o8319j36089k62217
6689g83993J05729J79305L68834R346j64003J69378o8526j11296J13996M2860
6679a38370L049J71695k6633J698J11530p1531l8687K29131l20370o9208R1956
6668e5740k91421K35160K50260K77619l41041j22216K40602k81780k12299k00861
6658e01717q5759L73871J93164N26938k33964l73759J72482p47k48169j15244
$$ plain form
6730 -656843 -754787 -1073905 -677524 -364632 -658016 -450297 -293084 -154994 -234395 -449875
6720 -449875 -608967 -270575 -367751 -420043 -299200 -264471 92313 -511147 -475173 -290724
6710 -290724 -314112 -341191 -470316 -269382 -370953 -166790 -375131 -289193 270519 356692
6700 356692 325302 139863 42145 -47659 4440 -84836 -162905 -317368 -385687 -521776 -783993
6689 -783993 -678264 -498959 -130125 -120779 -284782 -115404 -183930 -295226 -181230 -138370
6679 -138370 -135321 36374 9741 11439 122969 51438 12751 241882 -78488 -147696 -55740
6668 -55740 -347161 -112001 138259 415878 74837 -47379 193223 -88557 -300856 -501717
6658 -501717 -587476 -213605 -20441 506497 272533 -101226 71256 70509 -177660 -292904
6648b92904L72178k091J73461Q5134m33683J45726J33237k80318l9431r9708o7686
6637c06085j21771L80783K56325P2644j33559m31586M9314J93463p9907O1545
6627e8834o2103P9572k51003L23535K87691o29067K71013Q3144l56429q6843p0188
6616d69512J58983J98837p5702J86415k79632m10315J39433K91462j06543J00749
6606b65825m46l43544k39559K20250M06840J92587m27129k31883k7586J89479
6596e26816L45986k15032j02889k3262l05997J01239K05098J58114j68295n17274
6586a049128J60654K50145m6820k88266j90770P8026M71134p5717l8741L10808
6576d18675J04537j55423M378K06515K48703n5149k86151J8483K57211j2796l96610
$$ plain form
6648 -292904 79274 77183 250644 335778 -97905 47821 181058 -99260 -138691 -238399 -306085
6637 -306085 -427856 -47073 209252 281896 148337 -283249 -233935 -40472 -120379 -58834
6627 -58834 -120937 -41365 -292368 31167 318858 -310209 -39196 43948 -312481 -399324 -469512
6616 -469512 -310529 -111692 -187394 -979 -280611 -690926 -551493 -260031 -366574 -265825
6606 -265825 -266271 -609815 -849374 -629124 -222284 -29697 -456826 -688709 -716295 -526816
6596 -526816 -180830 -395862 -498751 -522013 -828010 -726771 -521673 -363559 -531854 -1049128
6586 -1049128 -888474 -638329 -685149 -973415 -1164185 -1086159 -615025 -690742 -729483 -418675
6576 -418675 -314138 -469561 -465183 -258668 -9965 -65114 -351265 -332782 -75571 -88367 -484977
6565d84977J62815J31382J02227l1959O5196L2402k12128K8320o4630K70486J33613
6554A32747k37538m3442o241j31174j36184M28244J44994m19937K48678L60521
6544C40668k23439J81649p9754k9713j13268q7960K47499j24060j10379p3258
6534g2015J38387K62786J50705r0117j15116k50712L280J65278K80331n3514l1815
6523C87478l21394K52185j92777m1896K42616l14516m51853J58701J01302j2867
6513a93021q3896l58946N3621r9560J96799k60606J50437N78582j65742p18706
6503i01038K98764J28873J21942j13767k83753J13602k18568J89506m0858l35703
6493a041000M57119N8884K9363q9824k51992J80942j90241K24524o5j24602k88742
$$ plain form
6565 -484977 -322162 -190780 -88553 -120512 -55316 -22914 -235042 -206722 -271352 -866 132747
6554 132747 -104791 -148233 -154474 -285648 -421832 6412 151406 -268531 -19853 340668
6544 340668 117229 298878 219124 189411 76143 -11817 235682 111622 1243 -72015
6534 -72015 66372 329158 479863 389746 274630 23918 27198 192476 472807 419293 387478
6523 387478 66084 318269 125492 83596 326212 11696 -440157 -281456 -180154 -193021
6513 -193021 -276917 -635863 -582242 -681802 -485003 -745609 -595172 -16590 -182332 -901038
6503 -901038 -602274 -473401 -351459 -465226 -748979 -635377 -853945 -664439 -705297 -1041000
6493 -1041000 -583881 -524997 -495634 -585458 -837450 -656508 -846749 -622225 -622290 -746892 -1035634
6482a035634J41123J77717K52641k67045J34433M41848l52577j73776L68850N3319
6472b59101l85230j94246L35966j65842j62023j64201K23109Q9396n50561J50460
6462a082273N8177M75898L14702q8719r6936J41525k13739j62591m0920l16477
6452a011353K56735k0556q6914j93930L48345K19870m08168q7051K33210L04560
6442d45252r421o4305P8462l16500j00472J28827l50929J0944k3555M3734J86226
6431h62241L74909Q3670k02319k6076J18518o74231M6148k4603L88871j75182
6421i52536J27424K74595k35570p8885r9990K32205k57607L36818K91227K213
6411c60106J3767j93091l74559k16404J92885j63127k25305L54946Q3704P1689
$$ plain form
6482 -1035634 -894511 -716794 -464153 -731198 -596765 -154917 -507494 -681270 -312420 -259101
6472 -259101 -644331 -838577 -502611 -668453 -830476 -994677 -771568 -682172 -1232733 -1082273
6462 -1082273 -1024096 -548198 -233496 -322215 -419151 -277626 -491365 -653956 -694876 -1011353
6452 -1011353 -754618 -775174 -862088 -1056018 -707673 -487803 -895971 -983022 -749812 -445252
6442 -445252 -454673 -518978 -440516 -757016 -857488 -728661 -1079590 -1068646 -1092201 -1048467 -862241
6431 -862241 -487332 -403662 -605981 -632057 -513539 -1187770 -1141622 -1166225 -777354 -952536
6421 -952536 -825112 -550517 -786087 -864972 -964962 -732757 -990364 -653546 -362319 -360106
6411 -360106 -346339 -539430 -913989 -1130393 -937508 -1100635 -1325940 -970994 -887290 -815601
6401h15601R8827n29283J63479J73522j37265l6135M1447r1180K15172J72658
6391g44359r3317O052k7190M7999P5459l04490N3159L28177K59950j71496N2722
6380e17334k14915J49407J7102k70947P114J08871L0361J14935k44061k52774
6370a072241L7891l2217N9327l45833R896J26784K08684o799k8873k76826L40033
6359i80174N3310k36535J24461K06347J69155J44214m2175j57059k61176j00759
6349a080391m9410J72983Q5643l043k7008p5125j92266J43113j53938J91331k4755
6338a012866j81360N4398K08542L10911N845j88993K08378k08036k4979P5646
6328g52514k5340k95828R7900M14755j94528j73587J08949l993j65266l5815N2534
$$ plain form
6401 -815601 -716774 -1246057 -1082578 -909056 -1046321 -1082456 -1041009 -1132189 -917017 -744359
6391 -744359 -837676 -831624 -858814 -810815 -735356 -1039846 -986687 -658510 -398560 -570056 -517334
6380 -517334 -732249 -582842 -565740 -836687 -829573 -720702 -690341 -575406 -819467 -1072241
6370 -1072241 -1034350 -1066567 -1007240 -1353073 -1343177 -1216393 -1007709 -1014508 -1043381 -1320207 -980174
6359 -980174 -926864 -1163399 -1038938 -832591 -663436 -519222 -561397 -718456 -979632 -1080391
6349 -1080391 -1129801 -956818 -871175 -874218 -901226 -976351 -1168617 -1025504 -1179442 -988111 -1012866
6338 -1012866 -1194226 -1139828 -931286 -620375 -614530 -803523 -595145 -803181 -828160 -752514
6328 -752514 -777854 -1073682 -975782 -561027 -755555 -929142 -820193 -824186 -989452 -1025267 -972733
6317i72733J73080j43937k24861N2784J54320q2978l0678r2646K03719L12028
6307f51902n63755K49459J12901J4629Q8453O3811K49996k44397j12193j41207
6297i34205J29688K36773k38626J98302P6328j77298J4818K52499j65166k90802
6287h97689J75313k33768J56380L05434O4969l22863P2015l8098K46463J42465
6277c29379L8828K9578k43805q2881L4134O4732m6262J26626n8679p8774K98758
6266b47124j89589m30990L45422K90274r9846P1671l04648o701K7881P9152j40954
6255f05452l64735j72353j564R1836K63928l2645M0508k8047R385J41106k41634
6244h99667L92471M61073l38599k74483M3640L9520o63k59880l8439K15030O418
$$ plain form
6317 -972733 -799653 -943590 -1168451 -1115667 -961347 -1044325 -1075003 -1167649 -963930 -651902
6307 -651902 -1215657 -966198 -853297 -838668 -750215 -686404 -436408 -680805 -792998 -934205
6297 -934205 -804517 -567744 -806370 -608068 -531740 -709038 -694220 -441721 -606887 -897689
6287 -897689 -722376 -956144 -799764 -494330 -429361 -752224 -680209 -718307 -471844 -329379
6277 -329379 -290551 -260973 -504778 -587659 -553525 -488793 -535055 -408429 -467108 -545882 -247124
6266 -247124 -436713 -867703 -522281 -232007 -331853 -260182 -564830 -571531 -543650 -464498 -605452
6255 -605452 -970187 -1142540 -1144104 -1052268 -788340 -820985 -780477 -808524 -799139 -658033 -899667
6244 -899667 -507196 -46123 -384722 -659205 -615565 -576045 -576708 -836588 -875027 -659997 -653579
6233f53579J49233q3263r5427K15796P4125k41434j66419k63616p732L38097k6445
6222g60664j70064K52867P5619N6417K46815k91367k32917J71147l20025j05364
6212a077536M62479J40357k54011J76905J95946n30435q4201J58517j24641L68906
6202e67714q1404j10905M3132j23108m39618K2941M25588q1751P9205J26796p5393
6191g82231k95836L35702J7589k03872Q4938k67212K53630K16467J22052p632
6181e26405N3214j52416r3732Q5372K1689k91193M8298N891J44038Q2416n09958
6170a132786J66918r5923l6248K60789J11901p1190j51654j46896J20545J08513
6160h66031L01225K3358M888J13878L08148l18958J63748l3022j74954l55313
$$ plain form
6233 -653579 -504346 -587609 -683036 -467240 -393115 -634549 -800968 -1064584 -1072316 -734219 -760664
6222 -760664 -930728 -677861 -602242 -545825 -299010 -590377 -823294 -652147 -972172 -1077536
6212 -1077536 -615057 -474700 -728711 -551806 -355860 -886295 -970496 -811979 -936620 -567714
6202 -567714 -649118 -760023 -716891 -839999 -1279617 -1256676 -831088 -912839 -833634 -706838 -782231
6191 -782231 -1078067 -742365 -724776 -928648 -843710 -1110922 -857292 -640825 -518773 -526405
6181 -526405 -473191 -625607 -719339 -633967 -612278 -903471 -855173 -849282 -705244 -622828 -1132786
6170 -1132786 -965868 -1061791 -1098039 -837250 -725349 -796539 -948193 -1095089 -974544 -866031
6160 -866031 -564806 -541448 -536560 -422682 -114534 -433492 -269744 -302766 -477720 -833033
6150h33033Q2491o9175j38690J63952o016L38899O334Q704j63495J99248J31286
6139b79495k54731o1074n7365K23260P3720k74926K35785q5817J98351O4558k71509
6128d89243j74186j83314K68298K4379r7755J03649K47407k6800N9815J88015
6118g9735j1740m47405K71985M33929M2410m31493j79710O0088k32918L06048
6108b68541P7375m7390J14761J16305m75201J81487M69539j16369O4453k06939
6098i0520O3313J84344j69576N5268j37780j05270R7040M27700q0680n01789j43368
6087d01318L62408J22587j4026L2681J00389J46002O9064L02544k08157m94953
6077A7221k6090L16017J84067K3327k43148J57681K970J6030Q993m0574J08635
$$ plain form
6150 -833033 -750542 -819717 -958407 -794455 -800471 -461572 -455238 -446534 -610029 -410781 -279495
6139 -279495 -534226 -595300 -652665 -429405 -355685 -630611 -394826 -480643 -282292 -217734 -489243
6128 -489243 -663429 -846743 -578445 -554066 -651821 -548172 -300765 -327565 -267750 -79735
6118 -79735 -91475 -538880 -266895 167034 209444 -222049 -401759 -341671 -574589 -268541
6108 -268541 -191166 -238556 -123795 -7490 -482691 -301204 168335 51966 116419 -90520
6098 -90520 -27207 157137 -12439 42829 -94951 -200221 -103181 324519 243839 -257950 -401318
6087 -401318 -38910 83677 69651 102332 202721 348723 417787 720331 512174 17221
6077 17221 -8869 307148 491215 514542 271394 429075 432045 448075 457068 416494 525129
6066E25129K2693L6146l03156M0926q7569J66824J65750j83009k1005K40213j97082
6055D05860k83849K99505M22752J61415j06303j6403j61804L98742k81442l50635
6045D87838J60538k19685K18054k75724L13250r724m84952j45542K02271N8455
6035C04779J18638J44945l56365L02513J97107R5784k58439k56605K04378k1537
6025D75198j82546J32626j17910k13376k21177L58814J20759o8738J59676M4378
6015D87704j88474j0503n4617Q6534J29678K35230l92876j59497K18000j23968
6005B27211k79859J27642K80934R0443k2002k82490K50231j02861K12834m1832
5995D60251r0170k39299k83360p0790K5342j62487K60096L83175k06230k39841
$$ plain form
6066 525129 547822 583968 280812 321738 234169 400993 566743 383734 362729 602942 405860
6055 405860 122011 421516 844268 1005683 899380 882977 721173 1119915 838473 487838
6045 487838 648376 428691 646745 371021 684271 674547 189595 44053 246324 304779
6035 304779 423417 568362 211997 514510 711617 807401 548962 292357 496735 475198
6025 475198 292652 425278 307368 93992 -127185 231629 352388 283650 443326 487704
6015 487704 299230 288727 234110 320644 450322 685552 292676 133179 351179 227211
6005 227211 -52648 74994 355928 446371 424369 141879 392110 289249 502083 460251
5995 460251 370081 130782 -152578 -223368 -198026 -360513 -100417 282758 76528 -163313
5985a63313M62395k82167k29682L34856P8961j67865k4116j16774j41216L67387
5975A18466L50095L9945l44204K625L50653p9730l18540j55463J13723J72704
5965B50274o8579j45433P1612m3056J59525j10360R9277K22422K7738j09334j47193
5954B06893K60565J35966J6836k98739L2919J24868m14876M56868J48667m75753
5944A94214K29414K76378K38816n7979q8312L44276K93945j11914k51445r7251
5934I70142J24175J06999K7235k27060k2871J22188r9358m35796N48764K1158
5924A135576j91354K57858Q3085k63105j41295j27204J16431L38254j98657K7114
5914A036703j69687N1244q2432J00670J97287k3633L7694k25564L77986M9231
$$ plain form
5985 -163313 299082 16915 -212767 122089 201050 33185 9069 -107705 -248921 118466
5975 118466 468561 508506 164302 166927 517580 437850 119310 -36153 77570 250274
5965 250274 181695 36262 107874 64818 224343 113983 213260 435682 463420 354086 206893
5954 206893 467458 603424 620260 321521 354440 479308 64432 521300 669967 194214
5944 194214 423628 700006 938822 880843 792531 1136807 1430752 1318838 1067393 970142
5934 970142 1094317 1201316 1228551 1001491 978620 1100808 1001450 565654 1114418 1135576
5924 1135576 944222 1202080 1285165 1022060 880765 753561 869992 1208246 1009589 1036703
5914 1036703 867016 918260 835828 936498 1133785 1110152 1147846 922282 1300268 1349499
5904A349499j07931R5369N1421l09203Q2942M65621j05788K50937k22360m0211
5894A510296o18423k52330R035J4104J3556K19322J50178l17056K2111J70737
5884I21530r1517L992R8247j23032k0470j57260K8086m49554K3194J85711L19007
5873G37934K05237K91023J16830j83696l42833k4854q3200n6194K88980j46754
5863H02473k71605N634j5640M5187P7314o8307K40214k91830l2390K72290M3442
5852H06782N9516l29918J91357J68615l18833l14418K17085M0572R8450k81842
5842C37366L63615j20306K05668K19693j61584K03066l98450m0079L44290j41279
5832H12000n9687O2022j8679M22936j63400K15240n9540l60258K52975j46531
$$ plain form
5904 1349499 1241568 1336937 1388358 1079155 1162097 1627718 1521930 1772867 1550507 1510296
5894 1510296 891873 639543 648578 662682 676238 895560 1045738 728682 750793 921530
5884 921530 830013 834005 932252 809220 788750 631490 659576 210022 233216 418927 737934
5873 737934 943171 1234194 1351024 1167328 824495 799641 716441 660247 949227 802473
5863 802473 530868 536502 520862 566049 643363 575056 815270 523440 491050 763340 806782
5852 806782 866298 536380 727737 896352 577519 263101 480186 520758 619208 337366
5842 337366 700981 580675 786343 1006036 844452 1047518 649068 608989 953279 812000
5832 812000 752313 814335 795656 1218592 1055192 1270432 1210892 850634 1103609 957078
5822I57078j49976M09236J03527K5943O078K68619q8937j1178K19612J1740l13987
5811A437755m2478P272P24442J04468J1065r4437N4145J25222k53330k03514L329
5800A873939K67353L81037M08660j5404J12012p5313J99147J81331O45582m81620
5790C496724J2085N24047k41228J96760j90668L21361j23680k98579L13762J40110
5780D150694j24548j8840K07524n252k64243n8223K79033m02285m65759l84410
5770B913691K65409o3921j08548J0263l19436J8578k19409P8469R9051n58054
5760B116093k00945J31706k6387j5221k2435M08199J06608m34926n01047L95168
5750A956813K12774k19793l23351J2682j00405J0747N0723l0406k2616K35354
$$ plain form
5822 957078 807102 1216338 1319865 1345808 1351886 1620505 1531568 1520390 1740002 1751742 1437755
5811 1437755 1395277 1402549 2126991 2231459 2242524 2148087 2202232 2327454 2074124 1870610 1873939
5800 1873939 2141292 2522329 2930989 2915585 3027597 2952284 3151431 3332762 3978344 3496724
5790 3496724 3508809 4032856 3791628 3988388 3797720 4119081 3995401 3696822 4010584 4150694
5780 4150694 4026146 4007306 4214830 4209578 3945335 3887112 4166145 3763860 3298101 2913691
5770 2913691 3179100 3115179 3006631 3016894 2697458 2716036 2496627 2575096 2674147 2116093
5760 2116093 1915148 2046854 2020467 2005246 1982811 2391010 2497618 2062692 1561645 1956813
5750 1956813 2169587 1949794 1626443 1639125 1538720 1549467 1600190 1569784 1547168 1782522
5740A782522j21444k09087l56617l4921L00609Q2334k27009q4186p0923j42233
5730I19045K7722l4670j30629N0060K45488o689k05093M3532o3399K96599K50521
5719A392487p9674j77723k57869n9459k47648n68N9056K87160L32643r8865n5784
5708A093756j60274l11520k3457k55533J63676L75936J72500o91698j8543L06571
5698F51414Q1447n0133J06874j11915N8606K6894l23495j34122l7857Q5805K25402
5687E78920K51168l7540l08890J70291K39185k9718j75873j67960l21164j8677
5677A79742J51162k95917K56482k04912K8272P4803K56256j72918l08923K86740
5667B50787J68523j36997j61803k7764j50357K07511K72868O447o47047M47408
$$ plain form
5740 1782522 1661078 1451991 1095374 1060453 1361062 1443396 1216387 1132201 1061278 919045
5730 919045 946767 912097 781468 831528 1077016 1070327 865234 908766 845367 1141966 1392487
5719 1392487 1312813 1135090 877221 817762 570114 569546 628602 915762 1248405 1149540 1093756
5708 1093756 933482 621962 598505 342972 506648 882584 1055084 363386 344843 651414
5698 651414 732861 682728 789602 677687 736293 763187 439692 305570 267713 353518 578920
5687 578920 830088 792548 483658 653949 893134 863416 687543 519583 198419 179742
5677 179742 330904 34987 291469 86557 114829 189632 445888 272970 -35953 250787
5667 250787 419310 282313 120510 92746 -57611 149900 422768 429215 -217832 229576
5657B29576j1099l4094k17228r5576J59819R6478k09300l0816J53996j13696K06391
5646A34451p8378J49143j55158k82428J27982q2837Q3926J02713P7518K36657
5636C13589J77451m20186k11188L45570k0980k93452O8882K8424l17737P85483
5626D55856J26063l25230K33526k49289j6359k2185j53058L9835K50002N4763
5616C93924n4289k27772j01308k77958N91203N83404k38034k35928l20814q7892
5606B4536L66371J40667l984k17701l29600J85358j31093j2748l85367J74810
5596a88751L50704k41194j17145K0214L7293N89270K19858l64095l46088J65092
5586A25158K25525Q9270n01677L95775K59090m79309l41601L01746R9248L3265
$$ plain form
5657 229576 218477 184383 -32845 -128421 31398 127876 -81424 -112240 41756 -71940 134451
5646 134451 56073 205216 50058 -232370 -104388 -187225 -103299 -586 76932 313589
5636 313589 491040 70854 -140334 205236 184256 -109196 -40314 -11890 -329627 455856
5626 455856 581919 256689 490215 240926 224567 202382 49324 89159 339161 393924
5616 393924 339635 111863 10555 -267403 323800 907204 669170 433242 112428 24536
5606 24536 390907 531574 527590 309889 -19711 165647 34554 21806 -363561 -188751
5596 -188751 161953 -79241 -196386 -176172 -138879 450391 670249 306154 -39934 125158
5586 125158 350683 439953 -61724 334051 593141 113832 -227769 73977 173225 206490
5576B06490N00954o5732l74221K24082K12021k07585l78189K51803K68440j81286
5566D56777k08556J62159O183J14742m65538j15440K89365N6081R2717L3212k58592
5555A63110J62911l2258j80344K83673k56551J68239J15203P386j94660L11765
5545E48474j4306j533J32604J37870k47643j42256J1851Q7685K55359q7209O1173
5534G42069k5196n5573j23478k57912L2781K56963j6131j79384L8220K12314j34987
5523D89686L98946Q5649m50510P0454Q4920j36460J60914l10658k11268L31837
5513E13510r8191N8223k595r9453l30562J39375K27925J94956l49751O0916M43216
5502G57569l37316J07193Q3574k77470K16427k33054m2028O48644J83092p0230
$$ plain form
5576 206490 707444 641712 267491 491573 703594 496009 117820 369623 638063 456777
5566 456777 248221 410380 416563 531305 65767 -49673 239692 295773 388490 421702 163110
5555 163110 326021 293763 113419 397092 140541 308780 423983 431369 236709 548474
5545 548474 534168 532635 665239 803109 555466 413210 425061 512746 768105 680896 742069
5534 742069 716873 661300 537822 279910 312691 569654 553523 374139 412359 624673 489686
5523 489686 888632 974281 523771 594225 679145 542685 703599 392941 181673 513510
5513 513510 415319 473542 470947 371494 40932 180307 408232 603188 253437 314353 757569
5502 757569 420253 527446 611020 333550 549977 316923 274895 923539 1106631 1036401
5492A036401l51846m3449J32338K8103L59301k45253j20873k38707K67917J68968
5482I92900l06393L32030K55761J17320m38953J01144j07458j73736J68932K15591
5472A157138q4938J28022j62042j95141O47360k57264m31817n73821M60142K39458
5462I27097k50978l68357K44850K24584l41662K02121K41243j23166K70390N0686
5452A076808k26690l59745N0886J97774j45900P7211M66202J40215m01461l01462
5442E73838M7328N1598K34885P4485m2497q0362j50299o0301j9926j91009n526
5431D32214M04328K24716p2375r9732M9103n31506M38887m8495L402q9123M18841
5420A130260J26412M2082M8742j80392k18783l78120R5258L41939K96248j62625
$$ plain form
5492 1036401 684555 641106 773444 801547 1160848 915595 794722 556015 823932 992900
5482 992900 686507 1018537 1274298 1391618 952665 1053809 946351 772615 941547 1157138
5472 1157138 1072200 1200222 1038180 843039 1490399 1233135 801318 227497 687639 927097
5462 927097 676119 307762 552612 777196 435534 637655 878898 755732 1026122 1076808
5452 1076808 850118 490373 541259 739033 593133 670344 1136546 1276761 875300 573838
5442 573838 621166 672764 907649 982134 939637 859275 708976 648675 628749 437740 432214
5431 432214 836542 1061258 988883 889151 938254 406748 845635 797140 800542 711419 1130260
5420 1130260 1256672 1298754 1347496 1167104 948321 570201 665459 1007398 1303646 1141021
5410A141021J2583j42431k90177r8419k4901K06811K90372j2517K5002N8610n6682
5399A109272J932K83885k45818j74563n0855m4048P4994L03145Q7773l76950n177
5388I63590K06471M7902m1001M1073j79030j77180k61271J4096J85348R6178r1658
5377H04518j0631j14141j3845K0247J23680o9456L142J51382R8547l44226O8843
5366G18060m6457J05386J95479k28333J19664J89014j85109J38018k8681n15419
5356D61622N31688J72212Q3729L1884m10499k41085J06195J09958L64797k62237
5346I48264j4890J90899r2238n1815o30428J18905M92320j92310p4813O5812j2275
5335G47431J1490K7589k64895J7329m04293K75921N83954j01145P0056l36019
$$ plain form
5410 1141021 1153604 1011173 720996 622577 597676 804487 1094859 1082342 1107344 1165954 1109272
5399 1109272 1111204 1395089 1149271 974708 923853 879805 954799 1257944 1345717 968767 963590
5388 963590 1170061 1217963 1176962 1218035 1039005 861825 600554 614650 799998 896176 804518
5377 804518 793887 679746 665901 686148 809828 740372 743514 894896 993443 649217 718060
5366 718060 671603 776989 972468 744135 863799 1052813 867704 1005722 977041 461622
5356 461622 993310 1165522 1249251 1281135 870636 629551 735746 845704 1210501 948264
5346 948264 933374 1124273 1032035 980220 349792 468697 961017 768707 693894 759706 747431
5335 747431 758921 786510 521615 538944 134651 410572 994526 893381 963437 627418
5325F27418r7435M3341j1545j98659k37424K70507L72689M58364l18383k46163
5315F62710L84747Q9206R3978m50436k98463K34326J30810J09845j08016j39347
5305G09360j07052p877M22045o6058j79451j13753J44310N8343k04195L18795
5295I74467J68566m51703O0416K12979J63948j9906m35898k82345L07129K23919
5285I21572j83008M1790K73836l73999l0798M36085L9591O0892L1872j82883P3350
5274A108300R4021m92666r1358K74809j7855J3060K91433k80390l2311P0369Q8282
5263A025694k66316J90210K074m5698K24822p4828J99086Q9158J13310j91438
5253A266074O2335R7123j37573k23488l97678J75531J15539K80530L79263p16698
$$ plain form
5325 627418 529983 573324 561779 363120 125696 396203 768892 1227256 908873 662710
5315 662710 1047457 1136663 1230641 780205 481742 716068 846878 956723 848707 709360
5305 709360 602308 594431 1016476 950418 770967 657214 801524 859867 655672 974467
5295 974467 1143033 691330 751746 964725 1128673 1108767 672869 390524 697653 921572
5285 921572 738564 780354 1054190 680191 649393 1085478 1125069 1185961 1217833 1034950 1108300
5274 1108300 1202321 709655 618297 893106 875251 888311 1179744 899354 867043 937412 1025694
5263 1025694 759378 949588 951662 905964 1130786 1055958 1255044 1344202 1457512 1266074
5253 1266074 1328409 1425532 1287959 1064471 666793 842324 957863 1238393 1617656 900958
5243I00958j2187J64519k33690J20732j73260J76166L33566j59300m04629l15906
5233C96969n6731K42828K91584K52364j55982j09648p6138j76930J40965p1997
5223F77284L02997j19866Q9426M8611l33946K72661m9314J32223L1015K72625
5213A323716J15545l77249L50121j94538P7123K5434k42292K68179k80443J73496
5203A239092L70732M0947L256j18715j70058J07987k41317j56057J2021j04504
5193I83384L10010J57003Q9808j7431p27817O5717K68193K86802M4498l30465
5183A129702k21102q1340J85272L1952n1958J97984l9341r8614J2434J02635J46048
5172A313672k609j16419k75082J84722k29136J87582j73946o8433L97833l9687
$$ plain form
5243 900958 888771 1053290 819600 940332 767072 943238 1276804 1117504 712875 396969
5233 396969 340238 583066 874650 1127014 971032 861384 785246 608316 749281 677284
5223 677284 980281 860415 949841 998452 664506 937167 887853 1020076 1051091 1323716
5213 1323716 1439261 1062012 1412133 1217595 1294718 1320152 1077860 1346039 1065596 1239092
5203 1239092 1609824 1650771 1654027 1535312 1365254 1473241 1231924 1075867 1087888 983384
5193 983384 1293394 1450397 1540205 1522774 794957 860674 1128867 1415669 1460167 1129702
5183 1129702 908600 827260 1012532 1044484 992526 1190510 1151169 1052555 1064989 1167624 1313672
5172 1313672 1311063 1194644 919562 1104284 875148 1062730 888784 820351 1218184 1178497
5162A178497m1823L6797o5265k68808k89451k07754M38499L56971O8137J60425
5152A366225P1750R32j33723l33806K7794O849j09737k03116J71549J08459R2449
5141A065625m1559k6316r2805k22070J2280K50893K18610r6626Q2296j32339j14668
5130I03321p2330N89126L60906k70648l26747K60184k21836q3837M7534M12286
5120A597959n8025j4490j37319k20655k60909N4474O39014M4208j30875R3606
5110A606988L683L1107j15684m108K56143o25179k73410J22707N15219J61242
5100A678708l03631R8203J32799j03913k26229N5344J79453P7815K75676l92358
5090A471867j51034M74354J48614n05176l33241K93645M39974N1176l19390j34280
$$ plain form
5162 1178497 1136674 1173471 1108206 839398 549947 342193 780692 1137663 1205800 1366225
5152 1366225 1437975 1438907 1305184 971378 999172 1006021 896284 693168 864717 973176 1065625
5141 1065625 1024066 997750 904945 682875 695155 946048 1164658 1068032 1150328 1017989 903321
5130 903321 830991 1420117 1781023 1510375 1183628 1443812 1221976 1138139 1185673 1597959
5120 1597959 1539934 1525444 1388125 1167470 906561 961035 1600049 1644257 1513382 1606988
5110 1606988 1610671 1641778 1526094 1521986 1778129 1152950 879540 1002247 1517466 1678708
5100 1678708 1375077 1473280 1606079 1502166 1275937 1331281 1510734 1588549 1864225 1471867
5090 1471867 1320833 1795187 1943801 1438625 1105384 1399029 1839003 1890179 1570789 1436509
5080A436509L24969p8838k18668j60603K63025N64448j90573J22525n2115p0210
5070A940469k43883k92570p8282L67954M30959k05357l24462R0702L75192K16719
5060B277441j11826j89860l1185N1334J27496J85037o4489l37127J02165J92212
5050B201198N0634r9220J96606k67751o11748r66K49248L24194j21415K62362
5040B183142L2011j99917L57937M38066m54329j67313J97334j18881J7813r7926
5030B187937K97943j4686K80559O0944l10066l35051M70131R6240O8822J065O3626
5019B867464k7084j93825Q2677N9559J23832N4679k61071J05350J18278L34160
5009C264019R7673k70898K92494R3850M1285k19213p4500M65353j14060l27397
$$ plain form
5080 1436509 1761478 1682640 1463972 1303369 1566394 2130842 1940269 2062794 2010679 1940469
5070 1940469 1696586 1404016 1325734 1693688 2124647 1919290 1594828 1685530 2060722 2277441
5060 2277441 2165615 1975755 1944570 1995904 2123400 2308437 2243948 1906821 2008986 2201198
5050 2201198 2251832 2152612 2349218 2081467 1469719 1468753 1718001 2042195 1920780 2183142
5040 2183142 2215153 2015236 2373173 2811239 2356910 2189597 2386931 2268050 2285863 2187937
5030 2187937 2485880 2471194 2751753 2812697 2502631 2167580 2637711 2733951 2802773 2803838 2867464
5019 2867464 2840380 2646555 2729232 2788791 2912623 2967302 2706231 2811581 2929859 3264019
5009 3264019 3361692 3090794 3383288 3477138 3518423 3299210 3224710 3690063 3576003 3248606
4999C248606J33749N1694k6801L19295L40165l5998k79846J97240k67572R8929
4989C779461J85759k30404R6975l61570K21090L14806o5382M7242L35000k1749
4979D301228L58459J80018k93882Q3924j8083N9164Q9332k1203k8089j61128L86010
4968D935750j59305j01179k7321j72793K77212K29502Q5704k84401j02288K34036
4958D914917J79898L91098j07893J39416P7814k83590N74285J07132k65732L12795
4948F040140J06645r1361l40620J17231J52914q2432K33491J45793j18786r4733
4938F068282L02900J26596k88435R6189J58982Q4453o1432K24114J23910k49713
4928F585846K94824J02469p2078K9797L7353J11900J01259r3546n8566J67646
$$ plain form
4999 3248606 3382355 3434049 3407248 3726543 4066708 4030710 3750864 3948104 3680532 3779461
4989 3779461 3965220 3734816 3831791 3470221 3691311 4006117 3940735 3987977 4322977 4301228
4979 4301228 4659687 4839705 4545823 4629747 4611664 4670828 4760160 4738957 4710868 4549740 4935750
4968 4935750 4776445 4675266 4647945 4475152 4752364 4981866 5067570 4783169 4680881 4914917
4958 4914917 5094815 5485913 5378020 5517436 5595250 5311660 5885945 5993077 5727345 6040140
4948 6040140 6146785 6055424 5714804 5832035 5984949 5902517 6136008 6281801 6163015 6068282
4938 6068282 6371182 6497778 6209343 6305532 6464514 6548967 6487535 6711649 6835559 6585846
4928 6585846 6880670 6983139 6911061 6940858 6978211 7090111 7191370 7097824 7039258 7206904
4918G206904k03852L70928j9864K24573N45282p8182M6906q964k96751n5919K69787
4907H000848M1281j81232L02552J7929k02360L3774r3584q8550J22084N32889
4897H485631L70037R4558P4565m6562k97693j88638J87535K25135n4873l81180
4887H468515J93664K85680K28080N48428l37676J65136J85430k10273J42101N845
4877I674930q6033L55377K36785J01787m40726p1330J16382J56811J15438j21042
4867A0038379N3208N41529N6711m1690j74797l4969J09529R7450M32446n276j42278
4856A0930242J80760R1899J57027M54966J38627j05289L3380j04333L21258Q970
4846A2107507j51537L60759J32209k52888l0792N27355Q9766L5362L75864K33811
$$ plain form
4918 7206904 7003052 7373980 7354116 7578689 8123971 8045789 8092695 8083731 7786980 7731061 8000848
4907 8000848 8042129 7860897 8163449 8181378 7979018 8012792 7919208 7830658 7952742 8485631
4897 8485631 8855668 8950226 9024791 8978229 8680536 8491898 8679433 8904568 8849695 8468515
4887 8468515 8662179 8947859 9175939 9724367 9386691 9551827 9737257 9526984 9669085 9674930
4877 9674930 9588897 9944274 10181059 10282846 9842120 9770790 9887172 10043983 10159421 10038379
4867 10038379 10091587 10633116 10689827 10648137 10473340 10438371 10547900 10645350 11077796 11072520 10930242
4856 10930242 11111002 11202901 11359928 11814894 11953521 11848232 11881612 11777279 12098537 12107507
4846 12107507 11955970 12316729 12448938 12196050 12165258 12692613 12782379 12817741 13193605 13427416
4836A3427416J23661K39136P9776K04134k13180o0915N66985J21434p8906j7628
4826A4391913j2366N95983L25717j5073j21311N79514K9302N9075K37877L74855
4816A6445486K00886k82991J50517L86450R3904K42984Q14193P0901k67371R3604
4806A7948563P10563L31180q0585N7283O51807K22082L14329L41955N85318K155
4796B1084650J02422K22924O32630M97926L21488K01335L32859O27322J62841
4787B4186397N50494N65019P90850J59482J98700M26693N95837M55168R51944
4778B8880584L73879j01713K15248R88551P28992L62230O67331Q46081O28264
4769C3589447N86975K89799Q93240R69420J014773J112268N16563O67409J061693
$$ plain form
4836 13427416 13551077 13790213 13869989 14074123 13860943 13800028 14367013 14488447 14409541 14391913
4826 14391913 14379547 14975530 15301247 15286174 15164863 15744377 15773679 15832754 16070631 16445486
4816 16445486 16646372 16363381 16513898 16900348 16994252 17237236 18051429 18122330 17854959 17948563
4806 17948563 18659126 18990306 18909721 18967004 19618811 19840893 20155222 20497177 21082495 21084650
4796 21084650 21187072 21409996 22042626 22540552 22862040 23063375 23396234 24023556 24186397
4787 24186397 24736891 25301910 26092760 26252242 26450942 26877635 27473472 27928640 28880584
4778 28880584 29254463 29152750 29367998 30356549 31085541 31447771 32115102 32961183 33589447
4769 33589447 34176422 34466221 35359461 36328881 37343654 38455922 38972485 39639894 40701587
4760D0701587R36111P79676J318877Q90193P65312J391746J292462R85730J262988
4751E0324682J367013J419322J218390J071312J446503J308652J667474J968837
4743F1792185R91752J530361K097425K052524J619176J591537K256918K407352
4735G6339230K140058J996241J990963K402018K148200K442864K883031K603974
4727I4946579L055628L029193L484631L284669L400385L730333L721717M107212
4719A22760347L734487M066975M738209M917920N081377N378809N434163N947163
4711A62059450N824055O267555O675159O727504P283155P429440Q016391P756943
4703B18039652Q119036Q589034R142400Q912167R073233R595784R629694J0102359
$$ plain form
4760 40701587 41637698 42417374 43736251 44626444 45391756 46783502 48075964 49061694 50324682
4751 50324682 51691695 53111017 54329407 55400719 56847222 58155874 59823348 61792185
4743 61792185 62783937 64314298 66411723 68464247 70083423 71674960 73931878 76339230
4735 76339230 78479288 80475529 82466492 84868510 87016710 89459574 92342605 94946579
4727 94946579 98002207 101031400 104516031 107800700 111201085 114931418 118653135 122760347
4719 122760347 126494834 130561809 135300018 140217938 145299315 150678124 156112287 162059450
4711 162059450 167883505 174151060 180826219 187553723 194836878 202266318 210282709 218039652
4703 218039652 226158688 234747722 243890122 252802289 261875522 271471306 281101000 291203359
4695B91203359R665844R758721Q617282Q774579Q608929Q101849P460214N923687
4687C58114464N426090M261649K618937J562802N38640p77771k169289l255520
4679C66320002m394351n741194n811654o790437p618403p974568q872764q979087
4671C10137544q651196q973717r101990q917250q889685q481385q743682q319095
4663B40059544p828723p829346p350084p147653o598815o628014o752821n915933
4655A84008155n674790n763436n255176n131188m977395n073753m587263l837697
4647A43707457m181035l880249l497620l985320l605259l442396l333408k926920
4639A14855250l158486l010825l000758k439158k715373k771831k156678k020558
$$ plain form
4695 291203359 300869203 310627924 319245206 328019785 336628714 344730563 352190777 358114464
4687 358114464 363540554 367802203 370421140 371983942 372522582 371744811 369575522 366320002
4679 366320002 361925651 356184457 350372803 343582366 335963963 327989395 319116631 310137544
4671 310137544 301486348 292512631 283410641 274493391 265603706 257122321 248378639 240059544
4663 240059544 232230821 224401475 217051391 209903738 203304923 196676909 189924088 184008155
4655 184008155 178333365 172569929 167314753 162183565 157206170 152132417 147545154 143707457
4647 143707457 139526422 135646173 132148553 128163233 124557974 121115578 117782170 114855250
4639 114855250 111696764 108685939 105685181 103246023 100530650 97758819 95602141 93581583
4631I3581583k385240k115907j939474k200964k090172j850278k119407j999256
4623G6880885j577681j883260j887944j371030j422180j420889j398715j427307
4615F4491879j461284j283076j068665j413621j336687j541411q17192q02833
4607E4767110r69261j274097j149655j165079q01994q76829j182870r59731p03609
4598D5683985j032032r47342q16861n37562m66845p04050r75299o46578o00537
4589C8956879n22575l17142p83886o70376r65561m89914m34738m31923m22544
4580C3918220O013p68338m78733o14936k14360m11700p75356l00704M9055J58050
4570C0567211o08366o32206m08651N5636o38587m70322n3553k95623k53672l66579
$$ plain form
4631 93581583 91196343 89080436 87140962 84939998 82849826 80999548 78880141 76880885
4623 76880885 75303204 73419944 71532000 70160970 68738790 67317901 65919186 64491879
4615 64491879 63030595 61747519 60678854 59265233 57928546 56387135 55569943 54767110
4607 54767110 53797849 52523752 51374097 50209018 49407024 48530195 47347325 46387594 45683985
4598 45683985 44651953 43704611 42887750 42350188 41883343 41179293 40203994 39557416 38956879
4589 38956879 38434304 38117162 37333276 36662900 35697339 35207425 34772687 34340764 33918220
4580 33918220 33924233 33155895 32677162 32062226 31847866 31436166 30660810 30360106 30409161 30567211
4570 30567211 29958845 29326639 28917988 28973624 28335037 27864715 27811162 27515539 27261867 26895288
4560B6895288m53047l17284j2677J1867m87328m3257l25543K29l47963j54542
4550B4765743N1083j30215m48513l18655j13616l08735J54432k8165q6255q3319
4540B3453785l5907M3002k48814m10085J74695l87475k42910P5111l77962j45989
4530B1897451l9872M07643J42460l55135j50421l78523M9976J00617j20593o6821
4520B1486782J96448j38714J35103n05086k58814k9529N77058n2368k66411j29009
4510B1015460p7059j71072j44245R8027J15539j68286k65185R4805L11637p5982
4500B0733639l97831n09914q4190K1749n07073n4897R3145J14419k18415r2265
4490A9098367j68384R3729m15982j01598o5554L22385n235k66555J98968o873
$$ plain form
4560 26895288 26442241 26124957 26112280 26124147 25636819 25593562 25268019 25268248 24920285 24765743
4550 24765743 24816826 24686611 24238098 23919443 23805827 23497092 23651524 23623359 23537104 23453785
4540 23453785 23417878 23460880 23212066 22801981 22976676 22589201 22346291 22421402 22043440 21897451
4530 21897451 21857579 22265222 22407682 22052547 21902126 21523603 21573579 21674196 21553603 21486782
4520 21486782 21683230 21544516 21679619 21174533 20915719 20886190 21463248 21410880 21144469 21015460
4510 21015460 20938401 20767329 20623084 20721111 20836650 20668364 20403179 20497984 20809621 20733639
4500 20733639 20335808 19825894 19741704 19763453 19256380 19201483 19294628 19409047 19190632 19098367
4490 19098367 18929983 19023712 18607730 18506132 18440578 18762963 18757728 18491173 18690141 18683268
4480A8683268j55691J60921n35691k76387K09146k57971k40916q6689j80753L86835
4470A7706072k59819l20568k49468k7448n6019k2870M9783l48912l82100L7905
4460A6126556l79340P0880o4163l72656j85971o8782J12931n37250k94949k33132
4450A4174124o7956k04489k10937j08234J56014j31356k87656n5918K39960J04282
4440A3607834k5527o34478p36047J33978L320k02420j16090Q3204K59830l77639
4430A1995965k54901q154j5957J95837L3449j90104l17583k84111l64987m49149
4420A0340305M10J83616j83245o8086q4938l40666L9557j21865p945Q0276J6271
4409I853690l94112l34284m683L9282j11592m627K26062j00400J8176L9313l55332
$$ plain form
4480 18683268 18527577 18688498 18152807 17876420 18085566 17827595 17586679 17499990 17319237 17706072
4470 17706072 17446253 17125685 16876217 16848769 16792750 16769880 16819663 16470751 16088651 16126556
4460 16126556 15747216 15818096 15753933 15381277 15195306 15126524 15239455 14702205 14407256 14174124
4450 14174124 14106168 13901679 13690742 13582508 13738522 13607166 13319510 13263592 13503552 13607834
4440 13607834 13582307 12947829 12211782 12345760 12349080 12146660 12030570 12113774 12373604 11995965
4430 11995965 11741064 11732910 11716953 11912790 11946239 11756135 11438552 11154441 10789454 10340305
4420 10340305 10340715 10524331 10341086 10273000 10188062 9847396 9886953 9765088 9757143 9837419 9853690
4409 9853690 9459578 9125294 9120611 9159893 9048301 9043674 9269736 9169336 9187512 9226825 8871493
4398H871493j96360l97458J62378j0446k22785K78003K4890l56903J38981K87456
4388H579249J90926O5465o70691j34287k66458O7471j17550j35847L00898L97168
4378H276344m5582k6846J09810l37219J37259J7133j41670j79117M89562l13102
4368G986572j7340k81562k86944L21098o2682l84656J00435J67140N5645l9286
4358G558420j40494N36003l55749k48854J3935M4806k25422l183K37873q3655
4348G333680k40921k10998J25976K77821K71061M7624n581k74395k72414n5047
4338F996806J61222K95539k72392n8545j46070k56673K41409N052J87083l8790
4328G114641j75534j70956L63821K65374j69891P2359M4786j98463N8480k36816
$$ plain form
4398 8871493 8675133 8277675 8440053 8429607 8206822 8484825 8509715 8152812 8291793 8579249
4388 8579249 8770175 8835640 8164949 8030662 7764204 7831675 7714125 7578278 7879176 8276344
4378 8276344 8230762 8203916 8313726 7976507 8113766 8130899 7989229 7810112 8299674 7986572
4368 7986572 7969232 7687670 7400726 7721824 7659142 7274486 7374921 7542061 7597706 7558420
4358 7558420 7417926 7953929 7598180 7349326 7363261 7408067 7182645 7179462 7417335 7333680
4348 7333680 7092759 6881761 7007737 7285558 7556619 7604243 7598662 7324267 7051853 6996806
4338 6996806 7158028 7453567 7181175 7122630 6976560 6719887 6961296 6966348 7153431 7114641
4328 7114641 6939107 6768151 7131972 7397346 7227455 7299814 7344600 7146137 7204617 6967801
4318F967801N55489J59792m83576K82601J79533J03188K54953j3628j31212J02990
4308G977931j98275j17510k5726M9145K02975K24575l41460K2604L5076O09962
4298H439297k7457j56647J49259J15241J13017k72928R6103J99227j40773K20724
4288H735063K52154m0521O6862N35947q3063j66110M3573K20757j39098L35780
4278I761344q5665K85519M21937K3090p0593K91209k24936K1390M63090M61875
4268A1348260K27488j67986J65365K92846J70217J63294K40132K14558K52820
4259A2906994L35402L14627L7993J66859J07083K80089L13801j29436J19812O23798
4249A5077022J64114K59443j97087J11464k6891r9842m93869R3139k68561k40786
$$ plain form
4318 6967801 7523290 7683082 7199506 7482107 7661640 7764828 8019781 8006153 7874941 7977931
4308 7977931 7779656 7662146 7636420 7685565 7888540 8113115 7771655 7794259 7829335 8439297
4298 8439297 8411840 8255193 8404452 8519693 8632710 8359782 8455885 8655112 8514339 8735063
4288 8735063 8987217 8946696 9013558 9549505 9466442 9300332 9343905 9564662 9425564 9761344
4278 9761344 9675679 9961198 10383135 10406225 10335632 10626841 10401905 10423295 10886385 11348260
4268 11348260 11575748 11407762 11573127 11865973 12036190 12199484 12439616 12654174 12906994
4259 12906994 13242396 13557023 13595016 13761875 13868958 14149047 14462848 14333412 14453224 15077022
4249 15077022 15241136 15500579 15303492 15414956 15388065 15288223 14794354 14887493 14618932 14378146
4239A4378146J26615m8082L22505k3849o46017M08113K8486J32792J21630j57118
4229A4643221J94975n0339J15482j69046K41365R3194l99470p2778m8420n4716
4219A4493468n90048l86882N3818K6477m26767m9093j21829o0840K29215j05502
4209A3062017l02842j73014J38512q4387l37113j76990o3250p8500k77335R5084
4199A1802182L68628j17340j33358k71383K8295L49895K08564p7250J87456J77109
4189A2522798p627k3737J4441J99099j57153m8862M9761j63564M9021K34130j6030
4178A2652277K31631K0703L95987K59986k36699j42627O0167J46181K01126O2802
4168A3651534O34184K19457j09981M05928J99487L29727K74779q4972J17581K85220
$$ plain form
4239 14378146 14504761 14456679 14779184 14755335 14109318 14517431 14545917 14678709 14800339 14643221
4229 14643221 14838196 14787857 14903339 14734293 14975658 15068852 14669382 14596604 14548184 14493468
4219 14493468 13903420 13516538 13570356 13596833 13170066 13120973 12999144 12938304 13167519 13062017
4209 13062017 12759175 12586161 12724673 12640286 12303173 12126183 12062933 11984433 11707098 11802182
4199 11802182 12170810 12053470 11920112 11648729 11677024 12026919 12235483 12158233 12345689 12522798
4189 12522798 12515171 12491434 12505875 12704974 12547821 12498959 12548720 12385156 12434177 12668307 12652277
4178 12652277 12883908 12904611 13300598 13560584 13323885 13181258 13241425 13387606 13588732 13651534
4168 13651534 14285718 14505175 14395194 14801122 15000609 15330336 15605115 15520143 15637724 15922944
4158A5922944K69937K43336l20598k6097m7646m2422j45783Q3146J97019K68804
4148A6402640k15461m72455j6722K19193J28268J62970l77066Q3126m25662K362
4138A5491193L12986k47221L2205k11225J69027l08725m23897P3492q298J50162
4128A5029699K9930k40224j893m5518N0363K46195j60275L934o15220L51287K26443
4117A4874721m09189J27315L48930K1271j70982L71400m3432l97491M89719J58019
4107A5370281L48676j95668o15633M02968K00581k97483M8060L98513P7476k42772
4097A5494999j26226o172M45092j46702n2860J67317J06165L4497J43970k2767
4087A6037313m75538j01216L26269k07308l2996K60252m67858l19809Q2808R7447
$$ plain form
4158 15922944 16192881 16436217 16115619 16089522 16041876 15999454 15853671 15936817 16133836 16402640
4148 16402640 16187179 15714724 15698002 15917195 16045463 16208433 15831367 15914493 15488831 15491193
4138 15491193 15804179 15556958 15589163 15377938 15546965 15238240 14814343 14887835 14879537 15029699
4128 15029699 15059629 14819405 14817512 14771994 14822357 15068552 14908277 14912211 14296991 14648278 14874721
4117 14874721 14465532 14592847 14941777 14963048 14792066 15163466 15120034 14722543 15212262 15370281
4107 15370281 15718957 15523289 14907656 15310624 15511205 15213722 15261782 15660295 15737771 15494999
4097 15494999 15368773 15362601 15807693 15660991 15608131 15775448 15881613 15916110 16060080 16037313
4087 16037313 15561775 15460559 15786828 15579520 15546524 15806776 15338918 15019109 15101917 15199364
4077A5199364l09983p0013k2603K1645j98441K12293n3005q1690m55898n64013
4067A3677656k7007j41594k09556m50986l06593k69735l29311K5497m10767j57106
4057A1400498l53984k93561m66546M5282j8567J56093N6366J7365k17724m31348
4047I893874l26030j25509L9428o0209o25663q7005J61813k34984J83645N1191
4037H870551l21702l63763J53241M3366P9507j74499m15495J91857K75567j24734
4027H213896k53381J41793j29734k0615J82076m26219K99511O0937j34155j5515
4017G918594k74970L77444M1801m09011j42559l6267j39503K39370j60947N583
4007G419535K49925L93466J90258k79955K2458r6995j26925J83997M14904k47831
$$ plain form
4077 15199364 14889381 14819368 14796765 14818410 14619969 14832262 14779257 14697567 14241669 13677656
4067 13677656 13650649 13509055 13299499 12848513 12541920 12272185 11942874 11968371 11557604 11400498
4057 11400498 11046514 10752953 10286407 10331689 10313122 10469215 10525581 10542946 10325222 9893874
4047 9893874 9567844 9442335 9481763 9421554 8795891 8708886 8870699 8635715 8819360 8870551
4037 8870551 8548849 8185086 8338327 8381693 8461200 8286701 7871206 8063063 8338630 8213896
4027 8213896 7960515 8102308 7972574 7951959 8134035 7707816 8007327 8068264 7934109 7918594
4017 7918594 7643624 8021068 8062869 7653858 7511299 7475032 7335529 7574899 7413952 7419535
4007 7419535 7669460 8062926 8253184 7973229 7995687 7898692 7771767 7955764 8370668 8122837
3997H122837L86182L20432j28900k34491L84918J83414J92794Q0376j44244J99563
3987I362881K9968J82752K29013n2135l17783j34649L65042m728k62350N64690
3977I962701L07225j21600m89612J8371k64820J69810N1116K52449P6315l3705
3967I928250J98150j71340l2791k73l7266k44407K15083M87813n267j36045M39846
3956A0641753M6759L29j03985J84663R4375j20217J55122M07953L85254l3990
3946A1658016n2631O42462L4794K20086J4067k14940M58684J99038j13805K89724
3936A3135495M32462K27353Q7821J52951K4798P79823L66600L23896K60461K3653
3926A5815313K80614K10841M78351O73916M88618O57417J92716M61571N60038
$$ plain form
3997 8122837 8509019 8829451 8700551 8466060 8850978 9034392 9227186 9307562 9163318 9362881
3987 9362881 9392849 9575601 9804614 9752479 9434696 9300047 9665089 9660361 9398011 9962701
3977 9962701 10269926 10148326 9658714 9677085 9412265 9582075 9633191 9885640 9961955 9928250
3967 9928250 10126400 9955060 9922269 9921996 9884730 9640323 9855406 10343219 10337952 10201907 10641753
3956 10641753 10688512 10688841 10584856 10769519 10863894 10743677 10898799 11306752 11692006 11658016
3946 11658016 11605385 12247847 12282641 12502727 12516794 12301854 12760538 12959576 12845771 13135495
3936 13135495 13567957 13795310 13883131 14036082 14060880 14840703 15207303 15531199 15791660 15815313
3926 15815313 16095927 16306768 16785119 17459035 17947653 18605070 18797786 19259357 19819395
3917A9819395L71552L15125L11369K98335N17560N32391P53218L77359O17473
3908B3913777J033099P90401N57297N01332P81261N94461J195401J036445M23328
3899C0826802P32829J413529P61714J137395J408718J361251J136206J546836
3891D0325280J375497J304235J203085J848396K081629K122777J977304J840052
3883E4078255K277326K593982K556444K887338K959424K594995L056561L463825
3875G6468150L209038L573529L642201L915026L524293L495504M076164L630229
3867A05534134M066129M087047L420801L440515L640770L775226L236528K936570
3859A34137720K975151K750609K288523K017712J784280J746329R65992M53079
$$ plain form
3917 19819395 20190947 20506072 20817441 21115776 21633336 22165727 22918945 23296304 23913777
3908 23913777 24946876 25737277 26294574 26795906 27577167 28171628 29367029 30403474 30826802
3899 30826802 31559631 32973160 33734874 34872269 36280987 37642238 38778444 40325280
3891 40325280 41700777 43005012 44208097 46056493 48138122 50260899 52238203 54078255
3883 54078255 56355581 58949563 61506007 64393345 67352769 69947764 73004325 76468150
3875 76468150 79677188 83250717 86892918 90807944 94332237 97827741 101903905 105534134
3867 105534134 109600263 113687310 117108111 120548626 124189396 127964622 131201150 134137720
3859 134137720 137112871 139863480 142152003 144169715 145953995 147700324 148666316 149119395
3851A49119395N07533J49350k09960j003689j179716j452607j487534j846853
3843A42595919k465472k389240k533913l082923l183617l368091l366127l334270
3835A18872266l413672l442092l870123l841673l570637l516563l647588l573725
3827H9996193l442779l479536k910298l012374l018708l308408k941027k416544
3819F5466519k673880k193612k313825j924532j889208j863002j740212j772642
3811D9095606j543740j870378j525343j453580j418994j049942j465048j394526
3803C7374055r04567q01592j145848j234534p29234p62518r60651p68837r91817
3794B9074457q46062r18236p47781m40133o04615k95372r03938o36255p20177
$$ plain form
3851 149119395 149626928 149776278 149566318 148562629 147382913 145930306 144442772 142595919
3843 142595919 140130447 137741207 135207294 132124371 128940754 125572663 122206536 118872266
3835 118872266 115458594 112016502 108146379 104304706 100734069 97217506 93569918 89996193
3827 89996193 86553414 83073878 80163580 77151206 74132498 70824090 67883063 65466519
3819 65466519 62792639 60599027 58285202 56360670 54471462 52608460 50868248 49095606
3811 49095606 47551866 45681488 44156145 42702565 41283571 40233629 38768581 37374055
3803 37374055 36469488 35667896 34522048 33287514 32558280 31795762 30835111 30066274 29074457
3794 29074457 28228395 27310159 26562378 26122245 25517630 25222258 24318320 23682065 22961888
3785B2961888n68627k38959o04697m70093l66178p37632l10997m42637q57735
3776A8364333l12942k96721o77941l04682l44046l68227l90356m05302J61139
3767A5425255j35016m90673q31238j06140j81955j82540k41051j43125m27836
3758A2685681m71532l93957j13208n9156m46449L2553l05702l66352j89737o9922
3748A0302219j29047Q7189n35099J1806k30056k32645l24629l07205J76207j32051
3738H686689n5621j35743k01797K26264J08932n50877o27695n8409p4391j47759
3728G169593J45328J38134l19632m79282K2466J42934p5049j02962J42353o20678
3718F163205j97376J14514m26557l92443R8305L40222k59170j77702J99194K45085
$$ plain form
3785 22961888 22393261 22154302 21549605 21079512 20713334 19975702 19664705 19222068 18364333
3776 18364333 18051391 17754670 17076729 16772047 16428001 16059774 15669418 15264116 15425255
3767 15425255 15290239 14799566 13968328 13862188 13680233 13497693 13256642 13113517 12685681
3758 12685681 12214149 11820192 11706984 11647828 11201379 11233932 10928230 10561878 10372141 10302219
3748 10302219 10173172 10260361 9725262 9737068 9507012 9274367 8949738 8642533 8818740 8686689
3738 8686689 8631068 8495325 8293528 8519792 8628724 8077847 7450152 7391743 7317352 7169593
3728 7169593 7314921 7453055 7133423 6654141 6676607 6819541 6744492 6641530 6783883 6163205
3718 6163205 5965829 6080343 5653786 5261343 5359648 5699870 5440700 5262998 5462192 5707277
3708E707277J92444r2358m09021q0526j95910m9549Q5450l2664j9096k77059q7993
3697D740995o9978J28633J24070k57378k20288j74927L7121k02753L45597J51676
3687D602768k15193K62461p1255j87580l50140m0812M09228L8111n42415l0138
3677C875035L43463J61903l64676p9740o2399o493k32560k78408N5096Q6314l75852
3666C121683N1241O7513M5356P5290n5623j89197k59050n6710J70270P3838m2855
3655C001756n083O9292k73245l44633r7651M86197n1523j00533M79037l01185
3645B862429Q9832K95357m41806m91430k87480M2454R0893J77466j01160J66546
3635B403101K9896k84961k66194j31529M1927k2120j47660L34767M57291l85898
$$ plain form
3708 5707277 5899721 5807363 5398342 5317816 5121906 5072357 5157807 5125143 5106047 4828988 4740995
3697 4740995 4671017 4799650 4923720 4666342 4446054 4271127 4308248 4105495 4451092 4602768
3687 4602768 4387575 4650036 4578781 4391201 4041061 4000249 4409477 4447588 3905173 3875035
3677 3875035 4218498 4380401 4015725 3935985 3873586 3867093 3634533 3356125 3411221 3497535 3121683
3666 3121683 3172924 3240437 3285793 3361083 3305460 3116263 2857213 2800503 2970773 3044611 3001756
3655 3001756 2996673 3065965 2792720 2448087 2350436 2836633 2785110 2684577 3163614 2862429
3645 2862429 2952261 3247618 2805812 2314382 2026902 2069356 2160249 2337715 2236555 2403101
3635 2403101 2432997 2148036 1881842 1750313 1792240 1770120 1622460 1957227 2414518 2028620
3625B028620L4762j90733L38819J58030j66807j91430k04209J20219K13949k56407
3615A884813k29781L04758j18991j72789j05544J01864M98749k72628L4098Q9946
3605B014495q5204K3614j47929J15206N8947n47870j18114M83634K05667j81638
3595A820808L73065l23387j66731j39236k69398K19187l2298K09277n0342m79922
3585A161023J57762J61483L1045J65530j61677L6226m38157J69831L95061j95586
3575A482541Q7972r7297J45071J77663R3119k97738k05308j3850K59990n2037
3565A580126P1032J6640J8631m9239L0696k0994l2193p1963J59632J21842p5027
3554A749183K65822L3556k89001m79026J35266m53489k5537L92770N5086o2164
$$ plain form
3625 2028620 2063382 1872649 2211468 2369498 2202691 2011261 1807052 1927271 2141220 1884813
3615 1884813 1655032 1959790 1840799 1668010 1562466 1664330 2163079 1890451 1924549 2014495
3605 2014495 1929291 1952905 1804976 1920182 1979129 1431259 1313145 1796779 2002446 1820808
3595 1820808 2193873 1870486 1703755 1564519 1295121 1514308 1482010 1691287 1640945 1161023
3585 1161023 1318785 1480268 1511313 1676843 1515166 1551392 1113235 1283066 1678127 1482541
3575 1482541 1570513 1473216 1618287 1795950 1889069 1591331 1386023 1372173 1632163 1580126
3565 1580126 1651158 1667798 1686429 1637190 1667886 1646892 1614699 1542736 1702368 1824210 1749183
3554 1749183 2015005 2048561 1759560 1280534 1415800 962311 936774 1329544 1384630 1322466
3544A322466L4608q977K008j8797O1126J73681L38861k10123n9964J0005m01563
3533A243331p7808J65899j50600R314N16033O5730j77233Q5334l14354j31802
3523A233844j62642M3379j327N2718K61121K71881j80455l3260M1782K54105n5973
3512A725173k02728M7248o7056l58361l37339L23888N91632J62631m11729k74550
3502A198809l26851k7933M1542L14693K67145o7252k23267N7580j7825j70972
3492A045669K72745L38240l41989m38057j77446K8313J34249L67049j25032j87965
3482I15776k71285p27728K02286K94350J94657O0502O9004j12513K82142R4198
3472A001389k2682k40101q4550p6526r733p4201o273K03091l04606J63536J27975
$$ plain form
3544 1322466 1357074 1348097 1350105 1331308 1392434 1566115 1904976 1694853 1634889 1644894 1243331
3533 1243331 1165523 1331422 1180822 1190136 1706169 1771899 1594666 1680000 1365646 1233844
3523 1233844 1071202 1114581 1113254 1165972 1427093 1698974 1518519 1485259 1527041 1781146 1725173
3512 1725173 1522445 1569693 1502637 1144276 806937 1130825 1722457 1885088 1473359 1198809
3502 1198809 871958 844025 885567 1200260 1467405 1400153 1176886 1234466 1216641 1045669
3492 1045669 1318414 1656654 1314665 876608 699162 727475 861724 1228773 1103741 915776
3482 915776 644491 -83237 119049 413399 608056 668558 737562 625049 907191 1001389
3472 1001389 978707 738606 654056 577530 567797 493596 487323 690414 385808 549344 677319
3461F77319j72998O231L45698N12516m81439n26060R7052J47331J30237k02398
3451E33489J20389j50391l27889J99053r1421N0865L28934r0849J69620m94011
3441B47789K43509j45451r9703M40038R070p4629l56823j59176j17970J85561
3431A72215Q4850K29192o3113R745j56027l6194J67361l03033r5331k08398L69391
3420A70658J79104j75143j18448l236J63690K16957k1165L83638k44183l96039
3410A55833k05305L52022L23553j81958j70705k41123l1391n2722P7910m2962
3400a6848M89048m7853k63171n1287J61254j10694l7588J83699R3917J15792k52733
3389B63536p6423n56676J1670M40055R5882l00163N9867K35078K45536k75728
$$ plain form
3461 677319 504321 510552 856250 1368766 887327 361267 458319 605650 735887 533489
3451 533489 653878 503487 175598 374651 283230 334095 663029 572180 741800 247789
3441 247789 491298 345847 246144 686182 695252 620623 263800 104624 -13346 172215
3431 172215 257065 486257 423144 432889 276862 240668 408029 104996 9665 -198733 170658
3420 170658 349762 174619 56171 52935 216625 433582 412417 796055 551872 155833
3410 155833 -49472 302550 626103 444145 273440 32317 926 -51796 26114 -16848
3400 -16848 472200 424347 161176 109889 271143 160449 122861 306560 400477 516269 263536
3389 263536 187113 -369563 -357893 82162 178044 -122119 -62252 172826 418362 142634
3379A42634m03769M30139L38563l59646K98693L9472l51049k61143k0647L00862
3369A54109n6690n6624j68142J77682n366m0234o8712l4807Q5654J65301J44521
3358B96692m1377L0080K1135l10863n7523l7997n0932j80620L52682N5559r4781
3347a7945M13659j12196l57239j42708k8068J64043K79559r8694k50202K35619
3337H5828J16895j83587k05555L35038m0551m146P1879q3132J04429m53846J23788
3326a32960K66105J1657j20039k34775j21511L1760J25635j10293J03476J89431
3316H486L32841l66591K20507k1439j69040l3500p572J23983j4350j79421l73780
3305d79876L23695J60295k27519k84320M88702K74327r9520k97126J86664K16512
$$ plain form
3379 142634 -261135 169004 507567 147921 446614 486086 135037 -126106 -146753 154109
3369 154109 97419 40795 -127347 50335 44969 4735 -63977 -98784 -13130 152171 296692
3358 296692 255315 285395 306530 -4333 -61856 -99853 -150785 -331405 21277 76836 -17945
3347 -17945 395714 283518 -73721 -216429 -244497 -80454 199105 100411 -149791 85828
3337 85828 202723 19136 -186419 148619 108068 103922 175801 92669 197098 -256748 -132960
3326 -132960 133145 144802 24763 -210012 -331523 -299763 -174128 -284421 -180945 8486
3316 8486 341327 -25264 195243 173804 4764 -28736 -36308 87675 73325 -106096 -479876
3305 -479876 -156181 4114 -223405 -507725 -19023 255304 155784 -141342 45322 261834
3295B61834J16223k8781o3961j83752j45970L56388k09590q2386j48653K4179
3285a04469j82244O4821k51688j48464L05320K86332k12257p8143o6625J12802
3275b74615J14173o8195L44765M4559j37267j07046Q0204L40237l61791j34298
3265a59274L467K38069M2622j80326L18254k40198l57018l68318K04205k56813
3255g55330K63243M83269J009m9296J91210k29976K33774m15969l01275j1486
3245e90827K62569O2143j59341j47749R7223J45941r4179O7825K1315L14210K58291
3234B37421j51198k0285m7091l82734L98076J65358m96979J77577K94624j22280
3224E2489M7288N2780k41786l00096j20306J5019J87404j01835q5895J67982J21340
$$ plain form
3295 261834 378057 349276 285315 101563 -44407 311981 102391 20005 -128648 -104469
3285 -104469 -286713 -221892 -473580 -622044 -316724 -30392 -242649 -320792 -387417 -274615
3275 -274615 -160442 -228637 116128 160687 23420 -83626 -3422 336815 -24976 -159274
3265 -159274 -155807 82262 124884 -55442 262812 22614 -334404 -702722 -498517 -755330
3255 -755330 -492087 -8818 -7809 -57105 134105 -95871 137903 -278066 -579341 -590827
3245 -590827 -328258 -266115 -425456 -573205 -475982 -330041 -424220 -356395 -335080 -20870 237421
3234 237421 86223 65938 18847 -363887 34189 199547 -297432 -119855 174769 52489
3224 52489 99777 152557 -89229 -389325 -509631 -494612 -307208 -409043 -494938 -326956 -205616
3213b05616j9517M7856L06564j30474j76234j15753j0993K17952J40987j06658
3203e1886l18908J62992k49491K78283P3606J74830O6063n0481m08200j62901
3193d86093K19208m8341K43535J45192l14274o9459K44969M7389N217K3507k39004
3182b28154j14785j6526j41629k11038K19236O7572J49049J41300k29084N4562
3172c09497j37160J83043L71161l54543j84572K14368Q5949M06169m48389K11952
3162C8481l56438n17715L94869K91074k12608M43383j1404j7531j98436k06641
3152c52966J67711j37224P5436j066J17476j30437j54685N1251l11986J37133
3142e39357K38563J14969K97870l27879j62314N2852j65812L43488K59170m51996
$$ plain form
3213 -205616 -225133 -177277 129287 -1187 -177421 -293174 -304167 -86215 54772 -51886
3203 -51886 -370794 -207802 -457293 -179010 -105404 69426 135489 85008 -323192 -486093
3193 -486093 -266885 -315226 -71691 73501 -240773 -310232 -65263 -17874 -12657 10850 -228154
3182 -228154 -342939 -359465 -501094 -712132 -492896 -425324 -276275 -134975 -364059 -309497
3172 -309497 -446657 -263614 107547 -246996 -431568 -217200 -131251 274918 -173471 38481
3162 38481 -317957 -835672 -440803 -149729 -362337 81046 69642 52111 -146325 -352966
3152 -352966 -185255 -322479 -247043 -248109 -130633 -261070 -415755 -364504 -676490 -539357
3142 -539357 -300794 -185825 112045 -215834 -378148 -325296 -491108 -147620 111550 -340446
3132c40446j84786k30225L40295L11131R8605k80889J166N17247m30368k58203
3122d56473O9491r5577k58272N41335j0596O6981P7872k97729M22335j15355J24598
3111F8610m8939m41602j55817J07732J36833J35091j51599K17080J5405k00835
3101c18041l54820L91947m9604k9189l5177l7641o4274j77651j92015L23044J66194
3090c77227J48654L39024j15260k18363k48127L49385q3560J00967Q2074k89421
3080c11854p505L3866M48504j71631k02553j33500m3036J76300j140J32474j30505
3069b10580k86595j23326j21413r7434K89785P0287j73250J18616j84866J92567
3059e26209Q7220L37733K00238m12687N442J47078P4737M09538j8608j24083N9352
$$ plain form
3132 -340446 -525232 -755457 -415162 -104031 -5426 -286315 -285149 232098 -198270 -456473
3122 -456473 -386982 -482559 -740831 -199496 -210092 -143111 -65239 -362968 59367 -55988 68610
3111 68610 19671 -421931 -577748 -470016 -333183 -198092 -349691 -132611 -117206 -318041
3101 -318041 -672861 -280914 -330518 -359707 -394884 -432525 -496799 -674450 -866465 -543421 -377227
3090 -377227 -228573 110451 -4809 -223172 -471299 -121914 -205474 -104507 -22433 -311854
3080 -311854 -319359 -285493 163011 -8620 -211173 -344673 -387709 -211409 -212549 -80075 -210580
3069 -210580 -497175 -620501 -741914 -839348 -549563 -479276 -652526 -533910 -718776 -526209
3059 -526209 -438989 -101256 98982 -313705 -308263 -161185 -86448 323090 304482 180399 239751
3048B39751m66770P8481j06895N679n4331L28039m93546R2657J28830k06435j37070
3037e91610J2803P9196J25490J95702J53620j08549l34943j06978J16884L37402
3027a20983j53470j32544M69926K37886k83437l62508k35408L06066N78318Q2488
3017C86334j96664m70019l59942L02362L30976k71408L19037j92188O88m9332
3007b00156O129J20931l04437L49270l1303r5266o1109J53884K5625j0033q1839
2996a28304l01297l1498J96221j23105o0371K7214J23174J66655j9582j02271
2986b53164J22943J75805K40403r3983r9972l1760l10501J95335K47585j09236
2976H3455m58436K8518L89583k9395J5870k1013O6881l34691k50022M22531m36872
$$ plain form
3048 239751 -227019 -148538 -255433 -249754 -304085 23954 -469592 -376935 -248105 -454540 -591610
3037 -591610 -578807 -499611 -374121 -178419 -24799 -133348 -468291 -575269 -458385 -120983
3027 -120983 -274453 -406997 62929 300815 17378 -345130 -580538 -274472 303846 386334
3017 386334 189670 -280349 -640291 -337929 -6953 -278361 40676 -151512 -150824 -200156
3007 -200156 -194027 -73096 -377533 -28263 -59566 -154832 -215941 -62057 -36432 -46465 -128304
2996 -128304 -429601 -461099 -264878 -387983 -448354 -421140 -297966 -131311 -150893 -253164
2986 -253164 -130221 45584 285987 192004 92032 60272 -250229 -54894 192691 83455
2976 83455 -374981 -346463 43120 13725 29595 8582 75463 -259228 -509250 -86719 -523591
2965e23591r0479K96837L35019j69773k46520K6773J12645K30696l17880K10168
2955a36105n4971j90713P2252j16464j50549R1851L16912K51675m72462j28504
2945e17078J97532K81454P2268J01478j80211L41471r6684o50205J42892J91575
2935a15508l00910k83990J35549o2287K37867P0032J19238J57007o4980Q9007
2925a8975q589o3384J40906j20052j72647n3150j07897j06557M1508J41684O9672
2914b57481J12663o6496K29505j22012o4166m21897J24066K7798K14921J99465
2904b3634j48666K92714R0651k95480k73679J66153M3601L4009k08908O7486L1646
2893b24107L98097k31543k40816R384r8887O1577J85340k93687j50448J0188M54352
$$ plain form
2965 -523591 -614070 -317233 17786 -151987 -398507 -371734 -259089 -28393 -346273 -136105
2955 -136105 -191076 -381789 -309537 -426001 -576550 -484699 -167787 83888 -388574 -517078
2945 -517078 -319546 -38092 34176 135654 -44557 296914 200230 -449975 -307083 -115508
2935 -115508 -416418 -700408 -564859 -627146 -389279 -319247 -200009 -43002 -107982 -18975
2925 -18975 -27564 -90948 49958 -70094 -242741 -295891 -403788 -510345 -468837 -327153 -257481
2914 -257481 -144818 -211314 18191 -103821 -167987 -589884 -465818 -438020 -223099 -23634
2904 -23634 -172300 120414 211065 -84415 -358094 -191941 -148340 -114331 -323239 -255753 -224107
2893 -224107 173990 -57553 -298369 -288985 -387872 -326295 -140955 -434642 -585090 -574902 -120550
2882a20550P0775j38269K20195r370k20471m9489J48634n38631L16894l9681N5917
2871c04046p8859j19056j5116K62860q4096K23123j2365q5386J5056j74627L40961
2860c1551M7359j30467n6297J69939m3222m7509n3382J02764j96939j20984K5775
2849c34514K59817k32979K90130k50716k58193O16558J92098j9854J37824n0135
2839C50036k71446o3141J52395k11312K09646k64254J55992J98027j35175j97957
2829g7189J43820r3293l25624N02230R9352m32677k02567K48355j44058m20977
2819g02628N74105M76287J38192R7136k56590j08281P6081j72703m1498n7287
2809B2814j84234J23640j80327K41765K11308M35231j6519l8223J48870N9005
$$ plain form
2882 -120550 -49775 -188044 32151 22781 -197690 -247179 -98545 -637176 -320282 -359963 -304046
2871 -304046 -382905 -501961 -517077 -254217 -338313 -115190 -127555 -212941 -197885 -372512 -31551
2860 -31551 15808 -114659 -170956 -1017 -44239 -91748 -145130 -42366 -239305 -360289 -334514
2849 -334514 -74697 -307676 -17546 -268262 -526455 90103 282201 262347 400171 350036
2839 350036 78590 15449 167844 -43468 166178 -98076 57916 255943 120768 -77189
2829 -77189 66631 -26662 -352286 149944 249296 -183381 -385948 -137593 -281651 -702628
2819 -702628 -128523 347764 485956 583092 326502 218221 294302 121599 80101 22814
2809 22814 -161420 -37780 -218107 23658 234966 670197 653678 615455 764325 823330
2799H23330L51507l10335K7728M4516j73744k9439r1950K29768n9245N000j77541
2788F39595k03184L92437J92615M1558J13122o01626L3793L70365j77408M8672
2778H49939O6205J49041L05279m1477O7975J39153j53085j31732K78801j04789
2768A425310R1806k33053p9335M04029J32351O8843L99174o9629p9676p969N40825
2757B592676K32254l14005K0247N7743j62605J14930J71097l56748J97342N77464
2747C130395L56640Q7374j97870M2j32307M51065N16250J9285O8657L58234K49767
2736D907532J28358J44026N539K76407K00226K18957J04215r2929N8924J4158
2726E965413L63968K29203J07100J44565L97507M09276k6658j8825J66255J73247
$$ plain form
2799 823330 1174837 864502 892230 936746 763002 733563 641613 871381 812136 817136 639595
2788 639595 436411 828848 1021463 1063021 1176143 574517 608310 978675 801267 849939
2778 849939 916144 1065185 1370464 1328987 1396962 1536115 1383030 1251298 1530099 1425310
2768 1425310 1517116 1284063 1204728 1608757 1741108 1809951 2209125 2139496 2059820 2051851 2592676
2757 2592676 2824930 2510925 2531172 2588915 2426310 2541240 2712337 2355589 2552931 3130395
2747 3130395 3487035 3574409 3376539 3376581 3244274 3695339 4211589 4230874 4299531 4657765 4907532
2736 4907532 5035890 5179916 5185455 5461862 5662088 5881045 5985260 5892331 5951255 5965413
2726 5965413 6329381 6558584 6665684 6810249 7207756 7617032 7590374 7571549 7737804 7911051
2716G911051K8090J68139J28966L28167R3850p4258M76266M57646m84827N96339
2706I629429K40712J16123N3553J47685m4975L54645L8059n843J7289P9165J98711
2695A0824553J48280J46373Q3247j14769K99552J225J23070L67279j69253K75546
2685A1985103K77582J0423m6071j61343R2330K92396j59850O3722p4923l62539
2675A1916830j67597J45358m99472l80206j3946K50654J9650k71814J25969l38043
2665A0787383n10540k03863k8513J02515l96419Q0744K8226j77630k89816J92749
2655I584836J20466l16899l10490l01352K25117k29142K6099j04989n9317m19639
2645H214690k30404m23838P3838J87139j58584l81758M9044j18212n03905N0895
$$ plain form
2716 7911051 7939141 8107280 8236246 8564413 8658263 8584005 9060271 9517917 9033090 9629429
2706 9629429 9870141 9986264 10039817 10187502 10142527 10497172 10535231 10529388 10546677 10625842 10824553
2695 10824553 10972833 11119206 11202453 11087684 11387236 11388461 11511531 11878810 11709557 11985103
2685 11985103 12262685 12273108 12227037 12065694 12158024 12450420 12290570 12354292 12279369 11916830
2675 11916830 11749233 11894591 11395119 11014913 11000967 11251621 11271271 10999457 11125426 10787383
2665 10787383 10276843 10072980 10044467 10146982 9750563 9831307 9859533 9681903 9392087 9584836
2655 9584836 9705302 9388403 9077913 8776561 9001678 8772536 8798635 8693646 8634329 8214690
2645 8214690 7984286 7560448 7634286 7821425 7662841 7281083 7330127 7211915 6708010 6758905
2635F758905k47801k39062l87999M2980M795j86752l91148k85004k40143L0123
2625D858894j16750j73491N0307l35755k66922K34049l62194O6737l4670l27076
2615C593129k18415J07740L52038J81194l10186k07063l99980q8423K36995k02035
2605C044994l9604L6862n44140K7543L30838j43386j86088l39988l62039K79763
2595B104755K08405q1475j82946m88892m207K08842K20565n2935m95691J47659
2585A584080K25813l4681o2190k00227J79211K21873j19807K2403j55844j38110
2575A522521J91068j97231k84341Q0059j19740K81069k07796O3657r0597j1866
2565A226803j96427m8399L35170j45075J23451n7998K08768R9216J17676l7705
$$ plain form
2635 6758905 6511104 6272042 5884043 5927023 5931818 5745066 5353918 5068914 4828771 4858894
2625 4858894 4742144 4568653 4618960 4283205 4016283 4250332 3888138 3954875 3920205 3593129
2615 3593129 3374714 3482454 3834492 4015686 3705500 3498437 3098457 3010034 3247029 3044994
2605 3044994 3005390 3042252 2498112 2525655 2856493 2713107 2527019 2187031 1824992 2104755
2595 2104755 2313160 2231685 2048739 1559847 1555640 1764482 1985047 1932112 1436421 1584080
2585 1584080 1809893 1775212 1713022 1512795 1692006 1913879 1794072 1816475 1660631 1522521
2575 1522521 1713589 1516358 1232017 1312076 1192336 1473405 1265609 1329266 1238669 1226803
2565 1226803 1030376 981977 1317147 1172072 1295523 1237525 1446293 1545509 1663185 1625480
2555A625480j86490k02366K56472k20089R8608m7417j02422J28396J22782K59720
2545A732674o0134l83116n5542J18552k3553n7604M2061p4426O1229K48765K74749
2534A823655k19635k54188M30448k86743j06511O80529j46350n29373j14429J9299
2524A296702k01392n4190J99420j39552k63586M08359L94035k3628k64656r133
2514A342379K8374p3578o88469r5337K1046J03137N1697k94182K33261J26069
2504G54397j42168m887J46680m27829n9150N39907j4384k00818l7637m84765p9508
2493a0162K10359l451j05408J16946Q2190M1506r1064J37556P7722K18224K15112
2482H89530k1683k32188K51399j04012k84386N9992n24516J61240l23097L22595
$$ plain form
2555 1625480 1438990 1236624 1493096 1273007 1371615 1324198 1221776 1350172 1472954 1732674
2545 1732674 1672540 1289424 1233882 1352434 1328881 1271277 1313338 1238912 1300141 1548906 1823655
2534 1823655 1604020 1349832 1780280 1493537 1387026 2067555 1921205 1391832 1277403 1296702
2524 1296702 1095310 1041120 1240540 1100988 837402 1245761 1639796 1616168 1351512 1342379
2514 1342379 1370753 1297175 608706 513369 534415 637552 689249 395067 628328 754397
2504 754397 612229 607342 754022 326193 267043 806950 792566 591748 554111 69346 -10162
2493 -10162 200197 196746 91338 208284 290474 331980 240916 378472 456194 674418 889530
2482 889530 867847 635659 887058 783046 498660 558652 34136 195376 -127721 194874
2472A94874k74040k6822M4306J739M10647Q6427J35151m66498k3188L16176k79546
2461A19226m60758K83724J56349k01709r9049J94752K08076M1299j47108k60838
2451a66036M3301K14560P5213N3596L06314j94378O723o9698Q1522P5218l03486
2440A22849q2103j99166j84327k19885L58501J52371M79907m2365k37166Q9933
2430B38549l3076j32475Q767l4667j54478j04353j26376J3171J48744j64835q1514
2419d22543L09879J05029o1295j4645J72274k12515O3031n2232k0759J4127k07255
2408c26904K40215l05248J4113K03965L96474k51974n10338j38518L39527N96845
2398B58157j7492O5154k16079l50927J58100R2150J49743J71146N4844J5764k67821
$$ plain form
2472 194874 -79166 -105988 -61682 -59943 350704 437131 572282 105784 82596 398772 119226
2461 119226 -341532 -57808 98541 -103168 -202217 -7465 200611 241910 94802 -166036
2451 -166036 -122735 91825 167038 220634 526948 332570 339293 269595 351117 426335 122849
2440 122849 40746 -158420 -342747 -562632 -204131 -51760 428147 385782 148616 238549
2430 238549 205473 72998 81765 47098 -107380 -211733 -338109 -324938 -176194 -341029 -422543
2419 -422543 -112664 -7635 -68930 -83575 88699 -123816 -60785 -113017 -133776 -119649 -326904
2408 -326904 -86689 -391937 -377824 -173859 222615 -29359 -539697 -678215 -338688 258157
2398 258157 240665 305819 89740 -261187 -103087 -10937 138806 309952 364796 380560 112739
2387A12739R3251j0531m64624J36550M2571M3165l4044L37714j81402L3131J68488
2376B77008n38947j65978J91858l62837p1889j21603M10499J17902K12066K40625
2366A88704j85913J95279O4571k65856J05355k41945l35298K21111l7816K17742
2356g4066k20757l57452J61603R7666k38931J70039P8438R8280j32435M01513
2346a6102J42276k04754j3187Q4941k54998K39401K0842n4259R692j82114k83728
2335e11990J48749N6527k51011J51577K64782j27488K61257K71229j08670j55524
2325e62K34981k45551n46612K9901J08364L10149k19378j71730L42532J47546
2315a0360k84242k14425J22259l6820K29786m8276p2626r247K98205J73887n16794
$$ plain form
2387 112739 205990 195459 -269165 -132615 -90044 -46879 -80923 256791 75389 108520 277008
2376 277008 -261939 -427917 -236059 -598896 -670785 -792388 -381889 -263987 -51921 188704
2366 188704 2791 198070 262641 -3215 102140 -139805 -475103 -253992 -291808 -74066
2356 -74066 -294823 -652275 -490672 -393006 -631937 -461898 -383460 -285180 -417615 -16102
2346 -16102 126174 -78580 -91767 -6826 -261824 -22423 -1581 -55840 -46148 -228262 -511990
2335 -511990 -363241 -306714 -557725 -406148 -141366 -268854 -7597 263632 154962 -562
2325 -562 234419 -11132 -557744 -527843 -419479 -109330 -328708 -500438 -157906 -10360
2315 -10360 -294602 -509027 -386768 -423588 -193802 -242078 -314704 -323951 -25746 148141 -368653
2304c68653k82670N74028P8028m1482K22684j6419k69496Q386q750M5002O3883
2293D541k08031L6507J76620o9748K48511M0622l197M9541k24340k43489J3646
2282a78817K16892k25067R5048M2519J04613J83380P0959j92396k14469J14626
2272A7288L31731j27740j84838J01353j68039k85339K19859J56546j0164L6815
2262H7472q6915k56321j7560K89443J33212r0495j0174j07373K41778M2126j96852
2251B8341l34752k39490M67556J90190j66901L10970j48483j24154R5387J82237
2241B60901m59164k15183L50396K29541l97366m2259M14266J37586m5457R8150
2231C31411J12679l79847j55762p7625J91388j55354k44997J78257O08718j55057
$$ plain form
2304 -368653 -651323 -77295 733 -40749 181935 165516 -103980 -95594 -104344 -59342 4541
2293 4541 -203490 -166983 9637 -60111 188400 229022 225825 275366 51026 -192463 -178817
2282 -178817 38075 -186992 -91944 -49425 55188 238568 309527 117131 -97338 17288
2272 17288 349019 221279 36441 137794 -30245 -315584 -95725 60821 50657 87472
2262 87472 557 -255764 -273324 16119 149331 58836 48662 -58711 183067 225193 28341
2251 28341 -306411 -545901 -78345 111845 -55056 255914 107431 -16723 78664 260901
2241 260901 -198263 -413446 -63050 166491 -230875 -273134 141132 278718 233261 331411
2231 331411 444090 64243 -91519 -169144 22244 -133110 -378107 -199850 408868 253811
2221B53811l52693r0592k99421O8669J45004J87683j21586J9991J52712j44886
2211a81308r3365j7051L03558M20527l88140p8317O0711l46456p9045J40412O4754
2200a93720R5671n7523n0873R9480K10552J30132k22861k44684j30257L43747
2190b0336M92230l43838n87442R1934M0982J9346L05552k70538m73557K48614
2180d97053j03912k50833j13025P8067J51674k66128M45324J41997k17156J77826
2170d53219l79756O0026N39821K89408J6641k07252l93162M52407J03914k56978
2160b28150K72980J99318k78506l88707k91199k40918L43281k68818n2411L58440
2150e74690k39297J42320K67375j28771J78642o343j88083o7156j44465K84253
$$ plain form
2221 253811 -98882 -189474 -488895 -420226 -275222 -87539 -209125 -189134 -36422 -181308
2211 -181308 -274673 -291724 11834 432361 44221 -34096 26615 -319841 -398886 -258474 -193720
2200 -193720 -98049 -155572 -206445 -106965 103587 233719 10858 -233826 -364083 -20336
2190 -20336 471894 128056 -459386 -367452 -326470 -307124 -1572 -272110 -745667 -497053
2180 -497053 -600965 -851798 -964823 -886756 -735082 -1001210 -555886 -413889 -631045 -453219
2170 -453219 -832975 -772949 -233128 56280 72921 -134331 -527493 -75086 28828 -228150
2160 -228150 44830 244148 -34358 -423065 -714264 -955182 -611901 -880719 -933130 -574690
2150 -574690 -813987 -671667 -404292 -533063 -354421 -360764 -548847 -616003 -760468 -476215
2140d76215P4057O0119r5580k35407K43554m66995j24909K5237J43422K34368
2130f18349L01678k38178J99638j8406m3497j34453p593R6277m14273M23117M45647
2119h392k22152l08744J82955j38867k48914N87093O1374l84505q7608n4142N7717
2108e64185J90077M87k86026K56600k83530n8463M1417J61969k68352l9317J54347
2097f94976p9732j00673N02130l8122K0606K5112q8450j98764J46123j53283K76856
2086c83173Q1390j5048j15225j23121L52342n7258J36964j42876p2590j84526
2076e23121j06008K43362J95486K41234m10684j2048K4316l91139M1378K00350
2066d96874L37524R657k98442J56165M12067m07473k359r3688J5839k17624n5644
$$ plain form
2140 -476215 -402158 -342039 -437619 -673026 -429472 -896467 -1021376 -996139 -852717 -618349
2130 -618349 -316671 -554849 -355211 -373617 -417114 -551567 -559160 -462883 -877156 -454039 -8392
2119 -8392 -230544 -539288 -356333 -495200 -744114 -157021 -95647 -480152 -567760 -621902 -564185
2108 -564185 -374108 -373621 -659647 -403047 -686577 -745040 -703623 -541654 -810006 -849323 -694976
2097 -694976 -774708 -875381 -373251 -411373 -390767 -365655 -454105 -652869 -506746 -660029 -383173
2086 -383173 -301783 -316831 -432056 -555177 -202835 -260093 -123129 -266005 -338595 -523121
2076 -523121 -629129 -385767 -190281 50953 -359731 -371779 -347463 -738602 -697224 -496874
2066 -496874 -159350 -149693 -448135 -291970 120097 -287376 -289735 -383423 -367584 -585208 -640852
2055f40852J40084K68925j16338l15349j4382k22683J75337L32884k78276j28827
2045g99477J92910k17170p2884j04314J10829j7795K209M31433k40447n5306Q7184
2034f82828j83457p8324K36965j25561M9884N3422n0573K43102N4844J55652j0613
2023c37487J82372J9234k84688k56503K2801J32557N356L539j10938o0555n19955
2012a204267O6679M64077L2763K62537K49176j70171J56135n2243j78933o4360
2002d38607j02942j35478j73013R0967J40214K33937K71008l81231J0674L04798
1992a79673j62764Q090M0649L5401K04359N9730l43643L18191k56749k0209P0993
1981b25625n76820J85027J81100J65552k95604k44814k12442K96944P9547J86432
$$ plain form
2055 -640852 -500768 -231843 -348181 -663530 -677912 -900595 -725258 -392374 -670650 -799477
2045 -799477 -606567 -823737 -896621 -1000935 -890106 -907901 -905692 -474259 -714706 -770012 -682828
2034 -682828 -866285 -944609 -707644 -833205 -783321 -729899 -780472 -537370 -482526 -326874 -337487
2023 -337487 -155115 -135881 -420569 -677072 -654271 -521714 -516358 -512819 -623757 -684312 -1204267
2012 -1204267 -1137588 -673511 -640748 -378211 -129035 -299206 -143071 -195314 -374247 -438607
2002 -438607 -541549 -677027 -850040 -759073 -618859 -384922 -113914 -495145 -484471 -179673
1992 -179673 -342437 -334347 -293698 -258297 -53938 5792 -337851 -19660 -276409 -296618 -225625
1981 -225625 -802445 -617418 -436318 -270766 -566370 -811184 -1023626 -726682 -647135 -460703
1971d60703k12615j6682K24093j27218j56784l0194K35324N2317q1114j94114
1961g67690K07498Q0602N7406O7671k08721k4210L22011R1450J58664J68781n36481
1950c83019j64573O092L1052N1589k73444R4414J53364M7033m03053m6888K74289
1939f13144n2249L80687j32491l15751J99418N8784J02796L6595Q1204J09262
1929a44889j26976Q2364l44944n2891K72698j83558K59563j184K46020K8175k0253
1918A4125K36068m14534j10206J21772n1688K62437l50806j7012J63228m15265
1908e61881j48458K53414P5400l3019P6787m6445m95632L88871J46498K225j60216
1897e02456L3776N439L8081K14945k1092l11869K6701K04360Q5822J00497N2824
$$ plain form
1971 -460703 -673318 -690000 -465907 -593125 -749909 -780103 -544779 -492462 -573576 -767690
1961 -767690 -560192 -479590 -422184 -354513 -563234 -587444 -265433 -173983 -15319 153462 -383019
1950 -383019 -547592 -541500 -510448 -458859 -732303 -637889 -484525 -437492 -840545 -887433 -613144
1939 -613144 -665393 -284706 -417197 -732948 -533530 -474746 -371950 -335355 -254151 -144889
1929 -144889 -271865 -189501 -534445 -587336 -314638 -498196 -238633 -239817 6203 34378 14125
1918 14125 250193 -164341 -274547 -152775 -204463 57974 -292832 -309844 -146616 -561881
1908 -561881 -710339 -456925 -381525 -414544 -337757 -384202 -879834 -490963 -344465 -342240 -502456
1897 -502456 -468680 -463241 -425160 -210215 -231307 -543176 -516475 -312115 -226293 -125796 -72972
1886g2972k19776K2511M362J52706M9162J29010m9772j63102l53462O3633K11756
1875b25944k93926k8723J48112K31763k08738J69674m0307l02545K2338K28472
1865b99824n5852j18029J88179M43391o565j14297j52719K1333o6888j11659k11653
1854d84583j27384m6880m4113R6408l38804j12719N0767N32735L25317q4390o0025
1843b93671k48780r1996l507J13154j66354K40203j8117K7302q1123L3569J72717
1832c16603J72475R2862o5758k37029j77370M0005R5000J21023N6131j84103L6914
1821c66453k1608Q192J37006j24751r6373N697k6126l06480j13796N51484K8503
1810c24705R9188j23471k11467l3066R3838K4365n5588j77651J52845L00302J41000
$$ plain form
1886 -72972 -292748 -270237 -265875 -113169 -64007 65003 15231 -147871 -501333 -437700 -225944
1875 -225944 -519870 -548593 -400481 -168718 -377456 -207782 -248089 -550634 -528296 -299824
1865 -299824 -355676 -473705 -285526 157865 151300 37003 -115716 -94383 -161271 -272930 -484583
1854 -484583 -611967 -658847 -702960 -606552 -945356 -1058075 -1007308 -474573 -149256 -233646 -293671
1843 -293671 -542451 -634447 -637954 -524800 -691154 -450951 -469068 -441766 -522889 -489320 -316603
1832 -316603 -144128 -51266 -117024 -354053 -531423 -491418 -396418 -275395 -219264 -403367 -366453
1821 -366453 -388061 -379869 -242863 -367614 -463987 -458290 -484416 -790896 -904692 -353208 -324705
1810 -324705 -225517 -348988 -560455 -593521 -499683 -475318 -530906 -708557 -555712 -255410 -114410
1799a14410k72950k27935J95622M62621J11644l0863j54491l70472m4761J84487
1789b61508K2013o7395k029M33850k3768k47525m476M1116j62820Q3543O9255
1778a19744o1740J31136o6797m87217K77944K15018J41165j06124K18862J38030
1768B80533n69265M38047k33335L7784j97679R853O5522O4413k38603L10296K21324
1757A88890J44061j96389k42033L8561k18522J05425M69393k05584m5925j31128
$$ plain form
1799 -114410 -387360 -615295 -419673 42948 154592 123729 -30762 -401234 -445995 -261508
1789 -261508 -239495 -306890 -308919 124931 101163 -146362 -150838 -109722 -272542 -188999 -119744
1778 -119744 -181484 -50348 -117145 -604362 -326418 -111400 29765 -76359 142503 280533
1768 280533 -288732 149315 -84020 -46236 -243915 -234062 -168540 -104127 -342730 -32434 188890
1757 188890 332951 136562 -105471 -66910 -285432 -180007 289386 83802 37877 -93251
$$ [...]
##END NTUPLES=NMR SPECTRUM
##END=
