##TITLE=1H_CA-8929-2
 CDCl3,8 sc, 
 28.9.2021
##JCAMPDX= 6.0         $$ Bruker NMR JCAMP-DX V2.0
##DATA TYPE= NMR SPECTRUM
##DATA CLASS= NTUPLES
##ORIGIN= UXNMR, Bruker Analytische Messtechnik GmbH
##OWNER= root
$$ XWIN-NMR		Version 3.5
$$ Tue Sep 28 11:33:47 2021 Russian Standard Time (UT+4h)  she@DPX200
##.OBSERVE FREQUENCY= 200.1314
##.OBSERVE NUCLEUS= ^1H
##.ACQUISITION MODE= SIMULTANEOUS
##.ACQUISITION SCHEME= undefined
##.AVERAGES= 8
##.DIGITISER RES= 18
##SPECTROMETER/DATA SYSTEM= spect
##.PULSE SEQUENCE= zg30
##.SOLVENT NAME= CDCl3
##.SHIFT REFERENCE= (INTERNAL, CDCl3, 0, 16.9595)
##AUDIT TRAIL= $$ (NUMBER, WHEN, WHO, WHERE, WHAT)
$$ ##TITLE= Audit trail, XWIN-NMR		Version 3.5
$$ ##JCAMPDX= 5.01
$$ ##ORIGIN= Bruker BioSpin GmbH
$$ ##OWNER= she
$$ F:/spectra/data/she/nmr/H-F/1/pdata/1/auditp.txt
$$ ##AUDIT TRAIL=  $$ (NUMBER, WHEN, WHO, WHERE, WHAT)
(   1,<2021-09-28 11:32:28.64 +0400>,<she>,<DPX200>,
      <created by zg, POWCHK disabled, PULCHK disabled
       configuration hash MD5:
       00 E9 B6 7A A2 85 ED C7 34 08 36 98 17 FE 4E 26
       data hash MD5: 16K
       FE BE 4C 26 E3 EE E2 56 CA 07 EB FB FB E9 13 C3>)
(   2,<2021-09-28 11:32:31.06 +0400>,<she>,<DPX200>,
      <Start of raw data processing
       efp BC_mod = 2 LB = 0.24 FT_mod = 6 PKNL = 1 PHC0 = -14080.08 PHC1 = 16.60089 SI = 16K 
       data hash MD5: 16K
       D7 72 6E 28 59 30 73 93 C3 4D AE 82 70 AF EE CF>)
(   3,<2021-09-28 11:32:59.07 +0400>,<she>,<DPX200>,
      <pk PHC0 = -15.5393 PHC1 = 18 
       data hash MD5: 16K
       A0 BA C7 49 5D CA 91 C3 5F 53 BC B3 7C C2 01 F5>)
(   4,<2021-09-28 11:33:02.57 +0400>,<she>,<DPX200>,
      <abs ABSG = 5 
       data hash MD5: 16K
       22 E7 49 04 1C 57 03 06 B8 CB FA 3D 91 7B B9 25>)
$$ ##END=
$$ 
$$ hash MD5
$$ C6 59 73 77 B2 C8 73 AD B3 D9 27 41 3E D3 F6 97
##$RELAX= 
##$RELAX= 
##$RELAX= 
##$RELAX= 
##$RELAX= 
##$RELAX= 
$$ Bruker specific parameters
$$ --------------------------
##$DU= <F:/spectra>
##$EXPNO= 1
##$NAME= <H-F>
##$PROCNO= 1
##$TYPE= <nmr>
##$USER= <she>
##$AMP= (0..31)
100 100 100 100 100 100 100 100 100 100 100 100 100 100 100 100 100 100 
100 100 100 100 100 100 100 100 100 100 100 100 100 100 
##$AQSEQ= 0
##$AQ_mod= 1
##$AUNM= <au_zg>
##$AUTOPOS= <>
##$BF1= 200.13
##$BF2= 200.13
##$BF3= 200.13
##$BF4= 200.13
##$BF5= 200.13
##$BF6= 200.13
##$BF7= 200.13
##$BF8= 200.13
##$BYTORDA= 1
##$CFDGTYP= 0
##$CFRGTYP= 5
##$CHEMSTR= <none>
##$CNST= (0..31)
1 1 145 1 1 1 1 1 1 1 1 1 1 1 1 1 1 1 1 1 1 1 1 1 1 1 1 1 1 1 1 1 
##$CPDPRG= <>
##$CPDPRG1= <>
##$CPDPRG2= <>
##$CPDPRG3= <>
##$CPDPRG4= <mlev>
##$CPDPRG5= <mlev>
##$CPDPRG6= <mlev>
##$CPDPRG7= <mlev>
##$CPDPRG8= <mlev>
##$CPDPRGB= <>
##$CPDPRGT= <>
##$D= (0..31)
0 1.2 0 0 0 0 0 0 0 0.06 0 0.03 0 0 0 0 0.0002 0 0 0 0 0 0 0 0 0 0 0 0 
0 0 0 
##$DATE= 1632814348
##$DBL= (0..7)
120 120 120 120 120 120 120 120 
##$DBP= (0..7)
150 150 150 150 150 150 150 150 
##$DBP07= 0
##$DBPNAM0= <>
##$DBPNAM1= <>
##$DBPNAM2= <>
##$DBPNAM3= <>
##$DBPNAM4= <>
##$DBPNAM5= <>
$$ [...]
##$SUBNAM2= <"">
##$SUBNAM3= <"">
##$SUBNAM4= <"">
##$SUBNAM5= <"">
##$SUBNAM6= <"">
##$SUBNAM7= <"">
##$SUBNAM8= <"">
##$SUBNAM9= <"">
##$SW= 20.0188988654967
##$SWIBOX= (0..15)
0 0 2 0 0 0 0 0 0 0 0 0 0 0 0 0 
##$SW_h= 4006.41025641026
##$TD= 16384
##$TD0= 1
##$TE= 0
##$TE2= 300
##$TE3= 300
##$TEG= 300
##$TL= (0..7)
0 120 120 120 120 120 120 120 
##$TP= (0..7)
150 150 150 150 150 150 150 150 
##$TP07= 0
##$TPNAME0= <>
##$TPNAME1= <>
##$TPNAME2= <>
##$TPNAME3= <>
##$TPNAME4= <>
##$TPNAME5= <>
##$TPNAME6= <>
##$TPNAME7= <>
##$TPOAL= (0..7)
0.5 0.5 0.5 0.5 0.5 0.5 0.5 0.5 
##$TPOFFS= (0..7)
0 0 0 0 0 0 0 0 
##$TUNHIN= 0
##$TUNHOUT= 0
##$TUNXOUT= 0
##$USERA1= <user>
##$USERA2= <user>
##$USERA3= <user>
##$USERA4= <user>
##$USERA5= <user>
##$V9= 5
##$VALIST= <valist>
##$VCLIST= <CCCCCCCCCCCCCCC>
##$VD= 0
##$VDLIST= <DDDDDDDDDDDDDDD>
##$VPLIST= <PPPPPPPPPPPPPPP>
##$VTLIST= <TTTTTTTTTTTTTTT>
##$WBST= 1024
##$WBSW= 4
##$XGAIN= (0..3)
0 0 0 0 
##$XL= 0
##$YL= 0
##$YMAX_a= 102030
##$YMIN_a= -204933
##$ZGOPTNS= <>
##$ZL1= 120
##$ZL2= 120
##$ZL3= 120
##$ZL4= 120
##$ABSF1= 16.96559
##$ABSF2= -3.053448
##$ABSG= 5
##$ABSL= 3
##$ALPHA= 0
##$AQORDER= 0
##$ASSFAC= 0
##$ASSFACI= 0
##$ASSFACX= 0
##$ASSWID= 0
##$AUNMP= <proc_1d>
##$AZFE= 0.1
##$AZFW= 0.1
##$BCFW= 0
##$BC_mod= 2
##$BYTORDP= 0
##$COROFFS= 0
##$CY= -3
##$DATMOD= 1
##$DC= 0
##$DFILT= <>
##$DTYPP= 0
##$F1P= 0
##$F2P= 0
##$FCOR= 1
##$FTSIZE= 16384
##$FT_mod= 6
##$GAMMA= 0
##$GB= 0
##$INTBC= 1
##$INTSCL= 0
##$ISEN= 128
##$LB= 0.24
##$LEV0= 0
##$LPBIN= 0
##$MAXI= 10000
##$MC2= 0
##$MEAN= 0
##$ME_mod= 0
##$MI= 1.114404
##$NCOEF= 0
##$NC_proc= -8
##$NLEV= 6
##$NOISF1= 3.799351
##$NOISF2= 2.8
##$NSP= 0
##$NTH_PI= 0
##$NZP= 0
##$OFFSET= 16.95949
##$PC= 1
##$PHC0= -14095.62
##$PHC1= 34.60089
##$PH_mod= 1
##$PKNL= yes
##$PPARMOD= 0
##$PSCAL= 0
##$PSIGN= 0
##$REVERSE= no
##$SF= 200.130009101755
##$SI= 16384
##$SIGF1= 3
##$SIGF2= 2
##$SINO= 5.538805
##$SIOLD= 16384
##$SREGLST= <1H.CDCl3>
##$SSB= 0
##$STSI= 16384
##$STSR= 0
##$SW_p= 4006.41025641027
##$SYMM= 0
##$S_DEV= 0
##$TDeff= 16384
##$TDoff= 0
##$TI= <>
##$TILT= no
##$TM1= 0
##$TM2= 0
##$TOPLEV= 0
##$USERP1= <user>
##$USERP2= <user>
##$USERP3= <user>
##$USERP4= <user>
##$USERP5= <user>
##$WDW= 1
##$XDIM= 16384
##$YMAX_p= 367093067
##$YMIN_p= -1541256
$$ End of Bruker specific parameters
$$ ---------------------------------
##NTUPLES= NMR SPECTRUM
##VAR_NAME=  FREQUENCY,     SPECTRUM/REAL,   SPECTRUM/IMAG
##SYMBOL=    X,             R,               I
##VAR_TYPE=  INDEPENDENT,   DEPENDENT,       DEPENDENT
##VAR_FORM=  AFFN,          ASDF,            ASDF
##VAR_DIM=   16384,         16384,           16384
##UNITS=     HZ,            ARBITRARY UNITS, ARBITRARY UNITS
##FACTOR=    0.244546801953871, 1,           1
##FIRST=     3394.10285251557, 0,            0
##LAST=      -612.307403894699, 0,           0
##MIN=       -612.307403894699, -1541256,    0
##MAX=       3394.10285251557, 367093067,    0
$$ Real data points
##PAGE= N=1
##DATA TABLE= (X++(R..R)), XYDATA
$$ [...]
$$ plain form
7728 32222645 32200027 31809456 31609656 31116511 30497145 30651898 30622931 30656941 29648174 29390943
7718 29390943 29515828 29754508 29203271 28865668 28921258 27935763 27616751 27556516 27346272 26982344
7708 26982344 26654237 26421934 26181526 26012948 25397822 25737860 25603617 24807933 24555694
7699 24555694 24192073 23451994 23303638 23344996 23368772 22951716 22738977 22164954 21592714 21192683
7689 21192683 21188483 21439413 21224649 21139339 20998265 20657021 20079656 19418100 19421332 19737990
7679 19737990 19622726 19412775 19100308 18806008 18313095 18500595 18339519 17461533 17429452 17213769
7669 17213769 17139839 17332394 17309281 16834356 16549611 16463413 16288804 16148054 15787815 15662320
7659 15662320 16128156 15581311 15245662 15024429 15578344 15856271 15357132 15494217 15023616
$$ packed form
7728C2222645k2618l90571j99800m93145o19366J54753k8967L4010j008767k57231
7718B9390943J24885K38680n51237l37603N5590r85495l19012o0235k10244l63928
7708B6982344l28107k32303k40408j68578o15126L40038j34243p95684k52239
7699B4555694l63621p40079j48356M1358K3776m17056k12739n74023n72240m00031
7689B1192683m200K50930k14764q5310j41074l41244n77365o61556L232L16658
7679A9737990j15264k09951l12467k94300m92913J87500j61076q77986l2081k15683
7669A7213769p3930J92555k3113m74925k84745q6198j74609j40750l60239j25495
7659A5662320M65836n46845l35649k21233N53915K77927m99139J37085m70601
$$ plain form
7650 15023616 15169198 15303994 14782286 14381457 14761758 15001152 14297128 14413869 14113253
7641 14113253 14123727 14300685 14017664 13772350 13907811 13961553 13885629 13833138 13187900 13052510
7631 13052510 13009046 13137397 13138087 12805137 12646949 13104557 13376355 13415136 13460302 13096066
7621 13096066 13248602 13491321 13222537 13080280 13328632 13055911 12572543 12520090 12298164 12636724
7611 12636724 12877335 12478651 12796449 12736716 11982027 11604982 11822581 11840746 12091349 11704405
7601 11704405 11552823 11375719 11068837 11016110 10873416 11193409 10737296 10520493 10351168 11117548
7591 11117548 11015931 10646443 10679020 10347868 10465072 10694854 10209466 10413470 10438409 10418089
7581 10418089 10378927 10281517 9614051 9474244 9889529 9565312 9515228 9011470 9070810 8708655
$$ packed form
7650A5023616J45582J34796n21708m00829L80301K39394p04024J16741l00616
7641A4113253J0474J76958k83021k45314J35461N3742p5924n2491o45238j35390
7631A3052510m3464J28351O90l32950j58188M57608K71798L8781M5166l64236
7621A3096066J52536K42719k68784j42257K48352k72721m83368n2453k21926L38560
7611A2636724K40611l98684L17798n9733p54689l77045K17599J8165K50603l86944
7601A1704405j51582j77104l06882n2727j42694L19993m56113k16803j69325P66380
7591A1117548j01617l69488L2577l31152J17204K29782m85388K04004K4939k0320
7581A0418089l9162r7410o67466j39807M15285l24217n0084n03758N9340l62155
$$ plain form
7571 8708655 8692272 8420142 8681117 8431293 8146220 8555112 8195030 8534069 8426343 8285119
7561 8285119 8332424 8223988 7785484 7908157 7923872 7645062 7523186 7448702 7981453 8117551
7551 8117551 7644942 7431834 7377316 7487380 7064415 6891510 7189251 7387511 7515912 7072563
7541 7072563 6729009 6979539 6841448 7226712 7269433 7514763 7378689 7307563 7167061 7005793
7531 7005793 6824037 6733774 6749240 6420522 6652427 6304628 6230746 6736524 7063637 6785776
7521 6785776 6743376 6478798 6399016 6232843 5925755 6399016 6813925 6311082 6544219 6552564
7511 6552564 6178199 6012253 6078452 6190499 6397761 6562333 6775197 6282767 5780478 5808947
7501 5808947 6345115 6454114 5858954 6406510 6128633 6044983 5965458 5046149 5377550 5726992
$$ packed form
7571H708655j6383k72130K60975k49824k85073M08892l60082L39039j07726j41224
7561H285119M7305j08436m38504J22673J5715k78810j21876p4484N32751J36098
7551H117551m72609k13108n4518J10064m22965j72905K97741J98260J28401m43349
7541G072563l43554K50530j38091L85264M2721K45330j36074p1126j40502j61268
7531G005793j81756r0263J5466l28718K31905l47799p3882N05778L27113k77861
7521F785776m2400k64578p9782j66173l07088M73261M14909n02843K33137Q345
7511F552564l74365j65946O6199J12047K07262J64572K12864m92430n02289K8469
7501E808947N36168J08999n95160N47556k77877q3650p9525r19309L31401L49442
$$ plain form
7491 5726992 5840452 5883163 5394530 5568138 5318197 5398533 5508731 5263883 5754055 5497661
7481 5497661 5992465 5807504 5186286 5260155 5567322 5044572 4830549 5409514 5702912 6084803
7471 6084803 5616940 5366742 5233370 5592802 6083100 5981128 6025241 5555706 5267406 5561374
7461 5561374 5671698 5829005 5431826 5781122 5452835 5654291 5749029 5553834 5471373 5750416
7451 5750416 5814481 5291972 5865694 6137876 6394588 6284908 5938815 5702104 5362781 5594578
7441 5594578 5783567 5774565 5552772 5186391 5359347 5569790 4886292 4766304 4856229 4966786
7431 4966786 5151225 4637717 4308338 4694910 4820890 4798785 4744441 4782649 4491972 4671807
7421 4671807 5111253 4836904 5036222 4544140 4634607 4497214 4599681 4263218 3773318 4078580
$$ packed form
7491E726992J13460M2711m88633J73608k49941Q0336J10198k44848M90172k56394
7481E497661M94804j84961o21218P3869L07167n22750k14023N78965K93398L81891
7471F084803m67863k50198j33372L59432M90298j01972M4113m69535k88300K93968
7461E561374J10324J57307l97179L49296l28287K01456R4738j95195q2461K79043
7451E750416O4065n22509N73722K72182K56712j09680l46093k36711l39323K31797
7441E594578J88989r002k21793l66381J72956K10443o83498j19988Q9925J10557
7431D966786J84439n13508l29379L86572J25980k2105n4344L8208k90677J79835
7421D671807M39446k74349J99318m92082R0467j37393J02467l36463m89900L05262
$$ plain form
7411 4078580 4339979 3651569 4497469 4309685 4567637 4440121 4205089 3878395 3799679 4521072
7401 4521072 4448455 4368295 4454646 4574759 4517000 4396483 3842871 4287507 4103099 4395996
7391 4395996 4071051 3837181 3933135 3949984 4350961 4462162 3877861 3460048 3996859 4096807
7381 4096807 3686864 4096624 3868131 3756024 4032632 3909867 4042357 3980760 3746992 3791225
7371 3791225 3639215 3642069 3796572 3939963 4173973 3804401 3348204 3319147 3600221 3477021
7361 3477021 3730077 3827976 3327692 3250851 3627374 3969312 3453875 3600485 3275290 3744838
7351 3744838 3671377 3935652 4227715 3895919 3397173 3496686 4022775 3884299 4068206 3778871
7341 3778871 3800519 3323451 3483055 3712665 4067858 3923793 3869387 3151476 2935524 3336616
$$ packed form
7411D078580K61399o88410Q45900j87784K57952j27516k35032l26694p8716P21393
7401D521072p2617q0160Q6351J20113n7759j20517n53612M44636j84408K92897
7391D395996l24945k33870R5954J6849M00977J11201n84301m17813N36811R9948
7381D096807m09943M09760k28493j12107K76608j22765J32490o1597k33768M4233
7371C791225j52010K854J54503J43391K34010l69572m56197k9057K81074j23200
7361C477021K53056R7899n00284p6841L76523L41938n15437J46610l25195M69548
7351C744838p3461K64275K92063l31796m98746R9513N26089j38476J83907k89335
7341C778871K1648m77068J59604K29610L55193j44065n4406p17911k15952M01092
$$ plain form
7331 3336616 3664376 3730339 3787006 3520549 3045985 3387410 3482050 3882140 3816138 3479104
7321 3479104 3235265 3085610 3275726 3420867 3231723 3606557 4125387 4167601 3953040 3734697
7311 3734697 3638791 3427805 3121531 3150468 3005232 3421685 3724217 3387179 3171915 3239399
7301 3239399 3578924 3175050 3094715 3327154 3063876 3544387 2824452 2751687 2715943 2875867
7291 2875867 3434347 2965878 2841110 2615614 2865461 3265467 3123993 2585180 2804218 2986189
7281 2986189 2608834 2672023 2895813 3061242 3229772 3662908 3554555 2774440 2763697 3065774
7271 3065774 3189374 2440824 2096326 2209772 2767640 3046597 2537360 2208101 2071039 2623432
7261 2623432 2441289 2701149 2604615 2673947 2575127 1938405 2330838 2228237 2992730 3369751
$$ packed form
7331C336616L27760O5963N6667k66457m74564L41425R4640M00090o6002l37034
7321C479104k43839j49655J90116J45141j89144L74834N18830M2214k14561k18343
7311C734697r5906k10986l06274K8937j45236M16453L02532l37038k15264O7484
7301C239399L39525m03874q0335K32439k63278M80511p19935p2765l5744J59924
7291B875867N58480m68469j24768k25496K49847M00006j41474n38813K19038J81971
7281B986189l77355O3189K23790J65429J68530M33136j08353p80115j0743L02077
7271C065774J23600p48550l44498J13446N57868K78957n09237l29259j37062N52393
7261B623432j82143K59860r6534O9332r8820o36722L92433j02601P64493L77021
$$ plain form
7251 3369751 3531012 2648501 2208176 1959294 2291632 2677886 2239164 2445687 2435043 2697047
7241 2697047 2366537 2075449 1794779 1924052 2084523 2109915 1762403 2325444 2760621 2735604
7231 2735604 2048389 1329007 1266514 1974350 2313972 2271215 2024693 1840179 2339045 2801032
7221 2801032 2150831 1919125 2055462 1828280 1677844 1522742 2442875 2249302 2297509 1847447
7211 1847447 1412729 1482700 1585859 1776833 2008180 1734368 1051614 1027336 984879 957110
7201 957110 1181356 1737853 1766995 1812694 1515717 1603396 1577966 2257763 2326786 1746050 1716177
7190 1716177 1429754 1930234 1908826 1788067 1648570 1542292 1509695 1378067 1929775 1743632
7180 1743632 1474308 1818219 921288 1167725 1787886 1714499 1157347 1534395 1180279 1285766
$$ packed form
7251C369751J61261q82511m40325k48882L32338L86254m38722K06523j0644K62004
7241B697047l30510k91088k80670J29273J60471K5392l47512N63041M35177k5017
7231B735604o87215p19382o2493P07836L39622m2757k46522j84514M98866M61987
7221B801032o50201k31706J36337k27182j50436j55102R20133j93573M8207m50062
7211A847447m34718O9971J03159J90974K31347k73812o82754k4278m2457k7769
7201I57110K24246N56497K9142M5699k96977Q7679k5430O79797O9023n80736k9873
7190A716177k86423N00480k1408j20759j39497j06278l2597j31628N51708j86143
7180A743632k69324L43911q96931K46437O20161p3387n57152L77048l54116J05487
$$ plain form
7170 1285766 1729411 1666676 1693072 1849418 1403099 1467921 1455930 1895611 2336826 2116017
7160 2116017 1514660 1207252 1159692 1339891 1426643 965488 984148 527526 976681 1052738
7150 1052738 1138137 1360051 1485991 1061723 948943 912852 1137106 1434683 1641752 1472776
7140 1472776 1156889 1359493 1399243 990207 1106704 1317820 835449 879245 1414070 1547458
7130 1547458 1531350 1374163 1094801 757230 1039218 1130700 991394 784652 658771 423161
7120 423161 363505 849076 1275013 1492859 742967 675147 1040766 1094825 965107 541596
7110 541596 675839 1409159 1101489 869353 1043402 814411 1059891 556208 547381 431013
7100 431013 1081479 1279993 1184617 1820092 1056919 548413 592978 648757 1054943 953069
$$ packed form
7170A285766M43645o2735K6396J56346m46319O4822j1991M39681M41215k20809
7160B116017o01357l07408m7560J80199Q6752m61155J8660m56622M49155P6057
7150A052738Q5399K21914J25940m24268j12780l6091K24254K97577K07069j68976
7140A472776l15887K02604L9750m09036J16497K11116m82371M3796N34825J33388
7130A547458j6108j57187k79362l37571K81988R1482j39306k06742j25881k35610
7120D23161n9656M85571M25937K17846p49892o7820L65619N4059j29718m23511
7110E41596J34243P33320l07670k32136J74049k28991K45480n03683q827j16368
7100D31013O50466J98514r5376O35475p63173n08506M4565N5779M06186j01874
$$ plain form
7090 953069 648641 1099078 897976 385287 657538 842059 898078 678026 535548 500048
7080 500048 731693 1201036 943084 680311 787488 493141 931688 1459281 1148629 970883
7070 970883 799902 901213 542242 92746 822507 482461 373849 798478 958850 754997
7060 754997 65230 869593 1167615 926203 780446 503706 431422 495511 615988 605413
7050 605413 326652 372255 213535 723005 1065036 1043268 905300 689377 119111 66631
7040 66631 372754 194811 183514 240150 59171 184090 310023 515380 644738 495797
7030 495797 548549 856864 1434786 1185991 816692 922850 942714 437860 430202 548663
7020 548663 920226 488651 499132 679571 729150 1049190 863788 822063 1232531 941095
$$ packed form
7090I53069l04428M50437k01102n12689K72251J84521N6019k20052j42478l5500
7080E00048K31645M69343k57952k62773J07177k94347M38547N27593l10652j77746
7070I70883j70981J01311l58971m49496P29761l40046j08612M24629J60372k03853
7060G54997o89767Q04363K98022k41412j45757k76740p2284O4089J20477j0575
7050F05413k78761M5603j58720N09470L42031k1768j37968k15923n70266n2480
7040F6631L06123j77943j1297N6636j80979J24919J25933K05357J29358j48941
7030D95797N2752L08315N77922k48795l69299J06158J9864n04854p658J18461
7020E48663L71563m31575J0481J80439M9579L20040j85402m1725M10468k91436
$$ plain form
7010 941095 892058 1099278 1185798 1129372 912118 811672 774187 648762 68215 270193
7000 270193 670499 635533 993333 912209 454693 720626 777794 639192 850701 670591
6990 670591 1004053 1061842 816628 655505 718917 191861 57788 532594 517491 815492
6980 815492 666133 1174071 952131 410885 139417 484831 591811 733417 566086 315622
6970 315622 701673 883673 748671 756582 605261 383812 607667 582539 591063 1102424 1182295
6959 1182295 921971 458167 607782 772980 1228004 1028635 706985 1210727 1074419 953841
6949 953841 555522 1033505 1361763 1216787 1180473 1243256 1017180 1493401 1609888 1058264
6939 1058264 1207146 1351921 1014400 1177877 1367942 1342603 1193157 1096110 1424103 2085846
$$ packed form
7010I41095m9037K07220Q6520n6426k17254j00446l7485j25425n80547K01978
7000B70193M00306l4966L57800q1124m57516K65933N7168j38602K11509j80110
6990F70591L33462N7789k45214j61123O3412n27056j34073M74806j5103K98001
6980H15492j49359N07938k21940n41246k71468L45414J06980J41606j67331k50464
6970C15622L86051J82000j35002P911j51321k21449K23855k5128Q524N11361P9871
6959A182295k60324m63804J49615J65198M55024j99369l21650N03742j36308j20578
6949I53841l98319M77983L28258j44976l6314O2783k26076M76221J16487n51624
6939A058264J48882J44775l37521J63477J90065k5339j49446r7047L27993O61743
$$ plain form
6929 2085846 2099283 1611370 2155643 2343429 2280488 2328840 2245611 2317864 2632707 2960920
6919 2960920 3004051 3112672 3030237 3753923 4191322 4325436 4942682 4140069 4502666 5267810
6909 5267810 5486190 5297076 4738597 4370379 4250959 3851884 3613296 3347671 2980705 2559615
6899 2559615 3017659 3028599 2802637 2227442 2164536 2104311 1877990 1810452 1804245 1933126 1961914
6888 1961914 1561452 971991 1123732 1334840 1491886 1395182 1261755 1502649 1386712 1227491
6878 1227491 1189131 1229253 1515733 1240408 1155545 1456248 1287042 1254757 2052283 1483201
6868 1483201 987418 952505 1003306 617223 695644 661823 58133 399764 809195 971505
6858 971505 1135812 1044632 1055704 655502 363371 528874 434355 781150 865790 472949
$$ packed form
6929B085846J3437m87913N44273J87786o2941M8352q3229P2253L14843L28213
6919B960920M3131J08621q2435P23686M37399J34114O17246q02613L62597P65144
6909E267810K18380j89114n58479l68218j19420l99075k38588k65625l66966m21090
6899B559615M58044J0940k25962n75195o2906o0225k26321o7538o207J28881K8788
6888A961914m00462n89461J51741K11108J57046r6704j33427K40894j15937j59221
6878A227491l8360M0122K86480k75325q4863L00703j69206l2285P97526n69082
6868A483201m95783l4913N0801l86083P8421l3821o03690L41631M09431J62310
6858I71505J64307r1180J1072m00202k92131J65503r4519L46795Q4640l92841
$$ plain form
6848 472949 710537 334422 509933 1110370 787522 281696 727496 681056 1033347 868261
6838 868261 472595 331542 772148 179571 -95156 479258 63865 234354 246806 415186
6828 415186 264000 -234387 93183 503261 827110 288926 538868 669980 581804 615627
6818 615627 381126 672969 517198 573095 1199283 739700 446390 549817 789738 314978
6808 314978 62930 514495 330017 588049 397462 402882 141723 404853 1059526 993275
6798 993275 392074 35494 7819 170486 550937 518225 138317 337640 337723 383079 35094
6787 35094 -157206 388098 549794 78591 85827 577755 241790 297578 512699 645865
6777 645865 308508 40260 -62217 156515 397429 574107 724536 960018 946815 604615
$$ packed form
6848D72949K37588l76115J75511O00437l22848n05826M45800m6440L52291j65086
6838H68261l95666j41053M40606n92577k74727N74414m15393J70489J2452J68380
6828D15186j51186m98387L27570M10078L23849n38184K49942J31112q8176L3823
6818F15627k34501K91843j55771N5897O26188m59583k93310J03427K39921m74760
6808C14978k52048M51565j84478K58032j90587N420k61159K63130O54673o6251
6798I93275o01201l56580k7675J62667L80451l2712l79908J99323Q3M5356l47985
6787C5094j92300N45304J61696m71203P236M91928l35965N5788K15121J33166
6777F45865l37357k68248j02477K18732K40914J76678J50429K35482j3203l42200
$$ plain form
6767 604615 584979 803578 860164 517114 376002 58376 745801 601680 361423 190508
6757 190508 -219853 -331264 404712 749571 320025 -52864 393940 381578 506532 321012
6747 321012 391776 532759 535223 190209 108859 190820 703167 305242 346498 382791 503804
6736 503804 399394 408143 674094 357386 516331 407577 409721 178498 -147489 52630
6726 52630 646618 541912 256472 -116867 8415 264021 216272 363080 547895 677794
6716 677794 709476 722005 794067 353014 30023 293218 510380 612164 578653 -272450
6706 -272450 186341 263073 742793 391881 90522 210713 80595 83096 195727 630083
6696 630083 766777 330630 301023 214774 911685 1016926 549111 37380 463074 790790
$$ packed form
6767F04615j9636K18599N6586l43050j41112l17626O87425j44121k40257j70915
6757A90508m10361j11411P35976L44859m29546l72889M46804j2362J24954j85520
6747C21012P0764J40983K464l45014q1350Q1961N12347l97925M1256L6293J21013
6736E03804j04410Q749K65951l16708J58945j08754K144k31223l25987K00119
6726E2630N93988j04706k85440l73339J25282K55606m7749J46808J84815J29899
6716F77794L1682J2529P2062m41053l22991K63195K17162J01784l3511q51103
6706b72450M58791P6732M79720l50912l01359J20191j30118K501J12631M34356
6696F30083J36694m36147k9607q6249O96911J05241m67815n11731M25694L27716
$$ plain form
6686 790790 970624 237091 -113085 391073 457374 1108910 1013423 1126143 1289161 535769
6676 535769 499779 582308 377995 820466 512920 687598 594074 748921 920917 1065941
6666 1065941 936806 938369 297087 156346 604217 1081449 634477 892838 994019 772105
6656 772105 857851 1109902 655854 872086 1362548 1367633 1487797 1369153 1852768 2221553
6646 2221553 1602592 1780683 1722036 1802546 2326854 2366785 2337900 1762043 2282919 2370034
6636 2370034 2789644 2698180 3283733 3664121 3664914 3450179 4096738 4280271 5273541 5972165
6626 5972165 6099106 6042799 6598543 7057660 7240403 7785724 7096272 7196323 6844836 6839326
6616 6839326 6634400 6180551 5564890 5069901 4418290 4309002 3938585 3493801 3299957 3647705
$$ packed form
6686G90790J79834p33533l50176N04158O6301O51536r5487J12720J63018p53392
6676E35769l5990Q2529k04313M42471l07546J74678r3524J54847J71996J45024
6666A065941j29135J563o41282j40741M47871M77232m46972K58361J01181k21914
6656G72105Q5746K52051m54048K16232M90462N085J20164j18644M83615L68785
6646B221553o18961J78091n8647Q0510N24308L9931k8885n75857N20876Q7115
6636B370034M19610r1464N85553L80388P93k14735O46559J83533R93270O98624
6626E972165J26941n6307N55744M59117J82743N45321o89452J00051l51487n510
6616F839326k04926m53849o15661m94989o51611j09288l70417m44784j93844L47748
$$ plain form
6606 3647705 3446203 3119863 2367277 2048708 1738729 1707709 2422882 2460567 2371024 1940420
6596 1940420 1937474 1968477 1997832 1906459 1869898 1804626 1782429 1296679 861103 754302 1065808
6585 1065808 1035906 762996 980100 649281 297953 1300018 962045 677202 698958 725915
6575 725915 859810 261896 310015 170661 1238133 1244372 686898 1012938 736385 1043390
6565 1043390 509517 441559 377839 464454 661573 1000136 299037 -120703 91360 650466
6555 650466 620532 392722 -1392 -110653 648092 931485 610827 755003 565686 116674
6545 116674 371965 639454 188385 -123791 -34073 319635 -39428 229443 1026322 1295652
6535 1295652 1013504 496453 316453 -11785 586377 743 214664 256686 273056 172840
$$ packed form
6606C647705k01502l26340p52586l18569l09979l1020P15173L7685q9543m30604
6596A940420k946L1003K9355r1373l6561o5272k2197m85750m35576j06801L11506
6585A065808k9902k72910K17104l30819l51328J002065l37973k84843K1756K6957
6575G25915J33895n97914M8119j39354J067472O239n57474L26040k76553L07005
6565A043390n33873o7958o3720Q6615J97119L38563p01099m19740K12063N59106
6555F50466k9934k27810l94114j09261P58745K83393l20658J44176j89317m49012
6545A16674K55291K67489m51069l12176Q9718L53708l59063K68871P96879K69330
6535A295652k82148n17051j80000l28238N98162n85634K13921M2022J6370j00216
$$ plain form
6525 172840 -104130 201059 544575 56234 -209863 158564 299974 454041 598840 578525
6515 578525 434521 231475 469381 220019 388504 61693 21307 335868 258248 -101726
6505 -101726 190330 55375 -116059 134596 -175655 -63106 -256571 -428736 -224312 -235459
6495 -235459 364685 788756 512370 219989 86011 -103116 208208 270360 471320 179326
6485 179326 -221168 -39692 -163151 -32380 303595 82766 33336 365085 140457 -572363
6475 -572363 -200609 511058 945158 940257 -120366 53424 396223 254351 534619 94202
6465 94202 135615 558834 773019 754100 619154 135875 414169 609574 61067 -133910
6455 -133910 105073 224425 333025 24498 -10786 276101 520802 427061 787808 923320
$$ packed form
6525A72840k76970L05189L43516m88341k66097L68427J41410J54067J44799k0315
6515E78525j44004k03046K37906k49362J68485l26811m0386L14561p7620l59974
6505a01726K92056j34955j71434K50655l10251J12549j93465j72165K04424j1147
6495b35459O00144M24071k76386k92381j33978j89127L11324O2152K00960k91994
6485A79326m00494J81476j23459J30771L35975k20829m9430L31749k24628p12820
6475e72363L71754P11667M34100m901j060623J73790L42799j41872K80268m40417
6465I4202M1413M23219K14185j8919j34946m83279K78294J95405n48507j94977
6455a33910K38983J19352J08600l08527l5284K86887K44701r3741L60747J35512
$$ plain form
6445 923320 799518 287713 276653 756973 49226 443802 656393 610081 468218 344730
6435 344730 13 332522 654723 3577 -675515 -327879 157803 648128 451751 79484
6425 79484 346006 370991 424276 285639 375079 372132 150104 666497 806493 227140 -89046
6414 -89046 367966 342729 302477 -18143 113289 353878 519291 830698 654866 147961
6404 147961 170553 275927 634231 920801 973948 1167184 1144456 974288 533834 228545
6394 228545 591496 220438 463324 343273 681956 30840 -230130 313189 724217 296484
6384 296484 423229 566480 550626 535174 139280 748 689515 935959 393892 125576
6374 125576 535308 642717 655993 724715 186803 -106729 -141398 555056 852538 833298
$$ packed form
6445I23320j23802n11805j1060M80320p07747L94576K12591m6312j41863j23488
6435C44730l44717L32509L22201o51146o79092L47636M85682M90325j96377l72267
6425G9484K66522K4985N3285j38637Q9440k947k22028N16393J39996n79353l16186
6414h9046M57012k5237m0252l20620J31432K40589J65413L11407j75832n06905
6404A47961K2592J05374L58304K86570N3147J93236k2728j70168m40454l05289
6394B28545L62951l71058K42886j20051L38683o51116k60970N43319M11028m27733
6384B96484J26745J43251j5854j5452l95894j38532O88767K46444n42067k68316
6374A25576M09732J07409J3276O8722n37912k93532l4669O96454K97482j9240
$$ plain form
6364 833298 668902 733181 936964 213017 662721 574775 627500 968260 870562 400449
6354 400449 386111 871456 730772 1352067 1347159 1300990 775362 717856 717789 980928 406584
6343 406584 900188 948486 1319842 667981 300300 300762 445595 786040 757011 372753 -160125
6332 -160125 402365 707047 499646 404515 459178 511927 372353 561820 411365 558948
6322 558948 431760 502457 826310 1027834 1007275 885701 849250 1049683 906053 709802
6312 709802 851333 792012 577148 374637 815921 1000005 874313 552769 570895 455236
6302 455236 592987 825383 661880 896193 982588 1124503 973819 1127465 1423697 1378412
6292 1378412 702709 309801 602122 70952 469759 825994 319137 -196462 -223944 166106
$$ packed form
6364H33298j64396O4279K03783p23947M49704q7946N2725L40760r7698m70113
6354D00449j4338M85345j40684O21295m908m6169n25628n7506o7K63139n74344
6343D06584M93604M8298L71356o51861l67681M62J44833L40445k9029l84258n32878
6332a60125N62490L04682k07401r5131N4663N2749j39574J89467j50455J47583
6322E58948j27188P0697L23853K01524k0559j21574l6451K00433j43630j96251
6312G09802J41531n9321k14864k02511M41284J84084j25692l21544J8126j15659
6302D55236J37751K32396j63503K34313Q6395J41915j50684J53646K96232m5285
6292A378412o75703l92908K92321n31170L98807L56235n06857n15599k7482L90050
$$ plain form
6282 166106 339815 331962 310955 418218 453499 327636 244532 859072 1115004 1200487 513869
6271 513869 680103 728675 1012637 1170704 1170228 1103704 1041118 1386749 815702 645171 639777
6260 639777 502448 896455 801713 1122883 1520752 1489560 1472698 1206515 934565 745009
6250 745009 1064538 1143787 617236 1088292 1401571 1421021 1672133 1021112 769595 1186776
6240 1186776 1105918 1302624 1049355 833273 1229629 1068200 927577 763838 956790 918716
6230 918716 1408690 1041907 1165989 1042408 835542 1049049 1053150 769735 1234904 1653029
6220 1653029 829845 575907 966808 507877 768672 918427 813083 446121 1026435 1239232
6210 1239232 1144589 550288 511963 967086 676232 370209 368763 610590 1004170 1500276
$$ packed form
6282A66106J73709p853k1007J07263L5281j25863q3104O14540K55932Q5483o86618
6271E13869J66234M8572K83962J58067m76o6524o2586L45631n71047j70531n394
6260F39777j37329L94007r4742L21170L97869l1192j6862k66183k71950j89556
6250G45009L19529P9249n26551M71056L13279J9450K51112o51021k51517M17181
6240A186776q0858J96706k53269k16082L96356j61429j40623j63739J92952l8074
6230I18716M89974l66783J24082j23581k06866K13507M101k83415M65169M18125
6220A653029q23184k53938L90901m58931K60795J49755j05344l66962N80314K12797
6210A239232r4643n94301l8325M55123k90854l06023j446K41827L93580M96106
$$ plain form
6200 1500276 1148201 954449 1427980 1395754 1176963 714301 803412 932863 615586 678545
6190 678545 841135 346262 1253027 1232229 889867 566386 583624 955159 1453269 1223465
6180 1223465 515376 563555 991995 1387772 1380614 1115041 779734 1040679 1381640 1181960
6170 1181960 937706 811429 1057496 1204672 967596 1502671 1149595 850709 848220 933944
6160 933944 764658 1237878 696370 272924 525756 591189 966063 1573157 1268520 1310093
6150 1310093 1340539 1351891 1426116 1188153 724528 1162441 1380714 1187745 1040986 260070
6140 260070 500141 1122376 1171750 1188484 685750 1051987 1191454 739921 683087 818432
6130 818432 680075 1022371 694985 919506 994281 1042659 968721 737828 757648 918317
$$ packed form
6200A500276l52075j93752M73531l2226k18791m62662Q9111J29451l17277O2959
6190F78545J62590m94873R06765k0798l42362l23481J7238L71535M98110k29804
6180A223465p08089M8179M28440L95777p158k65573l35307K60945L40961j99680
6170A181960k44254j26277K46067J47176k37076N35075l53076k98886k489Q5724
6160I33944j69286M73220n41508m23446K52832O5433L74874O07094l04637M1573
6150A310093L0446J1352P4225k37963m63625M37913K18273j92969j46759p80916
6140B60070K40071O22235M9374J6734n02734L66237J39467m51533n6834J35345
6130H18432j38357L42296l27386K24521P4775M8378p3938k30893J9820J60669
$$ plain form
6120 918317 1246713 1294237 1133784 1074178 1293382 1231939 685890 1031586 1007235 927030 831814
6109 831814 1117486 1536358 1596404 1205153 1617796 1689639 1318294 1417554 1422537 1415109 1007925
6098 1007925 612721 559140 772605 1517576 1756533 968908 852660 1011543 1077454 1110045
6088 1110045 1122216 741189 1032532 973920 946608 1273904 1783320 1716266 1518964 1130862
6078 1130862 1435649 1492142 1575691 1451905 1261758 584791 1483131 1723325 2079482 2050307
6068 2050307 1639281 1342443 1450447 1706707 1690371 1536220 1565390 2229216 1858836 1523427
6058 1523427 1758107 1865855 1686555 1775922 1611894 1252971 1286396 1754974 1894794 2045348
6048 2045348 2315354 2380954 2321531 1803172 2225472 2649555 2409577 2798216 2945521 2781458
$$ packed form
6120I18317L28396M7524j60453n9606K19204o1443n46049L45696k4351q0205r5216
6109H31814K85672M18872O0046l91251M12643P1843l71345R9260M983p428m07184
6098A007925l95204n3581K13465P44971K38957p87625j16248J58883O5911L2591
6088A110045J2171l81027K91343n8612k7312L27296N09416o7054j97302l88102
6078A130862L04787N6493Q3549j23786j90147o76967Q98340K40194L56157k9175
6068B050307m11026k96838J08004K56260j6336j54151K9170O63826l70380l35409
6058A523427K34680J07748j79300Q9367j64028l58923L3425M68578J39820J50554
6048B045348K70006O5600n9423n18359M22300M24083k39978L88639J47305j64063
$$ plain form
6038 2781458 2765724 2831431 2890601 3203362 3030326 3655809 3788342 3473029 3576906 3208406
6028 3208406 2962761 3059039 3044233 2873378 2935221 2939184 2656629 2244279 2167247 2316627 1908675
6017 1908675 1974198 1735169 2035948 2344998 2654241 2263278 1943207 2183968 2202238 2150328
6007 2150328 1676031 1559740 1542193 1994509 2179779 1751242 1477778 1185277 1612730 1932618
5997 1932618 1715461 1774344 1791363 1395744 1508443 1588018 1468367 1203503 1553847 1645408
5987 1645408 1835137 1806247 1147055 1576687 1664218 1708412 1883582 1609387 1466362 2256633
5977 2256633 2228057 1998207 2361952 2297972 2306615 2082010 1903850 1969633 1895198 2162969 2049591
5966 2049591 1953135 1993156 1716146 2096094 1945906 2122112 1906701 1685939 1759958 1919428
$$ packed form
6038B781458j5734O5707N9170L12761j73036O25483J32533l15313J03877l68500
6028C208406k45645R6278j4806j70855O1843L963k82555m12350p7032J49380m07952
6017A908675O5523k39029L00779L09050L09243l90963l20071K40761J8270n1910
6007B150328m74297j16291j7547M52316J85270m28537k73464k92501M27453L19888
5997A932618k17157N8883J7019l95619J12699P9575j19651k64864L50344R1561
5987A645408J89729k8890o59192M29632Q7531M4194J75170k74195j43025P90271
5977B256633k8576k29850L63745o3980Q643k24605j78160O5783p4435K67771j13378
5966B049591r6456M0021k77010L79948j50188J76206k15411k20762P4019J59470
$$ plain form
5956 1919428 2309953 1943892 2076433 2134859 1990110 1693742 1676601 2155687 2654940 1771192
5946 1771192 1786887 1673975 1789674 2075164 2042234 2166664 1862219 1721334 2079502 2211572
5936 2211572 1828514 1341427 1917928 1959712 1909328 2182361 1808035 2081727 2257760 2552831
5926 2552831 2586717 1910018 1840703 1487854 1311845 1844268 2070045 2317985 2040597 2136323
5916 2136323 2455952 2641184 2404763 2058712 2256353 2428121 2368129 2348340 2417011 2165117
5906 2165117 2393114 2803282 2479511 2022260 1865776 1795683 1748195 2138986 1736165 1934126
5896 1934126 2375381 2417147 2263178 2243773 2296379 2497089 2699831 2663930 2468832 2517563
5886 2517563 2550987 2298303 2704564 2386075 2352363 2470629 2593123 2526541 2484775 2494199 2476091
$$ packed form
5956A919428L90525l66061J32541N8426j44749k96368j7141M79086M99253q83748
5946A771192J5695j12912J15699K85490l2930J24430l04445j40885L58168J32070
5936B211572l83058m87087N76501M1784n0384K73033l74326K73692J76033K95071
5926B552831L3886o76699o9315l52849j76009N32423K25777K47940k77388R5726
5916B136323L19629J85232k36421l46051J97641J71768n9992j9789O8671k51894
5906B165117K27997M10168l23771m57251j56484p0093m7488L90791m02821J97961
5896A934126M41255M1766j53969j9405N2606K00710K02742l5901j95098M8731
5886B517563L3424k52684M06261l18489l3712J18266J22494o6582m1766R424j8108
$$ plain form
5875 2476091 3002383 3129006 2746031 1938930 2824678 3057095 2576528 2662225 2779902 3580378
5865 3580378 3535253 3517595 3146111 3987843 4053568 4357064 4372020 4272419 4451113 4280918
5855 4280918 5005800 4747760 4678629 4946371 5417977 5131936 5384543 4988837 5214358 5470725
5845 5470725 5399260 5073229 5227294 5532698 5285921 5428162 5700538 5666545 5377722 5084539
5835 5084539 4867002 5183332 5193867 5099486 4785235 4642463 4315295 4194190 4679888 4615892
5825 4615892 4109571 4357385 4522669 3884771 3433317 4039349 3939050 4183136 4131871 3609708
5815 3609708 3790605 4296289 4306303 4034734 4512708 4541337 5494121 5495034 4875841 4518068
5805 4518068 4382657 5037450 5365917 5083737 5426197 5772163 6093586 6527853 6342718 6254959
$$ packed form
5875B476091N26292J26623l82975q07101Q85748K32417m80567Q5697J17677Q00476
5865C580378m5125j7658l71484Q41732O5725L03496J4956r9601J78694j70195
5855D280918P24882k58040o9131K67742M71606k86041K52607l95706K25521K56367
5845E470725p1465l26031J54065L05404k46777J42241K72376l3993k88823k93183
5835E084539k17537L16330J0535r4381l14251j42772l27168j21105M85698o3996
5825D615892n06321K47814J65284o37898m51454O06032j00299K44086n1265n22163
5815C609708J80897N05684J0014k71569M77974K8629R52784R13o19193l57773
5805D518068j35411O54793L28467k82180L42460L45966L21423M34267j85135q7759
$$ plain form
5795 6254959 6179702 6863084 7091644 7272554 7266932 7232181 8300076 8470297 8406978 8293389
5785 8293389 7701886 7975767 8529436 7728728 7439443 7925743 8569048 8742035 8622307 8073794
5775 8073794 7913422 7690173 7984188 7418015 6488890 6468991 6635140 6573295 5849783 5226507
5765 5226507 4650226 5653434 5748434 5510231 5041655 4217364 4435008 4565134 4402942 4305732
5755 4305732 4520490 4579976 4201215 4102046 3762626 3841916 4213493 4034562 4117644 4390923
5745 4390923 3669713 3825858 4002012 3813152 3990205 3824201 4228408 4325084 4057612 3909897
5735 3909897 3439052 3366558 3781800 3675652 3688786 3820955 3911777 3817071 3982102 3896256
5725 3896256 3360644 3652719 3200749 3693115 4162816 3723127 3353909 3497996 3370291 3758622
$$ packed form
5795F254959p5257O83382K28560J80910n622l4751J067895J70221o3319j13589
5785H293389n91503K73881N53669q00708k89285M86300O43305J72987j19728n48513
5775H073794j60372k23249K94015n66173r29125j9899J66149o1845p23512o23276
5765E226507n76281J003208R5000k38203m68576q24291K17644J30126j62192r7210
5755D305732K14758N9486l78761r9169l39420P9290L71577j78931Q3082K73279
5745D390923p21210J56145J76154j88860J77053j66004M04207R6676k67472j47715
5735C909897m70845p2494M15242j06148J3134J32169R0822r4706J65031q5846
5725C896256n35612K92075m51970M92366M69701m39689l69218J44087j27705L88331
$$ plain form
5715 3758622 4136296 3910197 3644487 3568589 4032650 3990379 3515910 3738292 3966644 3697216
5705 3697216 3836495 3715068 3854122 4029605 4013095 3821662 3509756 4383916 4627079 4228045
5695 4228045 4063725 3966369 4013704 4393705 4612771 4442732 4584569 4611233 4816937 5257886
5685 5257886 5431645 5183924 5067131 4785862 4933963 4730940 5189407 5650646 5560155 5823307
5675 5823307 5501284 5824796 5777362 6165495 6504037 6601053 6644350 6729484 7447253 7529990
5665 7529990 8039714 8415637 8661073 8576068 8345148 8197984 8950508 9138027 8585903 8932095
5655 8932095 8675942 9066970 9374846 9102261 8941796 9082104 9538365 9815827 9084688 8673807
5645 8673807 9096468 9780036 10028855 9767636 9761209 9760621 9957045 9709214 9027478 8843167
$$ packed form
5715C758622L77674k26099k65710p5898M64061m2271m74469K22382K28352k69428
5705C697216J39279j21427J39054J75483j6510j91433l11906Q74160K43163l99034
5695D228045j64320r7356M7335L80001K19066j70039J41837K6664K05704M40949
5685E257886J73759k47721j16793k81269J48101k03023M58467M61239r0491K63152
5675E823307l22023L23512m7434L88133L38542R7016M3297Q5134P17769Q2737
5665G529990N09724L75923K45436q5005k30920j47164P52524J87519n52124L46192
5655H932095k56153L91028L07876k72585j60465J40308M56261K77462p31139m10881
5645H673807M22661O83568K48819k61219o427n88J96424k47831o81736j84311
$$ plain form
5635 8843167 8954877 8945418 8667453 8087460 7743714 7941600 7383676 6821843 6560715 6610784
5625 6610784 6822646 6714584 6706871 6085785 6433844 6799382 6322392 6153044 6510078 5518533
5615 5518533 5468934 6092102 6288884 5889728 6289859 6053863 6187402 6325514 6020256 6371957
5605 6371957 6050177 6104149 5886403 6420174 6767724 6934697 6870619 7051580 7172289 6705700
5595 6705700 7749092 8064627 7648758 7331763 7514678 7154617 7391637 7567582 7435609
5586 7435609 7234616 7176312 7090242 7164343 7337047 7074113 8018913 8105132 8077170 7964104
5576 7964104 7291107 6999408 7152767 7106992 6809371 6505952 5734678 6423218 6531752 6335687
5566 6335687 6111852 5987543 5918086 5913286 5824079 5234155 5204599 5490892 5624982 5399847
$$ packed form
5635H843167J11710r459k77965n79993l43746J97886n57924n61833k61128N0069
5625F610784K11862j08062p713o21086L48059L65538m76990j69348L57034r91545
5615E518533m9599O23168J96782l99156M00131k35996J33539J38112l05258L51701
5605F371957l21780N3972k17746N33771L47550J66973o4078J80961J20709m66589
5595F705700J043392L15535m15869l16995J82915l60061K37020J75945j31973
5586G435609k00993n8304q6070P4101J72704k62934R44800Q6219k7962j13066
5576G964104o72997k91699J53359m5775k97621l03419p71274O88540J08534j96065
5566F335687k23835j24309o9457m800q9207n89924k9556K86293J34090k25135
$$ plain form
5556 5399847 5505929 5649990 5893578 5654726 5486437 5504818 5261424 5469054 5991203 5680461
5546 5680461 5763681 5404844 5545117 5853245 5507032 4714590 5390409 5585859 5307053 4818168
5536 4818168 5212484 5386211 5305015 5349894 5346025 5325703 5364742 5478714 5566723 5776596 5584847
5525 5584847 5364385 5143628 5618192 5732362 5711115 5027091 5090248 5604795 5190727 5218676
5515 5218676 5543516 5859180 5543589 5739577 5838443 5809976 6082117 5779821 6016187 6106514
5505 6106514 5961128 6038087 6106862 6228488 5735948 5406792 5606464 5763542 6206088 6108387
5495 6108387 6063988 5769990 5701904 6289648 6206689 5003845 5222803 5816399 5889503 5831132
5485 5831132 5644244 5778409 6137472 6641945 6543406 6085352 5554539 5833331 6039088 5997126
$$ packed form
5556E399847J06082J44061K43588k38852j68289J8381k43394K07630N22149l10742
5546E680461Q3220l58837J40273L08128l46213p92442O75819J95450k78806m88885
5536D818168L94316J73727q1196M4879l869k0322L9039J13972Q8009K09873j91749
5525E584847k20462k20757M74564J14170k1247o84024O3157N14547m14068K7949
5515E218676L24840L15664l15591J95988R8866k8467K72141l02296K36366R0327
5505F106514j45386P6959O8775J21626m92540l29156J99672J57078M42546r7701
5495F108387m4399k93998o8086N87744q2959j202844K18958N93596P3104n8371
5485E831132j86888J34165L59063N04473r8539m58054n30813K78792K05757m1962
$$ plain form
5475 5997126 5964083 6014346 6007443 6740052 6557998 6307110 6330463 5964025 5953080 6445636 5742910
5464 5742910 5476532 6119571 5658488 5787028 5733370 5646807 5428603 5419911 5781881 5517869
5454 5517869 5691147 6074684 6262483 5933748 5816829 5966402 6169700 6232054 6260994 6264484
5444 6264484 6035810 6186306 5988631 6251462 5541694 5566652 6263038 5995021 5998401 5936006
5434 5936006 5990202 5567287 5663297 6030017 6148418 6437367 5812475 5829429 5752932 6181039
5424 6181039 6422992 6203722 6237982 5631128 6011272 6656475 6439702 6415524 6937482 6395957
5414 6395957 6044857 5688315 5529493 5976458 6572487 6581640 6446212 6235910 6090671 6361631
5404 6361631 6301630 6593104 6440087 7100301 6971338 6941003 6818030 6990553 6871561 6686557
$$ packed form
5475E997126l3043N0263o903P32609j82054k50888K3353l66438j0945M92556p02726
5464E742910k66378O43039m61083J28540n3658q6563k18204q692L61970k64012
5454E517869J73278L83537J87799l28735j16919J49573K03298O2354K8940L490
5444F264484k28674J50496j97675K62831p09768K4958O96386k68017L380o2395
5434E936006N4196m22915R6010L66720J18401K88949o24892J6954p6497M28107
5424F181039K41953k19270L4260o06854L80144O45203k16773k4178N21958n41525
5414F395957l51100l56542j58822M46965N96029R153j35428k10302j45239K70960
5404F361631o0001K91474j53017O60214j28963l0335j22973J72523j18992j85004
$$ plain form
5394 6686557 6770511 6370709 6309521 6932478 6983075 6688356 6657310 6881517 6955804 6637190
5384 6637190 6965461 7237527 7039315 6938238 7033563 6878327 6574226 7177205 7261182 7071985
5374 7071985 7145127 6860508 6922601 7222285 7284446 7114933 7460024 7543425 7608279 6849117
5364 6849117 6702716 7301084 6639042 6667799 6817674 6972487 7249967 6898576 7176257 6882328
5354 6882328 7132954 7654395 7615354 7425267 7081326 7623355 7697916 7960317 7716031 7117906
5344 7117906 7011508 6924967 7699060 7735752 7718152 7727057 7443219 7605097 7375599 7430054 7410347
5333 7410347 7857531 8244211 7680539 7166999 7246815 7621181 7638519 7636591 7877299 8229592
5323 8229592 7926631 8059447 7908299 7370477 7654497 8166684 7958877 7263983 7443548 7740476
$$ packed form
5394F686557Q3954l99802o1188O22957N0597k94719l1046K24207P4287l18614
5384F637190L28271K72066j98212j01077R5325j55236l04101O02979Q3977j89197
5374G071985P3142k84619O2093K99684O2161j69513L45091Q3401O4854p59162
5364F849117j46401N98368o62042K8757J49875J54813K77480l51391K77681k93929
5354F882328K50626N21441l9041j90087l43941N42029P4561K62401k44286n98125
5344G117906j06398q6541P74093L6692j7600Q905k83838J61878k29498N4455j9707
5333G410347M47184L86680n63672n13540P9816L74366J7338j928K40708L52293
5323H229592l02961J32816j51148n37822K84020N12187k07807o94894J79565K96928
$$ plain form
5313 7740476 7927990 7699474 7709022 7573021 7292403 7308556 7876370 8070437 7903620 7790607
5303 7790607 7561408 8142533 7917636 7670718 7652109 7884037 7826597 8233781 8331459 7739684
5293 7739684 7883620 8126749 8104827 7969931 8080834 8249848 8029875 8039652 8020597 8250814
5283 8250814 8114616 8422657 8175379 8400498 8320528 8686872 9066824 8909578 8521189 8121869
5273 8121869 8498620 8907231 9046302 8709265 8341770 8283526 9054655 8560752 8193427 8450268
5263 8450268 8956045 9210168 9457262 8921770 8558738 9420900 9031030 9259302 9178614 9145902
5253 9145902 9458935 9462276 9508957 9404015 9275110 9423589 9721515 9884904 9332953 8766730
5243 8766730 9283665 10453555 10060227 9142648 9147930 9681286 10248681 9786117 9580585 9561377
$$ packed form
5313G740476J87514k28516R548j36001k80618J6153N67814J94067j66817j13013
5303G790607k29199N81125k24897k46918j8609K31928n7440M07184R7678n91775
5293G739684J43936K43129k1922j34896J10903J69014k19973R777j9055K30217
5283H250814j36198L08041k47278K25119p9970L66344L79952j57246l88389l99320
5273H121869L76751M08611J39071l37037l67495n8244P71129m93903l67325K56841
5263H450268N05777K54123K47094n35492l63032Q62162l89870K28272q0688l2712
5253I145902L13033L341M6681j04942j28905J48479K97926J63389n51951n66223
5243H766730N16935J169890l93328r17579N282N33356N67395m62564k05532j9208
$$ plain form
5233 9561377 10139896 10246711 9791999 9860583 9552914 10355878 10906823 10607139 10133711 9632151
5223 9632151 10752010 10881426 11309072 11130289 11262334 10869594 11149919 11546918 11698392
5214 11698392 11621726 11755113 12385308 11895284 12115304 12328970 12935216 12853499 12924099 13053156
5204 13053156 13485269 13993044 14110367 14298983 14197522 14588369 14739981 15034110 15277163
5195 15277163 15234621 15798618 15784519 16397132 16978054 16896907 16969514 17187944 18061059 18032994
5185 18032994 17728516 18149544 17759343 17598651 17899256 18526907 18673811 18441144 18778395
5176 18778395 18415060 18506864 18515748 17799814 17979198 18248287 18424425 18478263 17966795 18031743
5166 18031743 17875569 18212787 17864968 18022095 17702547 17775912 17567383 17673508 17567574 17601111
$$ packed form
5233I561377N78519J06815m54712O8584l07669Q02964N50945k99684m73428n01560
5223I632151J119859J29416M27646j78783J32045l92740K80325L96999J51474
5214A1698392p6666J33387O30195m90024K20020K13666O06246q1717P0600J29057
5204A3053156M32113N07775J17323J88616j01461L90847J51612K94129K43053
5195A5277163m2542N63997j4099O12613N80922q1147P2607K18430Q73115k8065
5185A8032994l04478M21028l90201j60692L00605O27651J46904k32667L37251
5176A8778395l63335R1804Q884p15934J79384K69089J76138N3838n11468O4948
5166A8031743j56174L37218l47819J57127l19548P3365k08529J06125j05934L3537
$$ plain form
5156 17601111 18069992 17728255 17389398 16919574 17156835 17431110 17580188 17658815 17490723 16986663
5146 16986663 16713210 16282008 16038204 16315994 16322957 16193545 16194913 15436024 15037922 15610180
5136 15610180 15588111 16254478 16291362 15814473 15905418 16506555 16651233 16512498 16596459 16299254
5126 16299254 16494125 16386161 16181339 16404230 17119188 16760845 16521772 16664154 17009010
5117 17009010 16815938 17190343 17787207 17777278 17707240 18084270 18271343 18150193 17549595 17504682
5107 17504682 17566989 17983886 18317271 18031439 17880187 18385007 18429747 18066252 18308855 18599665
5097 18599665 19172200 18966255 19007212 19178355 19453471 19661048 19593028 19303708 19511386 20296637
5087 20296637 20528451 20688100 21580464 21498400 21740575 22632367 22670532 23469035 24300469 25068156
$$ packed form
5156A7601111M68881l41737l38857m69824K37261K74275J49078P8627j68092n04060
5146A6986663k73453m31202k43804K77790O963j29412J368p58889l98102N72258
5136A5610180k2069O66367L6884m76889R0945O01137J44678j38735Q3961k97205
5126A6299254J94871j07964k04822K22891P14958l58343k39073J42382L44856
5117A7009010j93072L74405N96864r929p0038L77030J87073j21150o00598m4913
5107A7504682O2307M16897L33385k85832j51252N04820M4740l63495K42603K90810
5097A8599665N72535k05945M0957J71143K75116K07577o8020k89320K07678P85251
5087B0296637K31814J59649Q92364q2064K42175Q91792L8165P98503Q31434P67687
$$ plain form
5077 25068156 25808176 26219163 26815735 27493770 28315583 29222060 29498768 29770116 29820034 30364162
5067 30364162 30541032 29976727 29458210 29531470 28999267 28090207 26978622 26331151 25773155
5058 25773155 25282404 24998929 24665370 24335155 23669118 23783891 23670751 23319247 22956231
5049 22956231 23188022 22913779 22836349 22696704 22554583 22578503 23090565 23560027 22875182 22815753
5039 22815753 23250659 24190171 24292034 23940648 23980624 24121979 24661020 24871147 24593326 25200221
5029 25200221 25830953 25891424 26136077 26300332 27212417 27677819 28274427 29489644 29790806
5020 29790806 30482259 31389910 32373355 33067440 34067553 35823057 38290034 39395759 39879063
5011 39879063 41510866 42941978 43759360 44371991 44681168 44623610 44154481 43157177 42300404
$$ packed form
5077B5068156P40020M10987N96572O78035Q21813R06477K76708K71348M9918N44128
5067C0364162J76870n64305n18517P3260n32203r09060j111585o47471n57996
5058B5773155m90751k83475l33559l30215o66037J14773j13140l51504l63016
5049B2956231K31791k74243p7430j39645j42121K3920N12062M69462o84845n9429
5039B2815753M34906R39512J01863l51386L9976J41355N39041K10127k77821O06895
5029B5200221O30732O0471K44653J64255R12085M65402N96608J215217L01162
5020B9790806O91453R07651R83445O94085J000113J755504K466977J105725M83304
5011C9879063J631803J431112Q17382O12631L09177n7558m69129r97304q56773
$$ plain form
5002 42300404 42110773 41489997 40616796 40498323 39456948 37940305 37115311 36386421 35801247
4993 35801247 35231278 34033245 34126878 34166945 33936800 33529788 33594937 34009894 34256594 34585775
4983 34585775 34711325 34845106 36022349 36996497 37124901 38049597 39013774 40271764 41209421
4974 41209421 41210806 42330748 43091481 43615458 43581251 43148592 42994494 42071675 41664401 41187165
4964 41187165 39660099 38887505 39482270 39621060 39381823 39248171 38943518 39876170 40214228
4955 40214228 40155468 40040296 40375536 40998850 41187203 41284614 41452542 42278850 42665659 43400171
4945 43400171 43425935 43719400 44453958 45563827 46246295 46851845 47497327 48125113 48914683
4936 48914683 49702261 51080959 52141953 53181550 54318639 55138921 56474101 58181884
$$ packed form
5002D2300404j89631o20776q73201j18473j041375j516643q24994p28890n85174
4993C5801247n69969j198033R3633M0067k30145m07012O5149M14957K46700L29181
4983C4585775J25550J33781J177243R74148J28404R24696R64177J257990R37657
4974D1209421J385J119942P60733N23977l4207m32659j54098r22819m07274m77236
4964D1187165j527066p72594N94765J38790k39237j33652l04653R32652L38058
4955D0214228n8760j15172L35240O23314J88353R7411J67928Q26308L86809P34512
4945D3400171K5764K93465P34558J109869O82468O05550O45482O27786P89570
4936D8914683P87578J378698J060994J039597J137089Q20282J335180J707783
$$ plain form
4928 58181884 59650012 61147712 62456604 64306768 66013100 68058889 69560646 70708054
4920 70708054 72730605 75184659 77517509 80308135 82890299 85428496 88196453 90758672
4912 90758672 93105387 95545915 97511620 98286494 98638633 99230982 99537676 100547455 101896722
4903 101896722 103055600 103984874 105075577 106517454 107588641 108444586 110157131 111913698
4895 111913698 113741859 115933568 117265497 119595134 122393544 125368539 129168146 133352382
4887 133352382 137876843 142642154 148094875 154040757 159564572 166103104 173164781 180036169
4879 180036169 187736617 194742524 200727582 207031351 212711080 217578631 221491099 223947780
4871 223947780 225099913 225834181 224733628 223698463 222986989 223490753 224302170 225252981 227275103
$$ packed form
4928E8181884J468128J497700J308892J850164J706332K045789J501757J147408
4920G0708054K022551K454054K332850K790626K582164K538197K767957K562219
4912I0758672K346715K440528J965705P74874L52139N92349L06694J009779J349267
4903A01896722J158878R29274J090703J441877J071187Q55945J712545J756567
4895A11913698J828161K191709J331929K329637K798410K974995L799607M184236
4887A33352382M524461M765311N452721N945882N523815O538532P061677O871388
4879A80036169P700448P005907N985058O303769N679729M867551L912468K456681
4871B23947780J152133P34268j100553j035165p11474N03764Q11417R50811K022122
$$ plain form
4862 227275103 229506986 232300488 235362130 238498283 241546344 243791470 245110864 244485877
4854 244485877 242227578 240309748 239447063 240692782 242783584 246067325 251599137 259281843
4846 259281843 267750539 278129031 289449002 301692619 314926070 326766428 337426636
4839 337426636 346749636 355303277 362759737 367093067 366518747 358926580 344600629 327685905
4831 327685905 308914268 292393678 279101914 267422427 257216728 248094817 240865135
4824 240865135 234965858 230015868 225167148 221038298 217906452 214500150 211702583 208826932
4816 208826932 206147525 203865195 200895309 198032370 195144380 192174076 188522048 184737268
4808 184737268 181647014 178179578 174631160 171409866 168174424 164690736 161159851 157477325
$$ packed form
4862B27275103K231883K793502L061642L136153L048061K245126J319394o24987
4854B44485877k258299j917830q62685J245719K090802L283741N531812P682706
4846B59281843Q468696J0378492J1319971J2243617J3233451J1840358J0660208
4839C37426636R323000Q553641P456460M333330n74320p592167j4325951j6914724
4831C27685905j8771637j6520590j3291764j1679487j0205699r121911p229682
4824B40865135n899277m949990m848720m128850l131846l406302k797567k875651
4816B08826932k679407k282330k969886k862939k887990k970304l652028l784780
4808A84737268l090254l467436l548418l221294l235442l483688l530885l682526
$$ plain form
4800 157477325 154010933 150296111 146765704 143439462 139772572 136000574 132814533 130152316
4792 130152316 126904045 123687501 120614371 117579540 114768380 111520418 109054216 106401405
4784 106401405 103382875 101339098 99235092 97502405 95272869 92608083 89964044 88201392
4776 88201392 86804789 85423774 83577429 81568474 80507002 79487470 78072953 76520002
4768 76520002 75364436 74179049 72664015 71271636 70219742 69353380 68469145 68120704 67615125
4759 67615125 67143580 66528567 66357633 65444202 65140274 65323672 64194590 64127018 64207491 63598956
4749 63598956 63307100 63636087 63873310 64295406 64093503 63532744 63601212 63767626 63837209 62847592
4739 62847592 61316551 59443008 58117608 56022253 54695081 52868815 51225807 50138397
$$ packed form
4800A57477325l466392l714822l530407l326242l666890l771998l186041k662217
4792A30152316l248271l216544l073130l034831k811160l247962k466202k652811
4784A06401405l018530k043777k104006j732687k229536k664786k644039j762652
4776H8201392j396603j381015j846345k008955j061472j019532j414517j552951
4768G6520002j155566j185387j515034j392379j051894q66362q84235l48441n05579
4759F7615125m71545o15013j70934r13431l03928J83398j129082o7572Q0473o08535
4749F3598956k91856L28987K37223M22096k01903n60759O8468J66414O9583r89617
4739F2847592j531041j873543j325400k095355j327172j826266j643008j087410
$$ plain form
4731 50138397 48492430 46572585 45113403 44428505 43980079 43231309 41387024 39859732 39096974
4722 39096974 38728498 37972334 36901229 36236712 35811497 34970209 33518561 33055544 32662760
4713 32662760 32185081 32025134 31626500 30893876 30476280 30270355 30026805 29461820 28692148
4704 28692148 28492940 27808761 27477593 27143141 26258528 25577225 25828943 25373475 24845726
4695 24845726 24466199 24420930 24072584 23655529 22843259 22962268 23324776 22636734 22163350 21876783
4685 21876783 21166683 21073535 21078231 20731571 20321908 19942474 20090394 20515770 20218938 19391717
4675 19391717 19253063 18845602 18672471 18641556 18340175 17770876 17972410 17548132 17409564 17272259
4665 17272259 17553218 17809512 17700773 17812362 17485066 17504046 17770211 18351601 18136793 18154229
$$ packed form
4731E0138397j645967j919845j459182o84898m48426p48770j844285j527292p62758
4722C9096974l68476p56164j071105o64517m25215q41288j451648m63017l92784
4713C2662760m77679j59947l98634p32624m17596k05925k43550n64985p69672
4704B8692148j99208o84179l31168l34452q84613o81303K51718m55468n27749
4695B4845726l79527m5269l48346m17055q12270J19009L62508o88042m73384k86567
4685B1876783p10100r3148M696l46660m09663l79434J47920M25376k96832q27221
4675A9391717j38654m07461j73131l0915l01381n69299K01534m24278j38568j37305
4665A7272259K80959K56294j08739J11589l27296J8980K66165N81390k14808J7436
$$ plain form
4655 18154229 18372381 18513780 18459628 18110658 17514230 17849994 17688892 16783077 16313199 15852780
4645 15852780 15306593 15837521 15651820 15089771 15565826 15558043 15362725 15230943 14938500 15067469
4635 15067469 15103272 14857063 15053087 14935436 14455754 14082111 14036734 14052582 13958837 13889133
4625 13889133 13679218 13351730 13279136 12869354 12617151 12380586 12910155 12877549 11834349 11264821
4615 11264821 11120041 11714930 11741762 11801783 12016614 12062969 11954326 11951490 11938749 12197761
4605 12197761 12289327 12252911 12465565 12167057 12320698 12399482 12250209 11987397 11544203 11837892
4595 11837892 11694833 11702927 12104365 12582486 12181438 11627728 11604897 11836106 11574275 11469662
4585 11469662 11851696 11998106 12041125 11856138 11847406 11461469 11794983 11725873 11641671 11803643
$$ packed form
4655A8154229K18152J41399n4152l48970n96428L35764j61102r05815m69878m60419
4645A5852780n46187N30928j85701n62049M76055p783j95318j31782k92443J28969
4635A5067469L5803k46209J96024j17651m79682l73643m5377J5848r3745o9704
4625A3889133k09915l27488p2594m09782k52203k36565N29569l2606j043200n69528
4615A1264821j44780N94889K6832O0021K14831M6355j08643k836j2741K59012
4605A2197761R1566l6416K12654k98508J53641P8784j49273k62812m43194K93689
4595A1837892j43059Q094M01438M78121m01048n53710k2831K31209k61831j04613
4585A1469662L82034J46410M3019j84987q732l85937L33514o9110q4202J61972
$$ plain form
4575 11803643 11337820 11335883 11757249 11691827 11177434 11084457 11490893 11691923 11885070 11641514
4565 11641514 11238793 11202547 11681641 11972779 11685255 11279126 11704524 11966646 11352437 11256404
4555 11256404 10716985 10983212 11409414 11507595 10913296 10208821 10452550 11126286 11302993 10654724
4545 10654724 10326417 10435013 10576301 10540402 10437977 10160987 10893588 10753788 10580394 10702942
4535 10702942 10466466 10363561 10018281 9758919 9960319 10286405 10757435 11177285 11188542 10652394
4525 10652394 10254419 10559533 11109990 11378563 11472269 11232144 11374065 11008309 10879810 10804777
4515 10804777 11123897 11262003 10981063 10714752 11267573 11486837 11320742 11998324 11554579
4506 11554579 11247810 11360359 11106193 11317434 11646401 11472196 11785919 11358591 11054300
$$ packed form
4575A1803643m65823j937M21366o5422n14393r2977M06436K01030J93147k43556
4565A1641514m02721l6246M79094K91138k87524m06129M25398K62122o14209r6033
4555A1256404n39419K66227M26202R8181n94299p04475K43729O73736J76707o48269
4545A0654724l28307J08596J41288l5899j02425k76990P32601j39800j73394J22548
4535A0702942k36476j02905l45280k59362K01400L26086M71030M19850J1257n36148
4525A0652394l97975L05114N50457K68573R3706k40125J41921l65756j28499p5033
4515A0804777L19120J38106k80940k66311N52821K19264j66095O77582m43745
4506A1554579l06769J12549k54166K11241L28967j74205L13723m27328l04291
$$ plain form
4497 11054300 11061507 11428089 11685141 11403418 11319584 11510945 11365984 10820099 10959275 10550751
4487 10550751 9901273 10021801 10030679 9871316 9736359 9366822 8705441 9157083 8967796 8972092
4477 8972092 8876703 8807633 8968475 8562687 8315138 8428679 8245160 8098297 8002420 7379069
4467 7379069 6979144 7481951 8093476 8291861 8063881 7294773 7213579 7350631 7241326 6976507
4457 6976507 6834157 6864615 7290393 7071484 6700217 6754467 7103959 7062625 7166372 6918455
4447 6918455 6312881 6028846 5980259 6544000 6802894 6464650 6669087 6291469 6601421 6443149
4437 6443149 6330914 6401666 6609267 6784827 6436531 6299107 6087529 6212196 6254519 5904141
4427 5904141 5671034 5955488 6332943 6548669 6624348 6399399 6252790 6531507 6288357 6310397
$$ packed form
4497A1054300P207L66582K57052k81723q3834J91361j44961n45885J39176m08524
4487A0550751o49478J20528Q878j59363j34957l69537o61381M51642j89287M296
4477H972092r5389o9070J60842m05788k47549J13541j83519j46863r5877o23351
4467G379069l99925N02807O11525J98385k27980p69108q1194J37052j09305k64819
4457F976507j42350L0458M25778k18909l71267N4250L49492m1334J03747k47917
4447F918455o05574k84035m8587N63741K58894l38244K04437l77618L09952j58272
4437F443149j12235P0752K07601J75560l48296j37424k11578J24667M2323l50378
4427E904141k33107K84454L77455K15726P5679k24949j46609K78717k43150K2040
$$ plain form
4417 6310397 6212019 6366177 6263539 6736626 6170301 6368722 6634980 6719908 6638643 6444812
4407 6444812 6301928 6237547 6536166 6525959 6498052 6394315 6349807 6218908 6526261 6841425
4397 6841425 6677453 6253871 6762262 7147648 7224555 7098234 6774192 7498292 7581648 7126243
4387 7126243 7203575 7615042 7935057 7867384 7705861 7308284 7579644 7132417 7318540 7604376
4377 7604376 6920214 7175537 7544970 7569712 7865867 8059868 8325524 8113936 7938778 7722266
4367 7722266 7771625 8086967 8242351 8105417 7682207 7364808 7695332 8320903 8501735 8162082
4357 8162082 7774179 8060107 8405704 8413910 8808746 8929875 9054261 9455878 9240994 8988775
4347 8988775 9481461 9473657 9014776 9443794 9264249 9213843 9365380 9476727 9604985 9749976
$$ packed form
4417F310397r8378J54158j02638M73087n66325J98421K66258Q4928q1265j93831
4407F444812j42884o4381K98619j0207k7907j03737m4508j30899L07353L15164
4397F841425j63972m23582N08391L85386P6907j26321l24042P24100Q3356m55405
4387G126243P7332M11467L20015o7673j61523l97577K71360m47227J86123K85836
4377G604376o84162K55323L69433K4742K96155J94001K65656k11588j75158k16512
4367G722266M9359L15342J55384j36934m23210l17399L30524O25571J80832l39653
4357H162082l87903K85928L45597Q206L94836J21129J24386M01617k14884k52219
4347H988775M92686p804m58881M29018j79545n0406J51537J11347J28258J44991
$$ plain form
4337 9749976 9805853 10217887 10114283 10476155 10852318 10808317 10587194 11323294 11172333 11484196
4327 11484196 12148859 11958703 12321846 12884414 13113670 13483123 14004831 14348825 15352283
4318 15352283 15905944 16482006 16849377 17185119 17835280 18503544 18786796 18680090 19109896
4309 19109896 20190893 21121579 21462769 21595647 21954750 22696843 23635849 24509024 25706064
4300 25706064 27443401 28283246 29607906 31916009 34210969 37245388 40300547 44085677
4292 44085677 48183324 53595094 59787489 66613292 74666582 83475118 94890680 108148887
4284 108148887 121877710 135149162 147668987 160284326 173087974 182948259 187577577
4277 187577577 185057818 169728961 148959680 127821061 109385965 94672651 83591516
$$ packed form
4337I749976N5877M12034j03604L61872L76163m4001k21123P36100j50961L11863
4327A1484196O64663j90156L63143N62568K29256L69453N21708L43994J003458
4318A5352283N53661N76062L67371L35742O50161O68264K83252j06706M29806
4309A9109896J080997R30686L41190J32878L59103P42093R39006Q73175J197040
4300B5706064J737337Q39845J324660K308103K294960L034419L055159L785130
4292D4085677M097647N411770O192395O825803Q053290Q808536J1415562J3258207
4284A08148887J3728823J3271452J2519825J2615339J2803648R860285M629318
4277A87577577k519759j5328857k0769281k1138619j8435096j4713314j1081135
$$ plain form
4270 83591516 74136678 66155906 60398098 54914477 50912395 47385653 43696516 40756611
4262 40756611 38591749 36189396 33640763 31318928 29278390 27609049 26145812 25444836
4254 25444836 24470294 23309101 22370777 21892808 21117927 20492008 20205619 19697128 19205732
4245 19205732 18332228 17615698 17308386 17193753 16786291 16925195 15847023 14841052 14983129
4236 14983129 14966154 14144899 13245040 12570167 12139681 12570995 11934761 11630180 11453921 11262997
4226 11262997 11250768 10683503 10636656 10603023 10531631 9975307 9856829 9686613 9964409 10302889
4216 10302889 9335326 8861560 8616269 8426895 8287290 8104771 8227390 8486628 8129972
4207 8129972 8004501 7708121 7785091 8135158 8227239 7847161 7431004 7580375 6741890 6630299
$$ packed form
4270H3591516r454838p980772n757808n483621m002082l526742l689137k939905
4262D0756611k164862k402353k548633k321835k040538j669341j463237p00976
4254B5444836r74542j161193r38324m77969p74881o25919k86389n08491m91396
4245A9205732q73504p16530l07312j14633m07462J38904j078172j005971J42077
4236A4983129j6975q21255q99859o74873m30486M31314o36234l04581j76259j90924
4226A1262997j2229n67265m6847l3633p1392n56324j18478j70216K77796L38480
4216A0302889r67563m73766k45291j89374j39605j82519J22619K59238l56656
4207H129972j25471k96380P6970L50067R2081l80078m16157J49371q38485j11591
$$ plain form
4197 6630299 6864147 6993920 6659242 6891981 6626023 6984753 7359759 7427263 7137740 6982377
4187 6982377 6530024 6361724 5866216 6266571 6209268 5778438 5565534 5649292 5620710 5602954
4177 5602954 5709573 5686919 5624606 5334930 5482038 5643622 5402701 5190402 5067371 4629085
4167 4629085 4991050 5079537 4825850 4855043 5173367 4933867 4776220 4974072 5073622 4870472
4157 4870472 4874398 4916959 5167894 5031778 4681223 5030958 5141041 4937122 5001836 4974975
4147 4974975 4563536 4800287 4712823 4607312 4960259 4757663 4294210 4286305 4710424 4519146
4137 4519146 4461222 4182505 4599657 4676947 4803225 4997654 4961892 4770669 4794808 5018222
4127 5018222 4557848 4475319 4560302 4335123 4514217 4425845 3924478 3957434 4460947 4070686
$$ packed form
4197F630299K33848J29773l34678K32739k65958L58730L75006O7504k89523j55363
4187F982377m52353j68300m95508M00355n7303m30830k12904Q3758k8582j7756
4177E602954J06619k2654o2313k89676J47108J61584k40921k12299j23031m38286
4167D629085L61965Q8487k53687K9193L18324k39500j57647J97852R9550k03150
4157D870472L926M2561K50935j36116l50555L49735J10083k03919O4714k6861
4147D974975m11439K36751q7464j05511L52947k02596m63453p905M24119j91278
4137D519146n7924k78717M17152P7290J26278J94429l5762j91223K4139K23414
4127E018222m60374q2529Q4983k25179J79094q8372n01367L2956N03513l90261
$$ plain form
4117 4070686 3815867 3759095 3889804 4286605 4113368 3687789 3819125 3866726 4091354 4158801
4107 4158801 4144270 4384581 3941973 3895686 4257014 3700819 4078358 4114778 3880011 4225133
4097 4225133 3887863 3645249 3844686 3877698 4122752 3844007 3533568 3158850 3226899 3969043
4087 3969043 3788150 3843674 3733836 3719909 3652425 3569929 3914977 3620335 3560543 4106514
4077 4106514 3619857 3624361 3509805 3759385 4378964 4137947 3703303 3533783 3658815 3532297
4067 3532297 3584464 4092709 3666288 3075095 3133626 3607839 4045750 3913389 3855972 3747768
4057 3747768 3302013 3575679 3485312 3210945 3540734 3781804 3792327 3624589 3463484 3171394
4047 3171394 3404816 3883664 4063960 4129399 3902064 4040036 3867305 3288033 3763451 3772094
$$ packed form
4117D070686k54819n6772J30709L96801j73237m25579J31336M7601K24628O7447
4107D158801j4531K40311m42608m6287L61328n56195L77539L6420k34767L45122
4097D225133l37270k42614J99437L3012K45054k78745l10439l74718O8049P42144
4087C969043j80893N5524j09838j3927o7484q2496L45048k94642n9792N45971
4077D106514m86657M504j14556K49580O19579k41017m34644j69520J25032j26518
4067C532297N2167N08245m26421n91193N8531M74213M37911j32361n7417j08204
4057C747768m45755K73666r0367k74367L29789K41070J0523j67738j61105k92090
4047C171394K33422M78848J80296O5439k27335J37972j72731n79272M75418Q643
$$ plain form
4037 3772094 3782422 3905756 3811538 3964264 4477759 4844394 5344638 4732653 4406769 4849507
4027 4849507 4562106 4387664 4146448 4377162 4566472 4472511 4358760 4796436 5201180 5327773
4017 5327773 4942291 5064644 4949872 4472119 4553815 4715383 5066472 4808058 4617821 4438357
4007 4438357 4339461 4551862 4621620 4537784 4466613 4075407 4078994 3945879 3769421 4033955 3901260
3996 3901260 3889960 4309417 4562562 4186015 3986344 4090557 4161537 3833714 3645358 3564167
3986 3564167 3870748 4098861 4623312 4232669 3533368 3737300 3844046 3915158 3901186 3807964
3976 3807964 3679556 4026240 3928769 3576186 3462113 3671519 3885794 3656294 3222835 3646198
3966 3646198 3780613 3718428 3484935 4127018 3880426 3345214 3422585 3150929 3743350 3825123
$$ packed form
4037C772094J0328J23334r4218J52726N13495L66635N00244o11985l25884M42738
4027D849507k87401j74442k41216K30714J89310r3961j13751M37676M04744J26593
4017E327773l85482J22353j14772m77753Q1696J61568L51089k58414j90237j79464
4007D438357r8896K12401O9758q3836p1171l91206L587j33115j76458K64534j32695
3996C901260j1300M19457K53145l76547j99671J04213P0980l27823j88356q1191
3986C564167L06581K28113N24451l90643o99301K03932J06746P1112j3972r3222
3976C807964j28408L46684r7471l52583j14073K09406K14275k29500m33459M23363
3966C646198J34415o2185k33493O42083k46592n35212P7371k71656N92421Q1773
$$ plain form
3956 3825123 3732424 3651598 3663507 3562377 3595149 3640928 3717094 3695706 3165216 3560656 3798185
3945 3798185 3815233 3965480 4128789 3734707 3008263 3425528 3431497 3867970 3758167 3583178
3935 3583178 3421599 3181365 3264916 3514390 3503838 3557988 3832771 3700965 3957379 3755917
3925 3755917 3651166 3901482 3824547 3596929 3428440 3424437 3699475 3586715 3630783 3730959
3915 3730959 2885052 3549157 4105563 3887314 3346841 3762561 3648677 3546477 3496741 3427003
3905 3427003 4121452 4091809 3849940 3737942 3198333 3185074 3577949 3663110 3728456 3361167
3895 3361167 3029151 3157425 3566273 3944290 3892729 3725998 3514494 3861057 3390962 3177476
3885 3177476 3279572 3700893 3977333 3496791 3598809 3536470 3746203 3914846 3972158 3113207
$$ packed form
3956C825123r2699q0826J1909j01130L2772M5779P6166k1388n30490L95440K37529
3945C798185J7048J50247J63309l94082p26444M17265N969M36473j09803j74989
3935C583178j61579k40234Q3551K49474j0552N4150K74783j31806K56414k01462
3925C755917j04751K50316p6935k27618j68489m003K75038j12760M4068J00176
3915C730959q45907O64105N56406k18249n40473M15720j13884j02200m9736o9738
3905C427003O94449k9643k41869j11998n39609j3259L92875Q5161O5346l67289
3895C361167l32016J28274M08848L78017n1561j66731k11504L46563m70095k13486
3885C177476J02096M21321K76440m80542J02018o2339K09733J68643N7312q58951
$$ plain form
3875 3113207 3293405 3692771 3948630 3860226 4008527 4008898 3938614 3706364 3298782 3564421
3865 3564421 3832968 3983217 3710149 3283861 3386346 3433673 4066445 4001357 3510162 3915453
3855 3915453 4411844 4121726 4340961 4130132 3955874 3983372 4711000 4891373 5210862 5165766
3845 5165766 4943422 4897884 4988952 4490382 4079433 4476811 3991073 3825728 3472382 3032923
3835 3032923 3199672 3270433 3358797 3519576 3431351 3027154 3133562 3536961 3324831 2935288
3825 2935288 2642666 2456569 2772547 3113697 2742840 3093646 2924647 2913590 3138772 3058815
3815 3058815 3037874 3208725 3102875 3079600 2850454 2899548 3141038 3006142 3455967 3246812
3805 3246812 2833308 2638998 2713808 2828136 2570950 2742352 2983387 2898834 2756141 2715109
$$ packed form
3875C113207J80198L99366K55859q8404J48301L71p0284k32250m07582K65639
3865C564421K68547J50249k73068m26288J02485M7327O32772o5088m91195M05291
3855C915453M96391k90118K19235k10829j74258K7498P27628J80373L19489m5096
3845E165766k22344m5538R1068m98570m10949L97378m85738j65345l53346m39459
3835C032923J66749P0761Q8364J60779q8225m04197J06408M03399k12130l89543
3825B935288k92622j86097L15978L41150l70857L50806j68999j1057K25182p9957
3815C058815k0941J70851j05850k3275k29146M9094K41490j34896M49825k09155
3805C246812m13504j94310P4810J14328k57186J71402K41035q4553j42693m1032
$$ plain form
3795 2715109 2257651 2677015 2797092 2780704 2316357 2536655 2675613 2688232 2733633 2829082
3785 2829082 2480082 2652603 3302350 2863031 2715411 3076966 3231798 2740217 2889494 2515816
3775 2515816 2847125 3255892 2589829 2697477 2628353 2679719 3240309 3000782 2872440 2746633
3765 2746633 2954968 2998657 3299475 3582262 3042434 2543893 2464769 3225501 2660348 2668274
3755 2668274 3112151 2819971 2803269 3047402 2819284 2698401 2563392 2741473 2588410 2361635
3745 2361635 2558165 2867681 2958719 2854094 2881496 2774097 3271493 3445253 3068705 2557395
3735 2557395 2768719 2531720 2876417 3151531 3103840 2488455 2653263 2664688 2101418 2401541
3725 2401541 2209965 2818443 3058079 2654789 2741800 2788795 2697773 2627639 2711527 2745716 2733323
$$ packed form
3795B715109m57458M19364J20077j6388m64347K20298J38958J2619M5401R5449
3785B829082l49000J72521O49747m39319j47620L61555J54832m91581J49277l73678
3775B515816L31309M08767o66063J07648o9124N1366N60590k39527j28342j25807
3765B746633K08335M3689L00818K82787n39828m98541p9124P60732n65153P926
3755B668274M43877k92180j6702K44133k28118j20883j35009J78081j53063k26775
3745B361635J96530L09516R1038j04625K7402j07399M97396J73760l76548n11310
3735B557395K11324k36999L44697K75114m7691o15385J64808J1425n63270L00123
3725B401541j91576O08478K39636m03290Q7011M6995r1022p0134Q3888L4189j2393
$$ plain form
3714 2733323 2778744 3207031 2751091 2514281 2690542 2761565 2464230 2563886 2793537 2434443
3704 2434443 2548418 2984936 2967017 2904330 2968417 2723954 3192894 2872838 2979572 3154351
3694 3154351 3029809 3329363 3281315 3202701 3010295 3046217 3180203 3294903 3467817 3253572
3684 3253572 3869450 3366439 3029184 2985144 3704973 3725535 3476898 3298284 3055874 3038789
3674 3038789 3463579 3363176 3343033 3226367 3121601 3743585 3228133 3221052 3154577 3229628
3664 3229628 3673137 3883196 3181770 3469383 3754508 3580656 3824986 3479455 3690603 3731513
3654 3731513 4009358 3682186 3570719 3970395 3859176 3921919 3995991 4178553 4160786 4791121
3644 4791121 4510380 4782939 4306822 4257652 4670725 5012385 4619376 4737186 4583089 4442453
$$ packed form
3714B733323M5421M28287m55940k36810J76261P1023k97335R9656K29651l59094
3704B434443J13975M36518j7919o2687O4087k44463M68940l20056J06734J74779
3694C154351j24542K99554m8048p8614j92406L5922J33986J14700J72914k14245
3684C253572O15878n03011l37255m4040P19829K0562k48637j78614k42410j7085
3674C038789M24790j00403k0143j16666j04766O21984n15452p081o6475P5051
3664C229628M43509K10059p01426K87613K85125j73852K44330l45531K11148M0910
3654C731513K77845l27172j11467L99676j11219O2743P4072J82562j7767O30335
3644D791121k80741K72559m76117m9170M13073L41660l93009J17810j54097j40636
$$ plain form
3634 4442453 4694704 4606906 4794140 4999380 4961307 5000667 5430894 4905417 4742144 5235762
3624 5235762 5306649 5859722 5348564 5399378 6080018 6220746 5405343 6186897 6196795 5816369
3614 5816369 6301300 6260198 6410043 6379376 7306212 6371884 6174361 6246181 6293627 6839368
3604 6839368 6725739 6790675 6903998 7143466 7175618 7213025 7010665 7103331 6868031 7086445
3594 7086445 7255150 7062016 7319215 7630079 8088082 8089555 8375557 7948942 8237329 8281476
3584 8281476 8716087 8925150 8543855 8612441 8769591 8910809 8716113 9143056 9416542 9916495
3574 9916495 9899810 9857901 9929070 9899603 10265790 10130689 10612118 10874828 10881393 11144496 11423288
3563 11423288 11335041 11854002 12631332 13356271 13440693 13276890 13427917 14646799 15426138 15229799
$$ packed form
3634D442453K52251q7798J87234K05240l8073L9360M30227n25477j63273M93618
3624E235762P0887N53073n11158N0814O80640J40728q15403P81554R898l80426
3614E816369M84931m1102J49845l0667R26836r34328j97523P1820M7446N45741
3604F839368j13629O4936J13323K39468L2152L7407k02360R2666k35300K18414
3594G086445J68705j93134K57199L10864M58003J473K86002m26615K88387M4147
3584H281476M34611K09063l81295O8586J57150J41218j94696M26943K73486M99953
3574I916495j6685m1909P1169k9467L66187j35101M81429K62710O565K63103K78792
3563A1423288q8247N18961P77330P24939Q4422j63803J51027J218882P79339j96339
$$ plain form
3553 15229799 15287504 15575720 16050514 16953170 17576802 18518150 19558849 20592819 21956717
3544 21956717 23560477 24492088 25458739 27142435 28626526 30112848 32375905 33991752
3536 33991752 35343578 36973860 37980635 38519320 39107902 39055935 38853757 38453372 37022193
3527 37022193 35004574 32992568 31068910 28615140 26704604 25253786 24217863 23000050
3519 23000050 22277112 21326466 20626564 19849284 19187459 19297207 18363056 17192343 16675737
3510 16675737 16345748 15701891 15465694 15315569 14567873 14240341 13607949 13544961 13175760 12534058
3500 12534058 12690925 12310261 11794510 11689205 11304949 11032049 10894264 10606104 10578694 9934868
3490 9934868 9739189 9709469 9558971 9651141 9760871 10026823 9377258 9286692 9361581 9045442
$$ packed form
3553A5229799N7705K88216M74794R02656O23632R41348J040699J033970J363898
3544B1956717J603760R31611R66651J683696J484091J486322K263057J615847
3536C3991752J351826J630282J006775N38685N88582n1967k02178m00385j431179
3527C7022193k017619k012006j923658k453770j910536j450818j035923j217813
3519B3000050p22938r50646o99902p77280o61825J09748r34151j170713n16606
3510A6675737l29989o43857k36197j50125p47696l27532o32392o2988l69201o41702
3500A2534058J56867l80664n15751j05305l84256k72900j37785k88160k7410o43826
3490I934868j95679k9720j50498R2170J09730K65952o49565r0566P4889l16139
$$ plain form
3480 9045442 8545872 8871782 8578651 8534277 8140515 7711973 7583872 7446970 6822903 6817819
3470 6817819 6943854 7008685 6826997 6179775 6057409 5645811 5886818 6076175 6064774 5913725
3460 5913725 5983295 5506790 5263482 5602114 5686173 5795695 5662644 5282507 4837854 5231592
3450 5231592 5335406 5050341 4830830 4872191 4997674 4495331 4651910 4897352 4934597 4783233
3440 4783233 4254969 4126044 3831986 4554116 4727607 4122811 4130830 3872335 3894741 3809549
3430 3809549 3614455 3027395 3412330 3904694 3982152 3489185 3827781 3475120 3696980 3437757
3420 3437757 3492603 3125877 3596152 3650020 3290961 2889479 2784481 3329347 3121582 3223468
3410 3223468 3030643 3122800 3237599 2998872 2618995 2969253 3014127 3563735 3373028 2992339
$$ packed form
3480I045442m99570L25910k93131m4374l93762m28542j28101j36902o24067n084
3470F817819J26035O4831j81688o47222j22366m11598K41007J89357j1401j51049
3460E913725O9570m76505k43308L38632Q4059J09522j33051l80137m44653L93738
3450E231592J03814k85065k19511M1361J25483n02343J56579K45442L7245j51364
3440D783233n28264j28925k94058P22130J73491o04796Q019k58495K2406q5192
3430C809549j95094n87060L84935M92364P7458m92967L38596l52661K21860k59223
3420C437757N4846l66726M70275N3868l59059m01482j04998N44866k07765J01886
3410C223468j92825R2157J14799k38727l79877L50258M4874N49608j90707l80689
$$ plain form
3400 2992339 3102809 3021430 2799437 2997569 2874090 2891563 2688968 2648321 2830632 2616506
3390 2616506 2506850 3232105 2662887 2525640 2727867 2725621 3039071 2879368 2739630 2615716
3380 2615716 2440424 2217186 2462605 2897234 2727493 2341569 2310511 2258901 2584711 2934531
3370 2934531 3207647 3119138 2107633 2164466 2140097 2361927 2603958 2437251 2350512 2585591
3360 2585591 2099395 2327805 2031768 2005003 2325774 2382112 2355619 1282361 2496246 2778775
3350 2778775 2898539 2676249 2328987 1771896 1942370 2379288 2719196 2694181 2362153 2244207
3340 2244207 2136456 1995367 2189328 2562414 2397320 2386795 2199530 2266373 2381195 2615924
3330 2615924 2342890 2142228 1707967 1823583 2411709 2341918 1990007 2461298 2838470 2827489
$$ packed form
3400B992339J10470q1379k21993J98132j23479J7473k02595m0647J82311k14126
3390B616506j09656P25255n69218j37247K02227k246L13450j59703j39738j23914
3380B615716j75292k23238K45419M34629j69741l85924l1058n1610L25810L49820
3370B934531K73116q8509j011505N6833k4369K21830K42031j66707q6739K35079
3360B585591m86196K28410k96037k6765L20771N6338k6493j073258J213885K82529
3350B778775J19764k22290l47262n57091J70474M36918L39908k5015l32028j17946
3340B244207j07751j41089J93961L73086j65094j0525j87265O6843J14822K34729
3330B615924k73034k00662m34261J15616N88126o9791l51911M71291L77172j0981
$$ plain form
3320 2827489 2189661 2440974 2426431 1998455 2626387 2711249 2316232 2421375 2542242 2088997
3310 2088997 2096520 2379208 2396497 3096352 3129426 2051709 2041268 2096343 2408653 2563313
3300 2563313 2492957 2506480 3174956 3189923 2913444 2895225 3137110 3264511 3170380 2739919
3290 2739919 3086222 3448866 4046332 3969951 3342973 3440910 3711613 3445421 3690249 3608563
3280 3608563 3609350 3992881 3827367 3545495 3219118 3534440 3513829 3646881 3406676 3479633
3270 3479633 3473815 3627396 3265813 3090887 3514047 3759964 4108429 3980445 3819190 3779634
3260 3779634 4219917 4593366 4080844 3717739 3852000 4638437 4856856 4932060 4349125 4271784
3250 4271784 4335910 5016079 5456135 4911138 4993403 5840557 5900810 5643361 5191680 4984701
$$ packed form
3320B827489o37828K51313j4543m27976O27932Q4862l95017J05143J20867m53245
3310B088997P523K82688J7289O99855L3074j077717j0441N5075L12310J54660
3300B563313p0356J3523O68476J4967k76479j8219K41885J27401r4131m30461
3290B739919L46303L62644N97466p6381o26978R7937K70703k66192K44828q1686
3280C608563P87L83531j65514k81872l26377L15322k0611J33052k40205P2957
3270C479633n818J53581l61583j74926M23160K45917L48465j27984j61255l9556
3260C779634M40283L73449n12522l63105J34261P86437K18419P5204n82935p7341
3250D271784O4126O80169M40056n44997Q2265Q47154O0253k57449m51681k06979
$$ plain form
3240 4984701 5073974 5082982 5369443 5368822 5699817 5624634 6225018 6245673 6084054 6148621 6385363
3229 6385363 6609471 6954437 7048080 6962611 7343712 7138195 6770610 7074541 6581285 6396823
3219 6396823 6515887 6299929 6064999 6031965 6011014 5784870 5629588 5710213 5241196 5557159
3209 5557159 5973062 6225722 6189137 6079928 5971245 5939219 5577920 6013963 6273710 5441918
3199 5441918 5719602 5805209 5969488 5633465 5595316 5565677 5329932 5641441 5694562 5102517
3189 5102517 5030353 4847232 4941104 4452785 3797851 4449127 4857994 5080855 4782821 4359511
3179 4359511 4169314 4086820 3757875 3636100 3627238 3684953 3855021 3770492 4001581 3459458
3169 3459458 3233176 3452196 3623166 3274121 3179343 3042973 3048653 2947630 2971541 2802145
$$ packed form
3240D984701Q9273R008K86461o21L30995p5183O00384K0655j61619O4567K36742
3229F385363K24108L44966R3643q5469L81101k05517l67585L03931m93256j84462
3219F396823J19064k15958k34930l3034k0951k26144j55282Q0625m69017L15963
3209E557159M15903K52660l6585j09209j08683l2026l61299M36043K59747q31792
3199E441918K77684Q5607J64279l36023l8149k9639k35745L11509N3121n92045
3189E102517p2164j83121R3872m88319o54934O51276M08867K22861k98034m23310
3179D359511j90197q2494l28945j21775q862N7715J70068q4529K31089n42123
3169C459458k26282K19020J70970l49045r4778j36370N680j01023K3911j69396
$$ plain form
3159 2802145 2429410 2607557 2467074 2185452 1978248 1598815 2245144 2044774 1677320 1112541
3149 1112541 1745227 1549957 1229105 1323847 1409336 1648931 1184251 1592471 1144745 1227644
3139 1227644 1199057 1369213 1261240 802512 598930 793025 853722 947908 1068159 353225
3129 353225 556060 777387 430709 740200 825385 1049419 901661 446795 653114 1212356
3119 1212356 1231844 652152 596032 955987 1030258 699904 391177 4023 387556 526998
3109 526998 808497 670800 570620 917518 768774 486215 -16511 -170827 408203 740025
3099 740025 652532 474737 691086 1075311 568966 744569 215423 562405 721687 592739
3089 592739 530748 688033 635085 880553 1083515 520600 308897 327830 313410 491246
$$ packed form
3159B802145l72735J78147j40483k81622k07204l79433O46329k00370l67454n64779
3149A112541O32686j95270l20852R4742Q5489K39595m64680M08220m47726Q2899
3139A227644k8587J70156j07973m58728k03582J94095O0697R4186J20251p14934
3129C53225K02835K21327l46678L09491Q5185K24034j47758m54866K06319N59242
3119A212356J9488n79692n6120L59955P4271l30354l08727l87154L83533J39442
3109E26998K81499j37697j00180L46898j48744k82559n02726j54316N79030L31822
3099G40025q7493j77795K16349L84225n06345J75603n29146L46982J59282j28948
3089E92739o1991J57285n2948K45468K02962n62915k11703J8933j4420J77836
$$ plain form
3079 491246 791351 505528 -38757 738233 458441 227406 -163647 -314790 -146886 78737
3069 78737 243534 -121946 493989 494101 96252 -297465 -585377 -139892 836362 676581
3059 676581 -48561 -277287 110443 496020 56997 493302 322031 -219062 -171002 -208712
3049 -208712 10567 50056 108479 244340 -158270 -120529 54260 -162186 -128973 201605
3039 201605 381873 -249525 52746 227498 508069 398415 152646 -213152 -265587 11997
3029 11997 326315 188405 35814 -52296 23490 -44220 223795 -75978 -613982 -355465
3019 -355465 210988 387506 -278609 -501072 -279070 62914 364579 271667 -249533 -477983
3009 -477983 -203358 -76762 -257918 -97493 -172803 445360 -137492 -261987 -117616 -192223
$$ packed form
3079D91246L00105k85823n44285P76990k79792k31035l91053j51143J67904K25623
3069G8737J64797l65480O15935J12l97849l93717k87912M45485R76254j59781
3059F76581p25142k28726L87730L85577m39023M36305j71271n41093M8060l7710
3049b08712K19279L9489N8423J35861m02610L7741J74789k16446L3213L30578
3039B01605J80268o31398L02271J74752K80571j09654k45769l65798n2435K77584
3029A1997L14318j37910j52591q8110P5786o7710K68015k99773n38004K58517
3019c55465N66453J76518o66115k22463K22002L41984L01665r2912n21200k28450
3009d77983K74625J26596j81156J60425p5310O18163n82852j24495J44371p4607
$$ plain form
2999 -192223 254369 399936 251239 78245 379344 273162 50756 -365973 -22233 496517
2989 496517 648346 196867 -216055 -631793 -561007 -256772 272890 121041 -363426 285514
2979 285514 510159 491266 475901 491881 229754 -200887 -72952 -206542 -234720 39211
2969 39211 567091 779127 678384 415662 477656 794913 909757 931909 654501 747898
2959 747898 810897 361254 362221 414559 528120 1036904 483527 356785 525408 -227182 415067
2948 415067 460619 605528 253338 469961 346111 191665 634157 620272 356468 225372
2938 225372 442176 148529 226977 254931 202771 133299 599987 173203 -352960 -570125
2928 -570125 -186412 273773 180275 -170286 -250957 -100107 474684 373967 264113 78975
$$ packed form
2999a92223M46592J45567j48697j72994L01099j06182k22406m16729L43740N18750
2989D96517J51829m51479m12922m15738P0786L04235N29662j51849m84467O48940
2979B85514K24645j8893j5365J5980k62127m30641J27935j33590k8178K73931
2969C9211N27880K12036j00743k62722O1994L17257J14844K2152k77408R3397
2959G47898O2999m49643R67N2338J13561N08784n53377j26742J68623p52590O42249
2948D15067M5552J44909l52190K16623j23850j54446M42492j3885k63804j31096
2938B25372K16804k93647P8448K7954n2160o9472M66688m26784n26163k17165
2928e70125L83713M60185r3498l50561q0671J50850N74791j00717j09854j85138
$$ plain form
2918 78975 208773 322598 -74908 -476677 -716317 177241 1230108 890110 335988 176488
2908 176488 208755 556992 332665 249678 363173 70244 165313 303051 145567 182540
2898 182540 71206 277937 -359632 -416951 -392387 109712 335603 230408 107705 -416171
2888 -416171 -357178 -113052 3775 -608104 -231793 -635856 47316 -409855 -515808 -103739
2878 -103739 154809 103454 -428479 2763 111905 -362288 -179706 -643508 -488187 136849
2868 136849 -467751 -612527 -266529 -303914 -480439 -341178 -233290 -89449 35149 -422214
2858 -422214 -646271 116869 -204447 -24805 -148878 -351967 -779811 -202398 207176 333549
2848 333549 -59853 -55123 -270418 -756707 -347605 -153694 -141812 76703 -184013 -342872
$$ packed form
2918G8975J29798J13825l97506m01769k39640Q93558J052867l39998n54122j59500
2908A76488L2267L48237k24327q2987J13495k92929R5069J37738j57484L6973
2898A82540j11334K06731o37569n7319K4564N02099K25891j05195j22703n23876
2888d16171N8993K44126J16827o11879L76311m04063O83172m57171j05953M12069
2878a03739K58548n1355n31933M31242J09142m74193J82582m63802J55321O25036
2868A36849o04600j44776L45998l7385j76525J39261J07888J43841J24598m57363
2858d22214k24057P63140l21316J79642j24073k03089m27844N77413M09574J26373
2848C33549l93402M730k15295m86289M09102J93911J1882K18515k60716j58859
$$ plain form
2838 -342872 -624802 -568448 -279155 -337062 -253331 -430945 -784009 -351335 234782 -229387
2828 -229387 -197313 -124944 45422 82649 -96846 -938279 -613562 159505 103704 26346 -517002
2817 -517002 -682743 -574715 -272858 -117190 -534209 -787189 -560857 -56857 -761517 -702874
2807 -702874 -211510 146075 -151483 -822548 -537493 -462413 -128204 -294682 -316562 -237473
2797 -237473 -779046 -492529 -267579 -311467 -704954 -991699 -998702 -744282 -922017 -718218
2787 -718218 -476667 -269441 -280623 -414524 -294919 -722722 -670016 -128606 -145205 -3561
2777 -3561 325605 -182875 -43459 -292425 -609206 -20661 -125969 53541 220619 -1406
2767 -1406 -204793 -377654 -506954 -104865 471203 -69495 -293412 -657575 -351172 -263721
$$ packed form
2838c42872k81930N6354K89293n7907Q3731j77614l53064M32674N86117m64169
2828b29387L2074P2369J70366L7227j79495q41433L24717P73067n5801p7358n43348
2817e17002j65741J08028L01857J55668m17019k52980K26332N04000p04660N8643
2807g02874M91364L57585k97558o71065K85055P5080L34209j66478k1880P9089
2797b37473n41573K86517K24950m3888l93487k86745p003K54420j77735K03799
2787g18218K41551K07226j1182j33901J19605m27803N2706N41410j6599J41644
2777c561L29166n08480J39416k48966l16781N88545j05308J79510J67078k22025
2767a406k03387j72861j29300M02089N76068n40698k23917l64163L06403Q7451
$$ plain form
2757 -263721 -223549 -376329 -360949 -167033 128338 218790 -194508 -377111 51949 192553
2747 192553 -103022 -240284 -261007 74405 291876 53868 -275350 -33423 372230 277603
2737 277603 -517847 -656614 -919248 -633502 -424119 -861174 -1327642 -1037519 -333017 -232914
2727 -232914 -17317 -320042 -261245 -296891 -390269 -472389 -547159 -204986 -196070 246833 180778
2716 180778 -618244 -776018 -498427 -246662 -567831 -505855 -534279 -151434 150809 249640
2706 249640 -546472 -744426 -470863 -885163 -394650 -518374 -436789 -407344 -574135 -518214
2696 -518214 -597696 -839718 -436490 -264421 -417382 -817946 -1444920 -1197781 -464550 97279
2686 97279 269532 -49101 -477948 -517991 -362322 -142313 -507104 -599115 -508209 -612989
$$ packed form
2757b63721M0172j52780J5380J93916K95371R0452m13298j82603M29060J40604
2747A92553k95575j37262k0723L35412K17471k38008l29218K41927M05653r4627
2737B77603p95450j38767k62634K85746K09383m37055m66468K90123P04502J00103
2727b32914K15597l02725N8797l5646r3378q2120p4770L42173Q916M42903o6055
2716A80778p99022j57774K77591K51765l21169O1976k8424L82845L02243R8831
2706B49640p96112j97954K73563m14300M90513j23724Q1585K9445j66791N5921
2696e18214p9482k42022M03228J72069j52961m00564o26974K47139P33231N61829
2686I7279J72253l18633m28847m0043J55669K20009l64791r2011R0906j04780
$$ plain form
2676 -612989 -619638 -803412 -1123723 -638632 -186740 -289044 -517296 -252344 -231025 25222
2666 25222 -371739 -52632 243493 -141702 -249007 -394280 -441705 -698652 -370154 414241
2656 414241 43738 -742250 -720786 -217975 257435 218321 -297180 -616462 -464574 -156933
2646 -156933 205987 -47818 -68162 146427 264125 248000 135017 -356046 -308607 -323154
2636 -323154 -95000 91859 -504647 -693976 -377488 -153098 386732 320291 376783 372611
2626 372611 258106 99661 78282 -207893 223139 496133 790395 264684 -48509 35094
2616 35094 724410 722711 164206 -189872 277349 208099 46139 132361 81148 476565 213888
2605 213888 244231 249074 580573 685553 479734 551533 393347 335348 596496 741090 912787
$$ packed form
2676f12989o649j83774l20311M85091M51892j02304k28252K64952K1319K56247
2666B5222l96961L19107K96125l85195j07305j45273m7425k56947L28498P84395
2656D14241l70503p85988K1464N02811M75410l9114n15501l19282J51888L07641
2646a56933L62920k53805k0344K14589J17698j6125j12983m91063M7439j4547
2636c23154K28154J86859n96506j89329L16488K24390N39830o6441N6492m172
2626C72611j14505j58445k1379k86175M31032K72994K94262n25711l13193Q3603
2616C5094O89316j699n58505l54078M67221o9250j61960Q6222n1213L95417k62677
2605B13888L0343M843L31499J04980k05819P1799j58186n7999K61148J44594J71697
$$ plain form
2594 912787 865058 905568 546531 286450 502039 594240 486273 850768 762333 820271 819784
2583 819784 767136 603809 274097 654222 550522 478351 551730 1067406 1094113 1176398 1123537
2572 1123537 963540 1521452 1788137 1472520 1185547 1399466 1742990 1811171 1923247 1551390
2562 1551390 1110425 1429040 1449545 1766661 1790403 2008349 1997389 2372156 2549746 2766358
2552 2766358 2659304 3163550 3354748 3417626 3200496 3324933 4402101 4462060 4733238 4616879
2542 4616879 4441620 3927211 4201000 5315190 5418249 5421913 5606402 6135243 6808630 7587242
2532 7587242 7186313 7714790 8497914 9308023 10313565 10704031 11492319 12852576 14431001
2523 14431001 15602051 16310839 17760760 20288253 23367605 26012124 29175460 32447137
$$ packed form
2594I12787m7729M0510l59037k60081K15589R2201j07967L64495q8435N7938m87
2583H19784n2648j63327l29712L80125j03700p2171P3379N15676K6707Q2285n2861
2572A123537j59997N57912K66685l15617k86973K13919L43524O8181J12076l71857
2562A551390m40965L18615K0505L17116K3742K17946j0960L74767J77590K16612
2552B766358j07054N04246J91198O2878k17130J24437J077168N9959K71178j16359
2542D616879j75259n14409K73789J114190J03059L664J84489N28841O73387P78612
2532G587242m00929N28477P83124Q10109J005542L90466P88288J360257J578425
2523A4431001J171050P08788J449921K527493L079352K644519L163336L271677
$$ plain form
2515 32447137 36763386 41732010 47903338 54891280 62778561 70487889 77659391 85667693
2507 85667693 92990393 99740026 104740456 104748297 97058250 85609092 73112726 62635398
2499 62635398 54740494 47907641 42691981 38209122 34554725 32056470 30062032 27768723
2491 27768723 25796102 24050753 22197705 20044883 18120673 16696768 16044609 14990696
2483 14990696 14239263 13451982 12661388 12342735 11867161 10881373 9858470 9617233 9299207
2474 9299207 9279744 8764842 7704025 7384060 7589891 7500186 7427103 6826081 7040358 6954060
2464 6954060 6748518 6379489 6276156 6190123 5933987 5808833 5322518 4786707 4815557 4584083
2454 4584083 4459223 4236595 4138112 4217606 3693243 3599295 3703161 3856011 3591921 2992964
$$ packed form
2515C2447137M316249M968624O171328O987942P887281P709328P171502Q008302
2507H5667693P322700O749633N000430P841p690047j1449158j2496366j0477328
2499F2635398p894904o832853n215660m482859l654397k498255j994438k293309
2491B7768723j972621j745349j853048k152822j924210j423905o52159j053913
2483A4990696p51433p87281p90594l18653m75574r85788j022903k41237l18026
2474I299207j9463n14902j060817l19965K05831q9705p3083o01022K14277q6298
2464F954060k05542l69029j03333q6033k56136j25154m86315n35811K8850k31474
2454D584083j24860k22628r8483P9494n24363r3948J03866J52850k64090n98957
$$ plain form
2444 2992964 2662314 2715201 3105790 3231080 2945032 2827325 2857197 3181720 3156785 2677789
2434 2677789 2481592 2268963 2392082 2029757 1917471 1980550 2344329 2490595 2214692 2024858
2424 2024858 1669104 1741622 2169685 2017570 1705128 1367697 1342445 1877277 1557301 1345882
2414 1345882 948414 846930 1543625 1616255 1585732 1018897 715557 753914 1457288 908490
2404 908490 1239730 1029534 1042982 808484 240603 436311 641918 700183 359310 715119
2394 715119 467888 124880 372209 812676 869408 532583 59210 168141 875725 643941
2384 643941 1084313 1148951 596084 523056 626766 401472 381756 488466 445202 715148
2374 715148 157549 331796 571274 798773 435271 761628 501628 249597 712746 701980
$$ packed form
2444B992964l30650N2887L90589J25290k86048j17707K9872L24523k4935m78996
2434B677789j96197k12629J23119l62325j12286O3079L63779J46266k75903j89834
2424B024858l55754P2518M28063j52115l12442l37431k5252N34832l19976k11419
2414A345882l97468j01484O96695P2630l0523n66835l03340L8357P03374n48798
2404I08490L31240k10196J3448k34498n67881J95708K05607N8265l40873L55809
2394G15119k47231l43008K47329M40467N6732l36825m73373J08931P07584k31784
2384F43941M40372O4638n52867p3028J03710k25294j9716J06710m3264K69946
2374G15148n57599J74247K39478K27499l63502L26357k60000k52031M63149j0766
$$ plain form
2364 701980 852872 602278 585871 903249 446937 83887 -43348 304876 509697 623282
2354 623282 301781 101934 -11961 376881 -143223 420970 433488 -30714 -26533 317940
2344 317940 676609 70065 36917 472082 215266 99654 9381 -515836 117705 -93353
2334 -93353 -257056 55616 497603 477472 173938 304049 -198658 -449067 -547935 -62638
2324 -62638 95934 24644 34050 -31040 -412440 -287668 -416723 -650015 -119094 -236816 -187716
2313 -187716 476494 261040 -43839 -94783 -234653 39406 -357283 -502803 -214140 -30308
2303 -30308 -60593 -8281 -117891 -340311 -115322 -339548 -670278 -460835 -92083 223105
2293 223105 -82093 -119730 -48964 140765 353404 80018 151951 -44709 405383 -66759
$$ packed form
2364G01980J50892k50594j6407L17378m56312l63050j27235L48224K04821J13585
2354F23282l21501j99847j13895L88842n20104N64193J2518m64202M181L44473
2344C17940L58669o06544l3148M35165k56816j15612r0273n25217O33541k11058
2334i3353j63703L12672M41987k0131l03534J30111n02707k50409r8868M85297
2324f2638J58572p1290R406o5090l81400J24772j29055k33292N30921j17722M9100
2313a87716O64210k15454l04879n0944j39870K74059l96689j45520K88663J83832
2303c0308l0285N2312j09610k22420K24989k24226l30730K09443L68752L15188
2293B23105l05198l7637P0766J89729K12639k73386P1933j96660M50092m72142
$$ plain form
2283 -66759 -969975 -1185285 -335664 214424 607329 320606 17058 200418 3359 340811
2273 340811 362829 99858 157029 408895 120650 140443 112943 906677 898832 653239 514364
2262 514364 425605 398860 421777 281895 -88537 -192525 -213025 -397591 -169582 -50521
2252 -50521 -327407 241827 17509 -304621 -179908 98232 75535 -127377 -196128 177981
2242 177981 113115 -282208 -259931 -202478 -377770 23349 193019 -344221 -92987 -133443
2232 -133443 -72354 -242236 -531869 -175201 333464 70098 180561 29067 -76548 -294462
2222 -294462 -353636 -545549 -320870 -530785 -701396 -562216 -431695 124156 175797 -589647
2212 -589647 -93873 -164383 -575661 -187205 -394574 -91016 -125646 -897798 -503632 -61977
$$ packed form
2283f6759r03216k15310Q49621N50088L92905k86723l03548J83360j97059L37452
2273C40811K2018k62971N7171K51866k88245J9793k7500P93734p845k45593j38875
2262E14364q8759k6745K2917j39882l70432j03988k0500j84566K28009J19061
2252e0521k76886N69234k24318l22130J24713K78140k2697k02912o8751L74109
2242A77981o4866l95323K2277N7453j75292M01119J69670n37240K51234m0456
2232a33443O1089j69882k89633L56668N08665k63366J10463j51494j05615k17914
2222b94462n9174j91913K24679k09915j70611J39180J30521N55851N1641p65444
2212e89647M95774p0510m11278L88456k07369L03558l4630p72152L94166M41655
$$ plain form
2202 -61977 98966 -621394 -459734 -722220 -979443 -624753 -53348 190118 131350 -372056
2192 -372056 -540482 -423685 -567854 -215535 -504213 -335712 23741 -414148 -405941 -100427
2182 -100427 -196931 -37591 48487 283477 322028 -187107 -109994 255937 288 -398602
2172 -398602 -256566 -311424 -631417 -101929 -588635 -110913 310455 -198509 131232 -243892
2162 -243892 -755830 -176311 62634 -125595 -330437 -107454 -197980 57355 -1616 -52778
2152 -52778 -103013 178081 146668 137607 -245824 -648901 -631512 -425146 -484366 -122027 -472464
2141 -472464 -415236 -284734 -133337 -297630 -368796 181300 -126435 -442921 -549811 -162895
2131 -162895 187066 -141032 103874 -414879 -276791 54225 -509293 -230137 -3722 -129048
$$ packed form
2202f1977J60943p20360J61660k62486k57223L54690N71405K43466n8768n03406
2192c72056j68426J16797j44169L52319k88678J68501L59453m37889Q207L05514
2182a00427r6504J59340Q6078K34990L8551n09135P7113L65931k55649l98890
2172c98602J42036n4858l19993N29488m86706M77722M21368n08964L29741l75124
2162b43892n11938N79519K38945j88229k04842K22983r0526K55335n8971n1162
2152e2778n0235K81094l1413r061l83431m03077J7389K06366n9220L62339l50437
2141d72464N7228J30502J51397j64293p1166N50096l07735l16486j06890L86916
2131a62895L49961l28098K44906n18753J38088L31016n63518K79156K26415j25326
$$ plain form
2121 -129048 -4202 -34090 -167159 -375852 -662798 -889724 -837663 -812928 -763493 -307396
2111 -307396 -175267 -10870 111634 -625988 -901316 -769241 -631395 -120051 -305752 -534573
2101 -534573 -476185 -360122 -418077 -596534 -886669 -635350 80479 -106883 -357536 -480780
2091 -480780 -233683 -47802 -255515 -410683 -131875 -20770 -430677 216479 -308311 -191168
2081 -191168 -35803 341394 257589 -354893 -205677 -515671 -272082 -217966 -251728 -289854
2071 -289854 -334258 -314447 -392955 -345848 -172960 -87033 -3569 -48667 -465676 39691 -22047
2060 -22047 34907 214415 -127284 -159439 268323 294648 271505 126863 -168776 -221119 -235880
2049 -235880 -280346 -288688 -24126 264845 230403 -280739 -140925 -171312 -127058 64593 -37145
$$ packed form
2121a29048J24846k9888j33069k08693k86946k26926N2061K4735M9435M56097
2111c07396J32129J64397J22504p37622k75328J32075J37846N11344j85701k28821
2101e34573N8388J16063n7955j78457k90135K51319P15829j87362k50653j23244
2091d80780K47097J85881k07713j55168K78808J11105m09907O47156n24790J17143
2081a91168J55365L77197q3805o12482J49216l09994K43589N4116l3762l8126
2071b89854m4404J9811p8508M7107J72888Q5927Q3464m5098m17009N05367o1738
2060b2047N6954J79508l41699l2155M27762K6325k3143j44642k95639n2343j4761
2049b35880m4466q342K64562K88971l4442n11142J39814l0387M4254J91651j01738
$$ plain form
2038 -37145 -372150 -76376 -100980 -552225 -222439 -43810 -197278 -249998 -506351 -1111841
2028 -1111841 -806530 -246639 -196967 -429346 -160943 -6334 34898 162331 123691 108739
2018 108739 -30859 37721 -6479 -552128 -670093 -591346 -154794 138534 -8244 -369533
2008 -369533 -519977 -445771 -210933 69945 73979 147730 317760 -27576 79245 -608994
1998 -608994 -563504 -308604 93413 -32050 -297620 -433023 -511535 -359178 -107049 31595
1988 31595 -135407 -476211 -590867 -514400 -1166521 -766334 -412188 -27379 -332505 -646391
1978 -646391 -545647 -398756 -464617 -128773 -493971 -755694 -426111 -128137 -323660 93716
$$ packed form
2038c7145l35005K95774k4604m51245L29786J78629j53468n2720k56353o05490
2028a111841L05311N59891M9672k32379K68403J54609M1232J27433l8640j4952
2018A08739j39598O8580m4200n45649j17965P8747M36552K93328j46778l61289
2008c69533j50444P4206K34838K80878M034P3751J70030l45336J06821o88239
1998f08994M5490K54900M02017j25463k65570j35403p8512J52357K52129J38644
1988C1595j67002l40804j14656P6467o52121M00187L54146L84809l05126l13886
1978f46391J00744J46891o5861L35844l65198k61723L29583K97974j95523M17376
$$ [...]
##END NTUPLES=NMR SPECTRUM
##END=
