##TITLE=1H_CA-8929-1
 CDCl3,8 sc, 
 28.9.2021
##JCAMPDX= 6.0         $$ Bruker NMR JCAMP-DX V2.0
##DATA TYPE= NMR SPECTRUM
##DATA CLASS= NTUPLES
##ORIGIN= UXNMR, Bruker Analytische Messtechnik GmbH
##OWNER= root
$$ XWIN-NMR		Version 3.5
$$ Tue Sep 28 11:39:05 2021 Russian Standard Time (UT+4h)  she@DPX200
##.OBSERVE FREQUENCY= 200.1314
##.OBSERVE NUCLEUS= ^1H
##.ACQUISITION MODE= SIMULTANEOUS
##.ACQUISITION SCHEME= undefined
##.AVERAGES= 8
##.DIGITISER RES= 18
##SPECTROMETER/DATA SYSTEM= spect
##.PULSE SEQUENCE= zg30
##.SOLVENT NAME= CDCl3
##.SHIFT REFERENCE= (INTERNAL, CDCl3, 0, 16.9558)
##AUDIT TRAIL= $$ (NUMBER, WHEN, WHO, WHERE, WHAT)
$$ ##TITLE= Audit trail, XWIN-NMR		Version 3.5
$$ ##JCAMPDX= 5.01
$$ ##ORIGIN= Bruker BioSpin GmbH
$$ ##OWNER= she
$$ F:/spectra/data/she/nmr/H-F/1/pdata/1/auditp.txt
$$ ##AUDIT TRAIL=  $$ (NUMBER, WHEN, WHO, WHERE, WHAT)
(   1,<2021-09-28 11:37:12.98 +0400>,<she>,<DPX200>,
      <created by zg, POWCHK disabled, PULCHK disabled
       configuration hash MD5:
       00 E9 B6 7A A2 85 ED C7 34 08 36 98 17 FE 4E 26
       data hash MD5: 16K
       B8 18 37 A3 5E 77 88 64 90 BA 9E 14 46 EE 2D A8>)
(   2,<2021-09-28 11:37:30.73 +0400>,<she>,<DPX200>,
      <Start of raw data processing
       efp BC_mod = 2 LB = 0.24 FT_mod = 6 PKNL = 1 PHC0 = -14095.62 PHC1 = 34.60088 SI = 16K 
       data hash MD5: 16K
       F0 80 47 60 AA D9 17 62 5A 11 A9 C1 13 1C DF 19>)
(   3,<2021-09-28 11:37:54.40 +0400>,<she>,<DPX200>,
      <pk PHC0 = -10.59663 PHC1 = 12.2 
       data hash MD5: 16K
       77 B6 24 14 98 94 EC 8C DF 50 43 28 4A 1F 1C DA>)
(   4,<2021-09-28 11:37:57.31 +0400>,<she>,<DPX200>,
      <abs ABSG = 5 
       data hash MD5: 16K
       8D 79 21 A1 A8 6B 6C A5 C8 6B 21 F8 7C E8 6A A1>)
(   5,<2021-09-28 11:38:13.78 +0400>,<she>,<DPX200>,
      <pk PHC0 = 2.144371 PHC1 = -4 
       data hash MD5: 16K
       E4 66 C2 C6 97 CE 0D 4A C4 2E D8 1E 76 EC 14 D4>)
(   6,<2021-09-28 11:38:17.04 +0400>,<she>,<DPX200>,
      <abs ABSG = 5 
       data hash MD5: 16K
       B9 4A 57 4A FD D0 A6 7D 2A 58 08 95 3C 23 22 46>)
$$ ##END=
$$ 
$$ hash MD5
$$ 04 A0 A7 0E 56 61 8C 3D 1E E5 E4 3A B4 86 5D 78
##$RELAX= 
##$RELAX= 
##$RELAX= 
##$RELAX= 
##$RELAX= 
##$RELAX= 
$$ Bruker specific parameters
$$ --------------------------
##$DU= <F:/spectra>
##$EXPNO= 1
##$NAME= <H-F>
##$PROCNO= 1
##$TYPE= <nmr>
##$USER= <she>
##$AMP= (0..31)
100 100 100 100 100 100 100 100 100 100 100 100 100 100 100 100 100 100 
100 100 100 100 100 100 100 100 100 100 100 100 100 100 
##$AQSEQ= 0
##$AQ_mod= 1
##$AUNM= <au_zg>
##$AUTOPOS= <>
##$BF1= 200.13
##$BF2= 200.13
##$BF3= 200.13
##$BF4= 200.13
##$BF5= 200.13
##$BF6= 200.13
##$BF7= 200.13
##$BF8= 200.13
##$BYTORDA= 1
##$CFDGTYP= 0
##$CFRGTYP= 5
##$CHEMSTR= <none>
##$CNST= (0..31)
1 1 145 1 1 1 1 1 1 1 1 1 1 1 1 1 1 1 1 1 1 1 1 1 1 1 1 1 1 1 1 1 
##$CPDPRG= <>
##$CPDPRG1= <>
##$CPDPRG2= <>
##$CPDPRG3= <>
##$CPDPRG4= <mlev>
##$CPDPRG5= <mlev>
##$CPDPRG6= <mlev>
##$CPDPRG7= <mlev>
##$CPDPRG8= <mlev>
$$ [...]
##$SUBNAM2= <"">
##$SUBNAM3= <"">
##$SUBNAM4= <"">
##$SUBNAM5= <"">
##$SUBNAM6= <"">
##$SUBNAM7= <"">
##$SUBNAM8= <"">
##$SUBNAM9= <"">
##$SW= 20.0188988654967
##$SWIBOX= (0..15)
0 0 2 0 0 0 0 0 0 0 0 0 0 0 0 0 
##$SW_h= 4006.41025641026
##$TD= 16384
##$TD0= 1
##$TE= 0
##$TE2= 300
##$TE3= 300
##$TEG= 300
##$TL= (0..7)
0 120 120 120 120 120 120 120 
##$TP= (0..7)
150 150 150 150 150 150 150 150 
##$TP07= 0
##$TPNAME0= <>
##$TPNAME1= <>
##$TPNAME2= <>
##$TPNAME3= <>
##$TPNAME4= <>
##$TPNAME5= <>
##$TPNAME6= <>
##$TPNAME7= <>
##$TPOAL= (0..7)
0.5 0.5 0.5 0.5 0.5 0.5 0.5 0.5 
##$TPOFFS= (0..7)
0 0 0 0 0 0 0 0 
##$TUNHIN= 0
##$TUNHOUT= 0
##$TUNXOUT= 0
##$USERA1= <user>
##$USERA2= <user>
##$USERA3= <user>
##$USERA4= <user>
##$USERA5= <user>
##$V9= 5
##$VALIST= <valist>
##$VCLIST= <CCCCCCCCCCCCCCC>
##$VD= 0
##$VDLIST= <DDDDDDDDDDDDDDD>
##$VPLIST= <PPPPPPPPPPPPPPP>
##$VTLIST= <TTTTTTTTTTTTTTT>
##$WBST= 1024
##$WBSW= 4
##$XGAIN= (0..3)
0 0 0 0 
##$XL= 0
##$YL= 0
##$YMAX_a= 77910
##$YMIN_a= -140117
##$ZGOPTNS= <>
##$ZL1= 120
##$ZL2= 120
##$ZL3= 120
##$ZL4= 120
##$ABSF1= 16.95949
##$ABSF2= -3.059547
##$ABSG= 5
##$ABSL= 3
##$ALPHA= 0
##$AQORDER= 0
##$ASSFAC= 0
##$ASSFACI= 0
##$ASSFACX= 0
##$ASSWID= 0
##$AUNMP= <proc_1d>
##$AZFE= 0.1
##$AZFW= 0.1
##$BCFW= 0
##$BC_mod= 2
##$BYTORDP= 0
##$COROFFS= 0
##$CY= -3
##$DATMOD= 1
##$DC= 0
##$DFILT= <>
##$DTYPP= 0
##$F1P= 0
##$F2P= 0
##$FCOR= 1
##$FTSIZE= 16384
##$FT_mod= 6
##$GAMMA= 0
##$GB= 0
##$INTBC= 1
##$INTSCL= 0
##$ISEN= 128
##$LB= 0.24
##$LEV0= 0
##$LPBIN= 0
##$MAXI= 10000
##$MC2= 0
##$MEAN= 0
##$ME_mod= 0
##$MI= 1.114404
##$NCOEF= 0
##$NC_proc= -8
##$NLEV= 6
##$NOISF1= 3.799351
##$NOISF2= 2.8
##$NSP= 0
##$NTH_PI= 0
##$NZP= 0
##$OFFSET= 16.95582
##$PC= 1
##$PHC0= -14104.08
##$PHC1= 42.80088
##$PH_mod= 1
##$PKNL= yes
##$PPARMOD= 0
##$PSCAL= 0
##$PSIGN= 0
##$REVERSE= no
##$SF= 200.130009835764
##$SI= 16384
##$SIGF1= 3
##$SIGF2= 2
##$SINO= 5.538805
##$SIOLD= 16384
##$SREGLST= <1H.CDCl3>
##$SSB= 0
##$STSI= 16384
##$STSR= 0
##$SW_p= 4006.41025641027
##$SYMM= 0
##$S_DEV= 0
##$TDeff= 16384
##$TDoff= 0
##$TI= <>
##$TILT= no
##$TM1= 0
##$TM2= 0
##$TOPLEV= 0
##$USERP1= <user>
##$USERP2= <user>
##$USERP3= <user>
##$USERP4= <user>
##$USERP5= <user>
##$WDW= 1
##$XDIM= 16384
##$YMAX_p= 299912700
##$YMIN_p= -1518946
$$ End of Bruker specific parameters
$$ ---------------------------------
##NTUPLES= NMR SPECTRUM
##VAR_NAME=  FREQUENCY,     SPECTRUM/REAL,   SPECTRUM/IMAG
##SYMBOL=    X,             R,               I
##VAR_TYPE=  INDEPENDENT,   DEPENDENT,       DEPENDENT
##VAR_FORM=  AFFN,          ASDF,            ASDF
##VAR_DIM=   16384,         16384,           16384
##UNITS=     HZ,            ARBITRARY UNITS, ARBITRARY UNITS
##FACTOR=    0.244546801953871, 1,           1
##FIRST=     3393.36844010795, 0,            0
##LAST=      -613.041816302322, 0,           0
##MIN=       -613.041816302322, -1518946,    0
##MAX=       3393.36844010795, 299912700,    0
$$ Real data points
##PAGE= N=1
##DATA TABLE= (X++(R..R)), XYDATA
$$ [...]
$$ plain form
7773 17879273 17531380 17353961 17018752 16835956 16787306 16660935 16557989 16457724 16400825 16042944
7763 16042944 15510213 15608266 15447373 15485879 15535588 15226191 15114105 14922127 15040656 14825547
7753 14825547 14785371 14347049 14215637 13603660 13778026 14018208 13485468 13165239 13014895 13105278
7743 13105278 13209818 13319154 13298196 12669864 12258185 12057031 11924017 11737955 12065973 11833815
7733 11833815 11666591 11461438 11153009 11442040 11426815 11310230 11007956 10913738 10482030 9778626
7723 9778626 9731764 10266411 10187862 9736804 9345556 9200397 8929662 9161091 9100932 8820593
7713 8820593 9319717 9459801 9284940 8958155 8454995 8186224 8162891 8675705 8388016 7957125
7703 7957125 7874481 7826890 7718893 7865348 7604855 7465115 7403381 7269566 7021178 6968963
$$ packed form
7773A7879273l47893j77419l35209j82796m8650j26371j02946j00265n6899l57881
7763A6042944n32731R8053j60893L8506M9709l09397j12086j91978J18529k15109
7753A4825547m0176m38322j31412o11977J74366K40182n32740l20229j50344R0383
7743A3105278J04540J09336k0958o28332m11679k01154j33014j86062L28018k32158
7733A1833815j67224k05153l08429K89031j5225j16585l02274r4218m31708p03404
7723I778626m6862N34647p8549m51058l91248j45159k70735K31429o0159k80339
7713H820593M99124J40084j74861l26785n03160k68771k3333N12814k87689m30891
7703G957125q2644m7591j07997J46455k60493j39740o1734j33815k48388n2215
$$ plain form
7693 6968963 6941625 7077078 7672627 7134929 7628640 7767037 7845526 7416069 7198785 6780228
7683 6780228 6789701 6838449 6445565 6360489 6329578 6782824 6432631 6099979 7137370 6635416
7673 6635416 6230050 6247652 6125483 6352842 6171896 6128680 6052252 6209128 5777430 5803592
7663 5803592 5944140 5497373 5697247 5629924 5269559 5875142 5579961 5514691 5395147 5472627
7653 5472627 5536806 5338718 6102114 6079499 6120237 5858087 5594861 5001176 5121221 5698232
7643 5698232 5892652 5380050 4904475 5159061 5213791 5226796 4945512 4988747 5340003 5656028
7633 5656028 5399354 5424339 5027463 5210067 5366484 5566631 5130595 5196607 5046350 4626291
7623 4626291 4871485 4656001 5011913 5062241 4779362 4539250 5085039 5286017 5279003 5248438
$$ packed form
7693F968963k7338J35453N95549n37698M93711J38397P8489m29457k17284m18557
7683F780228R473M8748l92884q5076l0911M53246l50193l32652J037391n01954
7673F635416m05366J7602j22169K27359j80946m3216p6428J56876m31698K6162
7663E803592J40548m46767J99874o7323l60365O05583k95181o5270j19544P7480
7653E472627O4179j98088P63396k2615M0738k62150k63226n93685J20045N77011
7643E698232J94420n12602m75575K54586N4730J3005k81284M3235L51256L16025
7633E656028k56674K4985l96876J82604J56417K00147m36036O6012j50257m20059
7623D626291K45194k15484L55912N0328k82879k40112N45789K00978p014l0565
$$ plain form
7613 5248438 4713502 5156219 5085051 4964770 4947218 4657569 4318136 3948589 4088956 4498337
7603 4498337 4381849 4605784 4510629 3971183 3832766 3918073 3676452 3687999 3993348 4488746
7593 4488746 4122490 3909000 3895638 4065923 4378036 4442844 4197516 4525340 4008654 3907369
7583 3907369 4242749 4171427 4155810 3428393 2938907 3791434 3956364 3680493 3880929 3301175
7573 3301175 3184181 2982382 3352824 3297005 3590588 3728194 3709696 3397845 3116414 3214615
7563 3214615 3145834 3032126 2868749 3196922 3253389 3279280 3299539 3329046 3166441 3187142 3170862
7552 3170862 3686534 3691151 3306087 3197545 2589090 3302156 3730022 3054148 2889213 3229840
7542 3229840 3423016 2595323 2753785 2826683 1863171 2544008 2575157 2993025 3535709 3558249
$$ packed form
7613E248438n34936M42717p1168j20281j7552k89649l39433l69547J40367M09381
7603D498337j16488K23935r5155n39446j38417Q5307k41621J1547L05349M95398
7593D488746l66256k13490j3362J70285L12113O4808k45328L27824n16686j01285
7583C907369L35380p1322j5617p27417m89486Q52527J64930k75871K00436n79754
7573C301175j16994k01799L70442n5819K93583J37606j8498l11851k81431R8201
7563C214615o8781j13708j63377L28173N6467K5891K0259K9507j62605K0701j6280
7552C170862N15672M617l85064j08542o08455P13066M27866o75874j64935L40627
7542C229840J93176q27693J58462P2898r63512O80837L1149M17868N42684K2540
$$ plain form
7532 3558249 2897957 2539572 2142461 2608378 2582279 2504125 2534664 2733467 3147265 2649990
7522 2649990 2400821 2300326 3038924 2928623 2690729 2567374 2675719 2923363 3254853 2942325
7512 2942325 3031777 3209135 2927608 2752617 2634832 2938326 2927957 2942708 2668290 2800325
7502 2800325 2656849 2765361 2771462 2570316 2546621 2629167 3104319 2951613 2667365 3080494
7492 3080494 3007962 2420580 2683891 2608712 2390363 2786200 2615975 2787828 3131260 2894755
7482 2894755 3030991 2927050 2582939 2218761 2370057 2336149 2665083 3000355 2786950 2673500
7472 2673500 2592128 2453959 2562296 3100873 3088564 2541656 2587041 2706690 2654502 2516533
7462 2516533 3105240 3233687 2903343 2844317 2978258 3144576 3393962 2774722 2334611 2556624
$$ packed form
7532C558249o60292l58385l97111M65917k6099p8154L0539J98803M13798m97275
7522B649990k49169j00495P38598j10301k37894j23355J08345K47644L31490l12528
7512B942325Q9452J77358k81527j74991j17785L03494j0369J4751k74418J32035
7502B800325j43476J08512O101k01146k3695Q2546M75152j52706k84248M13129
7492C080494p2532n87382K63311p5179k18349L95837j70225J71853L43432k36505
7482B894755J36236j03941l44111l64178J51296l3908L28934L35272k13405j13450
7472B673500q1372j38169J08337N38577j2309n46908M5385J19649n2188j37969
7462B516533N88707J28447l30344n9026J33941J66318K49386o19240m40111K22013
$$ plain form
7452 2556624 2295384 2349249 2383078 2669187 2446489 2488315 2389561 2671153 2580836 2630105 2014036
7441 2014036 2121247 2330847 2743534 2361491 2010142 1923579 2169493 2075934 1988920 2494388
7431 2494388 3078517 2516691 2874916 2778061 2352846 2476823 2174556 2084219 2321145 2383719
7421 2383719 2266770 2178749 1846933 1713765 1718977 2490486 2472235 2448790 2705170 2639491 2694821
7410 2694821 2726643 2274926 2182377 1976151 1872325 2437834 2607663 2037796 2373522 2168362
7400 2168362 2356218 2077445 1983125 1944341 1883796 1318658 1682251 1775080 1965683 2234239
7390 2234239 2207750 2439938 2287865 1764771 1305697 1553610 1841419 1471552 1638357 1579865
7380 1579865 1766524 1898547 1729560 1707434 1524321 1927770 1871933 1884780 1839701 1567383
$$ packed form
7452B556624k61240N3865L3829K86109k22698M1826r8754K81592r0317M9269o16069
7441B014036J07211K09600M12687l82043l51349q6563K45914r3559q7014N05468
7431B494388N84129n61826L58225r6855m25215J23977l02267r0337K36926O2574
7421B383719j16949q8021l31816j33168N212P71509j8251k3445K56380o5679N5330
7410B694821L1822m51717r2549k06226j03826N65509J69829n69867L35726k05160
7400B168362J87856k78773r4320l8784o0545n65138L63593R2829J90603K68556
7390B234239k6489K32188j52073n23094m59074K47913K87809l69867J66805n8492
7380A579865J86659J32023j68987k2126j83113M03449n5837J2847m5079k72318
$$ plain form
7370 1567383 1613552 1624007 1898999 1647878 1667947 1783508 1921864 1752366 1651350 1532635
7360 1532635 1834715 1636455 1840692 2038397 1884107 1711234 1785335 1778038 2085436 1772816
7350 1772816 1657051 1788585 1352477 1548216 1828191 1912619 2033499 1998058 1620406 1259359
7340 1259359 1479289 1381238 1508833 1881832 1631365 1853101 2316232 2182791 1378914 1188893
7330 1188893 1413262 1655578 1768497 1911507 2212068 2043518 1746297 1866238 1584805 1513937
7320 1513937 1458667 1810581 1671291 1324715 1426737 1350988 1322961 1837040 1724120 1828413
7310 1828413 1545317 1269150 1480983 1728851 1878970 1976829 1827282 1639795 1390810 1331790
7300 1331790 1513506 1943354 1982690 1599844 1642392 2005067 2074941 1710594 1786698 2213276
$$ packed form
7370A567383M6169J0455K74992k51121K0069J15561J38356j69498j01016j18715
7360A532635L02080j98260K04237J97705j54290j72873P4101p297L07398l12620
7350A772816j15765J31534m36108J95739K79975Q4428J20880l5441l77652l61047
7340A259359K19930r8051J27595L72999k50467K21736M63131j33441q03877j90021
7330A188893K24369K42316J12919J43010L00561j68550k97221J19941k81433p0868
7320A513937n5270L51914j39290l46576J02022p5749k8027N14079j12920J04293
7310A828413k83096k76167K11833K47868J50119R7859j49547j87487k48985n9020
7300A331790J81716M29848L9336l82846M2548L62675O9874l64347P6104M26578
$$ plain form
7290 2213276 1786530 1375865 1333307 1357537 1359729 1519058 1266650 1388416 1305172 1642121
7280 1642121 1816244 1599891 1342400 1608490 1687470 2012238 1615259 1420106 1794659 2036972
7270 2036972 1638716 1411606 1190762 1660889 1756462 1851478 1648958 1812118 1983165 1926674
7260 1926674 2142100 1958952 1788928 1406407 1671646 1585725 1430393 1472630 1617472 1778473
7250 1778473 1678030 1865634 2017204 1645884 1636080 1660013 1688931 1944312 2051882 1670526
7240 1670526 1765603 1773268 1637928 1089632 1324718 1174480 1277695 1531541 2211876 2393215
7230 2393215 1916369 1605892 1667206 2022819 1942796 1291944 695007 1327512 1645270 1878594
7220 1878594 1609261 1410533 1265605 1123229 1495815 1564462 1420047 1116632 785156 691683
$$ packed form
7290B213276m26746m10665m2558K4230K192J59329k52408J21766q3244L36949
7280A642121J74123k16353k57491K66090P8980L24768l96979j95153L74553K42313
7270B036972l98256k27110k20844M70127R5573R5016k02520J63160J71047n6491
7260A926674K15426j83148j70024l82521K65239q5921j55332M2237J44842J61001
7250A778473j00443J87604J51570l71320r804K3933K8918K55381J07570l81356
7240A670526R5077P665j35340n48296K35086j50238J03215K53846O80335J81339
7230B393215m76846l10477O1314L55613q0023o50852n96937O32505L17758K33324
7220A878594k69333j98728j44928j42376L72586O8647j44415l03415l31476r3473
$$ plain form
7210 691683 993841 832861 1021846 1116623 863537 889622 902675 1538925 1263672 1270720 710143
7199 710143 802503 1013302 649105 1006387 859434 600016 861944 1329612 874357 997814
7189 997814 885864 872097 819227 680993 501193 1095725 826839 501599 702124 656596
7179 656596 941750 1145514 1123947 1801528 937663 384859 376335 363650 416813 752876 1034725
7168 1034725 981353 942251 828853 713896 826532 943729 1115376 142789 265533 571770
7158 571770 534297 651435 1050564 917054 409171 326305 548759 708985 472627 361094
7148 361094 264233 13029 338480 819566 423503 224303 -18584 348749 401872 52028
7138 52028 313049 596640 731414 962744 663034 617843 714848 450098 190358 308433
$$ packed form
7210F91683L02158j60980J88985R4777k53086K6085J3053O36250k75253P048n60577
7199G10143R2360K10799l64197L57282j46953k59418K61928M67668m55255J23457
7189I97814j11950j3767n2870j38234j79800N94532k68886l25240K00525m5528
7179F56596K85154K03764k1567O77581q63865n52804q524j2685N3163L36063K81849
7168A034725n3372l9102j13398j14957J12636J17197J71647r72587J22744L06237
7158E71770l7473J17138L99129j33510n07883q2866K22454J60226k36358j11533
7148C61094r6861k51204L25451M81086l96063j99200k42887L67333N3123l49844
7138E2028K61021K83591J34774K31330k99710m5191R7005k64750k59740J18075
$$ plain form
7128 308433 193588 219112 162024 -452557 178398 364700 168417 604322 417376 58320
7118 58320 157961 256419 46288 60579 -245748 -387405 -595448 -292011 -182459 -259221 42408
7107 42408 247481 -203017 -134618 -568139 -365373 256892 213575 115571 233408 363796
7097 363796 487851 484405 471113 379243 460201 233248 64236 46721 -114180 -37412 156076
7086 156076 -58036 308022 -95593 -182165 209628 495679 314539 488160 47881 -201865
7076 -201865 -339749 -292478 -242673 -109521 -380515 -320448 -11393 205454 526669 187263
7066 187263 161060 190838 334870 551949 537688 19133 279428 -5030 -233964 106555
7056 106555 -174786 -481751 -455370 -281538 -218889 -773920 -399100 -25260 -98719 -233644
$$ packed form
7128C08433j14845K5524n7088o14581O30955J86302j96283M35905j86946l59056
7118E8320R9641R8458k10131J4291l06327j41657k08043L03437J09552p6762L01629
7107D2408K05073m50498O8399m33521K02766O22265m3317r8004J17837J30388
7097C63796J24055l446j3292r1870Q0958k26953j69012j7515j60901P6768J93488
7086A56076k14112L66058m03615q6572L91793K86051j81140J73621m40279k49746
7076b01865j37884M7271M9805J33152k70994O0067L09055K16847L21215l39406
7066A87263k6203K9778J44032K17079j4261n18555K60295k84458k28934L40519
7056A06555k81341l06965K6381J73832O2649n55031L74820L73840p3459j34925
$$ plain form
7046 -233644 -414009 -157918 -586872 -528254 -31988 227348 438476 60301 -354555 -128054
7036 -128054 -493800 -490019 -529535 -634634 -178138 -23560 -82230 -87780 88418 -321885 117038
7025 117038 199127 154488 14356 -348545 44222 238889 131349 115246 432822 131207
7015 131207 511480 295440 -235950 -139780 -113991 549301 429027 194269 -5887 -30964
7005 -30964 62728 3232 1016 -196619 -321235 560954 71431 90553 -114530 161329 332715
6994 332715 -256161 -209831 -64159 289260 -124028 -175986 -481116 -328573 -274017 -401085
6984 -401085 88469 -20125 1699 -280169 -404104 153145 346756 487658 396839 39372
6974 39372 310817 409743 538233 82570 71594 528027 159799 -233469 146973 570263
$$ packed form
7046b33644j80365K56091m28954N8618M96266K59336K11128l78175m14856K26501
7036a28054l65746L781l9516j05099M56496J54578n8670n550J76198m10303M38923
7025A17038Q2089m4639j40132l62901L92767J94667j07540j6103L17576l01615
7015A31207L80273k16040n31390R6170K5789O63292j20274k34758k00156k5077
7005c0964R3692n9496k216j97635j24616Q82189m89523J9122k05083K75859J71386
6994C32715n88876M6330J45672L53419m13288n1958l05130J52543N4556j27068
6984d01085M89554j08594K1824k81868j23935N57249J93611J40902r0819l57467
6974C9372K71445R8926J28490m55663j0976M56433l68228l93268L80442M23290
$$ plain form
6964 570263 304514 246215 317201 515556 680874 44361 -273227 -131789 144284 224159
6954 224159 389066 279699 194589 139217 -83441 -529988 94332 49747 370216 631576
6944 631576 1054411 903263 663462 980630 615691 246789 517014 510840 828034 1274373
6934 1274373 1170383 1096094 539310 717061 703023 920670 387082 731937 910455 1032648
6924 1032648 1377727 1482987 1194019 1307086 1695492 2377788 2834329 2938394 3051040 3042118
6914 3042118 2930017 3116837 3230000 2593517 1984554 1944922 1928783 1524967 1715580 1466738
6904 1466738 1200809 1091809 631039 403896 544925 778847 281112 605906 732848 900436
6894 900436 829515 414196 88880 330795 570067 809208 477248 114616 488406 429331
$$ packed form
6964E70263k65749n8299P0986J98355J65318o36513l17588J41438K76073P9875
6954B24159J64907j09367q5110n5372k22658m46547O24320m4585L20469K61360
6944F31576M22835j51148k39801L17168l64939l68902K70225o174L17194M46339
6934A274373j03990p4289n56784J77751j4038K17647n33588L44855J78518J22193
6924A032648L45079J05260k88968J13067L88406O82296M56541J04065J12646q922
6914C042118j12101J86820J13163o36483o08963l9632j6139m03816J90613k48842
6904A466738k65929j09000m60770k27143J41029K33922m97735L24794J26942J67588
6894I00436p0921m15319l25316K41915K39272K39141l31960l62632L73790n9075
$$ plain form
6884 429331 756484 253215 -168685 235354 207622 -208296 54249 64242 65714 487534 223332
6873 223332 78387 131433 -28492 588683 692499 80359 -353984 -194530 -42694 -86972
6863 -86972 -35959 -181240 -19115 77479 -252067 -76633 415826 348883 321846 -320486 -139786
6852 -139786 -437692 -279959 -44840 -199053 71449 90244 248094 149753 -88837 64656
6842 64656 -228297 -318024 -555668 -544549 -354474 -366187 -3964 -238170 -31020 217807
6832 217807 213214 -79000 -150675 234098 129052 -729973 -497599 93547 -40221 -230074
6822 -230074 46193 50206 -566320 -373617 -146146 -435684 -505328 -254195 -449833 -525193
6812 -525193 -386553 -94943 140654 -312024 -137224 143024 -98699 -164640 -773680 -927445
$$ packed form
6884D29331L27153n03269m21900M04039k7732m15918K62545R993J472M21820k64202
6873B23332j44945N3046j59925O17175J03816o12140m34343J59454J51836m4278
6863h6972N1013j45281J62125R6594l29546J75434M92459o6943k7037o42332J80700
6852a39786k97906J57733K35119j54213K70502J8795J57850r8341k38590J53493
6842F4656k92953q9727k37644J1119J90075j1713L62223k34206K07150K48827
6832B17807m593k92214p1675L84773j05046q59025K32374N91146j33768j89853
6822b30074K76267M013o16526J92703K27471k89538o9644K51133j95638p5360
6812e25193J38640K91610K35597m52678J74800K80248k41723o5941o09040j53765
$$ plain form
6802 -927445 -642106 -111747 73574 -4648 46708 -182131 -512298 -744363 -571496 -633188
6792 -633188 -416905 -50074 155502 -200414 -245219 -400409 -820527 -307527 -258950 -578626
6782 -578626 -294677 55206 -571056 -995226 -713760 -377709 -186361 -535622 -418972 -509927
6772 -509927 -217162 -173693 -232358 14558 -127064 -88657 -119279 109340 -297214 -333072 -465559
6761 -465559 -392569 -438755 -343404 -383919 -463787 -318508 -548168 -587926 -709672 -615000 -719236
6750 -719236 -500790 -646571 -472989 -527710 -593884 -567325 -409865 -604091 -125575 -341347
6740 -341347 -82762 -490490 -1017887 -438302 -2845 -169245 -268920 -172174 -415530 -620121
6730 -620121 -528557 -83691 -137820 -7926 248858 -249705 -656620 -214094 165800 -186451
$$ packed form
6802i27445K85339N30359J85321p8222N1356k28839l30167k32065J72867o1692
6792f33188K16283L66831K05576l55916m4805j55190m20118N13000M8577l19676
6782e78626K83949L49883o26262m24170K81466L36051J91348l49261J16650r0955
6772e09927K92765M3469n8665K46916j41622L8407l0622K28619m06554l5858j32487
6761d65559P2990m6186R5351m0515p9868J45279k29660l9758j21746R4672j04236
6750g19236K18446j45781J73582n4721o6174K6559J57460j94226M78516k15772
6740c41347K58585m07728n27397N79585M35457j66400r9675R6746k43356k04591
6730f20121R1564M44866n4129J29894K56784m98563m06915M42526L79894l52251
$$ plain form
6720 -186451 -315681 -389135 -211600 -306993 -793792 -879306 -612924 -670840 -480308 -699672
6710 -699672 -544713 103658 -191389 -432524 -460435 -541446 -537653 -415279 -287241 -286553 -226548
6699 -226548 258923 -130477 160102 69197 -404224 -252155 37764 100349 82943 12071
6689 12071 -158435 143902 46413 15887 49836 -29640 284550 -34520 -79314 -466016 -541481
6678 -541481 136635 359717 223747 172921 323187 60460 73992 661237 769644 595931
6668 595931 656196 322370 -307507 -452393 -17676 102159 31163 20657 247 314565
6658 314565 303201 419335 463271 168532 199049 980868 559700 767818 1162316 867114
6648 867114 287017 1050441 1386139 1202981 1510819 1467418 1741514 1608601 1990735 2529541
$$ packed form
6720a86451j29230p3454J77535r5393m86799q5514K66382n7916J90532k19364
6710f99672J54959O48371k95047k41135k7911q1011L793J22374J28038O88O0005
6699b26548M85471l89400K90579r0905m73421J52069K89919O2585j7406p0872
6689A2071j70506L02337r7489l0526L3949p9476L14190l19070m4794l86702p5465
6678e41481O78116K23082j35970n0826J50266k62727J3532N87245J08407j73713
6668E95931O0265l33826o29877j44886M34717J19835p0996j0506k0410L14318
6658C14565j1364J16134M3936k94739L0517P81819m21168K08118L94498k95202
6648H67114n80097P63424L35698j83158L07838m3401K74096j32913L82134N38806
$$ plain form
6638 2529541 2799761 2379313 2579772 3009871 3378047 3849664 4402204 5161293 5927323 6241398
6628 6241398 6426248 6541721 7208215 8219912 8651227 9738962 10015397 9487967 9260581
6619 9260581 8535281 7388853 6524338 5381815 4630660 4253461 3840737 3386490 3099205
6610 3099205 3050048 3016306 2711985 2524558 2120371 2224144 1977197 1447651 1073877 883324
6600 883324 977725 671181 444817 575258 87785 325926 425718 223265 399728 124480
6590 124480 311480 216493 256123 -125042 -426472 -215969 -260021 -267783 -521048 -243828 -377380
6579 -377380 -310372 -83289 -479784 -223678 200926 9372 -758870 -939928 -708443 -637726
6569 -637726 -460190 -254123 -905315 -923531 -760318 -422029 -761299 -520576 -167915 -370615
$$ packed form
6638B529541K70220m20448K00459M30099L68176M71617N52540P59089P66030L14075
6628F241398J84850J15473O66494J011697M31315J087735K76435n27430k27386
6619I260581p25300j146428q64515j142523p51155l77199m12724m54247k87285
6610C099205m9157l3742l04321j87427m04187J03773k46947n29546l73774j90553
6600H83324R4401l06544k26364J30441m87473K38141R9792k02453J76463k75248
6590A24480J87000r4987L9630l81165l01430K10503m4052p762k53265K77220j33552
6579c77380O7008K27083l96495K56106M24604j91554p68242j81058K31485P0717
6569f37726J77536K06067o51192j8216J63213L38289l39270K40723L52661k02700
$$ plain form
6559 -370615 -292633 -60538 260766 -278883 -411707 -646109 -747874 -566060 -850808 -638086
6549 -638086 -805498 -816271 -375371 -716471 -656981 -631085 -998677 -870976 -1132804 -874065
6539 -874065 -766987 -805004 -1165131 -340052 -311431 -745036 -296751 -838025 -761019 -421996
6529 -421996 -751638 -907668 -834645 -1018271 -1016338 -949121 -818809 -487530 -898547 -837268 -734945
6518 -734945 -593505 -661086 -609700 -569822 -538042 -743439 -475532 -486016 -478272 -551094 -568218
6507 -568218 -478069 -656893 -263037 -449861 -549080 -524622 -324776 -357601 -391229 -497347 -491927
6496 -491927 -687439 -678775 -499713 -525217 -863933 -818312 -481707 -688193 -751026 -502218 -792662
6485 -792662 -697343 -1045712 -1152303 -515549 -207627 -438826 -617370 -500689 -546967 -572178
$$ packed form
6559c70615P7982K32095L21304n39649j32824k34402j01765J81814k84748K12722
6549f38086j67412j0773M40900l41100N9490K5896l67592J27701k61828K58739
6539h74065J07078l8017l60127Q25079K8621m33605M48285n41274P7006L39023
6529d21996l29642j56030P3023j83626J933O7217J30312L31279m11017O1279J02323
6518g34945J41440o7581N1386L9878L1780k05397K67907j0484P744p2822j7124
6507e68218R0149j78824L93856j86824r9219K4458J99846l2825l3628j06118N420
6496d91927j95512Q664J79062k5504l38716M5621L36605k06486o2833K48808k90444
6485g92662R5319l48369j06591O36754L07922k31199j78544J16681m6278k5211
$$ plain form
6475 -572178 -612420 -583022 -456311 -344139 44751 -210116 -333959 -172482 -528242 -598507
6465 -598507 -358420 -391248 -348218 -464072 -774793 -847571 -335911 -406021 -772966 -606839
6455 -606839 -658604 -759150 -926458 -816888 -928400 -1150789 -1512798 -1137539 -751879 -503570
6445 -503570 -301208 48333 1290 -697977 -833671 -1038960 -571750 -259984 -437265 -152098
6435 -152098 -551216 -728367 -983881 -603313 -464001 -699287 -732085 -453698 -161149 -408629
6425 -408629 -508333 -570059 -217190 -481864 -397294 -541623 -340603 -536698 -603274 -142343
6415 -142343 199224 -654481 -799132 -404655 -45605 -215566 -325114 -632034 -487815 -405526
6405 -405526 -271286 -62401 -426556 -571599 -540366 -118087 143938 -150610 -445092 -615942
$$ packed form
6475e72178m0242K9398J26711J12172L88890k54867j23843J61477l55760p0265
6465e98507K40087l2828M3030j15854l10721p2778N11660p0110l66945J66127
6455f06839n1765j00546j67308J09570j11512k22389l62009L75259L85660K48309
6445e03570K02362L49541m7043o99267j35694k05289M67210L11766j77281K85167
6435a52098l99118j77151k55514L80568J39312k35286l2798K78387K92549k47480
6425d08629r9704o1726L52869k64674Q4570j44329K01020j96095o6576M60931
6415a42343L41567q53705j44651L94477L59050j69961j09548l06920J44219Q2289
6405d05526J34240K08885l64155j45043L1233M22279K62025k94548k94482j70850
$$ plain form
6395 -615942 -74876 198668 109960 194078 -89695 -76710 -498231 -644545 -443631 -375633
6385 -375633 -52182 -404889 -265847 139094 -22285 334767 353817 88328 -266532 71853
6375 71853 315852 -270115 -430408 185663 -126991 60809 -111214 182504 316400 48019
6365 48019 -76209 -173093 483314 356814 362262 313707 -63130 381637 620822 623653 191117
6354 191117 213583 510677 629310 10200 259213 339935 298878 287609 -286741 111508
6344 111508 623292 361878 -54449 -91479 -365950 -253899 -598380 -164567 -8479 15435
6334 15435 -214429 -345844 -978538 -784051 -535732 -694884 -319825 -293897 -247940 -793899
6324 -793899 -37763 -377137 -262466 156303 217917 231163 -105094 118162 245588 163863
$$ packed form
6395f15942N41066K73544q8708Q4118k83773J2985m21521j46314K00914O7998
6385c75633L23451l52707J39042M04941j61379L57052J9050k65489l54860L38385
6375G1853K43999n85967j60293O16071l12654J87800j72023K93718J33896k68381
6365D8019j24228r6884O56407j26500N448m8555l76837M44767K39185K831m32536
6354A91117K2466K97094J18633o19110K49013Q0722m1057j1269n74350L98249
6344A11508N11784k61414m16327l7030k74471J12051l44481M33813J56088K3914
6334A5435k29864j31415o32694J94487K48319j59152L75059K5928M5957n45959
6324g93899P56136l39374J14671M18769O1614J3246l36257K23256J27426q1725
$$ plain form
6314 163863 34800 -155309 -271646 -312421 162214 430625 98643 -291364 -82297 247406
6304 247406 -10522 195914 218600 -71766 -180671 -172790 -103466 32759 101837 -202766 -70979
6293 -70979 237288 32756 75861 -84622 -377467 43334 -200464 -268123 -139392 -615283
6283 -615283 -457768 -136108 -230888 -285805 -358466 227968 141834 -187185 -261193 -258654 -445457
6272 -445457 -649470 -462404 -130123 3999 61833 -153178 25678 213552 10919 -33222
6262 -33222 40750 -452940 -620639 -347371 -14763 -328273 -260760 273031 -10075 35035
6252 35035 213465 211670 -392315 135243 201571 -146132 -194183 -377371 -661831 251605 417021
6241 417021 -199767 -208269 487802 202351 -342487 -563199 -358369 -157922 -172450 -43046
$$ packed form
6314A63863j29063j90109j16337m0775M74635K68411l31982l90007K09067L29703
6304B47406k57928K06436K2686k90366j08905P881O9324J36225O9078l04603J31787
6293g0979L08267k04532M3105j60483k92845M20801k43798o7659J28731m75891
6283f15283J57515L21660r4780n4917p2661N86434q6134l29019p4008K539j86803
6272d45457k04013J87066L32281J34122N7834k15011J78856J87874k02633m4141
6262c3222P3972m93690j67699K73268L32608l13510O7513N33791k83106M5110
6252C5035J78430j795o03985N27558O6328l47703m8051j83188k84460R13436J65416
6241D17021o16788q502O96071k85451n44838k20712K04830K00447j4528J29404
$$ plain form
6231 -43046 19589 20734 223985 -198379 -369522 -10003 -136894 -13214 20606 -166484 7610
6220 7610 133364 -120559 25816 28709 -82758 -436304 -20634 138287 -117665 -293690
6210 -293690 -234814 -321982 -25302 316717 -996 71594 -229083 -184120 101866 -186360
6200 -186360 -316090 63683 560279 597454 428662 177554 450201 -10637 117345 310450
6190 310450 238881 519243 620302 357176 -461979 -543504 -94295 373367 -336480 -88099
6180 -88099 -336369 -201496 -190542 -199734 -629532 -643052 -413322 -132964 -206385 -153637 165228
6169 165228 530337 559561 527855 266633 -186815 125815 120158 105675 139 -73670 35552
6158 35552 212366 -43148 -432848 -267458 -162084 -332643 -120021 -166317 175832 425688
$$ packed form
6231d3046O2635J145K03251m22364j71143L59519j26891J23680L3820j87090J74094
6220G610J25754k53923J46375K893j11467l53546M15670J58921k55952j76025
6210b93690N8876q7168K96680L42019l17713P2590l00677M4963K85986k88226
6200a86360j29730L79773M96596L7175j68792k51108K72647m60838J27982J93105
6190C10450p1569K80362J01059k63126q19155q1525M49209M67662p09847K48381
6180h8099k48270J34873J0954r192m29798j3520K29730K80358p3421N2748L18865
6169A65228L65109K9224l1706k61222m53448L12630n657j4483j05536p3809J09222
6158C5552J76814k55514l89700J65390J05374j70559K12622m6296L42149K49856
$$ plain form
6148 425688 206343 107967 285916 391806 -80197 -255661 203369 65861 -144054 244560
6138 244560 53861 -100917 178784 -76962 266742 140994 9923 -326091 160683 -173067
6128 -173067 -352391 -138278 98709 -129799 188010 390180 93787 153618 -438520 -372324
6118 -372324 94348 49590 386276 254756 17539 41252 -107614 -122857 92923 17861
6108 17861 136726 246050 416178 225858 -165067 -132642 -92371 -44327 241472 323050 176406
6097 176406 131353 904561 472742 135151 67930 7082 171440 151422 93744 -7023 315492
6086 315492 38823 229029 451910 352057 427485 275433 327551 343734 405569 390938 -13219
6075 -13219 148625 107963 -105979 -380387 -362751 286223 424329 180484 376343 572169
$$ packed form
6148D25688k19345r8376J77949J05890m72003j75464M59030j37508k09915L88614
6138B44560j90699j54778K79701k55746L43704j25748j31071l36014M86774l33750
6128a73067j79324K14113K36987k28508L17809K02170k96393N9831n92138O6196
6118c72324M66672m4758L36686j31520k37217K3713j48866j5243K15780p5062
6108A7861J18865J09324J70128j90320l90925L2425M0271M8044K85799Q1578j46644
6097A76406m5053P73208m31819l37591o7221o0848J64358k0018n7678j00767L22515
6086C15492k76669J90206K22881r9853P5428j52052N2118J6183O1835j4631m04157
6075a3219J61844m0662k13942k74408J7636O48974J38106k43845J95859J95826
$$ plain form
6065 572169 614118 97910 354985 769748 816215 227152 699063 695419 264087 214698 -77674
6054 -77674 -130300 156591 96072 142724 36764 133351 703279 606530 301179 278150 323093
6043 323093 818613 463349 453719 696843 1236291 1057649 245243 177723 708382 456140
6033 456140 244468 507712 728036 707185 744583 781659 369962 506676 491831 239031
6023 239031 13238 -23523 -132408 -22938 52640 338147 591325 394180 243801 39646
6013 39646 36187 3175 556840 986967 612166 401356 276081 403259 473777 322579 285466
6002 285466 471015 168871 647832 784859 608037 342955 200967 38593 492472 796851
5992 796851 1102321 959453 439960 234271 389695 473932 698818 492122 898826 1078653
$$ packed form
6065E72169M1949n16208K57075M14763M6467n89063M71911l644m31332m9389k92372
6054g7674n2626K86891o0519M6652j05960R6587N69928r6749l05351k3029M4943
6043C23093M95520l55264r630K43124N39448j78642q12406o7520N30659k52242
6033D56140k11672K63244K20324k0851L7398L7076m11697J36714j4845k52800
6023B39031k25793l6761j08885J09470P5578K85507K53178j97145j50379k04155
6013C9646l459l3012N53665M30127l74801k10810j25275J27178P0518j51198l7113
6002B85466J85549l02144M78961J37027j76822k65082j41988j62374M53879L04379
5992G96851L05470j42868n19493k05689J55424Q4237K24886k06696M06704J79827
$$ plain form
5982 1078653 702020 947963 642393 830564 816592 689941 931439 631035 293101 304128
5972 304128 506491 929918 788780 546617 518037 1010302 717059 569115 633547 619629
5962 619629 591661 518135 588085 354357 456316 856623 963275 588011 236717 566109
5952 566109 630668 1015873 1243972 1204990 719553 593962 335932 795434 1033090 1036964
5942 1036964 886930 635055 417341 238655 133399 576585 1079976 1271381 1419907 1216657
5932 1216657 1462842 927027 813399 975363 1538232 1523532 1126666 806401 872027 1030440
5922 1030440 1149612 749361 880391 769543 893008 918630 1008443 752885 817400 1327032
5912 1327032 1235937 1399687 1068375 837090 1310299 1097690 1182937 1197994 858272 920706
$$ packed form
5982A078653l76633K45943l05570J88171j3972j26651K41498l00404l37934J1027
5972C04128K02363M23427j41138k42163k8580M92265k93243j47944O4432j3918
5962F19629k7968p3526O9950k33728J01959M00307J06652l75264l51294L29392
5952E66109O4559L85205K28099l8982m85437j25591k58030M59502K37656L874
5942A036964j50034k51875k17714j78686j05256M43186N03391J91405J48526k03250
5932A216657K46185n35815j13628J61964N62869j4700l96866l20265O5626J58413
5922A030440J19172m00251J31030j10848J23465K5622Q9813k55558O4515N09632
5912A327032r1095J63750l31312k31285M73209k12609Q5247J5057l39722O2434
$$ plain form
5902 920706 1042876 1031228 1405773 1458839 986511 553211 554831 1489225 1204951 1453702
5892 1453702 1900290 1212291 1313026 1627853 1612036 1398277 1310639 1126368 1213338 1664435
5882 1664435 1157267 1151948 1365591 1135644 1382048 1385665 1278832 1537479 1433446 1594015
5872 1594015 1761410 2094397 1930088 1755114 2249118 2476263 2130871 1901595 2298312 2289282
5862 2289282 2745648 2641238 2628485 2890576 3353980 3668218 3776462 3914508 4045093 3833101
5852 3833101 3912106 3506770 3134692 3334217 3348812 3682844 3230639 3425719 3767147 4161227
5842 4161227 3900867 4233110 4196941 3526701 3672193 3699743 3262268 3182647 2780893 2686974
5832 2686974 2340214 2325952 2185456 2337216 2674000 2879708 2808554 2375262 2335098 2349895
$$ packed form
5902I20706J22170j1648L74545N3066m72328m33300J620R34394k84274K48751
5892A453702M46588o87999J00735L14827j5817k13759q7638j84271Q6970M51097
5882A664435n07168n319K13643k29947K46404L617j06833K58647j04033J60569
5872A594015J67395L32987j64309j74974M94004K27145l45392k29276L96717r030
5862B289282M56366j04410j2753K62091M63404L14238J08244J38046J30585k11992
5852C833101P9005m05336l72078J99525J4595L34032m52205J95080L41428L94080
5842D161227k60360L32243l6169o70240J45492K7550m37475p9621m01754r3919
5832B686974l46760j4262j40496J51760L36784K05708p1154m33292m0164J4797
$$ plain form
5822 2349895 2820096 2740793 2452578 2337677 2701410 2870383 2453291 2196941 2199009 2421526
5812 2421526 2705224 2711310 2731678 2776124 3119849 2766398 2869576 3059178 2833069 3153615
5802 3153615 3298357 3608171 4020623 4425171 4336352 4918523 5585912 5603795 5696159 6298697
5792 6298697 6540422 6140485 6238990 6019725 5453994 5529053 5550122 5928538 6305268 6193130
5782 6193130 6237650 6144737 6728410 6311045 5798824 5680654 5687474 5384679 4879706 4409049
5772 4409049 4148172 3893398 3806954 3378141 3399290 3111755 3015587 3541337 3442751 3256957
5762 3256957 2667805 2625134 2614037 2169656 1917903 2530232 2404508 2349166 2186869 1846379
5752 1846379 1543257 1543688 2268860 2165312 2126189 2253840 1739720 1729229 1561903 2191895
$$ packed form
5822B349895M70201p9303k88215j14901L63733J68973m17092k56350K068K22517
5812B421526K83698O086K0368M4446L43725l53451J03178J89602k26109L20546
5802C153615J44742L09814M12452M04548q8819N82171O67389J7883R2364O02538
5792F298697K41725l99937R8505k19265n65731P5059K1069L78416L76730j12138
5782F193130M4520r2913N83673m17365n12221j18170O820l02795n04973m70657
5772D409049k60877k54774q6444m28813K1149k87535r6168N25750r8586j85794
5762C256957n89152m2671j1097m44381k51753O12329j25724n5342j62297l40490
5752A846379l03122M31P25172j03548l9123J27651n14120j0491j67326O29992
$$ plain form
5742 2191895 2206589 1805550 2350804 1951907 2029929 1797168 1856531 1929777 1748928 1749543 2353180
5731 2353180 2200954 1507762 1669740 1529370 1832269 1737652 1647206 1873565 1931203 2049054
5721 2049054 2254347 2205262 2217282 2137861 1634060 1817908 1917940 2206772 2434549 2408180
5711 2408180 2244205 1688441 1620516 2093169 1831609 1917292 2197492 2108816 2763369 2419057
5701 2419057 2055808 2476177 2442586 2515188 2636246 2552013 2655068 2233365 2505112 2552845
5691 2552845 2433840 2682925 2808584 2828312 2742516 2842822 2785309 2613736 3187203 3434296
5681 3434296 3371310 3540635 3849456 3631659 3287915 3770918 4393937 4129613 4312325 4436661
5671 4436661 4710671 5387436 5860490 5866108 5718638 6730881 6875391 6530131 6304433 6035298
$$ packed form
5742B191895J4694m01039N45254l98897P8022k32761N9363P3246j80849O15O03637
5731B353180j52226o93192J61978j40370L02899r4617r0446K26359N7638J17851
5721B049054K05293m9085J2020p9421n03801J83848J00032K88832K27777k6369
5711B408180j63975n55764o7925M72653k61560Q5683K80200q8676O54553l44312
5701B419057l63249M20369l3591P2602J21058q4233J03055m21703K71747M7733
5691B552845j19005K49085J25659J9728q5796J00306n7513j71573N73467K47093
5681C434296o2986J69325L08821k17797l43744M83003O23019k64324J82712J24336
5671D436661K74010O76765M73054N618j47470J012243J44510l45260k25698k69135
$$ plain form
5661 6035298 5707754 5369804 5331011 5377989 5376561 5763676 5638154 5950398 5822941 6123059
5651 6123059 6484169 6156019 6088999 6428789 6776407 6867228 6070739 6378980 6150875 5024450
5641 5024450 5011382 4834344 4705476 4800442 4536340 4398326 4282869 3896329 4170578 4159861
5631 4159861 3754792 3563382 3699539 3586086 3766866 3480659 3207357 3322581 3428708 3611274
5621 3611274 3490770 3483338 3219360 3026445 3241310 3489095 3658900 3975397 3580244 3476229
5611 3476229 3785013 3863821 4241832 4692511 4659350 4739472 4807816 4731742 4844775 5300868
5601 5300868 5255812 4697069 4385975 4217045 4294005 4368389 4582547 4801093 5105514 5028009
5591 5028009 4900252 5107094 5297209 5070049 5288620 5405191 5870908 5883650 5521304 5191036
$$ packed form
5661F035298l27544l37950l8793M6978j428L87115j25522L12244j27457L00118
5651F123059L61110l28150o7020L39790L47618R0821p96489L08241k28105j126425
5641E024450j3068j77038j28868R4966k64102j38014j15457l86540K74249j0717
5631D159861m05069j91410J36157j13453J80780k86207k73302J15224J06127J82566
5621C611274j20504p432k63978j92915K14865K47785J69805L16497l95153j04015
5611C476229L08784P8808L78011M50679l3161Q0122O8344p6074J13033M56093
5601E300868m5056n58743l11094j68930P6960P4384K14158K18546L04421p7505
5591E028009j27757K06842J90115k27160K18571J16571M65717J2742l62346l30268
$$ plain form
5581 5191036 5106914 4906134 4636550 4882460 4721691 4228832 4237258 4105031 4188236 4168616
5571 4168616 3836024 3666501 3616274 3298661 3745268 3635202 3816933 3992287 4137111 3758795
5561 3758795 3202581 3281657 3473864 4040881 4173414 3981996 4379879 4610580 4163445 4286869
5551 4286869 3975855 3995044 4357504 4325474 4048060 4114960 3590836 3445078 3997128 3738274
5541 3738274 3772441 4220310 4127336 3958720 4241580 4535222 4134601 4403468 4317620 4045240
5531 4045240 4165941 4094153 3939514 4083596 4071929 4339564 4388855 4093592 3802661 3794563
5521 3794563 3500983 3524686 4072063 4145873 4350509 4321435 4096084 4583151 5474737 5199429
5511 5199429 5339976 5120853 4861653 5296413 5315021 5971056 5775136 5831588 5405325 4845015
$$ packed form
5581E191036q4122k00780k69584K45910j60769m92859Q426j32227Q3205j9620
5571D168616l32592j69523n0227l17613M46607j10066J81731J75354J44824l78316
5561C758795n56214P9076J92207N67017J32533j91418L97883K30701m47135J23424
5551D286869l11014J9189L62460l2030k77414O6900n24124j45758N52050k58854
5541C738274L4167M47869r2974j68616K82860K93642m00621K68867q5848k72380
5531D045240J20701p1788j54639J44082j1667K67635M9291k95263k90931q098
5521C794563k93580K3703N47377P3810K04636k9074k25351M87067Q91586k75308
5511E199429J40547k19123k59200M34760J8608O56035j95920N6452m26263n60310
$$ plain form
5501 4845015 4630779 4810220 4539233 4491239 4410057 4280882 4130870 4238171 4033818 3858430
5491 3858430 4240751 4267183 4500245 4636866 4838093 4439572 4403830 4075914 4559394 4754023
5481 4754023 4928305 5468900 5556840 5522266 5200440 4987397 5125632 5124033 5177843 5308234
5471 5308234 4780197 4613875 4547620 4041755 3760232 3526960 3603195 3932314 4120737 3628538
5461 3628538 3840354 3770537 4182881 3809341 3778467 3723857 3436335 3469956 3066374 3553176
5451 3553176 3964990 4628462 4404901 4285659 3721063 4052804 3984531 3889488 3822464 3351782
5441 3351782 3549266 3643818 3441447 3240397 3204425 3207262 2974349 3023466 3110534 3202280 3907572
5430 3907572 3797352 3570404 3579525 3355086 3307043 3609608 3589369 3630245 3558111 3907942 3841084
$$ packed form
5501D845015k14236J79441k70987m7994q1182j29175j50012J07301k04353j75388
5491C858430L82321K6432K33062J36621K01227l98521l5742l27916M83480J94629
5481D754023J74282N40595Q7940l4574l21826k13043J38235j599N3810J30391
5471E308234n28037j66322o6255n05865k81523k33272P6235L29119J88423m92199
5461C628538K11816o9817M12344l73540l0874n4610k87522L3621m03582M86802
5451C553176M11814O63472k23561j19242n64596L31741o8273r5043o7024m70682
5441C351782J97484R4552k02371k01050l5972K837k32913M9117Q7068R1746P05292
5430C907572j10220k26948R121k24439m8043L02565k0239M0876p2134L49831o6858
$$ plain form
5419 3841084 4117561 4470633 4614779 4604648 4032806 4053194 3945976 4122659 4245044 4350391
5409 4350391 3992962 3351898 3716642 3884923 3921184 4050540 4353917 4506815 4478852 4335240
5399 4335240 4796502 4478364 4049447 3598184 4029062 4175943 4295029 4969179 4500403 4451321
5389 4451321 4957515 5008249 4608925 4406056 4352916 4333502 4191730 4214472 4165913 4435394
5379 4435394 4618451 5174939 4673473 4681627 4747216 5130309 4875770 4560614 4964176 4674584
5369 4674584 4349872 4587529 4644547 4245938 4609121 4891222 4947748 4799261 4932033 4517319
5359 4517319 4134418 4262851 4459722 4721801 4401781 4072813 4499755 4694058 4299003 4416862
5349 4416862 4764563 4492368 4370020 4591931 4294147 4178954 4317766 4425701 4777679 4807187
$$ packed form
5419C841084K76477L53072J44146j0131n71842K0388j07218J76683J22385J05347
5409D350391l57429o41064L64744J68281L6261J29356L03377J52898k7963j43612
5399D335240M61262l18138m28917m51263M30878J46881J19086O74150m68776m9082
5389D451321N06194N0734l99324k02869n3140j9414j41772K2742m8559K69481
5379D435394J83057N56488n01466Q154O5589L83093k54539l15156M03562k89592
5369D674584l24712K37657N7018l98609L63183K82101N6526j48487J32772m14714
5359D517319l82901J28433J96871K62079l20020l28968M26942J94303l95055J17859
5349D416862L47701k72195j22348K21911k97784j15193J38812J07935L51978K9508
$$ plain form
5339 4807187 4492457 4728639 4846131 4515157 5033062 4847790 4829994 4393200 4374784 4873657
5329 4873657 4865396 4849097 4700859 4815853 4657526 4898247 4704044 4576017 4660325 4921303
5319 4921303 4851352 4342666 4619005 4448901 4038552 4572255 4912739 5005495 4821724 4145083
5309 4145083 4325964 4046468 3749157 4474763 4618815 4424963 4347456 4479758 4717355 4658089
5299 4658089 4451348 4086196 4577390 4496074 4398504 4322171 4331007 4458628 4245584 4566187
5289 4566187 4547966 4539146 4415573 4652505 4195301 4279067 4592407 4535814 4927846 4326889
5279 4326889 4599475 4450921 4101787 4487410 4213477 4372461 4460265 4892925 4582001 4368029
5269 4368029 4097528 4836249 4589067 4713689 4654413 4520075 4630052 5003374 5222264 4915830
$$ packed form
5339D807187l14730K36182J17492l30974N17905j85272j7796m36794j8416M98873
5329D873657q261j6299j48238J14994j58327K40721j94203j28027Q4308K60978
5319D921303o9951n08686K76339j70104m10349N33703L40484R2756j83771o76641
5309D145083J80881k79496k97311P25606J44052j93852p7507J32302K37597n9266
5299D658089k06741l65152M91194q1316r7570p6333Q836J27621k13044L20603
5289D566187j8221q820j23573K36932m57204Q3766L13340n6593L92032o00957
5279D326889K72586j48554l49134L85623k73933J58984Q7804M32660l10924k13972
5269D368029k70501P38721k47182J24622n9276j34338J09977L73322K18890l06434
$$ plain form
5259 4915830 5270028 5206008 4926522 4912837 5007123 5036078 4965696 5205952 5200586 4836073 4987181
5248 4987181 4903257 5000187 5085749 4885927 4941544 5323752 5418621 5315569 5078080 5610711
5238 5610711 5287856 5107831 5289159 5415890 5365637 5691659 5626563 5852965 5852651 5419833
5228 5419833 5799886 5828785 5502435 5576019 5836347 5858326 5358685 5879539 6352796 6636369
5218 6636369 6697928 6755506 6401312 6631500 7154762 7307309 7113632 7333212 7578913 7497603
5208 7497603 7655693 7969804 8343570 8313624 8422240 8528928 8874100 9189365 9369951 9384807
5198 9384807 9840555 10102300 10367203 10716314 11107208 11249856 11078353 10885120 10844012 10942609
5188 10942609 10905039 11183407 11673363 11855393 11209769 11008555 11242787 11225807 11141730 11003354
$$ packed form
5259D915830L54198o4020k79486j3685R4286K8955p0382K40256n366l64513J51108
5248D987181q3924R6930Q5562j99822N5617L82208R4869j03052k37489N32631
5238E610711l22855j80025J81328J26731n0253L26022o5096K26402l14m32818
5228E419833L80053K8899l26350P3584K60328K1979m99641N20854M73257K83573
5218F636369O1559N7578l54194K30188N23262J52547j93677K19580K45701q1310
5208G497603J58090L14111L73766k9946J08616J06688L45172L15265J80586J4856
5198I384807M55748K61745K64903L49111L90894J42648j71503j93233m1108R8597
5188A0942609l7570K78368M89956J82030o45624k01214K34232j6980q4077j38376
$$ plain form
5178 11003354 10735894 10729330 10935151 11215901 11140522 10773522 10676049 11034334 10846251 10778860
5168 10778860 11116994 10630900 10482104 10333567 9724350 9638287 9593396 9582989 9632316 9228553
5158 9228553 9249088 9293653 8947162 8719972 8952967 8580316 8796975 8577447 8364479 8576932
5148 8576932 8552306 8318169 8354094 8365754 8013246 8071798 8797531 9149917 8572305 8398437
5138 8398437 8425555 9031259 8855798 9178857 8787715 8141046 8667465 8709625 8370781 8464581
5128 8464581 8369087 8600833 8625970 8702185 9027497 8530668 9086905 9339342 9364475 8969209
5118 8969209 9575167 9385818 9358684 9092550 9498438 10009402 9364777 9430302 9480117 9505894
5108 9505894 9437758 9173850 9115418 9393403 9662718 9304840 9026517 9027995 9103581 9118167 9035254
$$ packed form
5178A1003354k67460o564K05821K80750p5379l67000r7473L58285j88083o7391
5168A0778860L38134m86094j48796j48537o09217q6063m4891j0407M9327m03763
5158I228553K0535M4565l46491k27190K32995l72651K16659k19528k12968K12453
5148H576932k4626k34137L5925J1660l52508N8552P25733L52386n77612j73868
5138H398437K7118O05704j75461L23059l91142o46669N26419M2160l38844R3800
5128H464581r5494K31746K5137P6215L25312m96829N56237K52437K5133l95266
5118H969209O05958j89349k7134k66134M05888N10964o44625O5525M9815K5777
5108I505894o8136k63908n8432K77985K69315l57878k78323J478P5586J4586q2913
$$ plain form
5097 9035254 8818009 8843045 9199001 8975742 8820027 9326801 9388088 8813821 8881942 9179786
5087 9179786 9505217 9304860 8991895 9745959 9798700 9544082 9494180 9389713 9282547 9346837
5077 9346837 9559197 9368412 9649401 10063107 10259341 10216251 10614481 10831001 10781885 10708537
5067 10708537 10875059 11164006 10590060 10450452 11194485 11571421 11344464 11042680 10780218
5058 10780218 10710059 11041649 11661797 11041759 11127741 10986060 10797705 11797198 11976468 11925153
5048 11925153 11783598 12218589 12133730 12699432 12927048 13149195 12933585 12622485 12770055 13213788
5038 13213788 13275846 13229769 13209538 13131306 13294819 13381156 13594696 13850746 14248440 14607208
5028 14607208 14924484 15269404 16123805 16720633 17025230 17565441 17795239 18392526 19567229
$$ packed form
5097I035254k17245K5036L55956k23259j55715N06774O1287n74267O8121K97844
5087I179786L25431k00357l12965P54064N2741k54618m9902j04467j07166O4290
5077I346837K12360j90785K80989M13706J96234m3090L98230K16520m9116p3348
5067A0708537J66522K88947n73946j39608P44033L76936k26957l01784k62462
5058A0780218p0159L31590O20148o20038Q5982j41681j88355R99493J79270n1315
5048A1925153j41555M34991q4859N65702K27616K22147k15610l11100J47570M43733
5038A3213788O2058m6077k0231p8232J63513Q6337K13540K56050L97694L58768
5028A4607208L17276L44920Q54401N96828L04597N40211K29798N97287J174703
$$ plain form
5019 19567229 20921614 22220732 23585983 25170404 26370464 26866930 27013295 26767345 25851722
5010 25851722 25177827 24267379 22836527 21931668 20869413 20411855 19796425 19131079 18547836
5001 18547836 18699387 18011459 17468546 17288162 17119245 17415776 17423305 17750564 17120242 16970206
4991 16970206 17334064 17699558 18489564 18680257 18780056 19342749 19908596 20051197 20395270 21025422
4981 21025422 22263414 23003988 23991503 25352329 26632715 27254545 27288895 26778731 25878441
4972 25878441 25182858 24542144 23450829 22506369 22173225 21984338 21845396 21629473 21950205
4963 21950205 21902687 21373412 20855150 21508220 22030707 21608185 21561966 21584167 21642629 22545956
4953 22545956 22617225 22499822 22762442 23189110 23445362 24178563 24337885 24924635 24742570 24731350
$$ packed form
5019A9567229J354385J299118J365251J584421J200060M96466J46365k45950r15623
5010B5851722o73895r10448j430852r04859j062255m57558o15430o65346n83243
5001A8547836J51551o87928n42913j80384j68917K96531P529L27259o30322j50036
4991A6970206L63858L65494P90006J90693R9799N62693N65847J42601L44073O30152
4981B1025422J237992P40574R87515J360826J280386O21830L4350n10164r00290
4972B5878441o95583o40714j091315r44460l33144j88887j38942k15923L20732
4963B1950205m7518n29275n18262O53070N22487m22522m6219K2201N8462R03327
4953B2545956P1269j17403K62620M26668K56252P33201J59322N86750j82065j1220
$$ plain form
4943 24731350 25088474 25124553 25607103 26714154 26618556 26817536 27404118 27804546 28753501 29658832
4933 29658832 30047012 30659058 31841109 32387471 32837015 33270322 33767348 34480893 34800560
4924 34800560 36122164 37087571 38070248 39564826 41140104 42199769 43458583 44717160
4916 44717160 45755176 46524247 47637236 49149411 50493026 51900529 53582779 55161889
4908 55161889 56153455 57217951 57924524 58757018 59236849 59254382 59708085 60519715 61665886
4899 61665886 62422817 63097118 64561888 65372390 66529245 68102266 69639953 70944573 72887976
4890 72887976 74764218 77131984 78949876 81089064 83829536 86832723 89851255 93210570
4882 93210570 96646066 100155757 102654245 105729286 108436166 109959581 109798446 108410456
$$ packed form
4943B4731350L57124L6079M82550J107051r5598J98980N86582M00428R48955R05331
4933B9658832L88180O12046J182051N46362M49544M33307M97026P13545L19667
4924C4800560J321604R65407R82677J494578J575278J059665J258814J258577
4916D4717160J038016P69071J112989J512175J343615J407503J682250J579110
4908E5161889R91566J064496P06573Q32494M79831J7533M53703Q11630J146171
4899F1665886P56931O74301J464770Q10502J156855J573021J537687J304620J943403
4890G2887976J876242K367766J817892K139188K740472L003187L018532L359315
4882I3210570L435496L509691K498488L075041K706880J523415j61135j387990
$$ plain form
4874 108410456 107622322 106791878 107035440 107435680 108590265 110260924 111937468 114875202 119225033
4865 119225033 124450933 130251089 135395230 139033357 139711070 138701151 136209413 133832921
4857 133832921 132540233 132295110 133375728 135472195 138484692 142822166 148565205 156139572
4849 156139572 165676276 176304685 187905143 200181932 214406156 231199473 251063676
4842 251063676 273182756 292593546 299912700 291469348 271300472 248322584 225103391
4835 225103391 204174728 186601300 172051820 160577065 151351664 143740564 137832845
4828 137832845 133292096 129322553 125325446 121596110 119212160 116201949 113629809 111962630
4820 111962630 110201174 108572065 106099381 103433354 100341415 97031111 93673043 90648127
$$ packed form
4874A08410456p88134q30444K43562M00240J154585J670659J676544K937734M349831
4865A19225033N225900N800156N144141L638127O77713j009919k491738k376492
4857A33832921j292688k45123J080618K096467L012497M337474N743039P574367
4849A56139572R536704J0628409J1600458J2276789J4224224J6793317J9864203
4842B51063676K2119080J9410790P319154q443352k0168876k2977888k3219193
4835B25103391k0928663j7573428j4549480j1474755r225401p611100n907719
4828A37832845m540749l969543l997107l729336k383950l010211k572140j667179
4820A11962630j761456j629109k472684k666027l091939l310304l358068l024916
$$ plain form
4812 90648127 87864047 84584570 81877426 79019964 76500845 73862009 70931778 67953204
4804 67953204 65205866 63044964 60229659 58307594 56859271 54870047 52796735 50821580
4796 50821580 49240742 47821781 46094617 45115408 44037463 42492728 41266301 39642068
4788 39642068 38608799 37472385 36672718 35789563 34875115 34500072 33556833 33114459 32708053
4779 32708053 31770372 31196866 30484241 29976067 28968761 28629122 28295586 27678624 27688082 27339385
4769 27339385 26751772 26528554 26185162 26345352 26318878 26300550 26072872 26737365 26523415 26118570
4759 26118570 26131933 25947056 25985783 25491600 25417827 26051212 26084244 26343860 26772985 27380463
4749 27380463 28412451 29137658 29629448 30470653 31593453 31659268 31095144 30102124 28259784
$$ packed form
4812I0648127k784080l279477k707144k857462k519119k638836k930231k978574
4804F7953204k747338k160902k815305j922065j448323j989224k073312j975155
4796E0821580j580838j418961j727164r79209j077945j544735j226427j624233
4788C9642068j033269j136414p99667q83155r14448l75043r43239m42374m06406
4779C2708053r37681n73506p12625n08174j007306l39639l33536o16962R458l48697
4769B7339385n87613k23218l43392J60190k6474j8328k27678O64493k13950m04845
4759B6118570J3363j84877L8727m94183p3773O33385L3032K59616M29125O07478
4749B7380463J031988P25207M91790Q41205J122800O5815n64124r93020j842340
$$ plain form
4740 28259784 26473183 25026745 23614029 22628829 21513363 20224653 19572946 19436907 18935833
4731 18935833 18219869 17481484 16807335 16290585 15632951 14703022 14074181 13356091 12725190
4722 12725190 12389336 11925243 11633675 11282966 10903262 10761879 10722668 10332074 10720853 10681464
4712 10681464 10354852 10189133 9175313 9315904 9283028 8852880 8885192 8861857 8322801 8398678
4702 8398678 8606167 8395345 7404612 7434007 7497702 6876377 7004034 6744951 6575472 6118462
4692 6118462 6341555 6355439 5903476 5447204 5242310 5370844 4979203 5024453 5121273 5110325
4682 5110325 4851220 4716703 4589253 4734954 5260245 5272741 4834130 5109232 4694318 4430978
4672 4430978 4599055 4562016 4884684 4181131 4028413 3939458 3654225 3847963 3953283 3990392
$$ packed form
4740B8259784j786601j446438j412716r85200j115466j288710o51707j36039n01074
4731A8935833p15964p38385o74149n16750o57634r29929o28841p18090o30901
4722A2725190l35854m64093k91568l50709l79704j41383l9211l90594L88779l9389
4712A0681464l26612j65719j013820J40591l2876m30148L2312k3335n39056P5877
4702H398678K07489k10822r90733K9395O3695o21325J27657k59083j69479m57010
4692F118462K23093J3884m51963m56272k04894J28534l91641M5250R6820j0948
4682E110325k59105j34517j27450J45701N25291J2496m38611K75102m14914k63340
4672D430978J68077l7039L22668p03553j52718q8955k85233J93738J05320L7109
$$ plain form
4662 3990392 4030111 4094196 4208056 4380481 4093427 4134062 4178840 4194977 3737582 4037582
4652 4037582 4391893 4243309 4138220 4172023 4183822 3968778 4002845 3956011 4033235 3892595
4642 3892595 3876971 3773957 3577168 3629599 4046328 4317010 3510646 3369363 3282943 3237394
4632 3237394 3142411 3189767 3386416 3472295 3262125 3377481 3469844 2746120 2974746 3315415
4622 3315415 3054503 2834530 2598923 3039963 3239237 2932140 3163141 3584917 3347260 3131114
4612 3131114 3233769 2682643 2530058 2843401 3202839 3210993 3460983 3416445 3500898 3400310
4602 3400310 3541872 3500291 3619500 3399804 3399028 3195625 3331832 3399752 3187642 3562385
4592 3562385 3584132 3568921 3757166 3532204 3359082 3431350 3031363 3117967 3855178 3772794
$$ packed form
4662C990392L9719O4085J13860J72425k87054M0635M4778J6137m57395L00000
4652D037582L54311j48584j05089L3803J1799k15044L4067m6834P7224j40640
4642C892595j5624j03014j96789N2431M16729K70682q06364j41283q6420m5549
4632C237394r4983M7356J96649Q5879k10170J15356R2363p23724K28626L40669
4622C315415k60912k19973k35607M41040J99274l07097K31001M21776k37657k16146
4612C131114J02655n51126j52585L13343L59438Q154K49990m4538Q4453j00588
4602C400310J41562m1581J19209k19696p76k03403J36207O7920k12110L74743
4592C562385K1747j5211J88245k24962j73122P2268l99987Q6604P37211q2384
$$ plain form
4582 3772794 3367712 3464374 3767551 3560217 3006928 3040245 3325038 3195946 3281877 3498855
4572 3498855 3604935 3633744 3718350 3497672 3414854 3590076 3774612 4027797 4425070 4725097
4562 4725097 4975969 4496716 4655849 4531494 3612242 3883010 3848262 3872085 3504382 3580249
4552 3580249 3812802 4025148 3833046 3147647 3464528 3323732 3298459 3161496 3891191 3920227
4542 3920227 3523500 3030779 2851343 3063643 2891324 3094412 2975767 3365295 3475267 3111524
4532 3111524 2506632 2866886 2781326 3044704 2978101 2906659 3080791 3510141 2868756 3252789
4522 3252789 3470267 3412220 3348216 3312316 3456290 3302018 3492582 3122910 2898814 3204671
4512 3204671 3506977 3567982 3622814 3532756 3373523 3561081 3568264 3631767 3535353 3724675 3853727
$$ packed form
4582C772794m05082R6662L03177k07334n53289L3317K84793j29092Q5931K16978
4572C498855J06080K8809Q4606k20678q2818J75222J84536K53185L97273L00027
4562D725097K50872m79253J59133j24355r19252K70768l4748K3823l67703P5867
4552C580249K32553K12346j92102o85399L16881j40796k5273j36963P29695K9036
4542C920227l96727m92721j79436K12300j72319K03088j18645L89528J09972l63743
4532C111524o04892L60254q5560K63378o6603p1442J74132M29350o41385L84033
4522C252789K17478n8047o4004l5900J43974j54272J90564l69672k24096L05857
4512C204671L02306O1005N4832r0058j59233J87558P183O3503r6414J89322J29052
$$ plain form
4501 3853727 3439805 3691192 3784794 3926863 3981109 3605212 3934719 4131895 4535431 4177761
4491 4177761 4090364 3390853 3059406 3516153 3189328 3201713 3000113 2960017 2883198 2470206
4481 2470206 2140848 3206172 3327421 2542839 2362007 2503653 2918865 2656531 2396457
4472 2396457 2375393 2251435 2209838 1748025 2018253 1683818 1428964 1764537 2120257 2032019
4462 2032019 2089347 2053709 1866953 1787426 1566063 1445913 1869190 1456291 1373715 1718588
4452 1718588 1522519 1511779 1643879 1562375 2240342 2219908 1806474 1770706 1918924 1609619
4442 1609619 1430991 1419798 1323563 1640013 1238024 927741 1210175 951548 1185119 1601132
4432 1601132 1239659 1338780 1476394 1552064 1686931 1673741 1424441 1994477 1975314 1235014
$$ packed form
4501C853727m13922K51387R3602J42069N4246l75897L29507J97176M03536l57670
4491D177761q7397o99511l31447M56747l26825J2385k01600m0096p6819m12992
4481B470206l29358J065324J21249p84582j80832J41646M15212k62334k60074
4472B396457k1064j23958m1597m61813K70228l34435k54854L35573L55720q8238
4462B032019N7328l5638j86756p9527k21363j20150M23277m12899q2576L44873
4452A718588j96069j0740J32100q1504O77967k0434m13434l5768J48218l09305
4442A609619j78628j1193r6235L16450m01989l10283K82434k58627K33571M16013
4432A601132l61473R9121J37614P5670J34867j3190k49300N70036j9163p40300
$$ plain form
4422 1235014 1482094 1287322 1418532 1348724 1455648 1555330 1262510 1124768 1293798 1638166
4412 1638166 1490083 1765520 1674735 1489168 1830115 1547477 1986040 1913508 1964291 1761144
4402 1761144 1270672 2068779 1620137 1707281 2257041 2017663 2053564 1986127 2062060 2345325
4392 2345325 2129162 2081479 2323449 2719887 2372576 2236336 2524157 2049780 1971572 1835573
4382 1835573 1713625 1759312 2205656 2366432 2201890 2359908 2111974 1906677 2101732 2554686
4372 2554686 2530477 2722210 2397498 2432436 2442492 2274592 2103554 2169839 2603764 2649418
4362 2649418 2534648 2807368 3019698 3099217 3191925 3029993 2584259 2633561 2512844 3137412
4352 3137412 2883245 2917643 3278261 3495061 3840157 3892602 3711376 3955188 3781624 3791051
$$ packed form
4422A235014K47080j94772J31210o9808J06924R9682k92820j37742J69030L44368
4412A638166j48083K75437r0785j85567L40947k82638M38563p2532N0783k03147
4402A761144m90472P98107m48642Q7144N49760k39378L5901o7437P5933K83265
4392B345325k16163m7683K41970L96438l47311j36240K87821m74377p8208j35999
4382A835573j21948M5687M46344J60776j64542J58018k47934k05297J95055M52954
4372B554686k4209J91733l24712L4938J0056j67900j71038O6285M33925M5654
4362B649418j14770K72720K12330P9519R2708j61932m45734M9302j20717O24568
4352C137412k54167L4398L60618K16800L45096N2445j81226K43812j73564R427
$$ plain form
4342 3791051 4282413 4367208 4778188 5182371 5117181 5689163 5800726 5582301 5556094 5318802
4332 5318802 5267135 4858853 5314602 5877683 6488582 6588525 6567921 6893866 7039370 7051813
4322 7051813 7162482 7501393 7522637 7568874 8028104 8051079 7960262 8297798 8699959 9142014
4312 9142014 9222764 9398969 10033894 10289858 11071728 11664980 12182334 12978536 13349271 14019479
4302 14019479 14650475 15360754 16349841 17283105 17929928 19270667 21055315 22533514 24641725
4293 24641725 27434637 29896934 32936532 37024607 42290873 49744274 58571153 69188839
4285 69188839 83027102 101904058 122424911 136012144 131251015 113325644 95961553
4278 95961553 80811680 66967851 56778155 48554156 42327702 37331850 33053876 29583422
$$ packed form
4342C791051M91362Q4795M10980M04183o5190N71982J11563k18425k6207k37292
4332E318802n1667m08282M55749N63081O10899R9943k0604L25945J45504J2443
4322G051813J10669L38911K1244M6237M59230K2975r0817L37536M02161M42055
4312I142014Q0750J76205O34925K55964P81870N93252N17354P96202L70735O70208
4302A4019479O30996P10279R89087R33264O46823J340739J784648J478199K108211
4293B4641725K792912K462297L039598M088075N266266P453401Q826879J0617686
4285F9188839J3838263J8876956K0520853J3587233m761129j7925371j7364091
4278I5961553j5149873j3843829j0189696q223999o226454m995852m277974l470454
$$ plain form
4270 29583422 27066657 24051345 21832942 20151199 18453502 17473846 15908347 14872961
4262 14872961 14018584 12867114 11725595 10917590 10231696 9341860 8945444 8793935 8758865
4253 8758865 8361493 7457861 7153237 6978962 6882376 6646249 6374843 6030244 5599959 5389135
4243 5389135 5600788 5198283 4908096 4529391 4691259 4652160 4341878 4024073 3656495 4096577
4233 4096577 3818537 3348949 2906723 2870393 3342887 2968050 3127107 3012987 2628200 2560556
4223 2560556 2708041 2539425 2498957 2667323 2474187 2510553 2628736 2728533 2647683 2647185 2543237
4212 2543237 2279362 2187099 2223977 2104728 1624785 1900848 2193984 1864557 1833625 1867157
4202 1867157 1508723 1386123 1976189 1984919 1541197 1154982 1092136 1452751 1333032 1612274
$$ packed form
4270B9583422k516765l015312k218403j681743j697697r79656j565499j035386
4262A4872961q54377j151470j141519q08005o85894q89836l96416j51509l5070
4253H758865l97372r03632l04624j74275r6586k36127k71406l44599m30285k10824
4243E389135K11653m02505k90187l78705J61868l9099l10282l17805l67578M40082
4233D096577k78040m69588m42226l6330M72494l74837J59057j14120l84787o7644
4223B560556J47485j68616m0468J68366j93136L6366J18183R9797q0850m98j03948
4212B543237k63875r2263L6878j19249m79943K76063K93136l29427l0932L3532
4202A867157l58434j22600N90066Q730m43722l86215o2846L60615j19719K79242
$$ plain form
4192 1612274 1789621 1358782 1473289 1653054 1589728 1676877 1367111 1756000 1516476 1094423
4182 1094423 775529 859304 1676344 1016443 875908 682536 736923 1044117 1120243 905846
4172 905846 850256 607675 511358 523940 913975 721405 774823 904624 920064 1089789 973736
4161 973736 1163469 1295816 1038791 1000412 346972 373868 931484 1224496 1275248 789749
4151 789749 945641 1016387 864842 709843 782828 602933 283706 526730 554036 517455
4141 517455 709484 877558 920990 611432 708247 440881 1336119 728565 338503 824455
4131 824455 807199 865312 1109849 1198389 1107282 935941 955265 603220 901027 763642 455054
4120 455054 439042 314872 488686 351105 540117 1123602 804951 682205 1062898 545640
$$ packed form
4192A612274J77347m30839J14507J79765o3326Q7149l09766L88889k39524m22053
4182A094423l18894Q3775Q17040o59901j40535j93372N4387L07194P6126k14397
4172I05846n5590k42581r6317J2582L90035j92570N3418J29801J5440J69725j16053
4161I73736J89733J32347k57025l8379o53440K6896N57616K93012N0752m85499
4151G89749J55892P0746j51545j54999P2985j79895l19227K43024K7306l6581
4141E17455J92029J68074M3432l09558R6815k67366Q95238o07554l90062M85952
4131H24455j7256N8113K44537Q8540r1107j71341J9324l52045K97807j37385l08588
4120D55054j6012j24170J73814j37581J89012N83485l18651j22746L80693n17258
$$ plain form
4110 545640 476765 371048 10741 25866 351454 417792 577353 1200113 836697 730125
4100 730125 830362 990507 994289 837828 754286 930995 417318 366241 628182 374826
4090 374826 776807 234714 465216 831181 727587 792743 511700 270508 89372 761869
4080 761869 1329397 782162 682810 666090 394516 473730 593996 550098 468633 663251 492276
4069 492276 247180 387051 746427 722664 637884 569479 677671 1093345 1194654 897181
4059 897181 333490 415271 255446 178614 207578 429447 764503 631553 1070733 1068522 862934
4048 862934 1431137 1016210 1000407 486713 -12199 262545 930205 354054 279690 417229
4038 417229 561470 689870 1089457 1044989 552542 520281 400609 395208 951042 798571
$$ packed form
4110E45640o8875j05717l60307J5125L25588O6338J59561O22760l63416j06572
4100G30125J00237J60145L782j56461q3542J76709n13677n1077K61941k53356
4090C74826M01981n42093K30502L65965j03594O5156k81043k41192j81136O72497
4080G61869N67528n47235r9352j6720k71574P9214J20266m3898q1465J94618j70975
4069D92276k45096J39871L59376k3763q4780o8405J08192M15674J01309k97473
4059H97181n63691Q1781j59825p6832K8964K21869L35056j32950M39180k211k05588
4048H62934N68203m14927j5803n13694m98912K74744O67660n76151p4364J37539
4038D17229J44241J28400L99587m4468m92447l2261j19672n401N55834j52471
$$ plain form
4028 798571 942793 668758 394667 530275 1121784 1426254 1026752 1220972 1469916 1296403
4018 1296403 1245303 974611 920321 880024 586980 458372 483619 937789 1331386 971412
4008 971412 843222 886228 590745 686026 698311 734741 795149 760588 206971 523966 320217
3997 320217 170592 634607 843311 561280 468698 930346 780695 609441 625341 536121
3987 536121 422000 344374 1064121 782914 713519 708659 802396 390758 412000 469799 437039
3976 437039 371177 665300 733416 702126 923433 727842 435446 889395 809540 333016
3966 333016 72227 326158 448843 669175 186531 423464 798622 489187 791458 685071
3956 685071 600017 666098 1098324 908552 554020 976778 1006980 570213 523637 455495 1086861
$$ packed form
4028G98571J44222k74035k74091J35608N91509L04470l99502J94220K48944j73513
4018A296403n1100k70692n4290m0297k93044j28608K5247M54170L93597l59974
4008I71412j28190M3006k95483R5281J2285L6430O0408l4561n53617L16995k03749
3997C20217j49625M64015K08704k82031r2582M61648j49651j71254J5900q9220
3987E36121j14121p7626P19747k81207o9395m860R3737m11638K1242N7799l2760
3976D37039o5862K94123O8116l1290K21307j95591k92396M53949p9855m76524
3966C33016k60789K53931J22685K20332m82644K36933L75158l09435L02271j06387
3956F85071q5054O6081M32226j89772l54532M22758L0202m36767m6576o8142O31366
$$ plain form
3945 1086861 1027293 864376 528305 479122 534886 582699 607093 781640 501836 980855
3935 980855 1101154 821693 613346 244196 256256 422370 584101 522468 483575 405735
3925 405735 644400 699711 400437 689307 723924 532735 673218 512082 723450 418505
3915 418505 -65556 174383 291168 664036 1070796 659883 812858 728544 548096 765346
3905 765346 932085 381631 230789 373897 85396 -28316 171156 741985 850983 732654
3895 732654 648728 645727 424522 597758 988050 1064448 905245 917528 1078259 681150 470831
3884 470831 105732 316210 414297 692112 412904 677113 710779 748987 628519 923955
3874 923955 1240001 824348 683294 636847 650282 334838 487029 654490 832934 340941
$$ packed form
3945A086861n9568j62917l36071m9183N5764M7813K4394J74547k79804M79019
3935I80855J20299k79461k08347l69150J2060J66114J61731o1633l8893p7840
3925D05735K38665N5311k99274K88870L4617j91189J40483j61136K11368l04945
3915D18505m84061K39939J16785L72868M06760m10913J52975q4314j80448K17250
3905G65346J66739n50454j50842J43108k88501j13712J99472N70829J08998j18329
3895G32654q3926l001k21205J73236L90292P6398j59203J2283J60731l97109k10319
3884D70831l65099K10478R8087K77815k79208K64209L3666L8208j20468K95436
3874I23955L16046m15653j41054m6447J3435l15444J52191J67461J78444m91993
$$ plain form
3864 340941 64032 443200 785062 576160 622377 583197 833558 691355 579727 401068
3854 401068 576408 881733 313757 235722 886557 1070540 871546 1128703 1008293 1412980
3844 1412980 1379126 821156 554748 506967 642991 734259 798305 885736 581579 544646 707456
3833 707456 552552 498047 677021 712531 846904 645645 264141 353585 404272 353684 510284
3822 510284 614578 691657 1416756 1000916 734933 371492 310234 663027 494258 714430
3812 714430 919938 719898 1222938 651580 685444 643629 647649 795759 396947 621153
3802 621153 834821 973990 704881 530236 716530 454483 589215 446211 424399 275175
3792 275175 675362 659171 686184 768995 579338 965330 893523 660827 518842 948430
$$ packed form
3864C40941k76909L79168L41862k08902M6217l9180K50361j42203j11628j78659
3854D01068J75340L05325n67976p8035O50835J83983j98994K57157j20410M04687
3844A412980l3854n57970k66408m7781J36024R1268O4046Q7431l04157l6933J62810
3833G07456j54904n4505J78974L5510J34373k01259l81504Q9444N0687n0588J56600
3822E10284J04294P7079P25099m15840k65983l63441o1258L52793j68769K20172
3812G14430K05508k00040N03040n71358L3864m1815M020J48110l98812K24206
3802F21153K13668J39169k69109j74645J86294k62047J34732j43004k1812j49224
3792B75175M00187j6191K7013Q2811j89657L85992p1807k32696j41985M29588
$$ plain form
3782 948430 802979 866986 983191 746828 608216 305281 490434 481402 491016 499430 702742
3771 702742 933134 915166 723692 609962 530567 442053 791569 925718 711673 899721
3761 899721 868370 361728 225252 593243 1010229 750807 781235 984131 913357 549406
3751 549406 636339 766329 1048037 1024419 856025 763339 718328 424744 -20870 82730
3741 82730 342373 394647 672491 381678 25611 296833 503516 388874 834282 730239
3731 730239 892623 327820 627312 954371 610035 503294 558636 710195 562126 816367
3721 816367 750981 919262 827593 637836 854092 729046 647952 576926 684813 482621
3711 482621 192868 426049 369636 120858 210235 112648 586949 275417 -312426 0
$$ packed form
3782I48430j45451O4007J16205k36363j38612l02935J85153r032R614Q414K03312
3771G02742K30392j7968j91474j13730p9395q8514L49516J34149k14045J88048
3761H99721l1351n06642j36476L67991M16986k59422L0428K02896p0774l63951
3751E49406Q6933J29990K81708k3618j68394r2686m5011k93584m45614J03600
3741H2730K59643N2274K77844k90813l56067K71222K06683j14642M45408j04043
3731G30239J62384n64803K99492L27059l44336j06741N5342J51559j48069K54241
3721H16367o5386J68281r1669j89757K16256j25046q1094p1026J07887k02192
3711D82621k89753K33181n6413k48778Q9377r7587M74301l11532n87843L12426
$$ plain form
3701 0 386710 430442 264330 720194 1071839 737260 745338 1238794 1393387 1483248 1216179
3690 1216179 1110715 695386 569897 398420 448225 653689 682243 1381097 1533783 1498624
3680 1498624 1367580 1329125 937107 704354 555558 899113 1328599 1341366 1290668 1158939
3670 1158939 881750 1341512 1629515 1776482 1593058 1370516 1634377 1680461 1784046 2008692
3660 2008692 1619929 1549689 1785478 1604274 1206264 1413933 1533104 1407185 1847484 2288482
3650 2288482 2548488 2740662 3190841 3436719 3934151 4193365 4167301 3873951 3896000 3474222
3640 3474222 3326693 2755281 3169849 3636466 3836934 3707403 3421838 3176704 3753979 3368472
3630 3368472 2979718 3187821 3207079 3562776 3003151 3326790 3876838 4110980 4773445 5252620
$$ packed form
3701@L86710M3732j66112M55864L51645l34579Q078M93456J54593Q9861k67069
3690A216179j05464m15329j25489j71477M9805K05464K8554O98854J52686l5159
3680A498624j31044l8455l92018k32753j48796L43555M29486J2767n0698j31729
3670A158939k77189M59762K88003J46967j83424k22542K63861M6084J03585K24646
3660B008692l88763p0240K35789j81204l98010K07669J19171j25919M40299M40998
3650B288482K60006J92174M50179K45878M97432K59214k6064k93350K2049m21778
3640C474222j47529n71412M14568M66617K00468j29531k85565k45134N77275l85507
3630C368472l88754K08103J9258L55697n59625L23639N50048K34142O62465M79175
$$ plain form
3620 5252620 5429337 5832456 6387443 6601848 6790572 6415436 6232966 5277476 5097702 5472354
3610 5472354 4799531 4559396 4058977 4102797 3877526 3615174 4049018 3745927 3916135 3718658
3600 3718658 3585554 3614807 3300112 3559250 3555425 3582569 3974302 4084200 4688233 4677212
3590 4677212 4545773 4392263 4593827 5132548 5203545 4898499 4457781 4461200 4569198 4201920
3580 4201920 4022292 3331783 3231847 3198033 3467884 3426323 3010471 3366624 3477952 3727279
3570 3727279 3905839 3889284 3866299 3723429 3774180 3880898 3756780 3702691 4012068 4195253
3560 4195253 4116935 4538724 4746319 4591759 4750675 5137530 5053399 5210147 5328286 5245002
3550 5245002 5186933 6060554 6279208 6422896 7208299 7337206 7319156 7843137 7947019 8105969
$$ packed form
3620E252620J76717M03119N54987K14405J88724l75136j82470r55490j79774L74652
3610E472354o72823k40135n00419M3820k25271k62352M33844l03091J70208j97477
3600C718658j33104K9253l14695K59138l825K7144L91733J09898O04033j1021
3590D677212j31439j53510K01564N38721P0997l05046m40718L419J07998l67278
3580D201920j79628o90509r9936l3814K69851m1561m15852L56153J11328K49327
3570C727279J78560j6555k2985j42870N0751J06718j24118n4089L09377J83185
3560D195253p8318M21789K07595j54560J58916L86855q4131J56748J18139q3284
3550E245002n8069Q73621K18654J43688P85403J28907j8050N23981J03882J58950
$$ plain form
3540 8105969 8425082 8527336 8308929 8623050 9023894 9580710 9753493 10008879 10294169 9770786
3530 9770786 8943811 8736135 8597853 8570839 7857918 7194950 6775573 7577264 7316849 7412022
3520 7412022 7695784 7590701 7391494 7774191 7553156 7490233 7354850 7236524 7025190 6773346
3510 6773346 6662451 6297554 6542217 6485064 5895045 5287854 5352965 4808574 4688981 4547937
3500 4547937 4925679 4657592 4589086 4594117 4572123 4430987 4477209 4469292 4144425 4246232 4767640
3489 4767640 5009248 4138739 4509292 4702570 4362979 4371727 4265539 4155740 3772764 3911609
3479 3911609 3712868 3669558 3414141 3342699 2755492 2476137 2428012 2781159 2824141 2305515
3469 2305515 2454686 2306367 2142225 2276568 2382060 2055419 1865340 2315172 2180790 1815444
$$ packed form
3540H105969L19113J02254k18407L14121M00844N56816J72783K55386K85290n23383
3530I770786q26975k07676j38282k7014p12921o62968m19377Q01691k60415R5173
3520G412022K83762j05083j99207L82697k21035o2923j35383j18326k11334k51844
3510F773346j10895l64897K44663n7153n90019o07191O5111n44391j19593j41044
3500D547937L77742k68087o8506N031k1994j41136M6222p917l24867J01807N21408
3489D767640K41608q70509L70553J93278l39591Q748j06188j09799l82976J38845
3479C911609j98741m3310k55417p1442n87207k79355m8125L53147M2982n18626
3469B305515J49171j48319j64142J34343J05492l26641j90079M49832j34382l65346
$$ plain form
3459 1815444 2172347 2391051 1953265 1780865 1902323 2330380 1703878 1791982 1864069 1622028
3449 1622028 1390885 1847424 2096444 1601402 1271615 966031 1227162 1241672 1598454 1298913
3439 1298913 959424 1073728 1439990 981413 912690 740286 824973 963231 1001981 1415848
3429 1415848 1542234 1119358 772215 221730 234072 704713 861730 861214 503803 449455
3419 449455 409815 867757 738220 215860 610522 675709 386193 699510 628653 379159
3409 379159 86472 496146 807610 916543 923855 870878 466337 433239 421491 399895 343569
3398 343569 33258 -157504 -188391 142164 430854 585480 412990 740889 448691 410044
3388 410044 63308 -136642 297157 327191 127019 -22084 -76423 -327778 -318622 -537352
$$ packed form
3459A815444L56903K18704m37786j72400J21458M28057o26502Q8104P2087k42041
3449A622028k31143M56539K49020m95042l29787l05584K61131J4510L56782k99541
3439A298913l39489J14304L66262m58577o8723j72404Q4687J38258L8750M13867
3429A415848J26386m22876l47143n50485J2342M70641J57017n16l57411n4348
3419D49455l9640M57942j29537n22360L94662O5187k89516L13317p0857k49494
3409C79159k92687M09674L11464J08933P312n2977m04541l3098j1748k1596n6326
3398C43569l10311j90762l0887L30555K88690J54626j72490L27899k92198l8647
3388D10044l46736j99950M33799L0034k00172j49103n4339k51355R156k18730
$$ plain form
3378 -537352 1529 623766 653452 411535 529718 477748 68611 -28575 57560 275479
3368 275479 354343 -15983 367197 597045 882512 797936 637662 382471 344422 461793
3358 461793 305764 161927 458259 328347 233222 202163 374758 851691 503166 372779
3348 372779 560731 420943 375103 484508 358586 159802 41784 342867 -281747 -116638
3338 -116638 412745 294486 -226666 -207695 225812 269506 299954 128901 136939 175659 -110456
3327 -110456 -11493 376581 414283 577582 430907 173321 330648 780704 1162875 548647
3317 548647 528724 1146780 901266 318119 399625 478867 306794 100858 890690 925134
3307 925134 638900 888392 602374 162417 70170 44711 533168 462925 224810 -63447
$$ packed form
3378e37352N38881O22237K9686k41917J18183n1970m09137r7186Q6135K17919
3368B75479P8864l70326L83180K29848K85467q4576j60274k55191l8049J17371
3358D61793j56029j43837K96332j29912r5125l1059J72595M76933l48525j30387
3348C72779J87952j39788m5840J09405j25922j98784j18018L01083o24614J65109
3338a16638N29383j18259n21152J8971M33507M3694L0448j71053Q038L8720k86115
3327a10456R8963L88074L7702J63299j46675k57586J57327M50056L82171o14228
3317E48647j9923O18056k45514n83147Q1506P9242j72073k05936P89832L4444
3307I25134k86234K49492k86018m39957r2247k5459M88457p0243k38115k88257
$$ plain form
3297 -63447 609862 84226 25372 183476 354356 501719 368907 514652 1016755 832931
3287 832931 698551 692406 777088 490443 388777 975269 527117 1018081 980097 931450 466897
3276 466897 733255 392866 229291 394906 631132 675103 597620 720275 441253 331900
3266 331900 437323 721611 493781 337166 347125 333813 664486 509154 757304 1166632
3256 1166632 1304409 1061948 1023468 731900 869611 1415332 1381317 945017 517187 784385
3246 784385 803578 471195 312489 298798 345102 747176 945107 523094 442026 518238 554381
3235 554381 420934 614358 478188 250717 658227 549073 638349 1319424 1047936 301224
3225 301224 209696 322829 341796 330653 456227 378660 465139 417172 660429 663619 437904
$$ packed form
3297f3447O73309n25636n8854J58104J70880J47363j32812J45745N02103j83824
3287H32931j34380o145Q4682k86645j01666N86492m48152M90964l7984m8647m64553
3276D66897K66358l40389j63575J65615K36226M3971p7483J22655k79022j09353
3266C31900J05423K84288k27830j56615R959j3312L30673j55332K48150M09328
3256A166632J37777k42461l8480k91568J37711N45721l4015m36300m27830K67198
3246G84385J9193l32383j58706j3691M6304M02074J97931m22013q1068P6212L6143
3235E54381j33447J93424j36170k27471M07510j09154Q9276O81075k71488p46712
3225C01224r1528J13133J8967j1143J25574p7567Q6479m7967K43257L190k25715
$$ plain form
3214 437904 981821 1133254 1137070 794086 138332 74833 540409 493749 279470 159399
3204 159399 336218 435501 455393 813543 676382 191843 22913 13196 129953 360534
3194 360534 427940 456652 545886 699664 637794 314056 -162428 221999 54787 -90759
3184 -90759 -11440 277520 170330 -50407 83895 175758 238104 -225622 352135 508771
3174 508771 195584 267833 277366 -70985 19789 359315 173365 -214774 -236186 -15356 -110726
3163 -110726 -463612 -305189 -194613 -662567 -422252 -196333 -75968 -194282 -318632 -219971
3153 -219971 -441191 -965926 -1030049 -481687 -501299 -709710 -950398 -801120 -753890 -649642
3143 -649642 -508493 -226667 -361825 -653935 -329461 -513894 -200417 -97485 -717018 -506010
$$ packed form
3214D37904N43917J51433L816l42984o55754o3499M65576m6660k14279j20071
3204A59399J76819R9283J9892L58150j37161m84539j68930r717J16757K30581
3194C60534O7406K8712Q9234J53778o1870l23738m76484L84427j67212j45546
3184i0759P9319K88960j07190k20737J34302R1863O2346m63726N77757J56636
3174E08771l13187P2249R533l48351R0774L39526j85950l88139k1412K20830r5370
3163a10726l52886J58423J10576m67954K40315K25919J20365j18314j24350R8661
3153b19971k21220n24735o4123N48362j9612k08411k40688J49278M7230J04248
3143f49642J41149K81826j35158k92110L24474j84433L13477J02932o19533K11008
$$ plain form
3133 -506010 -763479 -664107 -777900 -856644 -225327 -269873 -855084 -954399 -815606 -1358735
3123 -1358735 -1337547 -1097427 -954382 -1042569 -399563 -326952 -835383 -941474 -483615 -537724
3113 -537724 -659983 -704959 -279685 -271731 -712797 -482426 -716197 -707206 -616194 -461916 -469897
3102 -469897 -591617 -368458 -288633 -369483 -109386 -514739 -1005994 -727899 -126504 -314607
3092 -314607 -570091 -830365 -1117106 -739297 -417757 -405168 -627844 -420793 -286207 -436130
3082 -436130 -657203 -1073250 -378930 -482617 -630151 -452601 -413256 -363721 -656138 -580579
3072 -580579 -518912 -683245 -708191 -975608 -685628 -380068 -362750 -354685 -806516 -845181 -670601
3061 -670601 -368480 -680735 -746074 -398351 -452132 -782699 -801358 -1075017 -600496 -405523
$$ packed form
3133e06010k57469R9372j13793p8744O31317m4546n85211r9315J38793n43129
3123a358735K1188K40120J43045q8187O43006P2611n08431j06091M57859n4109
3113e37724j22259m4976M25274P954m41066K30371k33771Q991R1012J54278p981
3102d69897j21720K23159P9825q0850K60097m05353m91255K78095O01395j88103
3092c14607k55484k60274k86741L77809L21540J2589k22676K07051J34586j49923
3082d36130k21073m16047O94320j03687j47534J77550L9345M9535k92417P5559
3072e80579O1667j64333k4946k67417K89980L05560J7318Q065m51831l8665J74580
3061f70601L02121l12255o5339L47723n3781l30567j8659k73659M74521J94973
$$ plain form
3051 -405523 -127458 -400293 -876117 -481972 -340002 -561857 -752298 -737336 -452241 133395
3041 133395 -5522 -418647 -745003 -330573 -314723 -502295 -763889 -813069 -655317 -953280
3031 -953280 -787040 -1077635 -1102783 -1172998 -771450 -243952 -540676 -719583 -1037166 -977272
3021 -977272 -537903 -479807 -293767 -414275 -806977 -758529 108206 82242 -147619 -18164
3011 -18164 -417528 -790283 -1374535 -1350583 -292550 -256428 -663043 -762901 -623828 -725203
3001 -725203 -495271 -276298 -583905 -737114 -584108 -490832 -318291 -288629 -489406 -514179
2991 -514179 -995328 -1119999 -624678 -274296 -516717 -178490 -133855 -781177 -678196 -986003
2981 -986003 -873669 -401383 -773216 -655477 -384001 -754017 -953902 -473356 -211234 -153184
$$ packed form
3051d05523K78065k72835m75824L94145J41970k21855j90441J4962K85095N85636
3041A33395j38917m13125l26356M14430J5850j87572k61594m9180J57752k97963
3031i53280J66240k90595k5148p0215M01548N27498k96724j78907l17583N9894
3021i77272M39369N8096J86040j20508l92702M8448Q66735k5964k29861J29455
3011a8164l99364l72755n84252K3952J058033L6122m06615r9858J39073j01375
3001g25203K29932K18973l07607j53209J53006R3276J72541K9662k00777k4773
2991e14179m81149j24671M95321L50382k42421L38227M4635o47322J02981l07807
2981i86003J12334M72286l71833J17739K71476l70016j99885M80546K62122N8050
$$ plain form
2971 -153184 -466656 -340876 -388311 -795470 -732661 -29306 -304538 -356732 -361801 -156466 -101474
2960 -101474 -520321 -285914 -220984 -511775 -800497 -617192 -282364 -61625 -485485 -662782
2950 -662782 -354647 -383896 -393790 72274 142968 -50853 -249485 -252701 -273870 -341766 -202950
2939 -202950 -425671 -189285 -282888 -823426 -647869 -260044 -631811 -429328 -597188 -344077
2929 -344077 -267031 -128730 250964 33132 -418362 -407328 -282936 -403693 -685792 -905501
2919 -905501 -955557 -742091 -771910 -557187 -174388 -256589 88693 -548010 -864654 -518750
2909 -518750 -349541 -349674 -742263 -1283568 -1473395 -653042 -710002 -1076743 -1031141 -873642 -677433
2898 -677433 -596828 -956455 -644911 -23310 -404204 -466290 -436947 -233977 -91100 -662751
$$ packed form
2971a53184l13472J25780m7435m07159O2809P03355k75232n2194n069K05335N4992
2960a01474m18847K34407O4930k90791k88722J83305L34828K20739m23860j77297
2950f62782L08135k9249r894M66064P0694j93821j98632l216k1169o7896J38816
2939b02950k22721K36386r3603n40538J75557L87825l71767K02483j67860K53111
2929c44077P7046J38301L79694k17832m51494J1034J24392j20757k82099k19709
2919i05501n0056K13466k9819K14723L82799q2201L45282o36703l16644L45904
2909e18750J69209j33l92589n41305j89827Q20353n6960l66741M5602J57499J96209
2898f77433Q0605l59627L11544O21601l80894o2086K9343K02970J42877n71651
$$ plain form
2888 -662751 -863997 -792684 -709399 -763576 -1099215 -849367 -878282 -788224 -821673 -287719 -603056
2877 -603056 -721698 -420763 -812825 -544163 -71171 -788639 -1103137 -804307 -953290 -1316400
2867 -1316400 -997020 -797428 -778574 -790905 -848734 -518331 -490259 -645623 -599970 -16853
2857 -16853 -23643 -704893 -809705 -988575 -657930 -534011 -861297 -1070658 -801727 -902674
2847 -902674 -1010755 -605499 -458254 94388 80500 -102978 -46318 -408293 -413746 79680
2837 79680 -88089 -79800 -241563 -643191 -178743 -425456 -767231 -615135 -563137 -567129 -762010
2826 -762010 -918396 -1421312 -1518946 -1384997 -1427714 -984830 -822376 -1238722 -881458 -1103258
2816 -1103258 -916471 -800670 -1115138 -651775 -644728 -522719 -371497 -599383 -43777 -219395
$$ packed form
2888f62751k01246P1313Q3285n4177l35639K49848k8915R0058l3449N33954l15337
2877f03056j18642L00935l92062K68662M72992p17468l14498K98830j48983l63110
2867a316400L19380J99592J8854j2331n7829L30403K8072j55364M5653N83117
2857a6853o790o81250j04812j78870L30645J23919l27286k09361K68931j00947
2847i02674j08081M05256J47245N52642j3888j83478N6660l61975n453M93426
2837G9680j67769Q289j61763m01628M64448k46713l41775J52096N1998l992j94881
2826g62010j56386n02916r7634J33949m2717M42884J62454m16346L57264k21800
2816a103258J86787J15801l14468M63363P047J22009J51222k27886N55606j75618
$$ plain form
2806 -219395 -878212 -733510 -600081 -476951 -773289 -415326 -738959 -852124 -504518 -545846
2796 -545846 -580116 -977080 -1063435 -912233 -624646 -509418 -506552 -415780 -459529 -570857 -697701
2785 -697701 -723004 -826966 -1062792 -1223102 -1249316 -1216944 -714728 -637039 -494529 -109278
2775 -109278 -419673 -675571 -547886 -656024 -170370 -52713 -139062 -575445 -333680 -709818
2765 -709818 -1087769 -1136058 -1032714 -971645 -816340 -560950 -382405 -369977 -463502 -396287 -422021
2754 -422021 -466857 -755223 -372362 -207622 21025 27886 -185158 402087 478050 351434
2744 351434 377321 -74005 -178554 -121985 159057 -303750 -553943 -5003 1870 -344513
2734 -344513 -433365 -367161 12555 -229524 -183963 -753964 -755903 -710147 -644792 -141223 -111897
$$ packed form
2806b19395o58817J44702J33429J23130k96338L57963l23633j13165L47606m1328
2796e45846l4270l96964q6355J51202K87587J15228K866R0772m3749j11328j26844
2785f97701k5303j03962k35826j60310k6214L2372N02216P7689J42510L85251
2775a09278l10395k55898J27685j08138M85654J17657q6349m36383K41765l76138
2765g09818l77951m8289J03344O1069J55305K55390J78545J2428r3525O7215k5734
2754d22021m4836k88366L82861J64740K28647O861k13044N87245P5963j26616
2744C51434K5887m51326j04549N6569K81042m62807k50193N48940O873l46383
2734c44513q8852O6204L79716k42079M5561n70001j939M5756O5355N03569K9326
$$ plain form
2723 -111897 -721322 -842124 -365419 -245957 -603271 -549878 -663019 -682652 -771204 -288240
2713 -288240 -514962 87570 -246019 -227267 -359746 -639489 -579981 -533558 -231500 -561491
2703 -561491 -663799 -870235 -721766 -612753 -560085 -520410 -77837 -573825 -557467 -442018
2693 -442018 -326805 -257267 -548092 -427405 -910650 -985400 -815362 -126143 -888247 -634449
2683 -634449 -520299 -629937 -136749 -165021 -464222 -686108 -762129 -642011 -426020 -704667
2673 -704667 -438363 -318848 -220118 -57382 -181770 -510102 -114702 -1453 -362125 -416846
2663 -416846 -21264 86791 536218 546667 289883 -54177 -341833 -785601 -200625 -297145
2653 -297145 -46458 -243867 -403087 -253648 -224437 -311123 -158400 -295137 -511432 -129251
$$ packed form
2723a11897o09425j20802M76705J19462l57314N3393j13141j9633q8552M82964
2713b88240k26722O02532l33589J8752j32479k79743N9508M6423L02058l29991
2703e61491j02308k06436J48469J09013N2668L9675M42573m95988J6358J15449
2693d42018J15213O9538k90825J20687m83245p4750J70038O89219p62104K53798
2683f34449J14150j09638M93188k8272k99201k21886p6021J20118K15991k78647
2673g04667K66304J19515R8730J62736j24388l28332L95400J13249l60672n4721
2663d16846L95582J08055M49427J0449k56784l44060k87656m43768N84976r6520
2653b97145K50687j97409j59220J49439K9211q6686J52723j36737k16295L82181
$$ plain form
2643 -129251 140575 79478 1467 142057 213103 371355 473072 195664 -182838 -318568
2633 -318568 164645 448075 476830 110019 41669 66906 334286 118409 372051 615587
2623 615587 272655 645133 800327 683451 517359 16169 345128 572059 1016444 802412
2613 802412 891720 1140410 1172265 667899 602355 828840 444122 801491 846358 748836 480637
2602 480637 885870 841622 591374 349343 681347 958406 772203 535232 795999 1145205
2592 1145205 1173758 989312 706568 1135105 1351823 1338880 1255339 1426669 1638390 1310810
2582 1310810 1536859 1851996 2180936 2375743 1961256 1940805 1936199 2031278 2116294 2159296 2516211
2571 2516211 2715891 2925684 2938717 2647055 3410735 3947916 3773484 3623254 3528918 3697924
$$ packed form
2643a29251K69826o1097p8011J40590P1046J58252J01717k77408l78502j35730
2633c18568M83213K83430K8755l66811o8350K5237K67380k15877K53642K43536
2623F15587l42932L72478J55194j16876j66092n01190L28959K26931M44385k14032
2613H02412Q9308K48690L1855n04366o5544K26485l84718L57369M4867r7522k68199
2602D80637M05233m4248k50248k42031L32004K77059j86203k36971K60767L49206
2592A145205K8553j84446k82744M28537K16718j2943q3541J71330K11721l27580
2582A310810K26049L15137L28940J94807m14487k0451m606R5079Q5016M3002L56915
2571B516211J99680K09793J3033k91662P63680N37181j74432j50230r4336J69006
$$ plain form
2561 3697924 3927103 3486007 3519179 3863599 3996222 4363427 4744816 4399037 4740428 4981555
2551 4981555 4871069 5319434 5700148 6067978 5940606 6500735 6500468 6782310 6847253 6948939
2541 6948939 7457618 7863211 8254462 8716003 8889998 8862349 9565448 11069982 11274510 12350122
2531 12350122 13271337 14136117 14909776 15698218 16736005 18322697 19786636 21823306 23551505
2522 23551505 25899953 27889169 29521145 31492776 34456308 38734978 43729960 50002645
2514 50002645 58765075 69604693 83293222 101368737 125069010 152330590 172919001
2507 172919001 169621103 147786442 126303980 107884378 89868511 75375043 65177337
2500 65177337 56891489 49845412 44782797 40838723 38014778 36000380 33462748 30836095
$$ packed form
2561C697924K29179m41096L3172L44420J32623L67205L81389l45779L41391K41127
2551D981555j10486M48365L80714L67830j27372N60129k67K81842O4943J01686
2541F948939N08679M05593L91251M61541J73995k7649P03099J504534K04528J075612
2531A2350122R21215Q64780P73659P88442J037787J586692J463939K036670J728199
2522B3551505K348448J989216J631976J971631K963532M278670M994982O272685
2514E0002645Q762430J0839618J3688529J8075515K3700273K7261580K0588411
2507A72919001l297898k1834661k1482462j8419602j8015867j4493468j0197706
2500F5177337q285848p046077n062615l944074k823945k014398k537632k626653
$$ plain form
2492 30836095 28067769 25025083 22912024 21814640 19421060 17675231 16762051 15445107
2484 15445107 14450833 14354937 13303856 12866843 12073929 11593855 10694996 10474854 9501705
2475 9501705 9158309 8628147 7914190 8155777 8048908 7945480 7809868 7246273 7203790 6756726
2465 6756726 5860130 5810478 5206533 4481137 4731404 4590321 4245229 4625434 4232117 3798656
2455 3798656 3776918 3312162 3525611 3600043 3377438 3330856 3343465 2785682 2989368 2833737
2445 2833737 2940597 2698242 2374345 2346122 2937701 3406090 3212840 3122504 2574914 1965112
2435 1965112 1692263 1758166 1340349 1367411 1204160 1505939 1668889 1575034 1467669 1523057
2425 1523057 1329941 849508 1089987 1045976 900072 949095 1100000 1295227 1067337 1299959
$$ packed form
2492C0836095k768326l042686k113059j097384k393580j745829r13180j316944
2484A5445107r94274r5896j051081m37013p92914m80074q98859k20142r73149
2475I501705l43396n30162p13957K41587j06869j03428j35612n63595m2483m47064
2465F756726q96596m9652o03945p25396K50267j41083l45092L80205l93317m33461
2455C798656k1738m64756K13449P4432k22605m6582J2609n57783K03686j55631
2445B833737J06860k42355l23897k8223N91579M68389j93250r0336n47590o09802
2435A965112k72849O5903m17817K7062j63251L01779J62950r3855j07365N5388
2425A523057j93116m80433K40479m4011j45904M9023J50905J95227k27890K32622
$$ plain form
2415 1299959 1497191 1258401 564813 453618 896965 642727 426677 46414 -61830 -303406
2405 -303406 -192674 402801 545182 602160 579164 -168923 236028 684459 -37993 -187201
2395 -187201 35092 -137742 28331 -168264 306836 600654 550156 538467 185189 136297
2385 136297 319569 18452 -318027 -259449 -153356 -122941 -150842 61881 -451011 -180053
2375 -180053 -355347 -126143 -331858 -385269 -138396 -731051 -819228 -345807 -215199 -545493
2365 -545493 -129231 -317451 -562399 6337 -241602 69475 -200951 -429899 -201628 -161939
2355 -161939 -283827 -397674 -902833 -890301 -603483 -286039 -228889 -102157 218162 -73530
2345 -73530 -300614 -285624 -206454 -303588 -503789 -694151 -1042772 -1170361 -643425 -250585
$$ packed form
2415A299959J97232k38790o93588j11195M43347k54238k16050l80263j08244k41576
2405c03406J10732N95475J42381N6978k2996p48087M04951M48431p22452j49208
2395a87201K22293j72834J66073j96595M75100K93818n0498j1689l53278m8892
2385A36297J83272l01117l36479N8578J06093L0415k7901K12723n12892K70958
2375a80053j75294K29204k05715n3411K46873n92655q8177M73421J30608l30294
2365e45493M16262j88220k44948N68736k47939L11077k70426k28948K28271L9689
2355a61939j21888j13847n05159J2532K86818L17444N7150J26732L20319k91692
2345g3530k27084J4990P9170r7134k00201j90362l48621j27589N26936L92840
$$ plain form
2335 -250585 112155 65126 -240016 -363463 -352101 -175061 -485597 -699500 -421229 -689278
2325 -689278 -457087 -623517 -899204 -419606 -233456 -498105 -1014974 -801108 -557298 -310301
2315 -310301 -314762 -102346 -388213 45398 -124357 -76378 -261499 -557893 -482930 -444041 -372968
2304 -372968 -426682 -185749 -453898 -521143 -320265 -503515 -694274 -972598 -1232383 -805514
2294 -805514 -53809 -100805 -424849 -421425 -296604 28069 -54242 -87771 -685233 -614428 -532518
2283 -532518 -409220 -155761 -310207 -247086 -278486 -151208 -573897 -926470 -107497 162727
2273 162727 23622 -564344 -491137 -318899 -271628 -28465 250990 290305 -66787 -310808
2263 -310808 -487053 -367377 -61270 -248119 97609 -263821 -240563 -391570 -358093 -399916
$$ packed form
2335b50585L62740m7029l05142j23447J1362J77040l10536k13903K78271k68049
2325f89278K32191j66430k75687M79598J86150k64649n16869K13866K43810K46997
2315c10301m461K12416k85867M33611j69755M7979j85121k96394P4963L8889P1073
2304c72968n3714K40933k68149o7245K00878j83250j90759k78324k59785M26869
2294h05514P51705m6996l24044L424J24821L24673q2311l3529n97462P0805Q1910
2283e32518J23298K53459j54446O3121l1400J27278m22689l52573Q18973K70224
2273A62727j39105n87966P3207J72238M7271K43163K79455L9315l57092k44021
2263c10808j76245J19676L06107j86849L45728l61430K3258j51007L3477m1823
$$ plain form
2253 -399916 -561896 -581920 -861715 -998239 -483286 -528934 -508102 -92466 -404407 -466404
2243 -466404 -768885 -546746 -611696 -431111 -304623 -605732 -378157 130931 -48277 -356141
2233 -356141 -507438 -509741 -375806 -169357 -247708 -357327 -447672 -520166 -456006 -398735 -318043
2222 -318043 -369499 -372156 -317115 -194999 -447493 -662928 -408575 195258 17322 -286095
2212 -286095 -373003 -378476 -13106 -275737 -468824 -492633 -303605 -346578 -577489 -1446004 -1101181
2201 -1101181 -838606 -538283 -235048 -252322 -508097 -868850 -997307 -874976 -698311 -484469
2191 -484469 -33479 -232253 -502234 -596979 -262550 -562698 -786873 -896699 -350822 -471938
2181 -471938 -724925 -746377 -551102 -96666 -268097 31896 -99006 -347699 13278 87176
$$ packed form
2253c99916j61980k0024k79795j36524N14953m5648K0832M15636l11941o1997
2243d66404l02481K22139o4950J80585J26488l01109K27575N09088j79208l07864
2233c56141j51297k303J33935K06449p8351j09619r0345p2494O4160N7271Q0692
2222c18043n1456k657N5041J22116k52494k15435K54353O03833j77936l03417
2212b86095q6908n473L65370k62631j93087k3809J89028m2973k30911q68515L44823
2201a101181K62575L00323L03235j7274k55775l60753j28457J22331J76665K13842
2191d84469M50990j98774k69981r4745L34429l00148k24175j09826N45877j21116
2181d71938k52987k1452J95275M54436j71431K99993j30902k48693L60977P3898
$$ plain form
2171 87176 59667 -262908 -98332 -145036 -160294 -411916 -753027 -307388 -346366 -945209 -1268892
2160 -1268892 -883880 -688028 -252510 -419198 -309489 -647678 -967110 -1172478 -1090503 -900660
2150 -900660 -911867 -591548 -833809 -531788 -952394 -803754 -955886 -1021737 -856480 -833710
2140 -833710 -413386 188092 -598243 -645512 -634646 -700629 -439304 -356748 -561360 -700864
2130 -700864 -694208 -774580 -304971 -585001 -830574 -625025 -1011748 -1036925 -777628 -444003
2120 -444003 -282250 -656126 -458105 -454007 -558699 -553719 -870090 -926551 -429696 -764961 -811496
2109 -811496 -497557 -407685 -753754 -693509 -1044523 -833464 -519172 -294221 -242297 -870719
2099 -870719 -866864 -790999 -795097 -443023 -381418 -369604 -918454 -729806 -750709 -870822 -727095
$$ packed form
2171H7176k7509l22575J64576m6704j5258k51622l41111M45639l8978n98843l23683
2160a268892L85012J95852M35518j66688J09709l38189l19432k05368Q1975J89843
2150i00660j1207L20319k42261L02021m20606J48640j52132o5851J65257K2770
2140h33710M20324O01478p86335m7269J0866o5983K61325Q2556k04612j39504
2130g00864O656q0372M69609k80030k45573K05549l86723k5177K59297L33625
2120d44003J61753l73876J98021M098j04692M980l16371n6461M96855l35265m6535
2109h11496L13939Q9872l46069O0245l51014K11059L14292K24951N1924o28422
2099h70719L855P5865m098L52074O1605J1814n48850J88648k0903j20113J43727
$$ plain form
2088 -727095 -198932 -329166 -357189 -263372 -10200 -413780 -793520 -1055971 -1220687 -940255
2078 -940255 -1085312 -643454 -400771 -876009 -1105587 -1051596 -476214 -396791 -798015 -407381
2068 -407381 -184502 -348841 -378599 -690335 -531305 -331023 -586459 -669236 -533600 -934093
2058 -934093 -1034052 -559103 -726205 -329001 -392363 -927269 -879892 -820937 -1054994 -626745
2048 -626745 -533511 -630547 -801274 -201407 -725521 -690714 -326384 -281725 -101501 -464700
2038 -464700 -162162 -489223 -460258 -193633 -411585 -415463 -629262 -634455 -347476 -716211 -947237
2027 -947237 -635827 -792317 -519138 -513863 -770165 -581054 -583828 -853196 -480783 -395672 -414619
2016 -414619 85618 -13103 -688283 -418776 -545739 -799066 -504706 -751125 -822503 -740203
$$ packed form
2088g27095N28163j30234k8023R3817K53172m03580l79740k62451j64716K80432
2078i40255j45057M41858K42683m75238k29578N3991N75382P9423m01224L90634
2068d07381K22879j64339k9758l11736J59030K00282k55436q2777J35636m00493
2058i34093r9959M74949j67102L97204o3362n34906M7377N8955k34057M28249
2048f26745R3234r7036j70727N99867n24114L4807L64330M4659J80224l63199
2038d64700L02538l27061K8965K66625k17952l878k13799n193K86979l68735k31026
2027i47237L11410j56490K73179N275k56302J89111k774k69368L72413Q5111j8947
2016d14619N00237r8721o75180K69507j26963k53327K94360k46419p1378Q2300
$$ plain form
2006 -740203 -981849 -634261 -483573 -425998 -719747 -663614 -638658 -421395 -546179 -508651
1996 -508651 -300696 -552534 -539738 -316363 19768 -349182 -418256 -348112 -419636 -858996
1986 -858996 -703971 -412035 -317228 -292644 -663207 -683908 -472542 -705108 -187336 -604359
1976 -604359 -764770 -229225 -636841 -584573 -414709 -427797 -511770 -916803 -841967 -824608 -616031
1965 -616031 -356478 -166374 -76541 -512311 -391174 -5566 -200582 -252853 -458453 -480956
1955 -480956 -204907 -466130 -866611 -713391 -762897 -427095 -379732 -621139 -505262 -985370
1945 -985370 -745124 -681052 -617341 -845159 -1116286 -778548 -550325 -881797 -579469 -247288
1935 -247288 -46509 -109374 -558795 -791108 -672928 -938523 -781167 -669676 -430962 -540052
$$ packed form
2006g40203k41646L47588J50688N7575k93749N6133K4956K17263j24784L7528
1996e08651K07955k51838J2796K23375L36131l68950o9074P0144p1524m39360
1986h58996J55025K91936R4807K4584l70563k0701K11366k32566N17772m17023
1976f04359j60411N35545m07616N2268J69864j3088q3973m05033P4836J7359K08577
1965f16031K59553J90104Q9833m35770J21137L85608j95016n2271k05600k2503
1955d80956K76049k61223m00481J53220m9506L35802M7363k41407J15877m80108
1945i85370K40246O4072O3711k27818k71127L37738K28223l31472L02328L32181
1935b47288K00779o2865m49421k32313J18180k65595J57356J11491K38714j09090
$$ plain form
1925 -540052 -764893 -229825 -518991 -961457 -1027614 -588102 64172 -27855 -761382 -724738
1915 -724738 -740951 -203553 -154859 -262950 38191 177641 97070 27830 -564679 -727609
$$ packed form
1925e40052k24841N35068k89166m42466o6157M39512O52274r2027p33527L6644
1915g24738j6213N37398M8694j08091L01141J39450q0571o9240n92509j62930
$$ [...]
##END NTUPLES=NMR SPECTRUM
##END=
