##TITLE=1H_CA-8928-3
 CDCl3,8 sc, 
 22.9.2021
##JCAMPDX= 6.0         $$ Bruker NMR JCAMP-DX V2.0
##DATA TYPE= NMR SPECTRUM
##DATA CLASS= NTUPLES
##ORIGIN= UXNMR, Bruker Analytische Messtechnik GmbH
##OWNER= root
$$ XWIN-NMR		Version 3.5
$$ Wed Sep 22 09:00:04 2021 Russian Standard Time (UT+4h)  she@DPX200
##.OBSERVE FREQUENCY= 200.1314
##.OBSERVE NUCLEUS= ^1H
##.ACQUISITION MODE= SIMULTANEOUS
##.ACQUISITION SCHEME= undefined
##.AVERAGES= 8
##.DIGITISER RES= 18
##SPECTROMETER/DATA SYSTEM= spect
##.PULSE SEQUENCE= zg30
##.SOLVENT NAME= CDCl3
##.SHIFT REFERENCE= (INTERNAL, CDCl3, 0, 16.9338)
##AUDIT TRAIL= $$ (NUMBER, WHEN, WHO, WHERE, WHAT)
$$ ##TITLE= Audit trail, XWIN-NMR		Version 3.5
$$ ##JCAMPDX= 5.01
$$ ##ORIGIN= Bruker BioSpin GmbH
$$ ##OWNER= she
$$ F:/spectra/data/she/nmr/H-F/1/pdata/1/auditp.txt
$$ ##AUDIT TRAIL=  $$ (NUMBER, WHEN, WHO, WHERE, WHAT)
(   1,<2021-09-22 08:58:47.50 +0400>,<she>,<DPX200>,
      <created by zg, POWCHK disabled, PULCHK disabled
       configuration hash MD5:
       00 E9 B6 7A A2 85 ED C7 34 08 36 98 17 FE 4E 26
       data hash MD5: 16K
       72 8D EE 2F 2C 49 A2 A9 B0 69 F6 9C 14 16 C0 7E>)
(   2,<2021-09-22 08:58:50.71 +0400>,<she>,<DPX200>,
      <Start of raw data processing
       efp BC_mod = 2 LB = 0.24 FT_mod = 6 PKNL = 1 PHC0 = -14095.76 PHC1 = 39.80089 SI = 16K 
       data hash MD5: 16K
       4E 2B 72 20 6C BD AC 14 A6 92 5E 49 F3 AC F0 EF>)
(   3,<2021-09-22 08:59:22.76 +0400>,<she>,<DPX200>,
      <pk PHC0 = -149.0107 PHC1 = -14.6 
       data hash MD5: 16K
       79 3E C6 21 10 5C 64 EB 4B 30 BF 43 E3 50 AD 28>)
(   4,<2021-09-22 08:59:26.70 +0400>,<she>,<DPX200>,
      <abs ABSG = 5 
       data hash MD5: 16K
       13 E6 9F A0 76 89 9C EE 88 90 F2 D3 48 BC 3D 8C>)
$$ ##END=
$$ 
$$ hash MD5
$$ 47 0B 36 09 29 0C 9F 0E AD 60 8E DA 39 92 CC 83
##$RELAX= 
##$RELAX= 
##$RELAX= 
##$RELAX= 
##$RELAX= 
##$RELAX= 
$$ Bruker specific parameters
$$ --------------------------
##$DU= <F:/spectra>
##$EXPNO= 1
##$NAME= <H-F>
##$PROCNO= 1
##$TYPE= <nmr>
##$USER= <she>
##$AMP= (0..31)
100 100 100 100 100 100 100 100 100 100 100 100 100 100 100 100 100 100 
100 100 100 100 100 100 100 100 100 100 100 100 100 100 
##$AQSEQ= 0
##$AQ_mod= 1
##$AUNM= <au_zg>
##$AUTOPOS= <>
##$BF1= 200.13
##$BF2= 200.13
##$BF3= 200.13
##$BF4= 200.13
##$BF5= 200.13
##$BF6= 200.13
##$BF7= 200.13
##$BF8= 200.13
##$BYTORDA= 1
##$CFDGTYP= 0
##$CFRGTYP= 5
##$CHEMSTR= <none>
##$CNST= (0..31)
1 1 145 1 1 1 1 1 1 1 1 1 1 1 1 1 1 1 1 1 1 1 1 1 1 1 1 1 1 1 1 1 
##$CPDPRG= <>
##$CPDPRG1= <>
##$CPDPRG2= <>
##$CPDPRG3= <>
##$CPDPRG4= <mlev>
##$CPDPRG5= <mlev>
##$CPDPRG6= <mlev>
##$CPDPRG7= <mlev>
##$CPDPRG8= <mlev>
##$CPDPRGB= <>
##$CPDPRGT= <>
##$D= (0..31)
0 1.2 0 0 0 0 0 0 0 0.06 0 0.03 0 0 0 0 0.0002 0 0 0 0 0 0 0 0 0 0 0 0 
0 0 0 
##$DATE= 1632286726
##$DBL= (0..7)
120 120 120 120 120 120 120 120 
##$DBP= (0..7)
150 150 150 150 150 150 150 150 
##$DBP07= 0
##$DBPNAM0= <>
##$DBPNAM1= <>
##$DBPNAM2= <>
##$DBPNAM3= <>
##$DBPNAM4= <>
$$ [...]
##$SUBNAM3= <"">
##$SUBNAM4= <"">
##$SUBNAM5= <"">
##$SUBNAM6= <"">
##$SUBNAM7= <"">
##$SUBNAM8= <"">
##$SUBNAM9= <"">
##$SW= 20.0188988654967
##$SWIBOX= (0..15)
0 0 2 0 0 0 0 0 0 0 0 0 0 0 0 0 
##$SW_h= 4006.41025641026
##$TD= 16384
##$TD0= 1
##$TE= 0
##$TE2= 300
##$TE3= 300
##$TEG= 300
##$TL= (0..7)
0 120 120 120 120 120 120 120 
##$TP= (0..7)
150 150 150 150 150 150 150 150 
##$TP07= 0
##$TPNAME0= <>
##$TPNAME1= <>
##$TPNAME2= <>
##$TPNAME3= <>
##$TPNAME4= <>
##$TPNAME5= <>
##$TPNAME6= <>
##$TPNAME7= <>
##$TPOAL= (0..7)
0.5 0.5 0.5 0.5 0.5 0.5 0.5 0.5 
##$TPOFFS= (0..7)
0 0 0 0 0 0 0 0 
##$TUNHIN= 0
##$TUNHOUT= 0
##$TUNXOUT= 0
##$USERA1= <user>
##$USERA2= <user>
##$USERA3= <user>
##$USERA4= <user>
##$USERA5= <user>
##$V9= 5
##$VALIST= <valist>
##$VCLIST= <CCCCCCCCCCCCCCC>
##$VD= 0
##$VDLIST= <DDDDDDDDDDDDDDD>
##$VPLIST= <PPPPPPPPPPPPPPP>
##$VTLIST= <TTTTTTTTTTTTTTT>
##$WBST= 1024
##$WBSW= 4
##$XGAIN= (0..3)
0 0 0 0 
##$XL= 0
##$YL= 0
##$YMAX_a= 105472
##$YMIN_a= -103159
##$ZGOPTNS= <>
##$ZL1= 120
##$ZL2= 120
##$ZL3= 120
##$ZL4= 120
##$ABSF1= 16.93383
##$ABSF2= -3.085207
##$ABSG= 5
##$ABSL= 3
##$ALPHA= 0
##$AQORDER= 0
##$ASSFAC= 0
##$ASSFACI= 0
##$ASSFACX= 0
##$ASSWID= 0
##$AUNMP= <proc_1d>
##$AZFE= 0.1
##$AZFW= 0.1
##$BCFW= 0
##$BC_mod= 2
##$BYTORDP= 0
##$COROFFS= 0
##$CY= -3
##$DATMOD= 1
##$DC= 0
##$DFILT= <>
##$DTYPP= 0
##$F1P= 0
##$F2P= 0
##$FCOR= 1
##$FTSIZE= 16384
##$FT_mod= 6
##$GAMMA= 0
##$GB= 0
##$INTBC= 1
##$INTSCL= 1.334414e-10
##$ISEN= 128
##$LB= 0.24
##$LEV0= 0
##$LPBIN= 0
##$MAXI= 10000
##$MC2= 0
##$MEAN= 0
##$ME_mod= 0
##$MI= 1.114404
##$NCOEF= 0
##$NC_proc= -9
##$NLEV= 6
##$NOISF1= 3.799351
##$NOISF2= 2.8
##$NSP= 0
##$NTH_PI= 0
##$NZP= 0
##$OFFSET= 16.93383
##$PC= 1
##$PHC0= -14244.77
##$PHC1= 25.20089
##$PH_mod= 1
##$PKNL= yes
##$PPARMOD= 0
##$PSCAL= 0
##$PSIGN= 0
##$REVERSE= no
##$SF= 200.130014238086
##$SI= 16384
##$SIGF1= 3
##$SIGF2= 2
##$SINO= 5.538805
##$SIOLD= 16384
##$SREGLST= <1H.CDCl3>
##$SSB= 0
##$STSI= 16384
##$STSR= 0
##$SW_p= 4006.41025641027
##$SYMM= 0
##$S_DEV= 0
##$TDeff= 16384
##$TDoff= 0
##$TI= <>
##$TILT= no
##$TM1= 0
##$TM2= 0
##$TOPLEV= 0
##$USERP1= <user>
##$USERP2= <user>
##$USERP3= <user>
##$USERP4= <user>
##$USERP5= <user>
##$WDW= 1
##$XDIM= 16384
##$YMAX_p= 354453059
##$YMIN_p= -1360966
$$ End of Bruker specific parameters
$$ ---------------------------------
##NTUPLES= NMR SPECTRUM
##VAR_NAME=  FREQUENCY,     SPECTRUM/REAL,   SPECTRUM/IMAG
##SYMBOL=    X,             R,               I
##VAR_TYPE=  INDEPENDENT,   DEPENDENT,       DEPENDENT
##VAR_FORM=  AFFN,          ASDF,            ASDF
##VAR_DIM=   16384,         16384,           16384
##UNITS=     HZ,            ARBITRARY UNITS, ARBITRARY UNITS
##FACTOR=    0.244546801953871, 1,           1
##FIRST=     3388.96769128539, 0,            0
##LAST=      -617.442565124885, 0,           0
##MIN=       -617.442565124885, -1360966,    0
##MAX=       3388.96769128539, 354453059,    0
$$ Real data points
##PAGE= N=1
##DATA TABLE= (X++(R..R)), XYDATA
$$ [...]
7747A7441498K05275O1473k35355k47438L03720J44740j23402K449R4375j03430
$$ 17441498 17646773 17708246 17472891 17225453 17529173 17673913 17550511 17552960 17647335 17543905
7737A7543905m3725j31280l80195j14446q0444j21593K84458J07152j7925j25443
$$ 17543905 17500180 17368900 16988705 16874259 16793815 16672222 16956680 17063832 17045907 16920464
7727A6920464J65654j92999Q6109k45834Q2774m51717j25394J75595k61988m16418
$$ 16920464 17086118 16893119 16979228 16733394 16816168 16364451 16239057 16414652 16152664 15736246
7717A5736246j77053J97414k60556j89188M6286k08417J35330K11638j47629K26887
$$ 15736246 15559193 15756607 15496051 15306863 15353149 15144732 15280062 15491700 15344071 15570958
7707A5570958j18829k72507O4562J62049k28708j86691l01653m87813K57803o4613
$$ 15570958 15452129 15179622 15244184 15406233 15177525 14990834 14689181 14201368 14459171 14394558
7697A4394558l45554m20707J49106K7612L5296K3690p2612J4583m5048L0282k91707
$$ 14394558 14049004 13628297 13777403 13805015 13840311 13864001 13791389 13805972 13760924 13791206 13499499
7686A3499499J55126l10482k39296j68615J13681j96037k91586K0587K06860o2137
$$ 13499499 13654625 13344143 13104847 12936232 13049913 12853876 12562290 12582877 12789737 12727600
7676A2727600l45439J42686j02733J70698J68853j67227o8701J21561j4350n14985
$$ 12727600 12382161 12524847 12422114 12592812 12761665 12594438 12525737 12647298 12632948 12117963
7666A2117963l2938L3730m11341j63102j64704j98765P9178N8764J14561Q3204
$$ 12117963 12085025 12118755 11707414 11544312 11379608 11180843 11260021 11318785 11433346 11516550
7656A1516550J64968k91870J57781K13637J63149o9889k66258n508n1867r9508
$$ 11516550 11681518 11389648 11547429 11761066 11924215 11854326 11588068 11582560 11530693 11431185
7646A1431185M4991n60782j6188j21275k35107Q4836J5064J31290J31679R3132
$$ 11431185 11476176 10915394 10899206 10777931 10542824 10627660 10642724 10774014 10905693 10998825
7636A0998825K38265j31094j69995J30365k48211M1917k29553J0969j09809j51040
$$ 10998825 11237090 11105996 10936001 11066366 10818155 10860072 10630519 10641488 10531679 10380639
7626A0380639k61239m0238J90466j92885j11030K8495j55310K76846l8971L1360
$$ 10380639 10119400 10079162 10269628 10076743 9965713 9994208 9838898 10115744 10076773 10108133
7616A0108133K34748M7878k82332r8068J42743l34858j32292J64948k59420j78226
$$ 10108133 10342881 10390759 10108427 10010359 10153102 9818244 9685952 9850900 9591480 9413254
7606I413254l26290j31775o7667L27857K12061k35468M9067j7961L7925k63158
$$ 9413254 9086964 8955189 8887522 9215379 9427440 9191972 9241039 9223078 9261003 8997845
7596H997845L5290K99652k25997j27440J67008j63216j01349J62925l93352J72842
$$ 8997845 9033135 9332787 9106790 8979350 9146358 8983142 8881793 9044718 8651366 8824208
7586H824208N1487k51730J0602L0147l2994l03105Q6559j16121p2386P2353k0831
$$ 8824208 8875695 8623965 8634567 8664714 8631720 8328615 8415174 8299053 8226667 8299020 8278189
7575H278189l1843K59729n5359j13975J8572j31584K36253P6372j72578o6228
$$ 8278189 8246346 8506075 8450716 8336741 8355313 8223729 8459982 8536354 8363776 8297548
7565H297548P3959O0581j0191p9286p5076K36751k86710k85334k4343K14779J73028
$$ 8297548 8371507 8432088 8421897 8342611 8267535 8504286 8217576 7932242 7907899 8122678 8295706
7554H295706l15129J6533O4384j01500j02275R589L32693K6685P9611l14021j61407
$$ 8295706 7980577 7997110 8061494 7959994 7857719 7867308 8200001 8226686 8306297 7992276 7830869
7543G830869r9338J32214M0012m3819Qj3981k93690r3993K09127j58607L23881
$$ 7830869 7731531 7863745 7903757 7859938 7859946 7845965 7552275 7458282 7667409 7508802 7832683
7532G832683o8129k96282J52972j2911l318R9486l2040k01220m050n9153n4712
$$ 7832683 7764554 7468272 7621244 7608333 7605015 7704501 7672461 7471241 7467191 7408038 7353326
7521G353326l5346L3539n9182O054Q8355J4770R3156j70704j62903J68437j02308
$$ 7353326 7317980 7351519 7292337 7298391 7386746 7401516 7494672 7323968 7161065 7329502 7227194
7510G227194N4021L9949r5093j48261o0550N5414L47023J00375l64472m9256l95002
$$ 7227194 7281215 7321164 7226071 7077810 7017260 7072674 7419697 7520072 7155600 7106344 6711342
7499F711342o9781j42662L1027K96958j32651J01834K03505j11012J29869l41230
$$ 6711342 6641561 6498899 6529926 6826884 6694233 6796067 6999572 6888560 7018429 6677199
7489F677199k328P7341L08944k6083l12834j48361j19900K42073O2670q162j19161
$$ 6677199 6674871 6752212 7061156 7035073 6722239 6573878 6453978 6696051 6758721 6750559 6631398
7478F631398l88024L02790L655l76682J80662N63141j20990r1417p120m7962J94352
$$ 6631398 6243374 6546164 6549819 6173137 6353799 6916940 6795950 6704533 6697413 6649451 6843803
7467F843803k8705j75779j50002j18758j8486J66934j2033J38863k90769L2397
$$ 6843803 6815098 6639319 6489317 6370559 6352073 6519007 6506974 6645837 6355068 6387465
7457F387465L63928j24554k59573J31602L35002p0454j26440k9940k83518J31136
$$ 6387465 6751393 6626839 6367266 6498868 6833870 6763416 6636976 6607036 6323518 6454654
7447F454654j43048R1736K03573M06855k524j19732j09007L3449L49041k78522
$$ 6454654 6311606 6403342 6606915 7013770 7011246 6891514 6782507 6815956 7164997 6886475
7437F886475J14323L28362o1638L22211J96826m29001j44861K80135j62154J07976
$$ 6886475 7000798 7329160 7267522 7589733 7786559 7357558 7212697 7492832 7330678 7438654
7427G438654q0435m7299P6033n3143q606l41443j82867P4775K92850l9845l2566
$$ 7438654 7358219 7310920 7386953 7333810 7325204 6983761 6800894 6875669 7168519 7128674 7096108
7416G096108k83330k34129j84543Q872j70211j24513J57442j32027j39072q2989
$$ 7096108 6812778 6578649 6394106 6402978 6232767 6108254 6265696 6133669 5994597 5911608
7406E911608n3869Q9477q5118O3487M81J26369j6141p5594l25800o9766j95229
$$ 5911608 5857739 5947216 5862098 5925585 5926066 6052435 6036294 5960700 5634900 5565134 5369905
7395E369905j10459J33389P6062l90619k20571J08829O3481K80604P1469M7203
$$ 5369905 5259446 5392835 5468897 5078278 4857707 4966536 5030017 5310621 5382090 5429293
7385E429293k30781N5492j85077j23702J97565j09862k69214J15868J68264l71809
$$ 5429293 5198512 5254004 5068927 4945225 5142790 5032928 4763714 4879582 5047846 4676037
7375D676037K03851o002N4255k33053L196j5225k588J59716k16935J55650K76223
$$ 4676037 4879888 4873886 4928141 4695088 4698284 4683059 4680471 4840187 4623252 4778902 5055125
7364E055125J88151m45291J4447L0908J75223m01122j76509q1430k54114k5502
$$ 5055125 5243276 4797985 4812432 4843340 5018563 4617441 4440932 4359502 4105388 4079886
7354D079886k56322M16505L43059j34140j8449j83785j03979K29880J70750L47852
$$ 4079886 3823564 4240069 4583128 4448988 4430539 4246754 4142775 4372655 4543405 4891257
7344D891257N1630k60833j15104M8322l56372j08587J0722p8715L06068k7954
$$ 4891257 4942887 4682054 4566950 4615272 4258900 4150313 4161035 4082320 4388388 4360434
7334D360434K84400N2540m35451O8669J11522q4383L3863J68754m6181o6512K8620
$$ 4360434 4644834 4697374 4261923 4330592 4442114 4357731 4391594 4560348 4514167 4447655 4476275
7323D476275j54194l43535P016p2923Q2034j7074j37410L73166J32377P0307J9664
$$ 4476275 4322081 3978546 3985562 3912639 3994673 3977599 3840189 4213355 4345732 4416039 4435703
7312D435703J84700l75172K0200P5603P6839p8571k76324r8176O49354j33709
$$ 4435703 4620403 4245231 4265431 4341034 4417873 4339302 4062978 3964802 4614156 4480447
7302D480447n21161O7390K5265m28369M64597O3144q8410J50425j14481J18949
$$ 4480447 3959286 4026676 4051941 3623572 4088169 4151313 4062903 4213328 4098847 4217796
7292D217796j00665J7708L6311M3602J17390k25561l68249r7132K59917J89594
$$ 4217796 4117131 4134839 4171150 4214752 4332142 4106581 3738332 3641200 3901117 4090711
7282D090711l74986K2372j86096L51256L3361O232J4769l192L39258J88123k15655
$$ 4090711 3715725 3738097 3552001 3903257 3936618 3942850 3957619 3954427 4293685 4481808 4266153
7271D266153k34024J38997m1107m7833J87468J95479k97730J772k46569r5768
$$ 4266153 4032129 4171126 4130019 4082186 4269654 4465133 4167403 4169175 3922606 3826838
7261C826838M61418L33014j72445k71841m0472o8680M22173k35170l52825M6739
$$ 3826838 4288256 4621270 4448825 4176984 4136512 4067832 4490005 4254835 3902010 3948749
7251C948749J06723q8198q6488m0201k9447P0694k04723k31670J13545J53942
$$ 3948749 4055472 3967274 3880786 3840585 3811138 3881832 3677109 3445439 3558984 3712926
7241C712926k03175Q9496J02863k39191k25613J7535K93818k06822P048M0346
$$ 3712926 3509751 3599247 3702110 3462919 3237306 3254841 3548659 3341837 3348885 3389231
7231C389231q9511l29328M4862L31900j72713j53577K76795K54480L735j96141
$$ 3389231 3299720 2970392 3015254 3347154 3174441 3020864 3297659 3552139 3555874 3359733
7221C359733O6737O492j14141K75449r4729m28415n3804j19777K32598K00472
$$ 3359733 3426470 3432962 3318821 3594270 3499541 3071126 3017322 2897545 3130143 3330615
7211C330615l3274j56147p9994J83774l19060n7121J82419P8529K2955P7080j46646
$$ 3330615 3297341 3141194 3061200 3244974 2925914 2868793 3051212 3129741 3152696 3229776 3083130
7200C083130m01336P9660j5209J5527l5332M7638K50463o5442l44087O7466L81580
$$ 3083130 2681794 2761454 2746245 2761772 2726440 2774078 3024541 2959099 2615012 2682478 3064058
7189C064058l4714k70712J02898K05867j65115l52165N0625P6621R9566K61638
$$ 3064058 3029344 2758632 2861530 3067397 2902282 2550117 2600742 2677363 2776929 3038567
7179C038567k47610O0017O5510K06435P3379j88391j86008q5841L99214j12796
$$ 3038567 2790957 2850974 2916484 3122919 3196298 3007907 2821899 2736058 3135272 3022476
7169C022476q0332J86955J07785k49906l5601j73209p7390p0806P1949j19555
$$ 3022476 2942144 3129099 3236884 2986978 2951377 2778168 2700778 2629972 2701921 2582366
7159B582366q1973J18418j3430k63043Q1385K07887j87670J38334J11863L7521
$$ 2582366 2500393 2618811 2605381 2342338 2423723 2631610 2443940 2582274 2694137 2731658
7149B731658l40429l7965R1146m6424K31150q8477l4544J16647j82771j72593
$$ 2731658 2391229 2353264 2444410 2397986 2629136 2540659 2506115 2622762 2439991 2267398
7139B267398J81492k13717J00330K78591o7876j93217l75634j35302N6647K69125
$$ 2267398 2448890 2235173 2335503 2614094 2546218 2353001 1977367 1842065 1898712 2167837
7129B167837L53111L720k84550L6049k15450M2283p1516J72853l72559J72757
$$ 2167837 2520948 2524668 2240118 2276167 2060717 2103000 2031484 2204337 1831778 2004535
7119B004535R9498K11274k56050J81714o85k68994q341j34026j10703J0736M88017
$$ 2004535 2104033 2315307 2059257 2240971 2240286 1971292 1962951 1828925 1718222 1728958 2216975
7108B216975j7409J3177J73942m88992p9470L56299r5970O115K21894r5838J78516
$$ 2216975 2199566 2212743 2386685 1897693 1818223 2174522 2078552 2084667 2306561 2210723 2389239
7097B389239Q6988m48236k38778J45496j62011j63439N98652j38617j94787K76335
$$ 2389239 2476227 2027991 1789213 1934709 1772698 1609259 2207911 2069294 1874507 2150842
7087B150842l3822j49282j28398J13286K10537N248o1288J10390k94563j25018
$$ 2150842 2117020 1967738 1839340 1952626 2163163 2168411 2107123 2217513 1922950 1797932
7077A797932J13658O3659J35306k40491o2726J60075j75139j45810M46574O5583
$$ 1797932 1911590 1975249 2110555 1870064 1807338 1967413 1792274 1646464 2093038 2158621
7067B158621j50865j35535R9950R7758j54073r5649J62874N7298j92474r865J10334
$$ 2158621 2007756 1872221 1972171 2069929 1915856 1820207 1983081 2040379 1847905 1838040 1948374
7056A948374L2160k08248j37764J93267j98051J75126k8326K47241q0047K88k3392
$$ 1948374 1980534 1772286 1634522 1827789 1629738 1804864 1776538 2023779 1943732 1944020 1920628
7045A920628K0074r7082l26647J18306j39174O4658M1115J34715K43363K21222
$$ 1920628 1940702 1843620 1516973 1635279 1496105 1560763 1601878 1736593 1979956 2201178
7035B201178m92398q4902L38516J40854j52609m0786q9813k82068J71972l13900
$$ 2201178 1708780 1623878 1962394 2103248 1950639 1909853 1820040 1537972 1709944 1396044
7025A396044q0395K91834j39445k83469j12263K31831J6353L59157j3274k4643
$$ 1396044 1315649 1607483 1468038 1184569 1072306 1304137 1320490 1679647 1666373 1641730
7015A641730j6697q7349k72007k1450N8501r8994K1016j5613M54741k42366P3839
$$ 1641730 1625033 1537684 1265677 1244227 1302728 1203734 1224750 1209137 1663878 1421512 1495351
7004A495351k6850j8499J03665j99482O1900j04424j0424Q9745m45640J81820
$$ 1495351 1468501 1450002 1553667 1354185 1416085 1311661 1301237 1390982 945342 1127162
6994A127162O7320j4469K3527J06133J3656j89732k43067J32443K60767j10638
$$ 1127162 1194482 1180013 1203540 1309673 1323329 1133597 890530 1022973 1283740 1173102
6984A173102K0674j23365J86866K00341n32829J55275J76748k08576L20071r0172
$$ 1173102 1193776 1070411 1257277 1457618 924789 1080064 1256812 1048236 1368307 1278135
6974A278135k25375J22569m0311l5968L53655P1155K8850l63151J29617L99311
$$ 1278135 1052760 1175329 1135018 1099050 1452705 1523860 1552710 1189559 1319176 1718487
6964A718487k92103j45138K13403p7789k16311j01979k817Q2589K2988P2987k16836
$$ 1718487 1426384 1281246 1494649 1416860 1200549 1098570 1095753 1178342 1201330 1274317 1057481
6953A057481K56093L2328J6916J9998m5479j16781J56198L19547N0524j92141
$$ 1057481 1313574 1345902 1362818 1382816 1337337 1220556 1376754 1696301 1746825 1554684
6943A554684k43160N0396J19723k6323m1812K02793l29660J0190J65603K439K053
$$ 1554684 1311524 1361920 1481643 1455320 1413508 1616301 1286641 1296831 1462434 1464873 1466926
6932A466926J45687L2095k04104o9246J90389n4247Q0947P7191j34639k54993
$$ 1466926 1612613 1644708 1440604 1371358 1561747 1507500 1588447 1665638 1530999 1276006
6922A276006m57282L45902J73597K18716n4703J32253J53831j55356K38076j79983
$$ 1276006 818724 1164626 1338223 1556939 1502236 1634489 1788320 1632964 1871040 1691057
6912A691057n3470K22409k49620n5679P4255k39858k26975m387Q6032j84978j73321
$$ 1691057 1637587 1859996 1610376 1554697 1628952 1389094 1162119 1157732 1243764 1058786 885465
6901H85465J93611L8853K22077K7517j76041J7965J78244j0922k65804K21656
$$ 885465 1079076 1117929 1340006 1367523 1191482 1209447 1387691 1376769 1110965 1332621
6891A332621k82294j48282P9618n3251J6441j06601j57526J26767k910N6841j11096
$$ 1332621 1050327 902045 981663 928412 944853 838252 680726 807493 804583 861424 750328
6880G50328J58458K18518K78568k84620J058j11693k72098r2721J20830O3816
$$ 750328 908786 1127304 1405872 1121252 1122310 1010617 738519 645798 766628 830444
6870H30444j62634k28746K95649R1680l12276j85665K40703M89518r5912K64582
$$ 830444 667810 439064 734713 826393 514117 328452 569155 1058673 962761 1227343
6860A227343k111m05388j24739K3148J51262N6409J2858M936o7867n31326K26461
$$ 1227343 1225232 819844 695105 718253 869515 925924 938782 943718 875851 344525 570986
6849E70986J16864o4082L47048l69333J7421M11388j2508j86613K2595j67383
$$ 570986 687850 623768 970816 601483 618904 1030292 1017784 831171 853766 686383
6839F86383k4355P2018N2920q2149j46390p6072J4324m2868K01556J68136k16142
$$ 686383 662028 734046 786966 704817 558427 482355 496679 453811 655367 823503 607361
6828F07361J52525J40151j05451p5422q8476p3441K67168o2902k41401j16202
$$ 607361 759886 900037 794586 719164 630688 557247 824415 761513 520112 403910
6818D03910q0261J95764j97480J79853J88837O6611k55833m15638N5370L12540
$$ 403910 323649 519413 321933 501786 690623 757234 501401 85763 141133 453673
6808D53673L53216j11388j40224k25629r6941l0007L26551L01288o11122K8348
$$ 453673 806889 695501 555277 329648 232707 202700 529251 830539 219417 247765
6798B47765o1419j5806j00972J8834L57507L47719p2225k64560l8738K0699k36880
$$ 247765 186346 170540 69568 88402 445909 793628 721403 456843 418105 438804 201924
6787B01924J2354J25118j25929j62722N09M234K5529L56725j46292J3347J30991
$$ 201924 214278 339396 213467 50745 51254 55488 81017 437742 291450 304797 435788
6776D35788K04071O200j34126p5288j87201J49973N0131Q9851J28206k99073k93606
$$ 435788 639859 646059 511933 436645 249444 399417 449548 539399 667605 368532 74926
6765G4926P9958q0276K62468J4880k3959k33833k7282M71661j65342Q7387L34300
$$ 74926 154884 74608 337076 351956 327997 94164 66882 538543 373201 460588 794888
6754G94888j47288k74077j00643m1403n6323m3706j94705o6943L25328K2553L5779
$$ 794888 647600 373523 272880 231477 175154 131448 -63257 -130200 195128 217681 253460
6743B53460j45987N7613K65467L6458K73733k08124k70461q3463L9315J15577
$$ 253460 107473 165086 430553 467011 740744 532620 262159 178696 218011 333588
6733C33588J27203m94728O9982K6831q1918K5845K35324N9695j09538j9895k06118
$$ 333588 460791 -33937 36045 62876 -19042 6803 242127 301822 192284 172389 -33729
6722c3729K50814n7703j13394J3473r4352R5813M2491k69269j07260L49636j90053
$$ -33729 217085 159382 45988 59461 -34891 60922 103413 -165856 -273116 76520 -113533
6711a13533M33712K11085k82621K49879N3435J7219J18081l5068q4146r4977j81026
$$ -113533 320179 531264 248643 498522 551957 569176 687257 652189 568043 473066 292040
6700B92040J00975k0809j60133j39514j52449L1562L1303p240P4015m7744L47457
$$ 292040 393015 372206 212073 72559 -79890 -48328 -17025 -24265 49750 2006 349463
6689C49463l1267k10160K97653K50514k94253J79091j59983o9875J13116q0914
$$ 349463 318196 108036 405689 656203 361950 541041 381058 311183 424299 343385
6679C43385K7608L8270M6634K96178m170K3770l22491j71761J74062o2660m7324
$$ 343385 370993 409263 455897 752075 747905 771675 449184 277423 451485 388825 341501
6668C41501K64294m6375Q2292l6581m28800j14637k7568L47200J03405j68637
$$ 341501 605795 559420 641712 605131 176331 61694 34126 381326 484731 316094
6658C16094K72620J47340J61182k07437j75730q2477N0685L09260K73764j81613
$$ 316094 588714 736054 897236 689799 514069 431592 482277 791537 1065301 883688
6648H83688J73594k41822j13330k38693J65681O4870P7675J46050K87860r9657
$$ 883688 1057282 815460 702130 463437 629118 693988 771663 917713 1205573 1105916
6638A105916k58469L58662L35134P603m55626j16918j23531j63268R7837K92731
$$ 1105916 847447 1206109 1541243 1548846 1093220 976302 852771 689503 787340 1080071
6628A080071J52990J33598j10848n9300J225O025j7078J38978K26538K9405k56848
$$ 1080071 1233061 1366659 1255811 1196511 1197736 1203761 1186683 1325661 1552199 1581604 1324756
6617A324756K4354K4795M2886J0754q9702Q573j9461l83043L9R0554R8151Q734
$$ 1324756 1349110 1373905 1416791 1427545 1337843 1346416 1326955 943912 943951 1034505 1132656 1141390
6605A141390j63820j71319N6752J53667K87307j88608q8206J80056j9138j29053
$$ 1141390 977570 806251 863003 1016670 1303977 1115369 1027163 1207219 1188081 1059028
6595A059028K9187q0096K21664k55577n9209j16254k48778J41638J164p837j53665
$$ 1059028 1088215 1008119 1229783 974206 914997 798743 549965 691603 692767 684930 531265
6584E31265J87462n8744o3514j48243o3427O236J84307n3194k10279J41098L8339
$$ 531265 718727 659983 596469 448226 384799 391035 575342 522148 311869 452967 491306
6573D91306J42050K06933l8882m87227J31806J40907n843k19059Q9893j9684K33661
$$ 491306 633356 840289 801407 314180 445986 586893 581050 361991 451884 432200 665861
6562F65861m79848M7550K5418K1447J34056j7978q9079P9347J21270M2276j01151
$$ 665861 186013 233563 258981 280428 414484 396506 307427 386774 508044 550320 449169
6551D49169j52627q6430j19044L28453j26916j52095J93388j29819k5345N3916
$$ 449169 296542 210112 91068 419521 292605 140510 333898 204079 178734 232650
6541B32650J15403J02536N5750p0689o8258J9141k67457m0532J7945J84905K36701
$$ 232650 348053 450589 506339 435650 367392 386533 119076 78544 96489 281394 518095
6530E18095j4610j98302P5196J52537R1151j23187l13361n3565M38062j56054
$$ 518095 503485 305183 380379 532916 624067 500880 187519 133954 572016 415962
6520D15962R6990N0731j84743K1220L47517k62661N7737N1225l23789j48314J97229
$$ 415962 512952 563683 378940 400160 747677 485016 542753 593978 270189 121875 319104
6509C19104K50759j79660k73605P4980k31837J89063L5128P0699K85396K98636
$$ 319104 569863 390203 116598 191578 -40259 148804 183932 254631 540027 838663
6499H38663K02032L6875j1126k65849K04696k01992l85257K26726K25033l4633
$$ 838663 1040695 1077570 1066444 800595 1005291 803299 418042 644768 869801 835168
6489H35168q1679q3260R1297O1401j13013j03099k50761p7466K94113J34157r6450
$$ 835168 753489 670229 761526 822927 709914 606815 356054 278588 572701 706858 610408
6478F10408J79385j7100j18225J33223k54733J4662O5023J61403K0449j27884
$$ 610408 789793 772693 654468 787691 532958 547620 612643 774046 794495 666611
6468F66611J81430l02342j83365J21111N28431K4544l16266j1620J72341M6361
$$ 666611 848041 545699 362334 483445 1011876 1036420 720154 708534 880875 927236
6458I27236R0473l20980M7488k5806J41832K2449N3503J27979N9705l97732p4872
$$ 927236 1017709 696729 744217 718411 860243 882692 936195 1064174 1123879 726147 651275
6447F51275P6126j77302K88126l56728O1890r0137p443J45658K25193p1728j34509
$$ 651275 727401 550099 838225 481497 543387 453250 445807 591465 816658 744930 610421
6436F10421p0488K54724k81945n4098J11053n7040j95348Q3029J90459J78227
$$ 610421 539933 794657 512712 458614 569667 512627 317279 400308 590767 768994
6426G68994R313l44811J14984J12347L731r3595Q7201j37548J03871j10195o5454
$$ 768994 778307 433496 548480 660827 664558 570963 658164 520616 624487 514292 448838
6415D48838J45169P0534j29293j08330j11847J10992J37977Q4929P3576K12595
$$ 448838 594007 664541 535248 426918 315071 426063 564040 648969 722545 935140
6405I35140J458l15174k89629J92533J94134j65544L37264k31869J23100K42736
$$ 935140 936598 621424 331795 524328 718462 552918 890182 658313 781413 1024149
6395A024149j29893k43869k9895j75142K04134Q2699j6245J24596J97510k19693
$$ 1024149 894256 650387 620492 445350 649484 732183 715938 840534 1038044 818351
6385H18351l34475L19990J60600n8837L4787j65000j09777K01495J45061j08884
$$ 818351 483876 803866 964466 905629 940416 775416 665639 867134 1012195 903311
6375I03311q484k27330l682Q1364Q4348K94077K11756j74440p8002n1193p8512
$$ 903311 894827 667497 663815 745179 829527 1123604 1335360 1160920 1082918 1031725 953213
6364I53213J49057J05380k16021k5678J30584K48055l13751l41414n5983L80021
$$ 953213 1102270 1207650 991629 965951 1096535 1344590 1030839 689425 633442 1013463
6354A013463K81114k47811r1769J70196K55720M1687k09718k09553j34300K6434
$$ 1013463 1294577 1046766 954997 1125193 1380913 1422600 1212882 1003329 869029 895463
6344H95463K94132p4937J23068l28495J8681j82403R8502L74246N9029R0014k16546
$$ 895463 1189595 1114658 1237726 909231 927912 745509 844011 1218257 1277286 1367300 1150754
6333A150754j45280R5554j64579J36545J47233j4013p5494j15083j94556M6952
$$ 1150754 1005474 1101028 936449 1072994 1220227 1206214 1130720 1015637 821081 868033
6323H68033L49002M8265j99898J24500J73845O3404o1559m4021j42266N9114M8509
$$ 868033 1217035 1265300 1065402 1189902 1363747 1427151 1365592 1321571 1179305 1238419 1286928
6312A286928M0241o0197j36143q5458J86840j52150m6988L15874M4607r8317k89925
$$ 1286928 1327169 1266972 1130829 1045371 1232211 1080061 1033073 1348947 1393554 1295237 1005312
6301A005312J21418J29651r2993Q779K92547l13731o7197O8553k0310q4431k36893
$$ 1005312 1126730 1256381 1163388 1172167 1464714 1150983 1083786 1152339 1132029 1047598 810705
6290H10705q996K03963J94887o3212J61748o1958J22253M27352l19138o11979
$$ 810705 801709 1005672 1200559 1137347 1299095 1237137 1359390 1786742 1467604 855625
6280H55625M05739k27232p865K33981P4479K60924J07370q5501k32602j03456
$$ 855625 1261364 1034132 1026267 1260248 1334727 1595651 1703021 1617520 1384918 1281462
6270A281462J23056K4773J01088L50347j23722l37953p0761L14787m2112K98073
$$ 1281462 1404518 1429291 1530379 1880726 1757004 1419051 1348290 1663077 1620965 1919038
6260A919038o9334k50478P701L9600j84993k79404K77818K62293j2349J68259
$$ 1919038 1849704 1599226 1606927 1646527 1461534 1182130 1459948 1722241 1709892 1878151
6250A878151p4048j65481K26341k81498m27128L88350J70877L2359J65229k80472
$$ 1878151 1804103 1638622 1864963 1583465 1156337 1544687 1715564 1747923 1913152 1632680
6240A632680k1653R2962m8987J44205n4023k86126J42704L16671k63014R0609
$$ 1632680 1611027 1703989 1655002 1799207 1745184 1459058 1601762 1918433 1655419 1746028
6230A746028M9324L0742l5050M8514j27727j6551q4393j68779j15007L8925L5249
$$ 1746028 1795352 1826094 1791044 1839558 1711831 1695280 1610887 1442108 1327101 1366026 1401275
6219A401275K07831J58453l9041L08925J09758N187R2100m7108k01063k38210
$$ 1401275 1609106 1767559 1728518 2037443 2147201 2152388 2244488 2197380 1996317 1758107
6209A758107n17244J21732L82458m0900J31n8931J11753o6628J28978J47501k74432
$$ 1758107 1240863 1362595 1745053 1704153 1704284 1645353 1757106 1690478 1819456 1966957 1692525
6198A692525o9589L34361M74192q5146k86517J55265j36981k55640j38338J68216
$$ 1692525 1622936 1957297 2431489 2346343 2059826 2215091 2078110 1822470 1684132 1852348
6188A852348J42290k71732R8849K8801K56964N0454n1944J16730R2327J34918
$$ 1852348 1994638 1722906 1821755 1850556 2107520 2157974 2106030 2222760 2315087 2450005
6178B450005Q2216l55557J83257J34729l96347j66551R9266p0534r725o7351L0499
$$ 2450005 2532221 2176664 2359921 2494650 2098303 1931752 2031018 1960484 1950759 1883408 1913907
6167A913907R8443J57059J60560j6282j56895K05144K55464K48527K125l09695
$$ 1913907 2012350 2169409 2329969 2313687 2156792 2361936 2617400 2865927 2868052 2558357
6157B558357j1554m07160R8507j4130N4903k71570j40111M69736p6881j25167
$$ 2558357 2546803 2139643 2238150 2224020 2278923 2007353 1867242 2336978 2260097 2134930
6147B134930L82132N6490k87864K00864L3251J2273J12118n2994P017L4541k73373
$$ 2134930 2517062 2573552 2285688 2486552 2519803 2532076 2644194 2591200 2598217 2632758 2359385
6136B359385m731j40582k59023R9250M77745K51643J02940m2028J22850j02095
$$ 2359385 2354654 2214072 1955049 2054299 2532044 2783687 2886627 2844599 2967449 2865354
6126B865354K23939o2975j93387K6610Q353j6643J45919Q4062M2093R1219l20880
$$ 2865354 3089293 3026318 2832931 2859541 2867894 2851251 2997170 3081232 3123325 3214544 2893664
6115B893664L9778m6986L65580L76761j11742k8134J97742l130K37537l31988
$$ 2893664 2933442 2886456 3252036 3628797 3517055 3488921 3686663 3683533 3921070 3589082
6105C589082j63912Q3037q119k08552M8443N0209k67760j82777k3125L55871J44157
$$ 3589082 3425170 3508207 3500088 3291536 3339979 3390188 3122428 2939651 2916526 3272397 3416554
6094C416554K91940J54730j38476J45064K24924j92231m07870Q5022l8969k17962
$$ 3416554 3708494 3863224 3724748 3869812 4094736 3902505 3494635 3579657 3540688 3322726
6084C322726K1970J24848O4800J35801L47740q3575p4369L56878J31695k01868
$$ 3322726 3344696 3469544 3534344 3670145 4017885 3934310 3859941 4216819 4348514 4146646
6074D146646J86274K52600J63234l3403N7172n0981j07234j00994j14498k9918
$$ 4146646 4332920 4585520 4748754 4715351 4772523 4721542 4614308 4513314 4398816 4368898
6064D368898M15518J61644L61268J04629p4344J26745O86N94701J69475l74070
$$ 4368898 4784416 4946060 5307328 5411957 5337613 5464358 5465044 6059745 6229220 5855150
6054E855150n6049J92688J10136m2855l6020K17067j34584j74410l45293q9651
$$ 5855150 5799101 5991789 6101925 6059070 6023050 6240117 6105533 5931123 5585830 5496179
6044E496179K1701M57579K62736j10795p6810O6146N7846L4170k47432j86724
$$ 5496179 5517880 5975459 6238195 6127400 6050590 6116736 6174582 6208752 5961320 5774596
6034E774596j55102l6880o26188k42687L9663k67112L46217n7916J27226J79141
$$ 5774596 5619494 5582614 4956426 4713739 4753402 4486290 4832507 4774591 4901817 5080958
6024E080958j99676J36995p042J94013j43890l16080n3759j63666o6517j29388
$$ 5080958 4881282 5018277 5011235 5205248 5061358 4745278 4691519 4527853 4461336 4331948
6014D331948j91901k3986k42338K15148J7061M3792J41597J81191L98186J3532
$$ 4331948 4140047 4116061 3873723 4088871 4105932 4149724 4291321 4472512 4870698 4884230
6004D884230k37933J85665j73463N1766J32453l53885n1126k5451j0003m0241
$$ 4884230 4646297 4831962 4658499 4710265 4842718 4488833 4437707 4412256 4402253 4362012
5994D362012j92104m3439K00465J38532L5650J68849J93320k4441J59282l10180
$$ 4362012 4169908 4126469 4326934 4465466 4501116 4669965 4863285 4838844 4998126 4687946
5984D687946K18930m0278m42226j82902L13665n2790l99345m0246M25809j11635
$$ 4687946 4906876 4866598 4424372 4241470 4555135 4502345 4103000 4062754 4488563 4376928
5974D376928Q3655r8618K64219J86691K66696j19767r1740l3070m3684r9729j91852
$$ 4376928 4460583 4361965 4626184 4812875 5079571 4959804 4868064 4834994 4791310 4691581 4499729
5963D499729l7740j43217j18253K78986J4253m8849J3412L02364K57527k89848
$$ 4499729 4461989 4318772 4200519 4479505 4493758 4444909 4458321 4760685 5018212 4728364
5953D728364l8562p6595J57915j98673J68035L03350k79207k57314Q3390N5406
$$ 4728364 4689802 4613207 4771122 4572449 4740484 5043834 4764627 4507313 4590703 4646109
5943D646109p0377q3296K03402L8604j48335K94161J03431P6833M6907k1297L898
$$ 4646109 4575732 4492436 4695838 4734442 4586107 4880268 4983699 5060532 5107439 5086142 5090040
5932E090040m9002O6894o1140r3376J64974q801p9274j95190l23444L9466Q0538
$$ 5090040 5041038 5107932 5046792 4953416 5118390 5109589 5030315 4835125 4511681 4551147 4631685
5921D631685J45214K19300L53989l6659L9395q5807m12016O8447J06011j43284
$$ 4631685 4776899 4996199 5350188 5313529 5352924 5267117 4855101 4923548 5029559 4886275
5911D886275O824L027J97474p6314R0036K15682k9729R797K08822J12385j4155
$$ 4886275 4893099 4896126 5093600 5017286 5107322 5323004 5293275 5303072 5511894 5624279 5610124
5900E610124j1187K23253j01555k05540J2228Q1715J58216l27216j26354P5792
$$ 5610124 5598937 5822190 5720635 5515095 5527323 5609038 5767254 5440038 5313684 5389476
5890E389476J94285k34631k318L0263N7642N79388L9916j94740J0742q435r977
$$ 5389476 5583761 5349130 5346812 5377075 5434717 6014105 6054021 5859281 5870023 5861588 5851611
5879E851611M9138j28879q8166l4961q1137j25076L06510K96266O1594k99478
$$ 5851611 5900749 5771870 5683704 5648743 5567606 5442530 5749040 6045306 6106900 5807422
5869E807422k32111J77891J65632R4916J95431l552M5285k15849J37759l7938
$$ 5807422 5575311 5753202 5918834 6013750 6209181 6205629 6250914 6035065 6172824 6134886
5859F134886n3104O6753K20116j22786n1971k2936j82162K81810J79022O7881
$$ 6134886 6081782 6148535 6368651 6245865 6193894 6170958 5988796 6270606 6449628 6517509
5849F517509l77612K56011J89820j38332j47498J9379L1682j00509L55526L1664
$$ 6517509 6139897 6395908 6585728 6447396 6299898 6319277 6350959 6250450 6605976 6637640
5839F637640k4992k89000K96626k94175R7312K23026r017L2140J26894j4905j13463
$$ 6637640 6612648 6323648 6620274 6326099 6423411 6646437 6637420 6669560 6796454 6781549 6668086
5828F668086L90608J43283k78972k13472j37759O9362q8656J62999R5587k99266
$$ 6668086 7058694 7201977 6923005 6709533 6571774 6641136 6552480 6715479 6811066 6511800
5818F511800J83330j64111m5140k0627M84017L1298K5472P1841K16406k37620
$$ 6511800 6695130 6531019 6485879 6465252 6949269 6980567 7006039 7077880 7294286 7056666
5808G056666K2179r699q4390j6926N1315k40250L07669J55374l4632O3786P1659
$$ 7056666 7078845 7069146 6984756 6967830 7019145 6778895 7086564 7241938 7207306 7271092 7342751
5797G342751n8130M5742j07977P126O9009M8237K25992m0837j91746j4238P2984
$$ 7342751 7284621 7330363 7222386 7229512 7298521 7346758 7572750 7531913 7340167 7325929 7398913
5786G398913j59697J75080K06836j56135m9857N7241j57839n1987K05583K59982
$$ 7398913 7239216 7414296 7621132 7464997 7415140 7472381 7314542 7262555 7468138 7728120
5776G728120n9573J75549m01337l06045L59239q0042L15205P8025k14553J9560
$$ 7728120 7668547 7844096 7442759 7136714 7495953 7415911 7731116 7809141 7594588 7614148
5766G614148K070p0277j84708J78979J15222k34138J59634K47717k16973j34336
$$ 7614148 7616218 7545941 7361233 7540212 7655434 7421296 7580930 7828647 7611674 7477338
5756G477338K09211J75878k02669j56603k40944P3051n2483J42538M63171L07826
$$ 7477338 7686549 7862427 7659758 7503155 7262211 7335262 7282779 7425317 7888488 8196314
5746H196314j58983j74266K30040Q5307k12886q8140j02648n5086j55937L5704
$$ 8196314 8037331 7863065 8093105 8178412 7965526 7877386 7774738 7719652 7563715 7599419
5736G599419N05028J03866j22598l2271j60647M45153j70045P4871J21862L78630
$$ 7599419 8104447 8208313 8085715 8053444 7892797 8337950 8167905 8242776 8364638 8743268
5726H743268m01910l23001L06361l15783O1384q6255K4855K01286k09891j7356
$$ 8743268 8341358 8018357 8324718 8008935 8070319 7984064 8008919 8210205 8000314 7982958
5716G982958K83783J21905N0899j60233K31539o782N922J3194m29394K8301L31159
$$ 7982958 8266741 8388646 8439545 8279312 8510851 8504069 8509991 8523185 8093791 8122092 8453251
5705H453251q2665k13970k0209N6799O4442J13672K29151l6606j74403M30601
$$ 8453251 8370586 8156616 8136407 8193206 8257648 8371320 8600471 8563865 8389462 8820063
5695H820063Q9271j40211l73197l62339N05751L98191j61855j18126j49993J40114
$$ 8820063 8909334 8769123 8395926 8033587 8539338 8937529 8775674 8657548 8507555 8647669
5685H647669K11785K39273j25384k74372J62569K09942K3482L5673J73569m9953
$$ 8647669 8859454 9098727 8973343 8698971 8861540 9071482 9094964 9130637 9304206 9254253
5675I254253o1056L19682R973K6201j34997M96325j18680K168L14273k36520k5843
$$ 9254253 9193197 9512879 9522852 9549053 9414056 9910381 9791701 9793869 10108142 9871622 9845779
5664I845779L25285N09158J11642j52426k7603l0128J6572P2932M22250J81964
$$ 9845779 10171064 10680222 10791864 10639438 10611835 10581707 10598279 10671211 11093461 11275425
5654A1275425J11697m08527j66832L65252k6574k51012J01392L18654L20552k88120
$$ 11275425 11387122 10978595 10811763 11177015 11150441 10899429 11000821 11319475 11640027 11351907
5644A1351907J7169j03293m84467K3224j2035J62874j66334J59197L8722O5896
$$ 11351907 11369076 11265783 10781316 10804540 10792505 10955379 10789045 10948242 10986964 11052860
5634A1052860l39286j14260p273J25079j8741k05769j96073q3827o7452K25049
$$ 11052860 10713574 10599314 10592041 10717120 10698379 10492610 10296537 10212710 10145258 10370307
5624A0370307L9264R9828j75099j99851j37336P6180J7299M8397r1075j44061
$$ 10370307 10409571 10509399 10334300 10134449 9997113 10073293 10090592 10138989 10047914 9903853
5614I903853m0551J10211m5978m5916J38286M0304N4583K92620j59298J35532
$$ 9903853 9863302 9973513 9927535 9881619 10019905 10060209 10114792 10407412 10248114 10383646
5604A0383646K4810K73386n3356k13028j35897j878o1758j9700K15216k44523
$$ 10383646 10408456 10681842 10628486 10415458 10279561 10277683 10215925 10196225 10411441 10166918
5594A0166918j37687N59619L0454N3002o7034l25992J37311L23672j2962j15364
$$ 10166918 10029231 10588850 10619304 10672306 10605272 10279280 10416591 10740263 10727301 10611937
5584A0611937Q9033J05471j11264l62012Q7941k08380J0501l54493J1712o9340
$$ 10611937 10700970 10806441 10695177 10333165 10421106 10212726 10223227 9868734 9880446 9811106
5574I811106M51265K49674M4981n8607K99363j08892j95638K59553N3182m22445
$$ 9811106 10262371 10512045 10557026 10498419 10797782 10688890 10493252 10752805 10805987 10383542
5564A0383542M5908j92409K25735l4364j14904J9067M57593n3758l07115K81759
$$ 10383542 10429450 10237041 10462776 10428412 10313508 10332575 10790168 10736410 10429295 10711054
5554A0711054Q1404o4308J86852K27452l73522Q8031l3390J17600N4710j42706
$$ 10711054 10792458 10728150 10915002 11142454 10768932 10856963 10823573 10941173 10995883 10853177
5544A0853177j90221J16055m8903J88732N527q4719J45970j17448J3270J86918
$$ 10853177 10662956 10779011 10730108 10918840 10924367 10839648 10985618 10868170 10881440 11068358
5534A1068358M435J57712J65581L1795j74078k2279J80816N3559k4292p0088K4714
$$ 11068358 11072793 11230505 11396086 11427881 11253803 11231524 11412340 11465899 11441607 11371519 11396233
5523A1396233j82838L699j43086k87877L49893K86962L06295Q3883j21234k23045
$$ 11396233 11213395 11217094 11074008 10786131 11136024 11422986 11729281 11813164 11691930 11468885
5513A1468885J35245K9571o2237m048j10807j02539o0255L91598k33666n8259
$$ 11468885 11604130 11633701 11571464 11567416 11456609 11354070 11293815 11685413 11451747 11393488
5503A1393488M2725o4896J40409M70052k4446J8892O6997M0986j89587N7040L1498
$$ 11393488 11436213 11371317 11511726 11981778 11957332 11976224 12043221 12084207 11894620 11951660 11983158
5492A1983158k9946m9188N0323J37011k60267q8312j25584N4883L23271J61492
$$ 11983158 11953212 11904024 11954347 12091358 11831091 11742779 11617195 11672078 11995349 12156841
5482A2156841K66130Q8462j12161J15714m9776j97651K41565j7082m83345J66883
$$ 12156841 12422971 12511433 12399272 12514986 12465210 12267559 12509124 12492042 12008697 12175580
5472A2175580k48484k0505j08063K1972K8224M86370L0817j15866K98155l2523
$$ 12175580 11927096 11906591 11798528 11820500 11848724 12335094 12365911 12250045 12548200 12515677
5462A2515677L87051J05227p3771k06464l7691Q3789l2939k27565J2516j04565
$$ 12515677 12902728 13007955 12934184 12727720 12690029 12773818 12740879 12513314 12525830 12421265
5452A2421265J63562J19436l34864R1184P6355L89518j22330L644P2508j45775
$$ 12421265 12584827 12704263 12369399 12460583 12536938 12926456 12804126 12807770 12880278 12734503
5442A2734503J43477J83832j9971J34974n28255j89843K46868k71829M3961q1397
$$ 12734503 12877980 13061812 13041841 13176815 12648560 12458717 12705585 12433756 12477717 12396320
5432A2396320J38393N59545J61692n0008l0081K86949J07884k05749O0280M7584
$$ 12396320 12534713 13094258 13255950 13205942 13175861 13462810 13570694 13364945 13425225 13472809
5422A3472809k8067Q4838N2406q0112m07867m7877M6866l8546K18089J5604L3364
$$ 13472809 13444742 13529580 13581986 13501874 13094007 13046130 13092996 13054450 13272539 13288143 13321507
5411A3321507J75686O9473N0767K95447r4447q3635l3002M7398j00419j03688
$$ 13321507 13497193 13566666 13617433 13912880 13818433 13734798 13701796 13749194 13648775 13545087
5401A3545087O7871j1528l7849J53176k28018j00925K50184j3200K10771K8645
$$ 13545087 13612958 13601430 13563581 13716757 13488739 13387814 13637998 13624798 13835569 13864214
5391A3864214Q2958K71840K20751K27145k49853k81547j46738o0440q0322o6241
$$ 13864214 13947172 14219012 14439763 14666908 14417055 14135508 13988770 13928330 13848008 13781767
5381A3781767Q72K05795K89888Q5767K90413p3637J13323m8167K17871M4876j64222
$$ 13781767 13782639 13988434 14278322 14364089 14654502 14580865 14694188 14646021 14863892 14908768 14744546
5370A4744546K50252l51536j55873M3554J87966Q902j45856k90640R6047K8791
$$ 14744546 14994798 14643262 14487389 14530943 14718909 14727811 14581955 14291315 14387362 14416153
5360A4416153K21258K31423M2255K94106p8296N6409j21865K16171J51505l24562
$$ 14416153 14637411 14868834 14911089 15205195 15126899 15183308 15061443 15277614 15429119 15104557
5350A5104557Q8752l01357L9234K13903J03903l73700j47257J58161k20303M68112
$$ 15104557 15193309 14891952 14931186 15145089 15248992 14875292 14728035 14886196 14665893 15134005
5340A5134005K63780j45432J81542J92795q4023J81263j57685j51635j82830J54828
$$ 15134005 15397785 15252353 15433895 15626690 15542667 15723930 15566245 15414610 15231780 15386608
5330A5386608J17522k22422J4383J10048K24692J26735L2845K0637q1213J14777
$$ 15386608 15504130 15281708 15296091 15406139 15630831 15757566 15790411 15811048 15729835 15844612
5320A5844612K93570r5799P803j8878j11072j44441K7427j18313p4426k0088K60522
$$ 15844612 16138182 16042383 16050186 16031308 15920236 15775795 15803222 15684909 15610483 15590395 15850917
5309A5850917J78332n8058K71437p8648j44059L52008K79728j83718j34001l2100
$$ 15850917 16029249 15971191 16242628 16163980 16019921 16371929 16651657 16467939 16333938 16301838
5299A6301838J04313L51300k47145R3809k43308m3418J74288j05551M4653N8274
$$ 16301838 16406151 16757451 16510306 16604115 16360807 16317389 16491677 16386126 16430779 16489053
5289A6489053N64270l7765L3588K6258n7434j9300L11835p8869r9551p5884k9923
$$ 16489053 17053323 17015558 17049146 17075404 17017970 16998670 17310505 17231636 17132085 17056201 17026278
5278A7026278L7154j29891k61570K00391J03481q0997J87086O6583N13528P9107
$$ 17026278 17063432 16933541 16671971 16872362 16975843 16894846 17081932 17148515 17662043 17741150
5268A7741150l60187j87130N95199R8655j54833k00376p7508P2373N1910n8758
$$ 17741150 17380963 17193833 17789032 17887687 17732854 17532478 17454970 17527343 17579253 17520495
5258A7520495R060M9048J93925J8557N3064J82830J53576K14686k93721J99701
$$ 17520495 17529555 17578603 17772528 17791085 17844149 18026979 18180555 18395241 18101520 18301221
5248A8301221k68064K48761J36014j49315J62374o0760Q4915j257R7310J31401
$$ 18301221 18033157 18281918 18417932 18268617 18430991 18370231 18455146 18453889 18551199 18682600
5238A8682600k70108J58788J26770M6612M06333N4106O6644k45466R8974j56018
$$ 18682600 18412492 18571280 18698050 18744662 19150995 19205101 19271745 19026279 19125253 18969235
5228A8969235J9461J20386k69198K74032J20154R3018J37457N0329j40868J71122
$$ 18969235 18988696 19109082 18839884 19113916 19234070 19327088 19464545 19514874 19374006 19545128
5218A9545128L2597r1078K68379K44569o652P0067J29028L6953k1514K03873R7309
$$ 19545128 19577725 19486647 19755026 19999595 19992943 20063010 20192038 20228991 20207477 20411350 20508659
5207B0508659J7839Q3710j18753K09807p2480R4514K16023K4014k97349L00180
$$ 20508659 20526498 20610208 20491455 20701262 20628782 20723296 20939319 20963333 20665984 20966164
5197B0966164M40966k36559o4807j1035N21414O3945j49187K67817N19810R6067
$$ 20966164 21407130 21170571 21105764 21094729 21616143 21680088 21530901 21798718 22318528 22414595
5187B2414595n26761J99172L21776j13410J21390r8629Q2510L5617O4773o0027
$$ 22414595 21887834 22087006 22408782 22295372 22416762 22318133 22400643 22436260 22501033 22441006
5177B2441006l76326J92558K4332J35964j95833K66016L35326k84963K6425K4094
$$ 22441006 22064680 22257238 22281570 22417534 22221701 22487717 22823043 22538080 22564505 22588599
5167B2588599J92321J11698j63166O0629K351M07609J75146l41705R771R0478
$$ 22588599 22780920 22892618 22729452 22790081 22792432 23200041 23375187 23033482 23043253 23133731
5157B3133731Q565Q6251J26931P2618Q2319m5265N640L17183K92004o6316R8215
$$ 23133731 23142296 23228547 23355478 23428096 23510415 23465150 23470790 23787973 24079977 24013661 24111876
5146B4111876K87177K52159j45569J38384K4114k40293J02760P4358Q1729J61280
$$ 24111876 24399053 24651212 24505643 24644027 24668141 24427848 24530608 24604966 24686695 24847975
5136B4847975J53204j19763q1464k93836q5952J18379O6213J06233P503r7375
$$ 24847975 25001179 24881416 24799952 24506116 24420164 24538543 24604756 24710989 24718492 24621117
5126B4621117N79933J9894l45627M4876J26273R7035l9564L52903N18641j06526
$$ 24621117 25201050 25220944 24875317 24920193 25046466 25143501 25103937 25456840 25975481 25868955
5116B5868955j57414O0757M2509l564M4970J89237m7547K1907Q8518k0449J62896
$$ 25868955 25711541 25772298 25814807 25811243 25856213 26045450 25997903 26019810 26108328 26087879 26250775
5105B6250775r4840r3778O15107M58723j5755K62042P4924k2566J17547J50479
$$ 26250775 26155935 26062157 26677264 27135987 27120232 27382274 27457198 27434632 27552179 27702658
5095B7702658p8398j14345J23153K21982K93926j37252O8424J55691K43940j36779
$$ 27702658 27624260 27509915 27633068 27855050 28148976 28011724 28080148 28235839 28479779 28343000
5085B8343000J25140K41790K88002L48144o6234P1205J95059J44916L00044j12720
$$ 28343000 28468140 28709930 28997932 29346076 29279842 29351047 29546106 29691022 29991066 29878346
5075B9878346L95436K26916k33863J56864j84854L66869M85166K61368J57813
$$ 29878346 30273782 30500698 30266835 30423699 30238845 30605714 31090880 31352248 31510061
5066C1510061L95633N11263n8379K90588N49908M87254m6676J82497j50704K27403
$$ 31510061 31905694 32416957 32358578 32649166 33199074 33686328 33639652 33822149 33671445 33898848
5056C3898848J69544L43868J94847M56286M87895O35624J1367K33846O75951L60041
$$ 33898848 34068392 34412260 34607107 35063393 35551288 36186912 36198279 36432125 37108076 37468117
5046C7468117L70442M45807L38330J30336N33411M2089K60185J81634K91984L34230
$$ 37468117 37838559 38284366 38622696 38753032 39286443 39328532 39588717 39770351 40062335 40396565
5036D0396565L88950J29735M24492M35705J40835O33157L71903L6741K86886L27472
$$ 40396565 40785515 40915250 41339742 41775447 41916282 42549439 42921342 42958083 43244969 43572441
5026D3572441K42554j16601O0772L94639K74045M68444M46469O4029L53992K07200
$$ 43572441 43814995 43698394 43759166 44153805 44427850 44896294 45342763 45406792 45760784 45967984
5016D5967984N29441N43110P26538O55734M67604N73554N80445M13613N57445
$$ 45967984 46497425 47040535 47767073 48422807 48890411 49463965 50044410 50458023 51015468
5007E1015468P5077K57490K55850M79004K04432L9114k86147J03643O06675J65623
$$ 51015468 51090545 51348035 51603885 52082889 52287321 52326435 52040288 52143931 52750606 52916229
4997E2916229J17648K09824l08716J42287j93045l14573j31084k05907l6911K20550
$$ 52916229 53033877 53243701 52934985 53077272 52884227 52569654 52438570 52232663 52195752 52416302
4987E2416302r240l55397o4244k2970M2800N41480J64451k65165M62429K58101
$$ 52416302 52407062 52051665 51987421 51964451 52007251 52548731 52713182 52448017 52910446 53168547
4977E3168547J29671K03021j92588J56220O19212J99065j08048K00701K35503
$$ 53168547 53298218 53501239 53308651 53464871 54084083 54283148 54175100 54375801 54611304
4968E4611304K46672Q6442J73747O11024L95917N53959M23272O99626N55072P26945
$$ 54611304 54857976 54944418 55118165 55729189 56125106 56679065 57102337 57801963 58357035 59083980
4958E9083980O21616P51418O03462P64718J173854O36675N82799J022801Q47192
$$ 59083980 59705596 60457014 61060476 61825194 62999048 63635723 64218522 65241323 66088515
4949F6088515Q10733J191015J045398J383938J208137J276262J868109J355945
$$ 66088515 66899248 68090263 69135661 70519599 71727736 73003998 74872107 76228052
4941G6228052J642180J220859J620224J567091J922770K065698J819422K057378
$$ 76228052 77870232 79091091 80711315 82278406 84201176 86266874 88086296 90143674
4933I0143674K388094K129448K420597L024014K935692K866787L588568L808551
$$ 90143674 92531768 94661216 97081813 100105827 103041519 105908306 109496874 113305425
4925A13305425M111302M165610M623132N122115N681126O081835O445294P419980
$$ 113305425 117416727 121582337 126205469 131327584 137008710 143090545 149535839 156955819
4917A56955819Q037571Q663290R351323R828480J0825569J1686316J2074301J2321360
$$ 156955819 164993390 173656680 183008003 192836483 203662052 215348368 227422669 239744029
4909B39744029J1882656J1302753R455788Q300047N472305K874791O4061l085637
$$ 239744029 251626685 262929438 272385226 280685273 286157578 289032369 289096430 286010793
4901B86010793n823330p519549q434675q360581q131451o898779n163997m825302
$$ 286010793 280187463 272667914 264233239 255872658 247741207 240842428 235678431 230853129
4893B30853129l602260k445310j800087j397923l62413m20601k12685M86272N08629
$$ 230853129 227250869 224805559 223005472 221607549 221245136 220824535 220611850 221098122 221606751
4884B21606751P76726R96350Q94540J268895J352558J817871J912858K703653
$$ 221606751 222383477 223379827 224274367 225543262 226895820 228713691 230626549 233330202
4876B33330202L287288M160285N203980O270411P947877Q259383R238277J0603890
$$ 233330202 236617490 240777775 245981755 252252166 260200043 268459426 277697703 288301593
4868B88301593J1339102J1695570J1491414J0455158R351802O882181M119167
$$ 288301593 299640695 311336265 322827679 333282837 342634639 349516820 353635987
4861C53635987Q17072l188994o916877j0290341j2236899j2584699j2456025j1992452
$$ 353635987 354453059 351264065 344347188 334056847 321819948 309235249 296779224 284786772
4853B84786772j0934141r801314q709895q154406p798092p262181p028273o681509
$$ 284786772 273852631 264051317 255341422 247187016 239388924 232126743 225098470 218416961
4845B18416961o827794o243443o548191o107684n586334n637880n109544m667747
$$ 218416961 211589167 205345724 198797533 192689849 187103515 181465635 176356091 171688344
4837A71688344m507860m072065m539482m011625l722715l495065l846768l606926
$$ 171688344 167180484 163108419 158568937 154557312 150834597 147339532 143492764 139885838
4829A39885838l342343l950945l379136l155838l096305l071731l057930k839629
$$ 139885838 136543495 132592550 129213414 126057576 122961271 119889540 116831610 113991981
4821A13991981k441516k496998k269215k547538k194812k258926k275121j862715
$$ 113991981 111550465 109053467 106784252 104236714 102041902 99782976 97507855 95645140
4813I5645140j756744k037665j911204k485753j906968j586873k194649j644935
$$ 95645140 93888396 91850731 89939527 87453774 85546806 83959933 81765284 80120349
4805H0120349j596768j464802j395285j162638q74063j310615j198424j326229
$$ 80120349 78523581 77058779 75663494 74500856 73626793 72316178 71117754 69791525
4797F9791525j294602j437933j128941j051132j045908p77640o39854j098522
$$ 69791525 68496923 67058990 65930049 64878917 63833009 63055369 62415515 61316993
4789F1316993q77019j297468q40524m64876p91461o89086o79680o41347p74541
$$ 61316993 60439974 59142506 58301982 57837106 57045645 56356559 55676879 55035532 54260991
4780E4260991q51189m84970l39448n08988o85826o22088l91774o88311n35454
$$ 54260991 53409802 52924832 52585384 52076396 51390570 50768482 50376708 49688397 49152943
4771D9152943r15879k41092l45418q2828l32982j14372j50743j21757j47063j70870
$$ 49152943 48237064 47995972 47650554 47567726 47234744 47120372 46969629 46847872 46700809 46529939
4761D6529939r2520k33042j81958k69400l18939n22709o74618o78894k85565o51243
$$ 46529939 46437419 46204377 46022419 45753019 45434080 44911371 44236753 43557859 43272294 42621051
4751D2621051m21059n61648m09931l73727r02132n92285m55771m48480l86800
$$ 42621051 42199992 41638344 41228413 40854686 39952554 39360269 38904498 38456018 38069218
4742C8069218o52849p47291m09918n42334o53640o34264j52675k01122o80436
$$ 38069218 37416369 36669078 36259160 35716826 35063186 34428922 34276247 34075125 33394689
4733C3394689l98109n2436l78374j61418j4777k29033m95175l98330k39069J0633
$$ 33394689 32996580 32944144 32565770 32404352 32389575 32160542 31665367 31267037 31027968 31038601
4723C1038601q17963m60212J40957j0412n15473k38404k56841P9542L82886n01336
$$ 31038601 30220638 29760426 29901383 29890971 29375498 29137094 28880253 28959795 29342681 28841345
4713B8841345j6798j56352k44587r2470k08922m19391k99697j25220j84343j29362
$$ 28841345 28824547 28668195 28423608 28331138 28122216 27702825 27403128 27277908 27093565 26964203
4703B6964203O1881l53860j58277j71600q2938O6017j91341Q585j6000m43836
$$ 26964203 27026084 26672224 26513947 26342347 26259409 26325426 26134085 26142670 26126670 25682834
4693B5682834J18782J67014k47999k38387q1257j63626n26892k48442M68656l23770
$$ 25682834 25801616 25968630 25720631 25482244 25400987 25237361 24710469 24462027 24930683 24606913
4683B4606913k61963j12893k6020m1867r3987n8273j27058j41006j35189M6020
$$ 24606913 24344950 24232057 24206037 24164170 24070183 24011910 23884852 23743846 23608657 23654677
4673B3654677P9426j31609L7944j98657O859n7035R511l90214m9342J99970l5327
$$ 23654677 23734103 23602494 23640438 23441781 23448640 23391605 23401116 23010902 22961560 23161530 23126203
4662B3126203o8488k82823K47550o8496K17797o2277m56371N8325j85041P7375
$$ 23126203 23057715 22774892 23022442 22953946 23171743 23109466 22653095 22711420 22526379 22603754
4652B2603754k90581j42695K43339l65820p9179P6218l40592p0245J84863r9602
$$ 22603754 22313173 22170478 22413817 22047997 21968818 22045036 21704444 21634199 21819062 21719460
4642B1719460j9121j54315J35118J36422M0523l99684K08158j70909J42459j26182
$$ 21719460 21700339 21546024 21681142 21817564 21858087 21458403 21666561 21495652 21638111 21511929
4632B1511929j95373K12628j13167l1350J2079k1455R1203o8545O4110L75847
$$ 21511929 21316556 21529184 21416017 21384667 21396746 21375291 21466494 21397949 21462059 21837906
4622B1837906L3341k56904k89460J62569m11257K40185K0976k50708J53746o6292
$$ 21837906 21871247 21614343 21324883 21487452 21076195 21316380 21337356 21086648 21240394 21174102
4612B1174102k86866j90138P582L69600J82744j62638o5991l42372k06844n085
$$ 21174102 20887236 20697098 20704680 21074280 21257024 21094386 21028395 20686023 20479179 20474094
4602B0474094J96095J69034j50286k41858k44Q4465R827L97892m58962k02944
$$ 20474094 20670189 20839223 20688937 20447079 20446835 20531300 20541127 20939019 20480057 20277113
4592B0277113K18588k097K84851j7756n2512j27039J47782q3010K53219J44634
$$ 20277113 20495701 20493604 20778455 20760699 20708187 20581148 20728930 20645920 20899139 21043773
4582B1043773p9255J75741l9433K82700P8674m21734k34279k19591P9418J5729
$$ 21043773 20964518 21140259 21100826 21383526 21462200 21040466 20806187 20586596 20666014 20681743
4572B0681743O652k43034l35616l43562N1592k59239j17689p620j47197R5185
$$ 20681743 20688395 20445361 20109745 19766183 19817775 19558536 19440847 19433227 19286030 19381215
4562A9381215P2003k53337j52063l08828j80176J39190K09418l30352R3951j3307
$$ 19381215 19453218 19199881 19047818 18738990 18558814 18698004 18907422 18577070 18671021 18657714
4552A8657714l31837j65822J82716K15785k91704l180j0614k6235r8356q64l27750
$$ 18657714 18325877 18160055 18342771 18558556 18266852 18263672 18253058 18226823 18128467 18127603 17799853
4541A7799853q7626R7715o37J61106k50577L4701j75952K09701Q8400n79095M4485
$$ 17799853 17712227 17809942 17809305 17970411 17719834 17754535 17578583 17788284 17876684 17297589 17342074
4530A7342074J7273K5264P379j52017K30482j80571k7737j99460K40274J41704
$$ 17342074 17359347 17384611 17391990 17239973 17470455 17289884 17262147 17062687 17302961 17444665
4520A7444665l43081K03105J8248J57102o0842o3942k51947J08393k97620k2491
$$ 17444665 17101584 17304689 17322937 17480039 17419197 17355255 17103308 17211701 16914081 16891590
4510A6891590P1975J91740j84373J62890o26j93787K8686R6886K03012k13413
$$ 16891590 16963565 17155305 16970932 17133822 17133196 16939409 16968095 17064981 17267993 17054580
4500A7054580K3710K13332M7429k38252l47119Q6182L13942o3884j42930Q4323
$$ 17054580 17078290 17291622 17339051 17100799 16753680 16839862 17153804 17089920 16946990 17031313
4490A7031313L2686L93858k24716k82913J31733L48175J88155l56726j34037J76735
$$ 17031313 17063999 17457857 17233141 16950228 17081961 17430136 17618291 17261565 17127528 17304263
4480A7304263m8966n19K3903l31191N4687j29999k9156K43582j07261j54763o0316
$$ 17304263 17255297 17254778 17278681 16947490 17002177 16872178 16843022 17086604 16979343 16824580 16764264
4469A6764264K3726j72415J19463r0906j16109l56717O5035J00658j24420j70611
$$ 16764264 16787990 16615575 16735038 16644132 16528023 16171306 16236341 16336999 16212579 16041968
4459A6041968j34198K01527J28983O3074L12566l43503k39137J24120O3003q9286
$$ 16041968 15907770 16109297 16238280 16301354 16613920 16270417 16031280 16155400 16218403 16129117
4449A6129117k46203j74730J46321K19901J6402L75036m30405k54823M09201J7262
$$ 16129117 15882914 15708184 15854505 16074406 16090808 16465844 16035439 15780616 16189817 16207079
4439A6207079l54483J88941p1660J90821J56198J35125l15846j31182L24507J83700
$$ 16207079 15852596 16041537 15969877 16160698 16316896 16452021 16136175 16004993 16329500 16513200
4429A6513200l98244J23727L43185l20755L48598J54232j11784j26923j34520
$$ 16513200 16114956 16238683 16581868 16261113 16609711 16763943 16652159 16525236 16390716
4420A6390716o637J81665M05790L29114q7248Q189R134L52176j11142k00224K74840
$$ 16390716 16384079 16565744 16971534 17300648 17213400 17221589 17230723 17582899 17471757 17271533 17546373
4409A7546373R7269p8910M26401O49188J39327K04848J63749L36635j59111n7167
$$ 17546373 17643642 17564732 17991133 18640321 18779648 18984496 19148245 19484880 19325769 19268602
4399A9268602m70038J9676K21669l26309n76789l18832j79878k37177M7015k13919
$$ 19268602 18798564 18818240 19039909 18713600 18136811 17817979 17638101 17400924 17447939 17234020
4389A7234020m27701j1566k55146k50179L9842r5473j04626R9953l1126K32323
$$ 17234020 16806319 16794753 16539607 16289428 16329270 16233797 16129171 16229124 16197998 16430321
4379A6430321r9891q1463j9278l28700L36L8275M043N1923j09617J21054J32625
$$ 16430321 16330430 16248967 16229689 15900989 15901325 15939600 15943643 15995566 15885949 16007003 16139628
4368A6139628L4435p2679j98411J91030N5768J01642k36505M39352K62361J08341
$$ 16139628 16174063 16101384 15902973 16094003 16149771 16251413 16014908 16454260 16716621 16824962
4358A6824962j64709K81565J35524J57237N17101L08279j59514k7954M81090M6591
$$ 16824962 16660253 16941818 17077342 17234579 17751680 18059959 17900445 17872491 18353581 18400172
4348A8400172m47831k42749k7227m71708j47080k46951j39432o35223q9046p8518
$$ 18400172 17952341 17709592 17682365 17210657 17063577 16816626 16677194 16041971 15952925 15874407
4338A5874407J32322M0992k82742k79134L20712q9477l04668M3563R4947R2571
$$ 15874407 16006729 16047721 15764979 15485845 15806557 15717080 15412412 15455975 15550922 15643493
4328A5643493k45106K6175j46283k5207q1276J31748K26353j7323l46871l5788
$$ 15643493 15398387 15424562 15278279 15253072 15171796 15303544 15529897 15512574 15165703 15129915
4318A5129915L77185j23403L45035J3215j89288M5294J33042J36759L45707K56005
$$ 15129915 15507100 15383697 15728732 15741947 15552659 15597953 15730995 15867754 16213461 16469466
4308A6469466N6290r2628Q1720L90172L10812N7380J61096O04444M35191J020959
$$ 16469466 16525756 16433128 16514848 16905020 17215832 17273212 17434308 18038752 18473943 19494902
4298A9494902N81940N85059Q58999Q00843M92643J096328J183618J306860J102076
$$ 19494902 20076842 20661901 21520900 22321743 22814386 23910714 25094332 26401192 27503268
4289B7503268J453890Q01247K62877Q20991N1934q88918j233009j269067j281106
$$ 27503268 28957158 29758405 30021282 30842273 30894207 30005289 28772280 27503213 26222107
4280B6222107j613299j132414r11512r17358j082331j106591p97901p62766m00619
$$ 26222107 24608808 23476394 22564882 21647524 20565193 19458602 18660701 17897935 17497316
4271A7497316k90638n35125j22214j55154r5219l50742l18943m16660j95o7052
$$ 17497316 17206678 16671553 16549339 16394185 16298966 15948224 15629281 15212621 15212426 15145374
4261A5145374m96373n34203K2586j11881M4816l28165k40503J45938l84825j91269
$$ 15145374 14649001 14114798 14137384 14025503 14070319 13742154 13501651 13647589 13262764 13071495
4251A3071495K58476k2612k53884K23316j20321J43313k12599O2610l43335l95809
$$ 13071495 13329971 13307359 13053475 13276791 13156470 13299783 13087184 13149794 12806459 12410650
4241A2410650L0531K2544m18354k84889o7551K74352J09389K422p9650l44784
$$ 12410650 12441181 12463725 12045371 11760482 11692931 11967283 12076672 12079094 11999444 11654660
4231A1654660P0480M86370k26458J51327M42897j78990n29182j6120o5198k64886
$$ 11654660 11725140 12211510 11985052 12136379 12579276 12400286 11871104 11854984 11789786 11524900
4221A1524900J25791j5937J86496J6210J21095N467l23865L0000o1997L09904
$$ 11524900 11650691 11634754 11821250 11837460 11958555 11964022 11640157 11670157 11608160 11918064
4211A1918064J72130J8582k43401k56032j33543J1022J12673m2731k11995j47870
$$ 11918064 12090194 12108776 11865375 11609343 11475800 11486822 11599495 11556764 11344769 11196899
4201A1196899K63559k168J19681J82715l45746k6928J61720K1207r9315l24805
$$ 11196899 11460458 11458290 11577971 11760686 11414940 11388012 11549732 11570939 11471624 11146819
4191A1146819M0805p7544P7541l17157n4184r7844K23727j86600R3311L47010
$$ 11146819 11187624 11110080 11187621 10870464 10816280 10718436 10942163 10755563 10848874 11195884
4181A1195884l17749q3562K9846J47649q4057j05098o1109Q348l81875J50060
$$ 11195884 10878135 10794573 10824419 10972068 10888011 10782913 10721804 10730152 10348277 10498337
4171A0498337L6329j05804J23664K58034k23713j5742K57131j9220m14161m0510
$$ 10498337 10534666 10428862 10552526 10810560 10586847 10571105 10828236 10809016 10394855 10354345
4161A0354345J09958j0646j90842r736k74570k96482j3411L74390l5426r2923
$$ 10354345 10464303 10453657 10262815 10253079 9978509 9682027 9668616 10043006 10007580 9914657
4151I914657M1776j23486L4763k4501J26590O8475J4088J9225J96525J5072J34457
$$ 9914657 9956433 9832947 9867710 9843209 9969799 10038274 10052362 10071587 10268112 10283184 10417641
4140A0417641m30568q104M9215J1356k94545o9614J32853O0007L71047j31925
$$ 10417641 9987073 9978969 10028184 10039540 9744995 9675381 9808234 9868241 10239288 10107363
4130A0107363k29971j8634l6285J35773j65278J8368J21647N494j11347j67840
$$ 10107363 9877392 9858758 9822473 9958246 9792968 9811336 9932983 9938477 9827130 9659290
4120I659290p2622l7044k1347m89589l07966J20931k8151K37013O8795J47443
$$ 9659290 9586668 9549624 9528277 9038688 8730722 8851653 8823502 9060515 9129310 9276753
4110I276753k28287K39468j45889j79407M8414l02394j30539L08056r756m40783
$$ 9276753 9048466 9287934 9142045 8962638 9011052 8708658 8578119 8886175 8876419 8435636
4100H435636J47004k0957j58753m4324L42454K8907l69027J29457J21361N3227
$$ 8435636 8582640 8561683 8402930 8358606 8701060 8729967 8360940 8490397 8611758 8664985
4090H664985k506l72577J21675P647J01383j45618l3552Q2533J05590O0501J04067
$$ 8664985 8662479 8289902 8411577 8419224 8520607 8374989 8341437 8423970 8529560 8590061 8694128
4079H694128Q894p1238q9478J13767k97580N560p3981m54063J79187O4000M6392
$$ 8694128 8703022 8631784 8542306 8656073 8358493 8364053 8290072 7836009 8015196 8079196 8125588
4068H125588k41374j62613J15991O478r7468J89729k80276P0581j30013Q128j14644
$$ 8125588 7884214 7721601 7837592 7844070 7746602 7936331 7656055 7726636 7596623 7604751 7490107
4057G490107K1410K1814j86652J07532J6934J68677r3777o3206j32026N914J40678
$$ 7490107 7511517 7533331 7346679 7454211 7471145 7639822 7546045 7482839 7350813 7356727 7497405
4046G497405j6169M13688M4434k09732J26868l36494j27697L6461j55369j1934
$$ 7497405 7481236 7894924 7939358 7729626 7856494 7520000 7392303 7428764 7273395 7261461
4036G261461J98929K22443J89042k44640k54756L16695M70k01934J43406j09043
$$ 7261461 7460390 7682833 7871875 7627235 7372479 7689174 7689644 7487710 7631116 7522073
4026G522073j8124n8465l44417K10522Q8480J9210j02597J5055K23871k31813
$$ 7522073 7503949 7445484 7101067 7311589 7400069 7419279 7316682 7331737 7555608 7323795
4016G323795k66876k2260L14390m3438J00101j46048K61291O0245l15629j92347
$$ 7323795 7056919 7034659 7349049 7305611 7405712 7259664 7520955 7581200 7265571 7073224
4006G073224M1154N7806k25488P8196J83403j98551j81921j13605J21547N2637
$$ 7073224 7114378 7172184 6946696 7024892 7208295 7009744 6827823 6714218 6835765 6888402
3996F888402o5628J47784J27365L9033q7608p7224K57279o8295j61507j09478
$$ 6888402 6822774 6970558 7097923 7136956 7049348 6972124 7229403 7161108 6999601 6890123
3986F890123O5048J41094P4835K2172k52343k93305r3817Q6355n3161J76856m4908
$$ 6890123 6955171 7096265 7171100 7193272 6940929 6647624 6553807 6640162 6587001 6763857 6718949
3975F718949r5756j16756n7876L20832j50420n9769l32393P0269L30932n08169
$$ 6718949 6623193 6506437 6448561 6769393 6618973 6559204 6226811 6297080 6628012 6119843
3965F119843P6977J87911K69918k9248K47296r8673K57634j37976k72140j42538
$$ 6119843 6196820 6384731 6654649 6625401 6872697 6774024 7031658 6893682 6621542 6479004
3955F479004j74433L32304l64501q2176j3278N3687J66155K06496q5014k43946
$$ 6479004 6304571 6636875 6272374 6190198 6176920 6230607 6396762 6603258 6518244 6274298
3945F274298k7160m1308K38968k02784L7447J62044j77248j8682j38547l0025
$$ 6274298 6247138 6205830 6444798 6242014 6279461 6441505 6264257 6245575 6107028 6077003
3935F077003M5242j20156p4937j08k70831j27960N5224K24765n827j35045R9356
$$ 6077003 6122245 6002089 5927152 5927044 5656213 5528253 5583477 5808242 5802415 5667370 5766726
3924E766726K18914J91221j8571k96416O6379K08694k33222j70463J35843l07843
$$ 5766726 5985640 6176861 6158290 5861874 5928253 6136947 5903725 5733262 5869105 5561262
3914E561262k04255K37954J8591K92058j73198r1149K62809J58994r4810J96631
$$ 5561262 5357007 5594961 5613552 5905610 5732412 5641263 5904072 6063066 5968256 6164887
3904F164887l15988J724K32036j18561k51283J61903k55177j59058k8527J6073
$$ 6164887 5848899 5850623 6082659 5964098 5712815 5874718 5619541 5460483 5431956 5448029
3894E448029N11676R766l90463p0403J98095J06943j5070l13386r4333J70266
$$ 5448029 5959705 5969471 5579008 5508605 5706700 5813643 5798573 5485187 5390854 5561120
3884E561120Q4474p8124K7996l61907J84679K879l50047K04544K32099k0545j42237
$$ 5561120 5645594 5567470 5595466 5233559 5418238 5421117 5071070 5275614 5507713 5487168 5344931
3873E344931K49054j37325k35921J41557j07640r4786K59569P0444N2532k33781
$$ 5344931 5593985 5456660 5220739 5362296 5254656 5159870 5419439 5489883 5542415 5308634
3863E308634k20767J10893k42381L02802k08954l9141o9513N6158J45694J68642
$$ 5308634 5087867 5198760 4956379 5259181 5050227 5011086 4941573 4997731 5143425 5312067
3853E312067l4866J67812m37675k4583K9885J73528q0133l3648M3979m14705L65632
$$ 5312067 5277201 5445013 5007338 4982755 5012640 5186168 5106035 5072387 5116366 4701661 5067293
3842E067293j09855J57487j53616m14473J88400K11713J01O0496j21422O9407
$$ 5067293 4957438 5114925 4961309 4546836 4735236 4946949 4947050 5007546 4886124 4955531
3832D955531J70797J5580j50496k91583K83692M7026m05488n2396L29131j59371
$$ 4955531 5126328 5141908 4991412 4699829 4983521 5030547 4625059 4572663 4901794 4742423
3822D742423r7516J7558n1678k7627j03337M0208J31384J28189N2699l4518K05847
$$ 4742423 4644907 4662465 4610787 4583160 4479823 4520031 4651415 4779604 4832303 4797785 5003632
3811E003632J54252k18524n06013m3871L61909j83025k17782j54545M78693j26639
$$ 5003632 5157884 4939360 4433347 4389476 4751385 4568360 4350578 4196033 4674726 4548087
3801D548087m4203J96538l2847k16820N6296J79177l8536R5802j07725l46133
$$ 4548087 4503884 4700422 4667575 4450755 4507051 4686228 4647692 4743494 4635769 4289636
3791D289636O2757J50128J48324j69008j15998M0765j3403R1962J58557R5565
$$ 4289636 4352393 4502521 4650845 4481837 4365839 4406604 4393201 4485163 4643720 4739285
3781D739285L323j54933q4767k36950j68933K14309N01337k55403m06412O8615
$$ 4739285 4742608 4587675 4502908 4265958 4097025 4311334 4812671 4557268 4150856 4219471
3771D219471o4994K86432n927r2107k77890J21723R6006J35531j74380m5253K34184
$$ 4219471 4154477 4440909 4434982 4342875 4064985 4186708 4282714 4418245 4243865 4198612 4432796
3760D432796o5127o1134J44059K29139l21658p2710J63893j38166n2256Q7621
$$ 4432796 4367669 4306535 4450594 4679733 4358075 4285365 4449258 4311092 4258836 4346457
3750D346457j20045p453K4721N3167K4670K06807L7594q9842j10127l01121K33918
$$ 4346457 4226412 4218959 4243680 4296847 4321517 4528324 4565918 4476076 4365949 4064828 4298746
3739D298746N0584o7175k35984k05762J91520j48780j2818M6879j7053r9661j0754
$$ 4298746 4349330 4282155 4046171 3840409 4031929 3883149 3870331 3917210 3900157 3800496 3789742
3728C789742j13359K57941n974j31218K58565J30377j27401j79755N364L59866
$$ 3789742 3676383 3934324 3928350 3797132 4055697 4186074 4058673 3878918 3884282 4244148
3718D244148O7992k86675n5884O1079q9730l23476O9501K50698R9398j49084l976
$$ 4244148 4312140 4025465 3969581 4030660 3940930 3617454 3686955 3937653 4037051 3887967 3883991
3707C883991j3993J11178K52271J4946O2287R3240o4692J04128l90249l2429k18499
$$ 3883991 3869998 3981176 4233447 4248393 4310680 4403920 4339228 4443356 4053107 4020678 3802179
3696C802179o9444K12530l46114K38196Q5872J80252J89042J25584k55643J57217
$$ 3802179 3732735 3945265 3599151 3837347 3923219 4103471 4292513 4418097 4162454 4319671
3686D319671j32304j22801J31057J11056n14701j57572J72016L8923j88196q0049
$$ 4319671 4187367 4064566 4195623 4306679 3791978 3634406 3806422 3845345 3657149 3577100
3676C577100J2748j94216K19391J4374K01731J23673L74149l27171J08771j49364
$$ 3577100 3589848 3395632 3615023 3629397 3831128 3954801 4328950 4001779 4110550 3961186
3666C961186k30163J43137J02920R347j19101R275J33827j5760Q6908m1115R5483
$$ 3961186 3731023 3874160 3977080 3986427 3867326 3876601 4010428 3994668 4081576 4040461 4135944
3655D135944o2501J83971J55655L33976p8653j50499J61842k24761k63229j16540
$$ 4135944 4073443 4257414 4413069 4747045 4668392 4517893 4679735 4454974 4191745 4075205
3645D075205j51512j6097N688J24781J00559p9177R2909J31763m5145L03307R508
$$ 4075205 3923693 3907596 3913284 4038065 4138624 4059447 4152356 4284119 4238974 4542281 4551789
3634D551789M7183J25004M71158K9013k35213K9281p1239K3599j91136n19328
$$ 4551789 4598972 4723976 5195134 5224147 4988934 5018215 4946976 4970575 4779439 4260111
3624D260111J75033M37807l40181R1691K01687o3102L48035M29856j69282K3550
$$ 4260111 4435144 4872951 4532770 4624461 4826148 4763046 5111081 5540937 5371655 5395205
3614E395205J00994K8857m82057j77079O262J98356k97378K97663Q4433o7790
$$ 5395205 5496199 5525056 5042999 4865920 4872182 5070538 4773160 5070823 5155256 5087466
3604E087466L5164J25535M16052L09083K19207m5793l25589J57088K35848q0680
$$ 5087466 5122630 5248165 5664217 5973300 6192507 6146714 5821125 5978213 6214061 6133381
3594F133381l50764L8002K17619l60899N6976J24275L56845K30231j83752K17638
$$ 6133381 5782617 5820619 6038238 5677339 5734315 5858590 6215435 6445666 6261914 6479552
3584F479552M44135J73385K01217M43875j33098K41605J36883P6745l2216k12806
$$ 6479552 6923687 7097072 7298289 7742164 7609066 7850671 7987554 8064299 8032083 7819277
3574G819277L64380M11532N8702j00962K47705M01142K81350K89899O36623N58794
$$ 7819277 8183657 8595189 8653891 8552929 8800634 9201776 9483126 9773025 10409648 10968442
3564A0968442M85966O3379J64573N52154L31649K24265j9144M02965L59330k22644
$$ 10968442 11454408 11517787 11682360 12234514 12566163 12790428 12771284 13174249 13533579 13310935
3554A3310935j49771j2154m09721j68994j66819J00297k74846J18196m05728j16505
$$ 13310935 13161164 13149010 12739289 12570295 12403476 12503773 12228927 12347123 11941395 11824890
3544A1824890q8297m99648j40180l79830j06195n99328m78724l55743p17456j90529
$$ 11824890 11736593 11236945 11096765 10716935 10610740 10011412 9532688 9176945 8459489 8268960
3534H268960O6737k00505K80411m6014n8846j21107k61901l50044Q919m74499
$$ 8268960 8335697 8135192 8415603 8369589 8310743 8189636 7927735 7577691 7586610 7112111
3524G112111m1380n4283k72855o3759j00349l95406m8352k53212n9435L1350k26411
$$ 7112111 7070731 7016448 6743593 6679834 6579485 6184079 6135727 5882515 5823080 5854430 5628019
3513E628019k0893j28256k7301l7065J82996Q4266m44569n1019m15659j40138
$$ 5628019 5607126 5478870 5451569 5414504 5597500 5681766 5237197 5186178 4770519 4630381
3503D630381k4824n9757l14925j42057L23494J33715n0104l0359K50270r3626
$$ 4630381 4605557 4545800 4230875 4088818 4412312 4546027 4495923 4465564 4715834 4622208
3493D622208Q8854k0878j48661r6992k39548m9488j36634k64097j86649l07480
$$ 4622208 4711062 4690184 4541523 4444531 4204983 4155495 4018861 3754764 3568115 3260635
3483C260635l26573j11874R0379J41859M19545Q7824j22187k04515K32680L27632
$$ 3260635 2934062 2822188 2912567 3054426 3473971 3561795 3439608 3235093 3467773 3795405
3473C795405p1279j08929k02383j63808j53292k43188k26558J85082l78996J7641
$$ 3795405 3724126 3615197 3412814 3249006 3095714 2852526 2625968 2811050 2432054 2449695
3463B449695J42966j75102M28949L02284J13048j74332J63978Q8230k59570o5443
$$ 2449695 2592661 2417559 2846508 3148792 3261840 3087508 3251486 3339716 3080146 3014703
3453C014703k35741k83970l08357p7988l62796p4557J89012K02410K1393R8384
$$ 3014703 2778962 2494992 2186635 2108647 1745851 1671294 1860306 2062716 2084109 2182493
3443B182493K66449k47921J48685L49361K13128n10394O7770q5951N3301j81678
$$ 2182493 2448942 2201021 2349706 2699067 2912195 2401801 2469571 2383620 2436921 2255243
3433B255243k95969p2781k71368j4282K45736J74928L55294m88604K24132J73533
$$ 2255243 1959274 1886493 1615125 1600843 1846579 2021507 2376801 1888197 2112329 2285862
3423B285862K4634J99056l5420m1425j06026r533k19217k44622l6427r7119J26809
$$ 2285862 2310496 2509552 2474132 2432707 2326681 2317148 2097931 1853309 1816882 1719763 1846572
3412A846572J03894j80092N5885M7023J1895N1752K34132K18355r281k62581J6727
$$ 1846572 1950466 1770374 1826259 1873282 1885177 1936929 2171061 2389416 2380135 2117554 2134281
3401B134281j39126J22027l57749j95436r690n562j4052J10338l7418j01013M2669
$$ 2134281 1995155 2117182 1759433 1563997 1554307 1548745 1534693 1645031 1607613 1506600 1549269
3390A549269Q5425n2667J2974O8500J84985Q3431j00314j48110J39800j17656
$$ 1549269 1634694 1582027 1595001 1663501 1848486 1931917 1831603 1683493 1823293 1705637
3380A705637j94267j72449m0790p0222k10226K07729J62437M629Q793R9828K43386
$$ 1705637 1511370 1338921 1298131 1227909 1017683 1225412 1387849 1392478 1401271 1501099 1744485
3369A744485L9839j07184q8791k34738J05333q3661j26637l98752K01694J11416
$$ 1744485 1784324 1677140 1588349 1353611 1458944 1375283 1248646 849894 1051588 1163004
3359A163004r9689J15035K94292K80137o7256k5680p7640M1256K48443J12864
$$ 1163004 1063315 1178350 1472642 1752779 1685523 1659843 1582203 1623459 1871902 1984766
3349A984766k45736j02055n3607j22392j64371J891K95866J48524j81181J93563
$$ 1984766 1739030 1636975 1583368 1460976 1296605 1298496 1594362 1742886 1561705 1755268
3339A755268o4247R6067j0345K36175j0450J22519R7767p6599p7039l16282j2039
$$ 1755268 1691021 1787088 1776743 2012918 2002468 2124987 2222754 2146155 2069116 1752834 1740795
3328A740795J98482j24159j86538N5734l61071J50080P1240J45457M63683L68661
$$ 1740795 1939277 1815118 1628580 1684314 1323243 1473323 1544563 1690020 2153703 2522364
3318B522364l6353M1560j40150k28752J50959O0596L74257k30587o4994J39558
$$ 2522364 2486011 2527571 2387421 2158669 2309628 2370224 2744481 2513894 2448900 2588458
3308B588458j72330k36657J99476O8766K1255N5305l4457p9122J21430K66092
$$ 2588458 2416128 2179471 2378947 2447713 2468968 2524273 2489816 2410694 2532124 2798216
3298B798216q6449J54464m3240k55803m3666o1744m0413j38701j23158O64j80597
$$ 2798216 2711767 2866231 2822991 2567188 2523522 2461778 2421365 2282664 2159506 2160170 1979573
3287A979573J53850P6288L10247J14668k91756P1703J05304j25279K94801K53666
$$ 1979573 2133423 2209711 2519958 2634626 2342870 2414573 2519877 2394598 2689399 2943065
3277B943065j00632l30247L36141K7731k30402j55114P6282K2176j79024K61647
$$ 2943065 2842433 2512186 2848327 2876058 2645656 2490542 2566824 2589000 2409976 2671623
3267B671623j30040k0458R108J65777k246L9637J51937l28028j30659J42714l9849
$$ 2671623 2541583 2521125 2530233 2696010 2693764 2733401 2885338 2557310 2426651 2569365 2529516
3256B529516r6749L82015j68375j59241l1104L56618L54182j19236k61854l44209
$$ 2529516 2432767 2814782 2646407 2487166 2456062 2812680 3166862 3047626 2785772 2441563
3246B441563K99620K28740Q2939Q847j58543k64192N3919J46406j82461J60729
$$ 2441563 2741183 2969923 3052862 3061709 2903166 2638974 2692893 2839299 2656838 2817567
3236B817567n2476j42757J17987j56546K12059j17743l03200L81742J612k47245
$$ 2817567 2765091 2622334 2740321 2583775 2795834 2678091 2374891 2756633 2758245 2511000
3226B511000k24740M92833K18214j19286m9586k02141q8117O2825j20544L69106
$$ 2511000 2286260 2779093 2997307 2878021 2828435 2626294 2538177 2601002 2480458 2849564
3216B849564K56327k29511m4890K46327l07618N4928L2606j76986k81853K72720
$$ 2849564 3105891 2876380 2831490 3077817 2770199 2825127 2857733 2680747 2398894 2671614
3206B671614M3045K2221J90803l24073J41139j43445j28728J02479J88460r7413
$$ 2671614 2714659 2736880 2927683 2603610 2744749 2601304 2472576 2575055 2763515 2666102
3196B666102j82573l76796k51712K4268J53335k19657o6659j05082K67193k36935
$$ 2666102 2483529 2106733 1855021 1879289 2032624 1812967 1746308 1641226 1908419 1671484
3186A671484O1140J15308m0355m31683j91576K3192J71172k26282K6664o0473
$$ 1671484 1732624 1847932 1807577 1375894 1184318 1207510 1378682 1152400 1179064 1118591
3176A118591N9164o034j7524P1174l56642k4062K25151j21887K12061j46768q4957
$$ 1118591 1177755 1171721 1154197 1225371 868729 844667 1069818 947931 1159992 1013224 928267
3165I28267k8279j30888j63557J28171J28208j61058k1288k89933k2514j06586
$$ 928267 899988 769100 605543 733714 861922 700864 679576 389643 367129 260543
3155B60543J21755k13661K30864R3357q7576J03429J00713q6615l18p5348J17014
$$ 260543 382298 168637 399501 492858 405282 508711 609424 522809 522491 447143 564157
3144E64157k39982l31477N4628m3515j8015j24588Q9609L57068j9602J31674J38034
$$ 564157 324175 -7302 47326 3811 -14204 -138792 -49183 307885 288283 419957 557991
3133E57991N3070k96177k36237J91635k22100k73201l7558K44942n0444m52270
$$ 557991 611061 314884 78647 270282 48182 -225019 -262577 -17635 -68079 -520349
3123e20349j00106J66120L31574j6516q6247L64773K46782j64213j62008j72686
$$ -520349 -620455 -454335 -122761 -139277 -225524 139249 386031 221818 59810 -112876
3113a12876M6999N841k74779Q3071M9532O2131J30159k16364o8977j39086M2734
$$ -112876 -65877 -60036 -334815 -251744 -202212 -140081 -9922 -226286 -295263 -434349 -391615
3102c91615m6979O5043L72967j3944O3310J00743k54896l23914J78639p1844l05495
$$ -391615 -438594 -373551 -584 -14528 48782 149525 -105371 -429285 -250646 -322490 -627985
3091f27985L28958k00841l43020K48183M63161J64647l10584o449j97941K09031
$$ -627985 -299027 -499868 -842888 -594705 -131544 33103 -277481 -283930 -481871 -272840
3081b72840K15755q6472j5755l6096j19286j7775m2646M0041m11190J36948L36589
$$ -272840 -57085 -143557 -159312 -195408 -314694 -332469 -375115 -335074 -746264 -609316 -272727
3070b72727N155J73370j86236j49768j2849O8723J92238J18441K3247r8639k59402
$$ -272727 -267572 -94202 -280438 -430206 -443055 -374332 -182094 -63653 -40406 -139045 -398447
3059c98447L11229r3150q6693K2550n4035K53985L8545j51011j30730q2815j13707
$$ -398447 -87218 -180368 -267061 -244511 -298546 -44561 -6016 -157027 -287757 -370572 -484279
3048d84279k20037J33514K29339M05678j78047O2654m0701j69327R0529j00663
$$ -484279 -704316 -570802 -341463 64215 -113832 -51178 -91879 -261206 -170677 -271340
3038b71340r1913k7652j49301J16917k05608K2200o6114K85623L64195m66229
$$ -271340 -363253 -390905 -540206 -423289 -628897 -606697 -672811 -387188 -22993 -489222
3028d89222J93655K15592q7662l22215o8343J72538N5301k18427k1233L67460
$$ -489222 -295567 -79975 -167637 -489852 -558195 -385657 -330356 -548783 -570016 -202556
3018b02556K77585l16418k20347K01118m8763l72201L5138K28939m8880N2835
$$ -202556 75029 -241389 -461736 -260618 -309381 -681582 -646444 -417505 -466385 -413550
3008d13550O5585j32763j61150J05343o0809K36695R0772k92845j45216Q3634
$$ -413550 -347965 -480728 -641878 -536535 -597344 -360649 -269877 -562722 -707938 -624304
2998f24304L66195J43804K5857k93j14015j45337M8847K02367K8512o3955j03775
$$ -624304 -258109 -114305 -88448 -88741 -202756 -348093 -299246 -96879 -68367 -132322 -236097
2987b36097k32481J41269k95347P1870R0765J6386J03859M0875n0379M5808L97331
$$ -236097 -468578 -327309 -622656 -550786 -460021 -443635 -339776 -298901 -349280 -303472 93859
2976I3859l9020J641l09649k62233J69775J12644K9377J85209l07304J76675J42545
$$ 93859 54839 56480 -253169 -515402 -345627 -232983 -203606 -18397 -325701 -149026 -6481
2965f481J79890j0965j24819L01641k0851n9763l10161j00963o8311j41206R6935
$$ -6481 173409 162444 37625 339266 318415 258652 -51509 -152472 -220783 -361989 -265054
2954b65054n0892l15890J12345J5996l4752K18343K32322q2274j02530p7886L67384
$$ -265054 -315946 -631836 -519491 -503495 -538247 -319904 -87582 -169856 -272386 -350272 17112
2943A7112k56517o6177J35337j32716j13978j4999q5944L35692L9476l13994k24029
$$ 17112 -239405 -305582 -170245 -302961 -416939 -431938 -517882 -182190 -142714 -456708 -680737
2932f80737K30602Q3849J765k81351J18694K38255p5787j59357J62287K4166j21023
$$ -680737 -450135 -366286 -364521 -645872 -527178 -288923 -364710 -524067 -361780 -337614 -458637
2921d58637Q03N7297m8332M6171j95857l3870K84437K6893J21976m5425q2269
$$ -458637 -457834 -400537 -448869 -402698 -598555 -632425 -347988 -321095 -199119 -244544 -326813
2910c26813j63125m4928K74523M7825o9159J49465l37013n9798k28632J31947
$$ -326813 -489938 -534866 -260343 -212518 -281677 -132212 -469225 -529023 -757655 -625708
2900f25708J56429k2418Q8248j76265l95337L22100J65243J80420L8908l18163
$$ -625708 -469279 -491697 -403449 -579714 -975051 -652951 -487708 -307288 -268380 -586543
2890e86543k93716K46564J59466Q260k89388m27436m1425K47508j37202L91141
$$ -586543 -880259 -633695 -474229 -465969 -755357 -1182793 -1224218 -976710 -1113912 -722771
2880g22771K6080K89332j74273j07728j39234j99802M87136m0203n8929L6233
$$ -722771 -696691 -407359 -581632 -689360 -828594 -1028396 -541260 -581463 -640392 -604159
2870f04159M9963o504k23649r9532m7677J27326j44999L7038j70440J44066K56137
$$ -604159 -554196 -560700 -784349 -883881 -931558 -804232 -949231 -912193 -1082633 -938567 -682430
2859f82430r9590L4955J49696l3551J12771J93655l07874j49734j57394K7810
$$ -682430 -782020 -747065 -597369 -630920 -518149 -324494 -632368 -782102 -939496 -911686
2849i11686j69188Q7370K53611j3823k74021M3431J55077M5403K1319J362J72751
$$ -911686 -1080874 -993504 -739893 -753716 -1027737 -984306 -829229 -783826 -762507 -761145 -588394
2838e88394J29342j33162j63730k2996L11643l65068j09572j47149K14521O5126
$$ -588394 -459052 -592214 -755944 -778940 -467297 -832365 -941937 -1089086 -874565 -809439
2828h09439l73551L3052J65879k00968L93376R3263o421j8501k09947J41761j37710
$$ -809439 -1182990 -1149938 -984059 -1185027 -791651 -698388 -704809 -723310 -933257 -791496 -929206
2817i29206p3079J51226N6815r5224P4238k6487o4392k1079M3196j81136j54434
$$ -929206 -1002285 -851059 -794244 -889468 -815230 -841717 -906109 -927188 -883992 -1065128 -1219562
2806a219562J29340M5430N8541R7437q9849P2343K58595L9908K4247k45976j77123
$$ -1219562 -1090222 -1044792 -986251 -888814 -978663 -906320 -647725 -607817 -583570 -829546 -1006669
2795a006669J52286l72914n3416J26080J06981j25986L23251K93238M8289m98228
$$ -1006669 -854383 -1227297 -1280713 -1154633 -1047652 -1173638 -850387 -557149 -508860 -1007088
2785a007088L60876L6821j65116Q0253k52817P3232j70688P9273J58122K51869
$$ -1007088 -646212 -609391 -774507 -694254 -947071 -873839 -1044527 -965254 -807132 -555263
2775e55263k88878j80977L02525N81256K11359l34053j01187P0891j9173K74155
$$ -555263 -844141 -1025118 -722593 -141337 70022 -264031 -365218 -294327 -313500 -39345
2765c9345m13509j21343J7718J23616J53163n94585Q3386J31515j68345j46750
$$ -39345 -452854 -574197 -556479 -432863 -279700 -874285 -790899 -659384 -827729 -974479
2755i74479k06027J12019M0754j3019J44334L47097J40631j06215K6923p389k208
$$ -974479 -1180506 -1068487 -1027733 -1040752 -896418 -549321 -408690 -514905 -487982 -495371 -497579
2744d97579R95k81236M0650J96638l12407j65147r7997R1893N15069j53760J11306
$$ -497579 -496584 -777820 -737170 -540532 -852939 -1018086 -1116083 -1024190 -509121 -662881 -551575
2733e51575R1528k24446j71292J5290L6350L53887k48225M9210j89878l86498
$$ -551575 -460047 -684493 -855785 -840495 -804145 -450258 -698483 -649273 -839151 -1225649
2723a225649N9314M12058j35016J50065J87265j30306K0078L18n2653q0495K24480
$$ -1225649 -1166335 -754277 -889293 -739228 -551963 -682269 -662191 -661873 -714526 -795021 -570541
2712e70541o2912J74574k06623l31722p9630J30877j002j73777n5296J41557K16396
$$ -570541 -633453 -458879 -665502 -997224 -1076854 -945977 -946979 -1120756 -1176052 -1034495 -818099
2701h18099J03058J21938L38291l66086k92548J59520K67632k35008j03695J10666
$$ -818099 -715041 -593103 -254812 -620898 -913446 -753926 -486294 -721302 -824997 -714331
2691g14331L9182j89627r3359L07320N2359l12174J73267J05604L1519k71146
$$ -714331 -675149 -864776 -958135 -650815 -598456 -910630 -737363 -631759 -600240 -871386
2681h71386P6422K09649L139O9512J07081q6782k14366J99019J1712k50418j71903
$$ -871386 -794964 -585315 -582176 -512664 -405583 -492365 -706731 -507712 -496000 -746418 -918321
2670i18321n7905J55557J7110J85656k72570K14493K97852j41713M5405P0262
$$ -918321 -976226 -820669 -803559 -617903 -890473 -675980 -378128 -519841 -474436 -404174
2660d04174J86680o309m51993k31942K78625J32776m2830j33357j00101Q5663
$$ -404174 -217494 -223803 -675796 -907738 -629113 -496337 -539167 -672524 -772625 -686962
2650f86962j91718j12931K11465K94677l2064J26069J17802L38800o9349Q6644
$$ -686962 -878680 -991611 -780146 -485469 -517533 -391464 -273662 65138 -4211 82433
2640H2433J37226r9162k11677j17581Q5646j84298L30205N8748p4542q8953j14768
$$ 82433 219659 120497 -91180 -208761 -123115 -307413 22792 81540 6998 -81955 -196723
2629a96723p6639r067N17650L16822m494j97517k56712K83080o8386j55154K704
$$ -196723 -273362 -282429 235221 552043 547549 350032 93320 376400 308014 152860 155564
2618A55564J1256j40356J85077m11888J80755l573K74635M21228j77643J7840
$$ 155564 166820 26464 211541 -200347 -19592 -23165 251470 672698 495055 512895
2608E12895j46075l9386J15214r8001J71504m7791k51989M3091J95802l9074k17678
$$ 512895 366820 327434 442648 344647 516151 468360 216371 259462 455264 416190 198512
2597A98512P9214J08036n1946N23694K85326l35742j94905J98388J4522l9066
$$ 198512 277726 385762 333816 857510 1142836 807094 612189 810577 825099 786033
2587G86033J56485j8791J39361L7182K35899L5904K4691R777R2992K04949Q7817
$$ 786033 942518 923727 1063088 1100270 1336169 1372073 1396764 1406541 1499533 1704482 1792299
2576A792299K64510P1101L25455R2353J53741l01052K53788M09157P2064K85403
$$ 1792299 2056809 2127910 2453365 2545718 2699459 2398407 2652195 3061352 3133416 3418819
2566C418819m344J19000l8948j5459L82509M57385L40880L72019K97188L91767
$$ 3418819 3414475 3533475 3494527 3479068 3861577 4318962 4659842 5031861 5329049 5720816
2556E720816Q81988L66900K03082M56111J34312M27578L04550N57949P92167Q79142
$$ 5720816 6602804 6969704 7172786 7628897 7763209 8190787 8495337 9053286 9845453 10724595
2546A0724595P45030J198870J173452J117957J499543J665538J675526J814243
$$ 10724595 11469625 12668495 13841947 14959904 16459447 18124985 19800511 21614754
2538B1614754K249970K698659L008586L469084L913870M316071M634717N126842
$$ 21614754 23864724 26563383 29571969 33041053 36954923 41270994 45905711 51032553
2530E1032553N357750M808041L564951K838481J951842P38762j570868m632946
$$ 51032553 56390303 61198344 64763295 67601776 69553618 70292380 68721512 64088566
2522F4088566n406594n738697o039889n283447m546929l734731l097219k441152
$$ 64088566 58681972 52943275 46903386 41619939 37073010 33338279 30241060 27799908
2514B7799908j886102k232397j961616j609832j450286j254002j089078j113597
$$ 27799908 25913806 23681409 21719793 20109961 18659675 17405673 16316595 15202998
2506A5202998j294086o12230j080966n54267q86845m66321n03863m53071o21490
$$ 15202998 13908912 13296682 12215716 11661449 10774604 10308283 9804420 9351349 8729859
2497H729859p11678j89814l88284l76470j77516l70544k6128l19419p01485N1716
$$ 8729859 8018181 7828367 7440083 7063613 6886097 6515553 6489425 6170006 5468521 5520237
2487E520237r1072n20842j02423J9317j65972l53514j79597j96995k66811j23637
$$ 5520237 5429165 4908323 4805900 4825217 4659245 4305731 4126134 3929139 3662328 3538691
2477C538691l94679N6881j68763J28011k70301q5709j29868k37877j18374K24445
$$ 3538691 3144012 3200893 3032130 3160141 2889840 2804131 2674263 2436386 2318012 2542457
2467B542457k88775j40858J27093J29997m64651r1697q6536n0844n2048o714o9667
$$ 2542457 2253682 2112824 2239917 2369914 1905263 1813566 1727030 1676186 1624138 1617424 1547757
2456A547757K3116Q9486j279m4125l08689p3311J52891J4017k80675j33520p654
$$ 1547757 1570873 1660359 1659080 1614955 1306266 1232955 1385846 1399863 1119188 985668 978014
2445I78014j26659j43961R76J40331K0812j67737k34479O1548L024j09074M19345
$$ 978014 851355 707394 708370 848701 869513 701776 467297 528845 531869 422795 842140
2434H42140M4331q6974k11090r8471Q3351n8265j60517k32256k55466k03307J21718
$$ 842140 886471 799497 588407 489936 573287 515022 354505 122249 -133217 -336524 -214806
2423b14806K75284l24436J82967K61990P5917k21333J82193k86412j3847N1753
$$ -214806 60478 -263958 -80991 180999 256916 35583 217776 -68636 -82483 -30730
2413c0730j35515r369l17862k30376M8960K53801r1031R7775n7206L06636q6738
$$ -30730 -166245 -175614 -493476 -723852 -674892 -421091 -512122 -414347 -471553 -164917 -251655
2402b51655K7772K18195J26050k42981J32151J89631l30635j40451k26685j99634
$$ -251655 -223883 -5688 120362 -122619 9532 199163 -131472 -271923 -498608 -698242
2392f98242L7421l36039L12791O6294L695J06058K08674n7637R4182m1067j40611
$$ -698242 -660821 -996860 -684069 -617775 -614080 -508022 -299348 -356985 -262803 -303870 -444481
2381d44481J04577J2653r0276m47243J10967j45109J40760K49101j61986j86331
$$ -444481 -339904 -327251 -417527 -864770 -753803 -898912 -758152 -509051 -671037 -857368
2371h57368M20703J819o705L4651O5320O1574J50598j29608K66580J22127k79831
$$ -857368 -436665 -434846 -441551 -406900 -341580 -280006 -129408 -259016 7564 129691 -150140
2360a50140k71942k83818j11579j49209J22761L00908j46618j30302o1251L09530
$$ -150140 -422082 -705900 -817479 -966688 -843927 -543019 -689637 -819939 -881190 -571660
2350e71660q8083j01050J46475O0060K50868K00683k5772o9643m09039k46739
$$ -571660 -659743 -760793 -614318 -554258 -303390 -102707 -128479 -198122 -607161 -853900
2340h53900j4823j13429j77388L96814N1961l05285J36078m1827K57814J3634
$$ -853900 -868723 -982152 -1159540 -762726 -710765 -1016050 -879972 -921799 -663985 -650351
2330f50351L28761J92325m6894l0154j98395l05878j01263K04280M463j21709
$$ -650351 -321590 -129265 -176159 -206313 -404708 -710586 -811849 -607569 -603106 -724815
2320g24815l26166L80527P8718m2226K64113k08697K038K01085J42218j96058
$$ -724815 -1050981 -670454 -591736 -633962 -369849 -578546 -576508 -375423 -233205 -429263
2310d29263j96843K3031n5992M5042k41521j40239J66695j70825J31543J66414
$$ -429263 -626106 -603075 -659067 -614025 -855546 -995785 -829090 -999915 -868372 -701958
2300g01958k18199L82506J86565N6800L3430r1685j982j30708J98149K34721j0106
$$ -701958 -920157 -537651 -351086 -294286 -260856 -352541 -354523 -485231 -287082 -52361 -62467
2289f2467j79995j91495k8048j23876j92634k306k64758P3576K20269M60426j57450
$$ -62467 -242462 -433957 -462005 -585881 -778515 -780821 -1045579 -972003 -751734 -291308 -448758
2278d48758J48768O3607P0283j57596l28142j86053K73360o9197J08994j99473
$$ -448758 -299990 -236383 -166100 -323696 -651838 -837891 -564531 -633728 -524734 -724207
2268g24207P2515k17221R818K99244J07783l758K9092j06316j47222J91283O7445
$$ -724207 -651692 -868913 -859095 -559851 -452068 -455826 -426734 -533050 -680272 -488989 -421544
2257d21544K839j14812R324J5070j61762l86846o2417n9301M7730L20284K63670
$$ -421544 -418705 -533517 -524193 -509123 -670885 -1057731 -1120148 -1179449 -1131719 -811435 -547765
2246e47765l3706p8706J60332j06565J2049K12544j46786K17457j18351k71239
$$ -547765 -581471 -660177 -499845 -606410 -594361 -381817 -528603 -311146 -429497 -700736
2236g00736j3292k95682J4293K94260j76699j69244L34706J15578j36244K31613
$$ -700736 -714028 -1009710 -995417 -701157 -877856 -1047100 -712394 -596816 -733060 -501447
2226e01447P2470J88422R4594J37451r3562j12986p7910l67208j38904L45908
$$ -501447 -428977 -240555 -145961 -8510 -102072 -215058 -292968 -660176 -799080 -453172
2216d53172j85346k54022k67880K23422J76986m5216L8627J99004L9480J19644
$$ -453172 -638518 -892540 -1160420 -936998 -760012 -805228 -766601 -567597 -528117 -408473
2206d08473K38943O0320k88173l30483L13245j850k18878k09418k25431P6271
$$ -408473 -169530 -109210 -397383 -727866 -414621 -416471 -635349 -844767 -1070198 -993927
2196i93927K61277N3527k7509q737j8681K54806J14084J90662p7037k7420K0336
$$ -993927 -732650 -679123 -706632 -715369 -734050 -479244 -365160 -174498 -251535 -278955 -258619
2185b58619M7713l42330l5665K6362k91170j08508j70563m9204O02164l1872j5116
$$ -258619 -210906 -553236 -588901 -562539 -853709 -962217 -1132780 -1181984 -579820 -611692 -626808
2174f26808m0059M02642J74516j84513j07980N1175J07993k13526j82088j64580
$$ -626808 -666867 -264225 -89709 -274222 -382202 -331027 -223034 -436560 -618648 -783228
2164g83228L0814k64180N4606L1286O1181l7994J9119M2271k2164K56332L48206
$$ -783228 -752414 -1016594 -961988 -930702 -869521 -907515 -888396 -846125 -868289 -611957 -263751
2153b63751M3377P9291K16649j37001l83043j72868k42160k57132M1932p9949
$$ -263751 -220374 -141083 75566 -61435 -444478 -617346 -859506 -1116638 -1074706 -1154655
2143a154655n5745L11512j46182J48222Q0219J00271K29498N5140J98870J84995
$$ -1154655 -1210400 -898888 -1045070 -896848 -816629 -716358 -486860 -431720 -232850 -47855
2133d7855r5365k08021j83438K8259k24971j94614l83902L86792O7334J16868
$$ -47855 -143220 -351241 -534679 -506420 -731391 -926005 -1309907 -923115 -855781 -738913
2123g38913J1886o3041J15637M46886L36623J32865j71988M6215k55598k49888
$$ -738913 -727027 -790068 -674431 -227545 109078 241943 69955 116170 -139428 -389316
2113c89316M8704k17781j88892k50993k25498J22445L26773l1639M38517L27642
$$ -389316 -340612 -558393 -747285 -998278 -1223776 -1101331 -774558 -806197 -367680 -40038
2103d0038j66371l51980J19273L949K16395P9578K01895j88105k56989k02050
$$ -40038 -206409 -558389 -439116 -435167 -218772 -139194 62701 -125404 -382393 -584443
2093e84443k48976N1747j99848l29550L62644J77459l7740N2069L48912J53881
$$ -584443 -833419 -781672 -981520 -1311070 -948426 -770967 -808707 -756638 -407726 -253845
2083b53845l7896m5851j60030L73758J03507l97598l32813N2251J81724j06061
$$ -253845 -291741 -337592 -497622 -123864 -20357 -417955 -750768 -698517 -516793 -622854
2073f22854j90257L1718J6692j3655q7080K46436J43912K00931J03608k63320
$$ -622854 -813111 -781393 -764701 -778356 -865436 -619000 -475088 -274157 -170549 -433869
2063d33869K88051o8826j79940n9060l4512j70267k73967m4264J81803P8125J28671
$$ -433869 -145818 -214644 -394584 -453644 -488156 -658423 -932390 -976654 -794851 -716726 -588055
2052e88055j53956j38769K81550K88321K44230l76051J0878N02652k62842p2841
$$ -588055 -742011 -880780 -599230 -310909 -66679 -442730 -431852 70800 -192042 -264883
2042b64883J51720l90096k14683k5780N8054N3042k4927J01029J02488n99j08498
$$ -264883 -113163 -503259 -717942 -743722 -685668 -632626 -657553 -556524 -454036 -454635 -563133
2031e63133J29556O3678J37873K18556m15743K44563J7501l76571J92477j87609
$$ -563133 -433577 -369899 -232026 -13470 -429213 -184650 -167149 -543720 -351243 -538852
2021e38852l36897p8899j5818K13511k8225J93351R7357j3119J21934J78878Q7647
$$ -538852 -875749 -954648 -970466 -756955 -785180 -591829 -494472 -507591 -385657 -206779 -119132
2010a19132j39796K888J97255j13062o5964j03671J65704K39981m12804k20328
$$ -119132 -258928 -256040 -58785 -171847 -237811 -341482 -175778 64203 -348601 -568929
2000e68929J58636J58832l7189q2089K59931J56644m65605R9722J33390R9923
$$ -568929 -410293 -251461 -288650 -370739 -110808 45836 -419769 -320047 -186657 -86734
1990h6734J24707j08781J5310k96876j06839j92361K14727r1060o451j7318O0096
$$ -86734 37973 -70808 -55498 -352374 -459213 -651574 -436847 -527907 -534358 -551676 -491580
$$ [...]
##END NTUPLES=NMR SPECTRUM
##END=
